##TITLE=31Pdec_DE-161_oil
 DMSO-d6+CCl4, 64 sc
 7.7.2026
##JCAMPDX= 6.0         $$ Bruker NMR JCAMP-DX V2.0
##DATA TYPE= NMR SPECTRUM
##DATA CLASS= NTUPLES
##ORIGIN= UXNMR, Bruker Analytische Messtechnik GmbH
##OWNER= root
$$ XWIN-NMR		Version 3.5
$$ Tue Jul  7 13:03:13 2026 Russian Standard Time (UT+4h)  she@DPX200
##.OBSERVE FREQUENCY= 81.013821
##.OBSERVE NUCLEUS= ^31P
##.ACQUISITION MODE= SIMULTANEOUS
##.ACQUISITION SCHEME= undefined
##.AVERAGES= 64
##.DIGITISER RES= 17
##SPECTROMETER/DATA SYSTEM= spect
##.PULSE SEQUENCE= zgpg30
##.SOLVENT NAME= DMSO
##.SHIFT REFERENCE= (INTERNAL, DMSO, 0, 197.392)
##AUDIT TRAIL= $$ (NUMBER, WHEN, WHO, WHERE, WHAT)
$$ ##TITLE= Audit trail, XWIN-NMR		Version 3.5
$$ ##JCAMPDX= 5.01
$$ ##ORIGIN= Bruker BioSpin GmbH
$$ ##OWNER= she
$$ F:/spectra/data/she/nmr/P31/2/pdata/1/auditp.txt
$$ ##AUDIT TRAIL=  $$ (NUMBER, WHEN, WHO, WHERE, WHAT)
(   1,<2026-07-07 13:02:17.60 +0400>,<she>,<DPX200>,
      <created by zg, POWCHK disabled, PULCHK disabled
       configuration hash MD5:
       00 E9 B6 7A A2 85 ED C7 34 08 36 98 17 FE 4E 26
       data hash MD5: 32K
       BF 44 F9 1C 60 81 AC BE 78 53 02 A2 83 26 9A 69>)
(   2,<2026-07-07 13:02:19.76 +0400>,<she>,<DPX200>,
      <Start of raw data processing
       efp BC_mod = 2 LB = 1.5 FT_mod = 6 PKNL = 1 PHC0 = 1935.025 PHC1 = 145.2988 SI = 64K 
       data hash MD5: 64K
       24 50 19 4C 56 CE 23 BE 38 82 AE 28 94 89 7F 00>)
(   3,<2026-07-07 13:02:36.92 +0400>,<she>,<DPX200>,
      <pk PHC0 = 3.533484 PHC1 = 0 
       data hash MD5: 64K
       11 27 45 E7 EA D0 3E 6C 0C B6 E1 A2 B0 2A 01 22>)
(   4,<2026-07-07 13:02:44.62 +0400>,<she>,<DPX200>,
      <abs ABSG = 5 
       data hash MD5: 64K
       79 89 9D 76 7A CC 31 C2 AD 8D FB A2 14 21 9A FC>)
$$ ##END=
$$ 
$$ hash MD5
$$ 8A E7 09 7F FE 77 7F 7A C5 C8 30 BD 82 31 7E 61
##$RELAX= 
##$RELAX= 
##$RELAX= 
##$RELAX= 
##$RELAX= 
##$RELAX= 
##$RELAX= 
##$RELAX= 
$$ Bruker specific parameters
$$ --------------------------
##$DU= <F:/spectra>
##$EXPNO= 2
##$NAME= <P31>
##$PROCNO= 1
##$TYPE= <nmr>
##$USER= <she>
##$AMP= (0..31)
100 100 100 100 100 100 100 100 100 100 100 100 100 100 100 100 100 100 
100 100 100 100 100 100 100 100 100 100 100 100 100 100 
##$AQSEQ= 0
##$AQ_mod= 1
##$AUNM= <au_zg>
##$AUTOPOS= <>
##$BF1= 81.014009
##$BF2= 200.13
##$BF3= 200.13
##$BF4= 200.13
##$BF5= 200.13
##$BF6= 200.13
##$BF7= 200.13
##$BF8= 200.13
##$BYTORDA= 1
##$CFDGTYP= 0
##$CFRGTYP= 5
##$CHEMSTR= <none>
##$CNST= (0..31)
1 1 145 1 1 1 1 1 1 1 1 1 1 1 1 1 1 1 1 1 1 1 1 1 1 1 1 1 1 1 1 1 
##$CPDPRG= <waltz16>
##$CPDPRG1= <>
##$CPDPRG2= <waltz16>
##$CPDPRG3= <>
##$CPDPRG4= <mlev>
##$CPDPRG5= <mlev>
##$CPDPRG6= <mlev>
##$CPDPRG7= <mlev>
##$CPDPRG8= <mlev>
##$CPDPRGB= <>
##$CPDPRGT= <>
##$D= (0..31)
0 1 0 0 0 0 0 0 0 0.06 0 0.03 2e-05 3e-06 0 0 0.0002 0 0 0 0 0 0 0 0 0 
0 0 0 0 0 0 
##$DATE= 1783414937
##$DBL= (0..7)
120 120 120 11 120 120 24 19 
##$DBP= (0..7)
150 150 150 150 150 150 150 150 
##$DBP07= 0
##$DBPNAM0= <>
##$DBPNAM1= <>
$$ [...]
##$SUBNAM3= <"">
##$SUBNAM4= <"">
##$SUBNAM5= <"">
##$SUBNAM6= <"">
##$SUBNAM7= <"">
##$SUBNAM8= <"">
##$SUBNAM9= <"">
##$SW= 400.765351723535
##$SWIBOX= (0..15)
0 1 3 0 0 0 0 0 0 0 0 0 0 0 0 0 
##$SW_h= 32467.5324675325
##$TD= 32768
##$TD0= 1
##$TE= 0
##$TE2= 300
##$TE3= 300
##$TEG= 300
##$TL= (0..7)
0 120 53 12 22 120 120 120 
##$TP= (0..7)
150 150 150 150 150 150 150 150 
##$TP07= 0
##$TPNAME0= <>
##$TPNAME1= <>
##$TPNAME2= <>
##$TPNAME3= <>
##$TPNAME4= <>
##$TPNAME5= <>
##$TPNAME6= <>
##$TPNAME7= <>
##$TPOAL= (0..7)
0.5 0.5 0.5 0.5 0.5 0.5 0.5 0.5 
##$TPOFFS= (0..7)
0 0 0 0 0 0 0 0 
##$TUNHIN= 0
##$TUNHOUT= 0
##$TUNXOUT= 0
##$USERA1= <user>
##$USERA2= <user>
##$USERA3= <user>
##$USERA4= <user>
##$USERA5= <user>
##$V9= 5
##$VALIST= <valist>
##$VCLIST= <CCCCCCCCCCCCCCC>
##$VD= 0
##$VDLIST= <DDDDDDDDDDDDDDD>
##$VPLIST= <PPPPPPPPPPPPPPP>
##$VTLIST= <TTTTTTTTTTTTTTT>
##$WBST= 1024
##$WBSW= 4
##$XGAIN= (0..3)
0 0 0 0 
##$XL= 0
##$YL= 0
##$YMAX_a= 5011
##$YMIN_a= -8472
##$ZGOPTNS= <>
##$ZL1= 120
##$ZL2= 120
##$ZL3= 120
##$ZL4= 120
##$ABSF1= 197.3918
##$ABSF2= -203.3724
##$ABSG= 5
##$ABSL= 3
##$ALPHA= 0
##$AQORDER= 0
##$ASSFAC= 0
##$ASSFACI= 0
##$ASSFACX= 0
##$ASSWID= 0
##$AUNMP= <proc_1d>
##$AZFE= 0.1
##$AZFW= 0.5
##$BCFW= 0
##$BC_mod= 2
##$BYTORDP= 0
##$COROFFS= 0
##$CY= -3
##$DATMOD= 1
##$DC= 0
##$DFILT= <>
##$DTYPP= 0
##$F1P= 0
##$F2P= 0
##$FCOR= 1
##$FTSIZE= 65536
##$FT_mod= 6
##$GAMMA= 0
##$GB= 0
##$INTBC= 1
##$INTSCL= 9.790993e-09
##$ISEN= 30
##$LB= 1.5
##$LEV0= 0
##$LPBIN= 0
##$MAXI= 10000
##$MC2= 0
##$MEAN= 0
##$ME_mod= 0
##$MI= 50
##$NCOEF= 0
##$NC_proc= -8
##$NLEV= 6
##$NOISF1= 182.463
##$NOISF2= 159.3651
##$NSP= 0
##$NTH_PI= 0
##$NZP= 0
##$OFFSET= 197.3918
##$PC= 4
##$PHC0= 1938.558
##$PHC1= 145.2988
##$PH_mod= 1
##$PKNL= yes
##$PPARMOD= 0
##$PSCAL= 0
##$PSIGN= 0
##$REVERSE= no
##$SF= 81.014063255964
##$SI= 65536
##$SIGF1= 159.3651
##$SIGF2= -187.1042
##$SINO= 113.3802
##$SIOLD= 16384
##$SREGLST= <1H.CDCl3>
##$SSB= 0
##$STSI= 65536
##$STSR= 0
##$SW_p= 32467.5324675325
##$SYMM= 0
##$S_DEV= 0
##$TDeff= 32768
##$TDoff= 0
##$TI= <>
##$TILT= no
##$TM1= 0
##$TM2= 0
##$TOPLEV= 0
##$USERP1= <user>
##$USERP2= <user>
##$USERP3= <user>
##$USERP4= <user>
##$USERP5= <user>
##$WDW= 1
##$XDIM= 65536
##$YMAX_p= 200027678
##$YMIN_p= -180282672
$$ End of Bruker specific parameters
$$ ---------------------------------
##NTUPLES= NMR SPECTRUM
##VAR_NAME=  FREQUENCY,     SPECTRUM/REAL,   SPECTRUM/IMAG
##SYMBOL=    X,             R,               I
##VAR_TYPE=  INDEPENDENT,   DEPENDENT,       DEPENDENT
##VAR_FORM=  AFFN,          ASDF,            ASDF
##VAR_DIM=   65536,         65536,           65536
##UNITS=     HZ,            ARBITRARY UNITS, ARBITRARY UNITS
##FACTOR=    0.49542278885378, 1,            1
##FIRST=     15991.5117654749, 0,            0
##LAST=      -16476.0207020576, 0,           0
##MIN=       -16476.0207020576, -180282672,  0
##MAX=       15991.5117654749, 200027678,    0
$$ Real data points
##PAGE= N=1
##DATA TABLE= (X++(R..R)), XYDATA
$$ [...]
##PAGE= N=2
##DATA TABLE= (X++(I..I)), XYDATA
7486C354390n5606Q83570P39337J8714P25826J482439p96481m651225m959712
7477c258748r43411K055563P57471j176478L92757L196895K604471n09350j139534
7468A979636J832249M014603K274339j050745k188537j170195r36543k795915
7460A958892m740321m007205l23401L518233M298457J822159o74404k63789K012811
7451C601432K433011n90824m406024n276114k527370J151922K809934J890886
7443i13147J85450k60292P63926J470823K21058k214395l173680j222802J834145
7434c308914K776767O39672k168984k658365n95061J547920J766123P78329O78788
7425e43725K008202L116002K367127N7294k194053l226738k982489j901292m24566
$$ y = [3354390, 3298784, 4182354, 4921691, 4940405, 5666231, 7148670, 6352189, 1700964, -3258748, -4202159, -2146596, -1389125, -2565603, -2172846, 1024049, 3628520, 3119170, 1979636, 3811885, 7826488, 10100827, 9050082, 6861545, 5691350, 4754807, 1958892, -2781429, -6788634, -7112035, -3593802, 704655, 2526814, 1852410, 1588621, 3601432, 6034443, 5443619, 1037595, -4238519, -6765889, -5613967, -2804033, -913147, -727697, -987989, -224063, 1246760, 1467818, -746577, -3920257, -5143059, -3308914, -532147, 107525, -2061459, -4719824, -5314885, -3766965, -2000842, -1222513, -543725, 1464477, 4580479, 6947606, 7004900, 4810847, 1584109, -1398380, -3299672, -3724238]
7416c724238R63902J747976J672935R69896K13081j88490m35703r93931j607126
7407a381698j209098N81047K439823K798677J910299J234525J103020N94122l75926
7398G694791q09696p62322j484116k668402k016351R98162L332628K461118J35434
7389F881246n53934q640p69521k664861l079495j596692n48585p28287k70923
7380c339692J473796K551756K008162J393772J266239j57282k838007l171788
7372h13044N30474M032904K511793k374363m888912l189205o17536J99176J30086
7363d478627K45395j23780r90317q15569N70374R47911q74514k937696k951979
7354a1408802j322624Q1067N37125M98708L90360N49654J212617J804092J592776
$$ y = [-3724238, -2760336, -1012360, 660575, 1630471, 1843552, 1655062, 1219359, 225428, -1381698, -2590796, -2009749, 430074, 3228751, 5139050, 6373575, 7476595, 8070717, 7694791, 6885095, 6122773, 4638657, 1970255, -46096, 952066, 4284694, 6745812, 6881246, 6327312, 6318672, 5549151, 2884290, -195205, -1791897, -2340482, -3068769, -3339692, -1865896, 685860, 2694022, 4087794, 5354033, 5196751, 2358744, -813044, -282570, 3750334, 6262127, 3887764, -1001148, -4190353, -4807889, -4608713, -4478627, -4233232, -4357012, -5347329, -6162898, -5592524, -4644613, -5519127, -8456823, -11408802, -12731426, -12650359, -12113234, -11614526, -11224166, -10674512, -9461895, -7657803, -6065027]
7345f065027J512411L361710O383429O994933L479872j183637l181691k686504
7337H615496k384986k681038j436711J860600M539194M019111Q15603k434410
7329A0912859l771776l234639k166576j590085j099521K90042K114544K491492
7321C946340R18791m38300K50689J476251M53607k590741m535446l610816j333305
7312e462930L6214N133o40647j121669q37654L83728J681354J917719J289099
7303b749653J020027J392695J457908Q08586J46657r0873j64253m472N67785N98273
7293B982680r39703k678038j994372P43477J925114J1807j810223m35785K311606
7284A16563K560489K06483j527789j289349q65292j439709j836920j101660j73887
$$ y = [-6065027, -4552616, -1190906, 5192523, 12187456, 15667328, 14483691, 11302000, 8615496, 6230510, 3549472, 2112761, 3973361, 8512555, 12531666, 13347269, 10912859, 7141083, 3906444, 1739868, 149783, -949738, -659696, 1454848, 3946340, 4865131, 4426831, 4677520, 6153771, 6607378, 4016637, -518809, -4129625, -5462930, -5426716, -5421583, -6062230, -7183899, -8021553, -7637825, -5956471, -4038752, -2749653, -1729626, -336931, 1120977, 1929563, 2076220, 1985347, 1821094, 1816622, 2384407, 2982680, 2042977, -635061, -2629433, -1885956, 39158, 50965, -1759258, -2195043, 116563, 2677052, 2883535, 1355746, 66397, -798895, -2238604, -4075524, -5177184, -5351071]
7275e351071K2808J94199J281056K732690L012623J154664k235720m788466l858248
7266g835465L30828L775358K979149m31160j903416l34401J083090O58565Q15679
7257h61773L172891M819083K621254j483019l186172k085176j412338k403521
7249h18771k897118j573646J52431J229166K543009M075613L614895L59368k671739
7240D013208k345286J82544J417557P28107O43747K198273K951439O92423k922380
7231G559632m046346j177590L165352N085980K999202j102270l592233k544356
7223F347371N45906K354679J024531k310305n064869n600767l965244j114528
7215g783226J782862L572947L566986K101840L00642r25457j449684j547961j406194
$$ y = [-5351071, -5328263, -5134064, -3853008, -1120318, 1892305, 3046969, 811249, -3977217, -7835465, -7504637, -3729279, -750130, -1181290, -3084706, -3419107, -2336017, -1677452, -861773, 2311118, 7130201, 9751455, 8268436, 5082264, 2997088, 1584750, -818771, -3715889, -5289535, -5137104, -3907938, -1364929, 2710684, 6325579, 6684947, 4013208, 1667922, 1850466, 3268023, 3996130, 4639877, 6838150, 9789589, 10482012, 7559632, 3513286, 2335696, 5501048, 10587028, 13586230, 12483960, 8891727, 6347371, 6893277, 9247956, 10272487, 7962182, 2897313, -2703454, -6668698, -7783226, -6000364, -2427417, 1139569, 3241409, 3542051, 2616594, 1166910, -381051, -1787245]
7206a787245j184530j084915r43589j57979J351708K347233J324045j423268l538103
7197e096643k905631K00185L611295N368098M897458K803073L76683j027117j061623
7188G165778p68459j205175j967378j929990j090422m30974r5343P54679K002982
7179B435698K155655O21116j036326j170483j61730O91713J192329J701005J584776
7170H013753J3357k166169l093416k364964j406338j355817j798639j661254m16204
7161f235691J484882K684932K064064O09443Q74324L160793L940114N68347l939674
7152E211534m419782j045007J076939j957m32258K211175M156154J500956k948842
7143E308912l676172p57120R64115k26807j062311N21519K148221J330192p21737
$$ y = [-1787245, -2971775, -4056690, -5000279, -5158258, -3806550, -1459317, -135272, -1558540, -5096643, -8002274, -7802089, -4190794, 1177304, 6074762, 8877835, 9254518, 8227401, 7165778, 6397319, 5192144, 3224766, 1294776, 204354, -226620, -321963, 432716, 2435698, 4591353, 5212469, 4176143, 3005660, 2843930, 3535643, 4727972, 6428977, 8013753, 8027110, 5860941, 2767525, 402561, -1003777, -2359594, -4158233, -5819487, -6235691, -4750809, -2065877, -1813, 607630, 1481954, 4642747, 8582861, 9151208, 5211534, 791752, -253255, 823684, 821727, 389469, 2600644, 6756798, 8257754, 5308912, 1632740, 875620, 1839735, 1612928, 550617, 1072136, 3220357, 4550549, 3828812]
7134C828812j562573j116743q15388q92785l45923J296951L268821M127107K806815
7125A0595094j38609k577135l075087k530115k258983j634147K17986J581931
7117A80935J95795k449459k569883Q485J416413R3732o65589J542767L908089
7108A661285K781434o68827k479407j410806O58645K112003K442136J283436n51354
7099E828545n58834K015017L714818J118218l673265n369928k615090R21578K318312
7090C699371K370863K251921J022767j863963m390866m321094k049258M18119
7082b862140K033904K949543L148225K102392l58718l222320m357822k156650
7074b723586K077885M352007K165706k152877m074279k345628J53352P13080l52839
$$ y = [3828812, 2266239, 1149496, 334108, -558677, -904600, 392351, 3661172, 7788279, 10595094, 10456485, 7879350, 4804263, 2274148, 15165, -1618982, -1400996, 180935, 376730, -2072729, -4642612, -4634127, -3217714, -3123982, -3789571, -2246804, 1661285, 4442719, 3773892, 1294485, -116321, 542324, 2654327, 5096463, 6379899, 5828545, 5269711, 7284728, 10999546, 12117764, 8444499, 3074571, 459481, 1381059, 3699371, 6070234, 8322155, 9344922, 7480959, 3090093, -1231001, -3280259, -2862140, -828236, 2121307, 5269532, 7371924, 7013206, 3790886, -566936, -2723586, -645701, 3706306, 5872012, 3719135, -355144, -2700772, -2547420, -1834340, -2187179]
7065b187179j355509j524173r82790j20514L46544j22115j057560j638971j846031
7056a0488298j712274k55294K934328N802377N891926L739031J702247J40687
7048G754730k088770l901155k738842O80794K541307J739155J254175K336402
7040G577796J998296j217102l545057j814042Q22849m07477m066191m427808q2688
7031e161424M099607L668364m36140m059410m240502j120186K469128L335881
7023a444682J434816K75568K147050M442942L291268n93853k961869k075353k25868
7014D290019M60494J92928o58588k403681l965409l116378R9534K726879K698286
7005C24084J051428l92209j217703j454365p86192K16308J86306p07991n55130
$$ y = [-2187179, -3542688, -5066861, -6049651, -6170165, -5823621, -5945736, -7003296, -8642267, -10488298, -12200572, -12455866, -9521538, -3719161, 2172765, 5911796, 7614043, 7754730, 5665960, 1764805, -974037, -293243, 2248064, 3987219, 5241394, 7577796, 9576092, 8358990, 4813933, 2999891, 3822740, 3415263, -650928, -5078736, -5161424, -1061817, 2606547, 2170407, -1889003, -6129505, -7249691, -4780563, -1444682, -9866, 265702, 2412752, 6855694, 10146962, 9553109, 6591240, 4515887, 4290019, 4750513, 4943441, 4284853, 1881172, -2084237, -5200615, -5101081, -2374202, 324084, 1375512, 983303, -234400, -1688765, -2474957, -2258649, -2072343, -2780334, -3335464]
6996c335464J218421K662850K280654J076938L76258l25023j743519k846042k302251
6987b937178o47568N49827O82318R4487p91428j265154m71826J130057J704228
6978a952237N52857o11754j60789R82700Q52525o09315j652091j127278M79393
6969c245989J960961K385717J634057N48437j44l48515j312183k262703j678137
6960b318499J15737R45641K47163Q0337J517382K644795J918543Q55131J020669
6951G026899R00886j172157l182218k207336N62118J656234J158117K181021M660647
6942A1584211M495434Q4158m558362n310282l144318j444618j050236p88490o94172
6933h26675j521990k347964j670845k78556k69865j405792j094164J519453L783406
$$ y = [-3335464, -2117043, 545807, 2826461, 3903399, 4279657, 3954634, 2211115, -634927, -2937178, -3584746, -3034919, -2352601, -2258114, -3049542, -4314696, -4786522, -3656465, -1952237, -1399380, -2011134, -2171923, -1189223, -336698, -946013, -2598104, -3725382, -3245989, -1285028, 1100689, 2734746, 3283183, 3283039, 2934524, 1622341, -640362, -2318499, -2202762, -1257121, -1009958, -929621, 587761, 3232556, 5151099, 6006230, 7026899, 7927785, 6755628, 3573410, 1366074, 1928192, 3584426, 4742543, 6923564, 11584211, 16079645, 16163803, 11605441, 6295159, 3150841, 1706223, 655987, -132503, -826675, -2348665, -4696629, -6367474, -6646030, -6915895, -8321687, -9415851, -7896398, -4112992]
6924d112992L036023K80972j164062J8050J708603J382738n99076j613946k72659
6915a336349J866213K473124J344335J25155k37081l33095o26829m92134M86497
6906C269836J481199J606629J256565J214128J071183j81206k125845k808980
6898D783509j239215Q37223O99110j853071l814301k546410O54758J994829K11796
6889b71772j645567m87615K457506L529380J834296K1j08548K62683n81820k148008
6879B840556l061705l118435k545758q90250J587882K801241J261093j183166
6871b308542j222561J512187L895426L315836N65591j715441k137806j422905
6863D81785r61160j160265j123494M7320J725778K297023J479191Q56188J270006
$$ y = [-4112992, -1076969, -795997, -1960059, -1942009, -233406, 1149332, 550256, -1063690, -1336349, 529864, 3002988, 4347323, 4472478, 4235397, 3902302, 3275473, 2783339, 3269836, 4751035, 6357664, 7614229, 8828357, 9899540, 9718334, 7592489, 4783509, 3544294, 4381517, 5080627, 3227556, -586745, -3133155, -2478397, -483568, -271772, -1917339, -2404954, 52552, 3581932, 5416228, 5416249, 5307701, 5570384, 4988564, 2840556, -221149, -3339584, -5885342, -6775592, -5187710, -2386469, -1125376, -2308542, -3531103, -2018916, 1876510, 5192346, 5757937, 4042496, 1904690, 481785, -479375, -1639640, -2763134, -2715814, -990036, 1306987, 2786178, 3642366, 4912372]
6854D912372J210051o19482k591353k356181o73335r1699l99761R27611L398993
6845C717216K881311j747525n235431k717091K895970M579884Q59192k834777
6837B398749k434533j87148K08898o55758o1437J568346J327571j104153k600277
6828a539742j306790O23656M47776j030476q61071J417816K961371J838969O446
6819B557955N07768K838357L311436K34727l335484l321301J23918K847028J854703
6810G619107j432645l465166k814741j249569j072350k230941k400295M6446L496310
6801c503844M409270J562037k113572l054103j462774l93546j034582j421636
6793g012750k00356J062637P73740J74200J037121K187815J204008j192866j638177
$$ y = [4912372, 6122423, 5502941, 2911588, 555407, -117928, -209627, -609388, 318223, 3717216, 6598527, 4851002, -384429, -3101520, -205550, 4374334, 5233526, 2398749, -35784, -222932, -14034, -669792, -731229, 837117, 2164688, 1060535, -1539742, -2846532, -2222876, -1775100, -2805576, -3666647, -2248831, 712540, 2551509, 2557955, 3065723, 5904080, 9215516, 9450243, 6114759, 2793458, 2917376, 5764404, 7619107, 6186462, 2721296, -93445, -1343014, -2415364, -4646305, -7046600, -7000154, -3503844, 905426, 2467463, 353891, -2700212, -4162986, -4556532, -5591114, -7012750, -7213106, -6150469, -5376729, -5202529, -4165408, -1977593, -773585, -1966451, -3604628]
6784c604628O65410K277654M85756k425524k134558J709773M921746M174042Q59336
6775F929007j244995p12086N12234K27577j446488k974113l623967l694497l131178
6766i158506j374653J189817K863871K446436O86065p38908j091802q15169n42968
6757f535817o09081r78505r61259L39976K494355L498121K224780L38069K52350
6748F2989J756496K462116J348915j60715q32032j206057j860067k045468j252281
6739a726104n61106r64197j429852j85818K620117M808423M456465J509698k409918
6730F117708n031769m816349k180969R08580K956011L895780L789786J991703
6722G630481j258509l653011l026215k70672J614510J231141j7656m62418k54282
$$ y = [-3604628, -2939218, -661564, -175808, -2601332, -4735890, -3026117, 1895629, 6069671, 6929007, 5684012, 4971926, 5484160, 5711737, 4265249, 1291136, -2332831, -6027328, -9158506, -10533159, -9343342, -6479471, -4033035, -3346970, -4085878, -5177680, -5992849, -6535817, -7144898, -8123403, -9084662, -8744686, -6250331, -2752210, -527430, -189361, 62989, 1819485, 4281601, 5630516, 5469801, 4637769, 3431712, 1571645, -473823, -1726104, -2287210, -3251407, -4681259, -4867077, -2246960, 2561463, 7017928, 8527626, 6117708, 1085939, -3730410, -5911379, -5002799, -2046788, 1848992, 5638778, 7630481, 6371972, 2718961, -307254, -577926, 1036584, 2267725, 2250069, 1787651, 1533369]
6713A533369l57184q08284j005431j039442j657731k866982l298156j557744J768947
6704i288638M108343L598340J455550N01494J341171J664792N4507j430538l05904
6695A699117K044420J777568j865210n057073m309597q50642J396926Q77305l70277
6686d657463r6416J316647J935040J115969K13716N41076J515660J455345j28388
6677C211186j890130k466402k123242j992682k142060j239611J621486N044387
6669a977068N796885J978262l962796o590325l308741K001295L326587R1331k536238
6660e180808j238927J267086J471453P21763K055646M113525K944334j177945
6652D976127l537459j864992P87912J080397l90527j343129j122013p7168J635606
$$ y = [1533369, 1176185, 367901, -637530, -1676972, -3334703, -6201685, -9499841, -11057585, -9288638, -5180295, -1581955, -126405, 375089, 1716260, 3381052, 3435559, 2005021, 1699117, 3743537, 5521105, 3655895, -1401178, -5710775, -6561417, -5164491, -4287186, -4657463, -4753879, -3437232, -1502192, -386223, -172507, 368569, 1884229, 3339574, 3211186, 1321056, -1145346, -3268588, -5261270, -7403330, -8642941, -7021455, -1977068, 3819817, 5798079, 1835283, -4755042, -8063783, -6062488, -2735901, -2644570, -5180808, -6419735, -5152649, -3681196, -2959433, -903787, 3209738, 6154072, 4976127, 1438668, -426324, 361588, 1441985, 1051458, -291671, -1413684, -1490852, 144754]
6643A44754K893804J715988j652768l995815l265216j273450l66700K03404K048645
6634c547354L828728K890397k35359k041691o95770J868815K717159J004880j902402
6625C887403l977429l870414j648131J363603L533038L630251J254648k193497
6617A979472l567227j246758J752519Q97187l202725m959723k004028J100648
6609i250635J31155k144176r90670K236333K785098Q78780Q55299K883249K464701
6600a50866j163335k943958m32954J904600J80965k474341j322620K248519L315886
6591h38104J049994j064322j056068j38517N80963J143277Q64663j105189l344818
6582c908121l233831o63207J696459J865738K68345j689745k640587j338564J952303
$$ y = [144754, 3038558, 4754546, 3101778, -894037, -4159253, -5432703, -5799403, -5595999, -3547354, 281374, 3171771, 2936412, 894721, 198951, 2067766, 4784925, 5789805, 3887403, -90026, -3960440, -5608571, -4244968, -711930, 2918321, 4172969, 1979472, -1587755, -2834513, -1081994, -184807, -3387532, -8347255, -10351283, -9250635, -9119480, -11263656, -12254326, -10017993, -7232895, -6354115, -5498816, -2615567, -150866, -1314201, -4258159, -4691113, -2786513, -2605548, -5079889, -6402509, -4153990, -838104, 211890, -852432, -1908500, -2047017, -1466054, -322777, 541886, -563303, -3908121, -7141952, -7805159, -6108700, -4242962, -3974617, -5664362, -8304949, -9643513, -7691210]
6573g691210M532285M065117J879068J010929J568433J132694n00637p28393J033260
6564F301546J698645o18815l288589k976653k61975K003854K894852L292846L093153
6555A2138864J403261j153081k817890l112153k888408k350541r94469P24091
6547I49674J625472J692929J946950K430708K106048Q81734p9831m37763j281373
6538I834548l027521m270982l586643j340301R47770K029786J365395n79742k051324
6529f79014j496476J22685K01827j548669k061200P09524M305360M855618K281307
6520F690962j14030m76201j47430o99831j750675k212006j732858l96587J335543
6511D96887K089448P68538j439227k146803j139683m86332r18099q29495J66880
$$ y = [-7691210, -3158925, 906192, 2785260, 3796189, 5364622, 6497316, 5996679, 5268286, 6301546, 8000191, 7381376, 4092787, 1116134, 854159, 2858013, 5752865, 9045711, 12138864, 13542125, 12389044, 9571154, 6459001, 3570593, 1220052, 225583, 949674, 2575146, 4268075, 6215025, 8645733, 10751781, 11633515, 11553684, 11115921, 9834548, 6807027, 2536045, -1050598, -2390899, -1443129, 586657, 1952052, 1372310, -679014, -2175490, -2052805, -1850978, -3399647, -5460847, -4751323, -445963, 4409655, 6690962, 6576932, 6100731, 5953301, 5253470, 3502795, 1290789, -442069, -838656, 496887, 2586335, 3354873, 1915646, -231157, -1370840, -1857172, -2775271, -3604766, -3437886]
6502c437886j74986k617599l870323j152932K899962L550540Q45813p64372O91722
6493d030061K237427J038910j604946k794959j722877P68327L845547O064953
6485C802321N259946J325877k345034k460679P4490J662579P89899q43677j508136
6476E757586j428922j280852o73471Q71511K495916K526490J82324l529133o437287
6467a515838o851034m973734k559253r02008L66017K053721L773147M483903M083218
6458b041861L218998J891883k91653k539738l173385j886187k29525P06992J572303
6449b772173K899828L643316K959443J980211J916007J599099o14741l226393
6441H384597k966095J7679J659106j19630k224373j318551R54146R00877j239712
$$ y = [-3437886, -3612872, -6230471, -10100794, -11253726, -8353764, -4803224, -3957411, -4721783, -4030061, -1792634, -753724, -2358670, -5153629, -6876506, -6108179, -2262632, 3802321, 9062267, 10388144, 8043110, 5582431, 5656921, 7319500, 8109399, 7265722, 5757586, 4328664, 3047812, 2374341, 3245852, 5741768, 8268258, 8450582, 4921449, -1515838, -8366872, -13340606, -15899859, -16801867, -16435850, -14382129, -10608982, -6125079, -2041861, 1177137, 3069020, 2777367, 237629, -2935756, -4821943, -5051468, -4344476, -2772173, 127655, 3770971, 6730414, 8710625, 10626632, 12225731, 11610990, 8384597, 5418502, 5436181, 7095287, 6975657, 4751284, 3432733, 4386879, 5287756, 4048044]
6432D048044k243739j567973j553544k241139q95700K332240L187298m6312l159378
6423b140203k399755k04994n39106k024415q31103K050945K296965p3927n41441
6414d407034K169828M029578K718269J216213J992102K491859j79932l890444
6406F140439m658955k545980n78250L07192J476800K827255K388005k78308k858707
6397B219491k892882k40106K954115L981296J987799p30184j068639P90715J527371
6388H528976m46376k838575l373022k823349k303649p89253J940368L052011R03153
6379A850284j231061J60341K749253J782863k081179l696201j549938M56914k48190
6370a806914j470626p85587Q60417J717886J817967J462611K43919j157601j087724
$$ y = [4048044, 1804305, 236332, -1317212, -3558351, -4454051, -2121811, 1065487, 1019175, -2140203, -4539958, -4744952, -5284058, -7308473, -8139576, -6088631, -3791666, -3865593, -4407034, -2237206, 1792372, 4510641, 5726854, 7718956, 10210815, 10030883, 6140439, 1481484, -1064496, -1642746, -1335554, 141246, 2968501, 5356506, 5078198, 2219491, -673391, -913497, 2040618, 6021914, 8009713, 7279529, 6210890, 7001605, 8528976, 8082600, 5244025, 1871003, -952346, -3255995, -4045248, -2104880, 947131, 1850284, 619223, 779564, 3528817, 5311680, 3230501, -465700, -2015638, -1558724, -1806914, -3277540, -4063127, -3202710, -1484824, 333143, 1795754, 2039673, 882072, -205652]
6361b05652J87282N73019j95147j36995J119927J545033N21779j69272J5457l46938
6351B908493r34965L30582K474356J638118k194399m014953j757743L06048n59791
6342a804254n29051L083688N200459Q39907n249042m859444Q98050L605990P53823
6333A940126j746814l04044J535660O73810o52157k82599n7332j205728j365274
6324a464352M78961J103615j279711k998193o35476L022153L097602k16938k800237
6315a692576k634569p80588J729781M113311M490353K039948o82840r83601k67908
6306E331311j398169l085327j368273L518063O322377L917931n48182k437437
6298A0252294j545050r91645k278114l910332l995332k199330N33706K737289
$$ y = [-205652, -18370, 554649, 359502, 222507, 1342434, 2887467, 3409246, 3239974, 3255431, 2908493, 1973528, 2304110, 4778466, 6416584, 4222185, 207232, -1550511, -1244463, -1804254, -2333305, 750383, 5950842, 6790749, 1541707, -3317737, -2419687, 1186303, 1940126, 193312, -110732, 1424928, 2098738, 1446581, 1163982, 1106650, -99078, -1464352, -985391, 118224, -1161487, -4159680, -4795156, -1773003, 1324599, 1107661, -1692576, -4327145, -5107733, -3377952, 735359, 5225712, 7265660, 6582820, 5599219, 5331311, 3933142, 847815, -520458, 2997605, 9319982, 13237913, 12689731, 10252294, 8707244, 7715599, 5437485, 1527153, -2468179, -4667509, -4133803, -1396514]
6290a396514L036242J225166j121906j981478j056555K2537m9991n00880K93690
6281a529689K231652L335137K478339J046923R14525J709931J537091p6682j588084
6272A0059143j763141j079789o26724r29163j966594l028346k669956m53259J488103
6263i69726P97189j232896r27994K104040L835993J768417j284504j719066m91898
6254A879555p44881k341412k536369q35295N58071O60102O56121R96435O63690
6245a043983m20248j020498r24424j125502j465795o60745J041387J837384J421633
6236b360791J431919K298215K356166R25410l78733m46315k51159n04464k90929
6227B779319O39115Q01193k47493o75456K26904J07457k557838n094382m159429
$$ y = [-1396514, 1639728, 2864894, 1742988, -238490, -1295045, -1272508, -1322499, -1823379, -1529689, 701963, 4037100, 6515439, 7562362, 8476887, 10186818, 11723909, 11647227, 10059143, 8296002, 7216213, 6589489, 5660326, 3693732, 665386, -2004570, -2457829, -969726, -172537, -1405433, -2333427, -229387, 3606606, 5375023, 4090519, 2371453, 1879555, 1134674, -1206738, -3743107, -4578402, -4020331, -3360229, -2704108, -1707673, -1043983, -1464231, -2484729, -3409153, -4534655, -6000450, -6661195, -5619808, -3782424, -2360791, -928872, 1369343, 3725509, 4650919, 4272186, 3825871, 3574712, 3070248, 2779319, 3418434, 4219627, 3972134, 3296678, 3523582, 3631039, 1073201, -4021181, -8180610]
6218h180610p47485J565209J886804K016514K256670J183232n53730j91938K537912
6209A772578M242046K680417k38491j951297k884591m246698m562940j676302
6201f865278K889410M909469K951000J46072k75732J075445J563384M44658q60276
6192E978152j355892j327353r59607l9695P72779J93369j518438k255627r17009
6183a429321Q88425J266096P77650J036657J763001J513304O45064R06075K129675
6174I496626K081565J09658j750467k226131k572875l426189k793417L75608L079741
6165B374119K018319j116125j782384O21497K002873N2098k241122j218001K105640
6156B816914L668381J739462j611110l701238l903639l110341j999262m61344
$$ y = [-8180610, -8928095, -7362886, -5476082, -3459568, -1202898, -19666, -573396, -765334, 1772578, 6014624, 8695041, 8456550, 6505253, 3620662, -626036, -5188976, -6865278, -3975868, 933601, 3884601, 4030673, 3754941, 4830386, 6393770, 6838428, 5978152, 4622260, 3294907, 2335300, 2295605, 3068384, 3261753, 1743315, -512312, -1429321, -540896, 725200, 1502850, 2539507, 4302508, 5815812, 6460876, 7366951, 9496626, 11578191, 11687849, 9937382, 7711251, 5138376, 1712187, -1081230, -705622, 2374119, 4392438, 3276313, 1493929, 2115426, 4118299, 4170397, 1929275, 711274, 2816914, 6485295, 8224757, 6613647, 2912409, -991230, -4101571, -6100833, -6562177]
6148f562177J648167L551367L684351J344843j839112l015033j235005J158239
6140a264360J078525j547844l376251j445213K925130M950865J827291l279117
6132a30974m349469P2228M639488L862259q34734l357023j291166J396384N07853
6123E14846k782363m265716k365312Q05777K714801K503105N35887j977702l046040
6114g362717j484966J199734J996534L6558k081272j432857J489325L237903J577089
6105b824669j784759l317280j985083j35033J74280K7361J355272L125167K462403
6096b902341n71402k265639l57805K769446L758920K869066K396852K270630N10448
6087H478175k527964l795455j975326O40871J836933K501751M189973N579807
$$ y = [-6562177, -4914010, -1362643, 2321708, 3666551, 1827439, -1187594, -2422599, -1264360, -185835, -1733679, -5109930, -6555143, -3630013, 1320852, 3148143, -130974, -4480443, -4408215, 231273, 4093532, 3258798, -98225, -1389391, 6993, 514846, -2267517, -6533233, -8898545, -8092768, -5377967, -2874862, -2338975, -4316677, -7362717, -8847683, -7647949, -5651415, -5614857, -7696129, -9128986, -7639661, -4401758, -2824669, -4609428, -7926708, -9911791, -10046824, -9872544, -9845183, -8489911, -5364744, -2902341, -3473743, -5739382, -6097187, -3327741, 431179, 3300245, 5697097, 7967727, 8478175, 5950211, 2154756, 179430, 820301, 2657234, 5158985, 9348958, 14928765]
6079A4928765L823754j182162n977755p206035m819481j413827N94470P20728
6071e31543P0766j26926L10944O38000K99732m11473r56733j272840j395208q67275
6061d242556N43754J728994J116068q65445j464933J014704M326385M539359J135811
6052G832141k128206k166970l54810K54859k48636O65183L131296M056729J912558
6043A2954144n49548k16257J811950J901710r86946m182842m932444l170037o39252
6034A990478J152890J794292J762928J526835N40138k049838n088939n420789
6026c792005j878737K204216K906313R93633K26945J183411Q03425j534547k059152
6017i46498J183435M190094K521222j892530l563730j381240O66222J70326p65444
$$ y = [14928765, 18752519, 17570357, 11592602, 4386567, -432914, -1846741, -1252271, -531543, -460777, -587703, -276759, 361241, 660973, 249500, -707233, -1980073, -3375281, -4242556, -3698802, -1969808, -853740, -1719185, -3184118, -2169414, 2156971, 6696330, 7832141, 5703935, 3536965, 3182155, 3437014, 3188378, 3853561, 6984857, 11041586, 12954144, 12404596, 12188339, 14000289, 15901999, 14915053, 10732211, 5799767, 2629730, 1990478, 3143368, 4937660, 6700588, 8227423, 8767561, 6717723, 1628784, -3792005, -5670742, -3466526, -560213, 433420, 660365, 1843776, 2647201, 1112654, -946498, 236937, 4427031, 6948253, 5055723, 1491993, 110753, 776975, 947301, 181857]
6008A81857r9348O22802o30678k572832k479450k93553J625529K158612K592122
5999A105061L996243N166665M062016O28976k685264l493525k185950j395104
5991E199118k559319l987117l240641n43109J761960K604362K929899L048103
5983E213256J804175o59239j833467l73300J365393P14903j019882o91765J257683
5974E777757J147782j948410m229684k628936Q28385K392795J969972K213820
5966E523481L568401L448068M14367l437739n100672m045056k192575j519507
5958c341232k272521k978430k060706J75402J715787J753462K273851M873146
5950A38759O987771M419969k109674o438262m694375m62894N78948j295128j171106
$$ y = [181857, 82509, 705311, 74633, -2498199, -4977649, -5271202, -3645673, -1487061, 1105061, 5101304, 10267969, 14329985, 14958961, 12273697, 8780172, 6594222, 5199118, 2639799, -1347318, -4587959, -5131068, -3369108, -764746, 2165153, 5213256, 7017431, 6358192, 4524725, 4151425, 5516818, 6231721, 5211839, 4520074, 5777757, 6925539, 4977129, 747445, -1881491, -1053106, 1339689, 3309661, 5523481, 9091882, 12539950, 12954317, 9516578, 4415906, 370850, -1821725, -3341232, -5613753, -8592183, -10652889, -10477487, -8761700, -7008238, -4734387, 138759, 7126530, 11546499, 9436825, 2998563, -1695812, -2158706, -1579758, -2874886, -4045992]
5941d045992K269097M501481K070883k298578l884448k400134j073759r12306
5933e773756L57943L494654N369913L263348o22749j631249R79564K903600P80310
5924I121578l108226m186076k089640p71477k199951l345240j059943K790349
5916d848626L923529J822132J3526N69625J648477J140512k55558j043519j548295
5907A421803k520893k913754j378026J016018J837007P08035l53087k9324O78362
5898a533859L71036o70583j114913m18179P46793J544344J878236K167245K396283
5889E366403J756975k34287k363940k484337j74994K268394K349101J66885k170729
5880D479471l123636k528741o18305K082086M102923L985703K141390M22355l33972
$$ y = [-4045992, -1776895, 2724586, 4795469, 2496891, -1387557, -3787691, -4861450, -5773756, -5415813, -1921159, 3448754, 6712102, 6089353, 4458104, 5437668, 8341268, 9121578, 6013352, 1827276, -262364, -1033841, -3233792, -6579032, -7638975, -4848626, -925097, 897035, 910561, 1480186, 3128663, 4269175, 4013617, 2970098, 1421803, -1099090, -4012844, -5390870, -4374852, -2537845, -1829810, -2182897, -2212221, -1533859, -1162823, -1833406, -2948319, -3366498, -2619705, -1075361, 802875, 2970120, 5366403, 7123378, 6889091, 4525151, 2040814, 1865820, 4134214, 6483315, 6650200, 4479471, 1355835, -1172906, -1791211, 290875, 4393798, 8379501, 10520891, 10943246, 10609274]
5871A0609274r80524k120524l078146l280364l083882k522244q63266J535679
5863c783997K558941J091332q47595o72054R09869Q28665j766139m117255l548164
5854i346397o40285K170009L599513L860261L129834J345667o69072j230129N10621
5845B730022L301277M621810L002039l38347k479167j934358l91261l42542j429071
5836F740402j019332J309787K390508J68528k481769j503370K095384L292505
5828A0992643K47150l245425l520044j783668j011608j045338J58215K247560
5820C039485K864489J599345M51655M03369K98194n07354q48625J28159J468918
5811H897635J805908Q04184j145780l140654l507122j233136J932959K789719
$$ y = [10609274, 9628750, 7508226, 4430080, 1149716, -1934166, -4456410, -5319676, -3783997, -1225056, -133724, -981319, -1653373, -743504, 85161, -1680978, -5798233, -9346397, -9986682, -7816673, -4217160, -356899, 2772935, 4118602, 3449530, 2219401, 2730022, 6031299, 10653109, 13655148, 13316801, 10837634, 8903276, 8512015, 8169473, 6740402, 5721070, 7030857, 9421365, 9589893, 7108124, 5604754, 7700138, 10992643, 11239793, 7994368, 4474324, 2690656, 1679048, 633710, 791925, 3039485, 5903974, 7503319, 7954974, 8358343, 8656537, 8149183, 7300558, 7428717, 8897635, 10703543, 11507727, 10361947, 7221293, 3714171, 2481035, 4413994, 7203713]
5803G203713P09761j591053j977865j401087j445861j657637r55450J24784M45932
5794e44763J85488J10738J50475J02500M32854J000004N36754j069455j736376
5785h31781l02122J108432J19615k101939k650785j062063J050422L149457N385107
5776C864343O138381L589814o27404k826757k269705j468318j614704j353678
5768C431972l13709N8351j03555J156509L296927K815768j080724m303458l775061
5759A183020j807206j689816k380847j217103R35919J410070O71887J278873K963645
5750A348442K788764q2305l136976l953071k180255J387996M923310N481944K049611
5741H627460j790868j636283J555577K745604K94420k058696j585299n25387j538845
$$ y = [7203713, 7913474, 6322421, 4344556, 2943469, 1497608, -160029, -1115479, -990695, -544763, -359275, -248537, -98062, 4438, 437292, 1437296, 1974050, 904595, -831781, -1133903, -25471, 94144, -2007795, -4658580, -5720643, -4670221, -1520764, 3864343, 10002724, 13592538, 12965134, 10138377, 7868672, 6400354, 4785650, 3431972, 3118263, 3176614, 3073059, 4229568, 7526495, 10342263, 9261539, 4958081, 1183020, -624186, -2314002, -4694849, -5911952, -4976033, -3565963, -2894076, -1615203, 1348442, 4137206, 4054901, 917925, -3035146, -5215401, -3827405, 1095905, 6577849, 8627460, 6836592, 5200309, 6755886, 9501490, 9795910, 7737214, 6151915, 5626528, 4087683]
5732D087683l076753k416009m89622j38097j274669j335217K49250J318821P05196
5723b369417j37564K17320J114818J267333N79839m35900j783622l390907m202961
5714i141061l080853m31985J946080K749124K279857J537768Q63326J6918q24170
5705d084996r91836l04282O00807J118691J207806Q67190o5052j163920j405351
5696d220943o03659M1190k69677n17328N59855K247597K684007J451303j29673
5687A242672r99742j207099r86876m92636l13539p74940q68329N35161K530913
5678a334415L014503J696641L98364J35039j05264j212180k516852l129435k929849
5669e983448j712464O96988K896201K697071L34794j376419j121123q20255j900655
$$ y = [4087683, 1010930, -1405079, -1894701, -2032798, -3307467, -4642684, -4393434, -3074613, -2369417, -2506981, -2289661, -1174843, 92490, 672329, 236429, -1547193, -4938100, -9141061, -12221914, -12653899, -10707819, -7958695, -5678838, -4141070, -3277744, -3260826, -4084996, -5076832, -5381114, -4780307, -3661616, -2453810, -1586620, -1651672, -2815592, -4220943, -4824602, -4783412, -5053089, -5570417, -5010562, -2762965, -78958, 1372345, 1242672, 242930, -964169, -1951045, -2443681, -2757220, -3532160, -4400489, -3865328, -1334415, 1680088, 3376729, 3775093, 3910132, 3804868, 2592688, 75836, -3053599, -5983448, -7695912, -6998924, -4102723, -1405652, -1070858, -2447277, -3568400, -4388655, -6289310]
5660f289310k565456r47512J446006K100675J320676Q30924L40639j187640k165450
5651g116448l8971M096552O126879M363641J185491j087812k723911m177829m331419
5642c703827k699227r71359o53203r85438p02654j62013j26013P1373J285898
5633h646463K496158J917869j45203j269885l9556J970566K104638R5583j418033
5624b934326m23859J354004O87884j919004k034513K196186O246580N023492L39104
5615H535548j713705J87073J288981j034985l227197j966787J85298o23765k790336
5606a159875j745867K572560N304779L488875l62224k094647p65834J155340R83842
5597G376949j299245k893991j404365J623918K125391p80823l048740j437043
$$ y = [-6289310, -8854766, -9802278, -8356272, -6255597, -4934921, -4103997, -3763358, -4950998, -7116448, -7155419, -3058867, 3068012, 7431653, 8617144, 7529332, 4805421, 627592, -3703827, -6403054, -7374413, -8027616, -9013054, -9715708, -9877721, -10003734, -9932361, -8646463, -6150305, -4232436, -4377639, -5647524, -5687080, -3716514, -1611876, -1516293, -2934326, -3358185, -2004181, -1316297, -3235301, -5269814, -3073628, 3172952, 8196444, 8535548, 6821843, 7008916, 8297897, 7262912, 4035715, 2068928, 2254226, 1630461, -1159875, -2905742, -333182, 4971597, 8460472, 8098248, 6003601, 5237767, 6393107, 7376949, 6077704, 3183713, 1779348, 3403266, 5528657, 4747834, 1699094, 262051]
5589B62051J750972K466430R65197L20653P48036j58913k411364l390437k527631
5580a975006j880383j779535l18913K101319K289993k34113j619592M04455L005629
5571f146L030890J517580O53395j42630j814727k645389j355994k89666j407428
5562b460115j892869J343356N033032L407005k187197m045318N19485M779999
5554D497378K401175l486398n307854j758944J540883Q43049j149988l07429K948048
5545B19920M767466L141096j38241k195597j910305P9641K470553L489944J482546
5536A1407023k939271o115729m890038p83482J748700J381633J203857K939161
5528C951854L529376J91004m170341m574932j193956J362009J086116L65432P61003
$$ y = [262051, 2013023, 4479453, 5444650, 5765303, 6513339, 6354426, 3943062, 552625, -1975006, -3855389, -5634924, -5953837, -3852518, -1562525, -1796638, -3416230, -3011775, -6146, 3024744, 4542324, 5195719, 5053089, 3238362, 592973, -763021, -1052687, -2460115, -4352984, -3009628, 2023404, 5430409, 3243212, -802106, -282621, 4497378, 6898553, 3412155, -1895699, -3654643, -2113760, -1270711, -2420699, -2728128, 219920, 4987386, 8128482, 7990241, 5794644, 3884339, 3963980, 6434533, 9924477, 11407023, 8467752, 2352023, -2538015, -3321497, -1572797, -191164, 1012693, 3951854, 7481230, 7672234, 3501893, -1073039, -2266995, -904986, 181130, 546562, 1307565]
5519A307565P01819n60569j093375k36930m36340k612443l314673J34328M434249
5510a676369M243964k16588l464596k185862J202841K776021J870170N67378N03907
5501C620866J513632K376251J941899J4721k320904l420891k307460O70934L938851
5492F027899N468861M327236J728685l21574j549038l237405n327575n707020
5484A410069l379164l13834J339014J855204J885883J45443l817234o382190l544875
5475a0801684K611205N418116K340321j840268k208367k42581j94102j912007
5467f829367j523162J761306L843538J670198k245744l204149l64045K808970
5459d082455L357865J873974M96184j86477r92105j961589j991151o84628P20979
$$ y = [1307565, 2009384, 1448815, 355440, 118510, -317830, -2930273, -6244946, -6110618, -1676369, 2567595, 2351007, -1113589, -3299451, -2096610, 679411, 2549581, 3116959, 3620866, 5134498, 7510749, 9452648, 9467369, 7146465, 3725574, 1418114, 2089048, 6027899, 11496760, 15823996, 17552681, 17231107, 15682069, 12444664, 7117089, 1410069, -1969095, -2282929, -943915, 911289, 2797172, 2942615, -874619, -7256809, -10801684, -8190479, -2772363, -432042, -2272310, -4480677, -4723258, -4917360, -6829367, -8352529, -6591223, -2747685, -1077487, -3323231, -6527380, -6891425, -4082455, -724590, 1149384, 1645568, 1459091, 466986, -1494603, -3485754, -4170382, -3449403]
5450c449403Q56799r6079q54578p55768m29755q07352j807546k214024j026056
5441a0583762J152434K698457L174916L865335N212565N074905J548786l258540
5433H885096m997479k754064j98360l54267k049076k847705k636158k244551j070205
5424a0266769J299122L080898K673551J404355J194484J180257k72323j838462
5416a544887j176101O51588P80372j90845R40116L893372M484222J263623j950737
5407G150723j910443k52206J63319m47212o56602p44897j045978l02276J518467
5398C472895J629969j122014k909747M0957N038411N912308J471731l250793m067624
5389F216093k032581k64770J10421l20435q83927p94549O02810K487984K938982
$$ y = [-3449403, -2592604, -2688683, -3543261, -4299029, -4728784, -5536136, -7343682, -9557706, -10583762, -9431328, -6732871, -3557955, 307380, 5519945, 10594850, 12143636, 8885096, 3887617, 1133553, 935193, 580926, -1468150, -4315855, -6952013, -9196564, -10266769, -8967647, -5886749, -3213198, -1808843, -614359, 565898, 293575, -1544887, -2720988, -2069400, -1289028, -1479873, -539757, 3353615, 7837837, 9101460, 7150723, 5240280, 4988074, 5151393, 4704181, 4047579, 3302682, 2256704, 1954428, 3472895, 5102864, 3980850, 1071103, 1112060, 6150471, 12062779, 13534510, 10283717, 6216093, 4183512, 3918742, 4029163, 3708728, 2824801, 2030252, 2633062, 5121046, 8060028]
5380H060028J388899o07326j508153j325430p31121j35484l9542p88101j504488
5371B809282p50553J232359K401360J617030K9688q97755j249595j616623j596362
5362A978831n92124Q45668J684507J750105J407944O17314o00330j355620q30370
5353D905925K28708J74336j312908k673676k415492q43622N00478N91511k22920
5344a067660p44798n7465J535442K536804J671956m50516j652766p14203R51495
5335B008289J076676l30702j018420J11912J259857M84499j123299r00037J293615
5326B862390K563210R37394j958563l074909j493608J199144L121307L535860
5318G692225K642313J015702p84689k518097l987693m417691k935500j01582J992358
$$ y = [8060028, 9448927, 8841601, 7333448, 6008018, 5276897, 5141413, 5101871, 4313770, 2809282, 2058729, 3291088, 5692448, 7309478, 7339166, 6441411, 5191816, 3575193, 1978831, 1386707, 2232375, 3916882, 5666987, 7074931, 7692245, 7091915, 5736295, 4905925, 5134633, 5308969, 3996061, 1322385, -1093107, -1936729, -1436251, -844740, -1067660, -1812458, -1869923, -334481, 2202323, 3874279, 3423763, 1770997, 1056794, 2008289, 3084965, 2754263, 1735843, 1847755, 3107612, 3592111, 2468812, 1568775, 2862390, 5425600, 6362994, 4404431, 1329522, -164086, 1035058, 4156365, 7692225, 10334538, 11350240, 10565551, 8047454, 4059761, -357930, -3293430, -3395012, -1402654]
5309a402654J981204Q56449L91623N66877j64616k179929l580504k400415P19299
5300e212666K864083J967624q69427k673668k034071l72241M97110Q52213J955922
5291c025121L419300L539970K082202P92847P58658R50404R6223j417030k362461
5282D834992k328534j811437j434894j511334j701956j119590M17235J737397
5274b918121K170587L077546N404100O744540M087505r44191l590922l022916
5266A1008128l335588o178550p418284l941009Q47365K204419Q89393M60215J113539
5257d350372J130522J577646M014352N653259K807374k096119l106833J44125
5249E773954K169098O41476p67298K27840P04243j444407l334386k265784m45687
$$ y = [-1402654, 578550, 1434999, 1826622, 2393499, 2228883, 48954, -3531550, -5931965, -5212666, -2348583, -380959, -1250386, -3924054, -5958125, -6330366, -5833256, -4981043, -3025121, 394179, 3934149, 6016351, 6809198, 7567856, 8518260, 8614483, 7197453, 4834992, 2506458, 695021, -739873, -2251207, -3953163, -5072753, -4655518, -2918121, -747534, 2330012, 7734112, 14478652, 18566157, 17621966, 14031044, 11008128, 7672540, 1493990, -5924294, -9865303, -9017938, -6813519, -5924126, -5463911, -4350372, -3219850, -1642204, 2372148, 8025407, 10832781, 8736662, 5629829, 5773954, 7943052, 8584528, 7817230, 8045070, 8749313, 7304906, 3970520, 1704736, 1259049]
5240A259049r36552k606199k698020j428361o72440o11333o88540j454731k595977
5231a2433104j633112K359199O064835O133046L939426K848217K757557J165514
5223A1201578j719796k953201j555610J99721L40618o73837j545652j655859q87965
5214G49997L14337Q36854K18665n04812n67571r07137k162257k696981r21244
5205e640149J649094K297475J148874M78078O43820j68555k255865l562023k993611
5196h402862j798437r44661K66681J981360K614195J339233j28437J56791J610883
5187c305254K190668J280153O5995m01460j97301K42921P42768J014027M54181
5178B086698j105965k680208k798967j196544O51601J227837P57713M60463N42745
$$ y = [1259049, 322497, -2283702, -4981722, -6410083, -7082523, -7693856, -8382396, -9837127, -12433104, -14066216, -11707017, -5642182, 490864, 4430290, 7278507, 10036064, 11201578, 9481782, 6528581, 4972971, 5172692, 5513310, 4839473, 3293821, 1637962, 749997, 1064334, 1901188, 2119853, 1615041, 1047470, 140333, -2021924, -4718905, -5640149, -3991055, -1693580, -544706, -66628, 577192, 408637, -1847228, -5409251, -8402862, -10201299, -11145960, -10879279, -8897919, -6283724, -4944491, -5072928, -4916137, -3305254, -1114586, 165567, 231562, -169898, -367199, -124278, 618490, 1632517, 2086698, 980733, -1699475, -4498442, -5694986, -5043385, -3815548, -3057835, -2597372, -2054627]
5169b054627L57646K59309J264502K578704J862165r65171k607759r11251J697200
5160A480718J804082K59505N66632K891498L303025n50240n971974q500799o539809
5151a1257362j770064L067045N559148M454400P88974k482375l163059j809246
5143f612539m49943N3137N07232J588532K538392K080799K80995j181200r68110
5134b162705J53108L54725o37809j243961n86863J98847R9301J34186J576397
5125b114774L329315L029765M01166k286100l115568k312762r42353O32821K312548
5116a065942L402908L210601K134493J368567J383747J214402k05171k180544
5108I263061k753401j473225l19956o52523p79308J113737K912020J064737l113175
$$ y = [-2054627, -1696981, -1437672, -173170, 2405534, 4267699, 3302528, 694769, -216482, 1480718, 3284800, 3544305, 4110937, 7002435, 10305460, 9755220, 3783246, -4717553, -11257362, -13027426, -9960381, -4401233, 53167, 842141, -1640234, -4803293, -6612539, -7062482, -7009345, -6502113, -4913581, -2375189, -294390, -13395, -1194595, -2162705, -2009597, -1654872, -2292681, -3536642, -4123505, -3924658, -3825357, -3691171, -2114774, 1214541, 4244306, 4645472, 2359372, -756196, -3068958, -4011311, -3378490, -1065942, 2336966, 5547567, 7682060, 9050627, 10434374, 11648776, 11443605, 9263061, 6509660, 5036435, 4716479, 4063956, 3284648, 4398385, 7310405, 8375142, 5261967]
5099E261967m064207j93987L028237R06149l499694m130373o75158K079331J812759
5090E25024O94060N00355L83369j31289J04447J243273J743675J080917M52379
5081F596210K58147m53406j582074j758789j083526j338570k730162l062253j103383
5072f257806J564418K907826K474070N18529k402426m298752k949239O86020K846347
5063d911013J935390M39752N04571N41159j510663m052820l915707j112307J362871
5054a0718767J810822J385785J534014K041755K040231J466663Q87296N81348
5046A029147K70050l66999r88126o56218Q90346K241786J544421j081537l271216
5037c88346l002938p90281J126497J275174K39139l33648K25933P79936L1776
$$ y = [5261967, 1197760, 1003773, 4032010, 4938159, 1438465, -2691908, -3367066, -1287735, 525024, 1219084, 1719439, 2102808, 1971519, 2075966, 3319239, 5062914, 6143831, 6596210, 6854357, 6400951, 4818877, 3060088, 1976562, 637992, -2092170, -5154423, -6257806, -4693388, -1785562, 688508, 1207037, -1195389, -5494141, -8443380, -7757360, -4911013, -2975623, -2535871, -2031300, -1490141, -3000804, -7053624, -10969331, -12081638, -10718767, -8907945, -7522160, -5988146, -3946391, -1906160, -439497, 447799, 1029147, 1299197, 932198, -55928, -712146, 178200, 2419986, 3964407, 2882870, -388346, -3391284, -4181565, -3055068, -1779894, -1540755, -1874403, -1648470, -868534, -836758]
5028h36758j240744q50411J530685L321520K300329m50516k168934j684540L51856
5019B72487L048069N237996N178156K412358r64788k750822l255994l752987l916662
5010A507813l000544j825777j044275O81867L790167N258048K709486r08160j227350
5001E941275P01582P13108p19761N97680M115295M060548r74363m688129k403320
4992G343915J999403K481658m52398k058881j057652k40558j076314j868433r38981
4983D131759J108123K384137J661587m50063j974983j902841j441194j548096
4975A968429p19929K024489L682734J011804l420822m113614j131380J56860j783763
4966b325192k306619J002994M096494L421370J174748K92806l38172k014038k641326
$$ y = [-836758, -2077502, -2927913, -1397228, 1924292, 4224621, 3774105, 1605171, -79369, 272487, 3320556, 8558552, 13736708, 16149066, 15184278, 12433456, 9177462, 5424475, 1507813, -1492731, -3318508, -4362783, -3680916, 109251, 5367299, 8076785, 7168625, 5941275, 6642857, 7355965, 6636204, 7233884, 11349179, 15409727, 14435364, 9747235, 7343915, 9343318, 11824976, 11372578, 9313697, 8256045, 8015487, 6939173, 5070740, 4131759, 5239882, 7624019, 9285606, 8835543, 6860560, 4957719, 3516525, 1968429, 1248500, 3272989, 6955723, 7967527, 4546705, 433091, -698289, -541429, -2325192, -4631811, -3628817, 467677, 3889047, 5063795, 5356601, 5018429, 3004391, 363065]
4957C63065r61922K45377r05429j600879O99555L653121M163987L027893J858210
4948A0542978k90995l495669m604314k242163J59490N7807j87010J268065J675109
4939B883298o27996k103372m85897M58746j832498k827159J224905N414663L693652
4930E798342r90118k156349o50898j373566l238440j686098J725444J532188j722741
4921b762236k513056Q4708J926838J712075J746624K053915R01899k77325O78886
4912C552328J376809j151854l881665k452283O90412N45606j391621n78502J594761
4903a696009J026912n54588N48980J628845j158688l606217k76695M232848K603560
4894B748948j664718r79266J516549j438366n223773p98898O591879M822546k902654
$$ y = [363065, -598857, -353480, -1258909, -2859788, -2160233, 1492888, 5656875, 8684768, 10542978, 10251983, 6756314, 2152000, -90163, 69327, 127134, -59876, 1208189, 2883298, 2255302, 151930, -333967, 124779, -1707719, -4534878, -3309973, 2104690, 5798342, 4808224, 2651875, 2000977, 627411, -2611029, -4297127, -2571683, -1039495, -2762236, -5275292, -5190584, -3263746, -1551671, 194953, 2248868, 3150767, 2873442, 3552328, 4929137, 3777283, -104382, -2556665, -1866253, -1320647, -2712268, -3290770, -1696009, -669097, -1223685, -674705, 954140, -204548, -3810765, -4087460, 145388, 2748948, 1084230, 104964, 1621513, 183147, -5040626, -5839524, 752355, 5574901, 2672247]
4885B672247l371802K593554L436403P87632N172955J0879689M114335n805896
4877B0479117K011591J7456553J1780444j137801K9138791R7991900J18241065
4870B95961660L3011117q7966005j27603395p1002427q654595k097132j9212891
4863A2436332j2780013O148174N616171p614897p195484N025696Q334802J203673
4855A1174454k176518m34708k575904o379107l098371L299103K405276k982442
4847g68217k201055L421559L674604j506364k721098J649558M011704J993443
4839G554134P56262J614164N08586k416620k521268J21747O92706j478524k434583
4830B396604j310996p36146o63807P54196J701004n61506l359872k388805L57744
$$ y = [2672247, -699555, 1893999, 5330402, 6118034, 11290989, 22170678, 26285013, 20479117, 22490708, 39947261, 51727705, 50589904, 79728695, 177720595, 295961660, 328972777, 241006772, 113403377, 42400950, 33746355, 31649223, 12436332, -343681, 5804493, 11420664, 3805767, -3389717, 1635979, 9970781, 11174454, 8997936, 8563228, 5987324, -391783, -3490154, -191051, 2214225, -768217, -2969272, 452287, 4126891, 2620527, -100571, 1548987, 5560691, 7554134, 8310396, 9924560, 10433146, 8016526, 5495258, 5617005, 6309711, 4831187, 2396604, 1085608, 349462, -314345, 439851, 2140855, 1579349, -1780523, -4169328, -3811584]
4821c811584J15026j564667L14606M163440L758125o78704k535324n5152J432744
4812A138510m61533j547053N16417J977488Q8678k176654j689227k171L95230
4803a760315J19417N21816J138891J655537K880261M096506L006435j49039j999915
4794I509594j181427n16630k145994l735305k016213K117621M418500K139119
4786H589265l266873p580387p481260l546106M58294J830345J468708J299960
4778h228054J209980N44651N49934K326953L944858K935835N03924k17661P88275
4769D358695P25373j213792k939876l165555k647450j819951l89459P78609M69380
4760e844026k88180N01442K146741K157984O73609M56898K102227K727829M29669
$$ y = [-3811584, -3696558, -5261225, -4946619, -783179, 2974946, 2296242, -239082, -294234, 1138510, 676977, -870076, -353659, 1623829, 1712507, -464147, -2153374, -2155545, -1760315, -1640898, -1119082, 19809, 1675346, 4555607, 8652113, 11658548, 11509509, 9509594, 8328167, 7811537, 5665543, 1930238, -85975, 2031646, 6450146, 8589265, 5322392, -2257995, -9739255, -13285361, -12827067, -10996722, -9528014, -8228054, -7018074, -6473423, -5923489, -3596536, 348322, 3284157, 3788081, 3570420, 4358695, 5084068, 3870276, 930400, -2235155, -4882605, -6702556, -7092015, -6313406, -5844026, -6132206, -5630764, -3484023, -1326039, -652430, -195532, 1906695, 4634524, 5064193]
4751E064193k839826l998826k313280O51378K821927K938228J506869M09782N05862
4742D746307N76500j04679r1261J260542J524291r79004l402936k350813L93041
4733A571988P27760q21538l89496J918524J876177j530551m313377l930937k262908
4724g154358r93140Q18251L050000L385889J650514O07204P79324n61623l357800
4715a775739l191504J388027N198328L750538l45682k230681j777145j416277
4707d00135r48092N74723J060661j268506l243264q48057L776607M824067J408552
4698D936556j509834o95923J547078J744067m15988l007064m241822l283555q65032
4689e791517Q84676J073706J573987L632782M622425J688515k722580l542593
$$ y = [5064193, 2224367, -1774459, -4087739, -3436361, -614434, 2323794, 3830663, 4240445, 4746307, 5322807, 5218128, 5126867, 6387409, 7911700, 6932696, 3529760, 1178947, 1571988, 2299748, 1478210, 1088714, 3007238, 4883415, 3352864, -960513, -4891450, -7154358, -8147498, -7329247, -4279247, -893358, 757156, 1364360, 2143684, 1582061, -1775739, -4967243, -3579216, 1619112, 5369650, 5023968, 2793287, 1016142, -400135, -1348227, -773504, 287157, -981349, -4224613, -5072670, -1296063, 3528004, 4936556, 3426722, 2730799, 4277877, 6021944, 5605956, 2598892, -1642930, -4926485, -5791517, -4906841, -3833135, -2259148, 1373634, 5996059, 7684574, 4961994, 1419401]
4681A419401r11841l05963l983411p248310n377803j07916L675792M493876M321814
4672d024361M415136M331082L736294K498934Q7152k872205l792688j364422J683944
4663D698866J820572l67659j589681j331530k087944m048604l823206n0879L421284
4654c358781K618631r69391k871760j786644k4220R15165J698613K488319K270540
4645I80472J178943N90773M12056r30148l097383l356617o75007K411739L466394
4636I81222L042081K248075L32893k786116m165582j368093L233446N050188L234375
4627I802489Q75790l6859m79587j314927j638804r08837k30808p24357k338564
4618C005536m489891o132721n412899j464898L415946N619398M395301K132415
$$ y = [1419401, 507560, 201597, -3781814, -11030124, -16407927, -16515843, -12840051, -8346175, -4024361, 390775, 4721857, 8458151, 10957085, 11044237, 8172032, 4379344, 3014922, 4698866, 6519438, 6151779, 4562098, 3230568, 1142624, -2905980, -6729186, -6780065, -3358781, -740150, -1709541, -4581301, -6367945, -6392165, -5477000, -3778387, -1290068, 980472, 2159415, 2750188, 3162244, 2232096, -865287, -4221904, -4896911, -2485172, 981222, 4023303, 6271378, 6604271, 3818155, -347427, -1715520, 1517926, 6568114, 9802489, 10678279, 10641420, 10161833, 8846906, 7208102, 6299265, 6068457, 5344100, 3005536, -1484355, -7617076, -13029975, -14494873, -11078927, -5459529, -1064228, 1068187]
4610A068187O19020m87813j411002j300896j96754N44283N30392P96506J424951
4601A586874J143504m5460m44076K30964J5568j748473k654025p92824K038466
4592f69482K596389J78148l118260m827257l811285r87999R24875J28075j363254
4583a0950050N7497L858113N041097J129454l722950m156028n33590K605347L080961
4574c590149K613530K758709K638838R97260j734325l969946m424003k981651
4566g691737q46926M65651O93518P49454J004355Q76022L03278P2651L83765P18497
4556c271472J199257K123134K381495R53562l94444N93537J936219l10009m623526
4547E87753m750464L18119L651891J166931j649886P31459L971181J120706n009508
$$ y = [1068187, 1687207, 1199394, -211608, -1512504, -1709258, -1164975, -634583, 161923, 1586874, 2730378, 2684918, 2240842, 2471806, 2487374, 738901, -1915124, -2707948, -669482, 1926907, 2105055, -1013205, -5840462, -9651747, -10639746, -9714871, -9586796, -10950050, -10892553, -7034440, -1993343, -863889, -4586839, -8742867, -9276457, -6671110, -3590149, -976619, 1782090, 4420928, 5418188, 3683863, -286083, -4710086, -7691737, -8538663, -8073012, -7379494, -6630040, -5625685, -4749663, -4446385, -4373734, -3989969, -3271472, -2072215, 50919, 2432414, 3385976, 2991532, 3585069, 5521288, 5211279, 587753, -4162711, -3844592, -192701, 974230, -675656, 55803, 4026984, 5147690, 138182]
4538A38182n917597j227425J215988j507958l685479j641894Q64953P24352Q14878
4529a0222000L189067L992256L84481l108273j025187M250184O023032L009248
4521F492808o6602k21670N94675K2104j091624n55061J977349M443033M205518
4512A5800530Q23139k690579k821972k40179P48875j591835l645624j825790K022501
4503F579066L464904J686400l34709o42318k06650m67134j457453k306916k056027
4494D259163m74167R06880n8395k721213l442475o98036K014402J161913j289303
4485c41231j198870O64266j75921l994542n536138k011917K328947K416024m62377
4476h311759j326473Q99469K522926J201591q31412n40300J632782K930824K168230
$$ y = [138182, -5779415, -7006840, -5790852, -7298810, -10984289, -12626183, -11761230, -11036878, -10222000, -7032933, -3040677, -2656196, -5764469, -6789656, -2539472, 3483560, 6492808, 6426206, 6204536, 6799211, 6821315, 5729691, 5174630, 7151979, 11595012, 15800530, 16623669, 13933090, 11111118, 10870939, 11619814, 10027979, 6382355, 4556565, 6579066, 10043970, 11730370, 11395661, 10753343, 10546693, 10079559, 8622106, 6315190, 4259163, 3784996, 4691876, 4633481, 1912268, -1530207, -2228243, -213841, 948072, -341231, -1540101, -875835, -1051756, -5046298, -10582436, -12594353, -10265406, -7849382, -8311759, -9638232, -8738763, -6215837, -5014246, -5845658, -6385958, -4753176, -1822352, 345878]
4467C45878N75121n97019j372831j720453p32324J691983L560094K877918M83307
4458E111674j028217r87763j069112j730543r50132J984628L866836J420273l568975
4449C048669n937411l643345J90779K044791K113187K445468L125739K391497
4441E779374j85771k495676k231085L98880K787958K647251L53177j622546j535830
4432C895732q8575Q79136O37443k17804j131501j953756k102311p33412J720752
4423I05704L147696J801636j500571l952252l651824j429431N83897J738608L129859
4414G73322M856505M633930Q42889l941686n059822j727660J696780J572681m00457
4405C246482m87472J283669J711720j70056j645821o11200J452689J867257K64874
$$ y = [345878, 920999, 323980, -1048851, -2769304, -3501628, -1809645, 1750449, 4628367, 5111674, 4083457, 3095694, 2026582, 296039, -654093, 1330535, 5197371, 6617644, 3048669, -2888742, -6532087, -6341308, -4296517, -2183330, 262138, 3387877, 5779374, 5593603, 3097927, 866842, 1265722, 4053680, 6700931, 7054108, 5431562, 3895732, 3807157, 4686293, 5323736, 5105932, 3974431, 2020675, -81636, -815048, 905704, 4053400, 5855036, 4354465, 402213, -3249611, -4679042, -4095145, -2356537, 773322, 5629827, 10263757, 11106646, 7164960, 2105138, 377478, 2074258, 3646939, 3246482, 2759010, 4042679, 5754399, 5584343, 3938522, 3327322, 4780011, 6647268, 6912142]
4396F912142j411754j299471P24304K948151L115890O84843k195810k948783j542661
4387D986851N6396Q62948J351940J245098n93094l474334m591573k597212N16339
4378b236641K270623K454686J783313L4896k588749m128304l097980o70039J317461
4369d860734K903706M321933L747046O1327l448790k252905K677631N288724K340568
4360A0778506k814615n523004n161657l315832m02939K818838L462416K46527
4352H8240k907553j339871L229576M561740R45450k247466m54139L774882M920925
4343A0571784J822189k225266m470249m477252k368017J106915L270236J799504
4335E029844j422237j913381J228658L836801K663284j33881o85540Q58482J299758
$$ y = [6912142, 5500388, 4200917, 4925221, 7873372, 10989262, 11674105, 9478295, 6529512, 4986851, 5043247, 5906195, 7258135, 8503233, 7910139, 4435805, -155768, -2752980, -2236641, 33982, 2488668, 4271981, 4306877, 1718128, -2410176, -5508156, -6178195, -4860734, -1957028, 2364905, 6111951, 6173278, 2724488, 471583, 3149214, 8437938, 10778506, 7963891, 2440887, -2720770, -6036602, -6439541, -3620703, -158287, 88240, -2819313, -4159184, -929608, 3632132, 4577582, 2330116, 1875977, 5650859, 10571784, 12393973, 10168707, 5698458, 1221206, -1146811, -39896, 3230340, 5029844, 3607607, 1694226, 2922884, 6759685, 9422969, 9289088, 8603548, 9462030, 10761788]
4326A0761788l06619j607592r88544K75272M97335p5295l59394k22294j46513
4317G828144k22718k79176k08150K30487J017556J164492k84431k304436k624532
4308D317236j029476q2663j423429l145782k575018k18747J146657M33275q91136
4299c469083j447351j332366r14152j82331M65448M40466K32965R74960K507108
4290b724336L356001K889454K004773J362696M78422r36973k142534k409752j673156
4281B04595J13108K748024M606506L585828Q1010k675671k354144k37146Q50583
4272F922693L7225j262422j413500L6041K107684K869998J169910j688870l193688
4263E585071k686909j592316p06807L55712R38524l10587k219890j805422N95790
$$ y = [10761788, 10455169, 8847577, 7859033, 8134305, 8631640, 8556345, 8196951, 7974657, 7828144, 7605426, 7326250, 7118100, 7348587, 8366143, 9530635, 9246204, 6941768, 4317236, 3287760, 3205097, 1781668, -1364114, -3939132, -4157879, -3011222, -2577947, -3469083, -4916434, -6248800, -7162952, -7345283, -6879835, -6439369, -6206404, -5231444, -2724336, 631665, 3521119, 5525892, 6888588, 7367010, 6430037, 4287503, 1877751, 204595, 317703, 3065727, 7672233, 11258061, 11339071, 8663400, 6309256, 6072110, 6922693, 6959918, 5697496, 4283996, 4320037, 6427721, 9297719, 10467629, 8778759, 5585071, 2898162, 1305846, 599039, 954751, 1893275, 1582688, -637202, -2442624, -1846834]
4254a846834R63774j701033k859351K85918L583280K372680j007281j546742P9171
4245a676418k58401k168039j895412J32142J00379j510336l33744L574539N060380
4236A025090K464054r8734m24443j175618l251404l289152m37320J145187m02327
4227d444667j378456K61791J160597l73098n16030K554122M267378J737090o91025
4218B577702M72838J218124k060259m821398j986155K890694L950810K693459
4210D935815L022704K557535j808787n156098j587737M572400N065157Q69814
4202A2470803j465447j878762l727669m018268L10027K263226l811984p722794
4194g580868l20026J631766k4551927o2216030o3260097j3475817M0401017M9529357
$$ y = [-1846834, -883060, -2584093, -5443444, -5157526, -1574246, 798434, -208847, -1755589, -1676418, -1934819, -4102858, -5998270, -5866128, -5765749, -7276085, -7609829, -4035290, 1025090, 3489144, 3390410, 2965967, 1790349, -1461055, -4750207, -5187527, -4042340, -4444667, -5823123, -5561332, -4400735, -4773833, -5289863, -2735741, 1531637, 3268727, 2577702, 3050540, 4268664, 2208405, -2612993, -4599148, -1708454, 2242356, 4935815, 7958519, 10516054, 8707267, 3551169, 1963432, 6535832, 11600989, 12470803, 11005356, 9126594, 5398925, 1380657, 1690684, 3953910, 141926, -7580868, -7900894, -6269128, -30821055, -93037085, -156297182, -169772999, -129371982, -79842625]
4186g9842625K3528214O077209J0793432J4976278O422548j71015M599836P896702
4178e719421l73173r511795p206561J018865L842756K010806K269959L888428
4170i780136K526690M9280O52307K774254K800122J866817K339750K447429M56848
4161F133361p40411J016848K112377p89831m353156m062538j662384j153844j557686
4152e057264K9087J831735N22459j858088q24070K557654L084214p8756k302874
4143b095903q50758J842843K733520J824987N72280k06500k78592j1240l09162
4134C221475j027099o45268Q40192P75186k077270m629125l630233n99626P93888
4125f977880L00830K20686O39141j53337j439108o85214J777129K755323J230631
$$ y = [-79842625, -56314411, -50237202, -39443770, -24467492, -18044944, -18215959, -13616123, -5719421, -6092594, -15604389, -22810950, -21792085, -17949329, -15938523, -13668564, -9780136, -7253446, -7204166, -6551859, -3777605, -977483, 889334, 3229084, 5676513, 6133361, 5392950, 6409798, 8522175, 7732344, 3379188, -683350, -2345734, -3499578, -5057264, -5028177, -3196442, -2673983, -4532071, -5356141, -2798487, 285727, 206971, -2095903, -2946661, -1103818, 1629702, 3454689, 4026969, 3820469, 3541877, 3530637, 3221475, 2194376, 1549108, 2389300, 3164486, 1087216, -3541909, -7172142, -7771768, -6977880, -6677050, -6456364, -5817223, -5970560, -7409668, -8094882, -6317753, -3562430, -2331799]
4116b331799k49176J20263R48816N15587n95237r24683l14986L37074L28989k51193
4106b416345m41055O47125K066692J581986p61269j628213Q09563L212887J508569
4097D579940k706306m295433k173199j16999l083P38370L542524N331046L481146
4088H378006N54646N71529K837616L084881k61660m163151n218341l314399o05572
4079A863555J233443J853742J472166L61849j003327j861539j578090k76405J058629
4070C124023J327943K27892j498278k427949j230301K038498N044909M678883
4062A1285620N13546l941897m759892k022250O16192O26973p50434j010006M1554
4053E99406N15516m65569j519846j240775m58113j020127k710363l050261q17604
$$ y = [-2331799, -2580975, -2460712, -1511896, -996309, -1591546, -2516229, -2831215, -2494141, -2165152, -2416345, -2857400, -2210275, -143583, 1438403, 677134, -951079, -141516, 3071371, 4579940, 1873634, -2421799, -4594998, -4711997, -4715080, -3976710, -434186, 4896860, 8378006, 8932652, 9504181, 12341797, 15426678, 15165018, 11001867, 5783526, 2469127, 1863555, 3096998, 4950740, 6422906, 6784755, 5781428, 3919889, 2341799, 2065394, 3124023, 4451966, 4679858, 3181580, 753631, -476670, 1561828, 6606737, 11285620, 11799166, 7857269, 3097377, 1075127, 1691319, 2318292, 1567858, 557852, 599406, 1114922, 649353, -870493, -2111268, -2569381, -3589508, -6299871, -9350132, -10167736]
4044a0167736J757466J760256m71493k006387j293004N67425K156655L016261
4036d680557K611004N84698j527224j419597N02742J437848P06566P90332K569484
4027A575296L083919L52243k848922l048647j151994o6210K39309J357285K128322
4018A620601K26280k958565l521728r38484J340131J330960O24337N36876L6702
4009a702890j289581j554250M31423K864127L203358J119022j662388l016146
4001a607325j702238J325832L001369J502707q51824n38947J794809K133733o36206
3992D421910k963224k203551m74581j038816l534471m969751l668441m37536K858938
3983a2009523M586302M308765L195114K401567J262669j026968k532413n81070
$$ y = [-10167736, -8410270, -6650014, -7121507, -9127894, -10420898, -9853473, -7696818, -4680557, -2069553, -1484855, -3012079, -4431676, -3928934, -2491086, -1784520, -994188, 1575296, 4659215, 5011458, 2162536, -886111, -2038105, -2104315, -1865006, -507721, 1620601, 1846881, -1111684, -4633412, -5571896, -4231765, -2900805, -2276468, -1739592, -1702890, -2992471, -4546721, -4115298, -1251171, 1952187, 3071209, 1408821, -1607325, -3309563, -1983731, 1017638, 2520345, 1668521, 1129574, 2924383, 5058116, 4421910, 1458686, -744865, -1219446, -2258262, -5792733, -10762484, -14430925, -14868461, -12009523, -7423221, -3114456, 80658, 2482225, 3744894, 2717926, 185513, -395557]
3975c95557L211501L777526k99885m264432l758489m53211J452189J183285O01792
3966A054719J1855j443390k649511j520559J284869K716128J478994n36611j200126
3957h03632o63293n46955j741621l326807l406441j380396Q05689R52139k7530
3948a0138847P83767L521732M735119K541604m36599j259783q70811j420979k039208
3939d584005p49990J229825R31790j490613k827956j451521J116734L067845L971465
3930g86426L696977K294642R94568R93373J296532Q386k365339l214737j444773
3921A473203J306722L014710K874920R02520j920031l436990k489837q75167q58016
3912g966j539436o23149J002076K96542k351454k887909N8209K780403K308677
$$ y = [-395557, 2815944, 6593470, 6293585, 2029153, -1729336, -2182547, -730358, 452927, 1054719, 1066574, -376816, -3026327, -4546886, -3262017, -545889, 933105, 396494, -803632, -1466925, -2013880, -3755501, -7082308, -10488749, -11869145, -11063456, -10111317, -10138847, -9355080, -5833348, -1098229, 1443375, 1006776, -253007, -1123818, -2544797, -4584005, -5333995, -4104170, -3172380, -4662993, -7490949, -8942470, -7825736, -4757891, -786426, 2910551, 5205193, 6199761, 7193134, 8489666, 8498052, 6132713, 2917976, 1473203, 2779925, 5794635, 8669555, 9572075, 7652044, 4215054, 1725217, 850050, -7966, -1547402, -2170551, -1168475, -871933, -3223387, -6111296, -6053087, -3272684, -964007]
3903i64007P59092J266462K897893K862961J260192R8859n98685k046065l158747
3894B377955j565149K005070L808077K172555l55034r34141q8782l7513j167343
3885F215695j909300j257911N5505O61668o9711j589182k544267j845890J61007
3876b122386J831778J922512Q60104p3172l67776m20657m03167k4640N09221L96335
3866B108152m20245p85100L0257J079656J127414M66955M5872m55556j836811
3857A360594l112986k364597l6424J102971M1415j007122m65485K3044j056218
3848e514808j819437j29453K068310J422734r73718p73718K616160M666015K544437
3839D106522p28452j113801P92122J802662J348427J234273J548081L50521k581402
$$ y = [-964007, -204915, 1061547, 3959440, 6822401, 8082593, 8181452, 7582767, 5536702, 2377955, 812806, 2817876, 6625953, 8798508, 8443474, 7509333, 7420551, 7383038, 6215695, 4306395, 3048484, 3103989, 3765657, 3695946, 2106764, -437503, -2283393, -2122386, -290608, 1631904, 2492008, 2418836, 2051060, 1630403, 1227236, 1202596, 1711817, 2108152, 1687907, 902807, 933064, 2012720, 3140134, 3607089, 3652961, 3197405, 1360594, -1752392, -4116989, -4153413, -3050442, -3009027, -4016149, -4481634, -4458590, -5514808, -7334245, -7463698, -5395388, -3972654, -4946372, -5720090, -3103930, 1562085, 4106522, 3378070, 2264269, 3056391, 4859053, 6207480, 7441753, 8989834, 9340355, 6758953]
3830F758953m626536l787317j355342m9661o43480j473553p92932J215358K768778
3821a985732K411443M22692j598389k289752j528850j77034Q02883J107604J249380
3812a585755J758660K190960J667630O43426P74012K068233J840211j477416m820729
3803C059232l773463J084605M451760L342101M22495q40397q41158j441771k024999
3794C438405j062672N23729Q79558N56467R86049R40655j563275m472298l288045
3785c061427J887191N216081K914072j502952k547032m86838j22831l320978o600260
3776g624974o205001k463004J695186M131628M281624K530559M03130Q8562K082422
3767a079868L993710L245579M95306j260062p57353K29538p5449j137384j791870
$$ y = [6758953, 2132417, -1654900, -3010242, -3059903, -3703383, -5176936, -5969868, -4754510, -1985732, 425711, 848403, -749986, -3039738, -4568588, -4745622, -3942739, -2835135, -1585755, 172905, 2363865, 4031495, 4674921, 5448933, 7517166, 9357377, 7879961, 3059232, -714231, 370374, 4822134, 8164235, 8586730, 7746333, 6905175, 5463404, 3438405, 2375733, 2899462, 3779020, 4335487, 5321536, 6262191, 4698916, 226618, -3061427, -1174236, 4041845, 6955917, 5452965, 2905933, 2419095, 2296264, -1024714, -7624974, -13829975, -16292979, -14597793, -10466165, -6184541, -3653982, -3250852, -3162290, -1079868, 2913842, 6159421, 6654727, 5394665, 4637312, 4866850, 4791401, 3654017, 1862147]
3758A862147k321613l146508k950624m97149K445230K692196K40768j373646l8184
3749c087383K176650K574163J741337J726492K152792J007970j522984k958358
3741C810679k293016j182299p41881K89256K790970M694253L294320p64695l830515
3732F067072l504108j051498O73384M68020o45555j236968r75065m73804k65717
3723i44239j98897K41996J150113J855522J498279n4571j979678l185528l097565
3714d714568j836853j5885J455123J803886J149377N57883P21721Q17287l83638
3705d45667k303762k792084j096588P77324P77653l52601n27699L78053P88832
3696d796539M66435P67527J712066J497790j62827q80185O05139J883988N34631
$$ y = [1862147, -459466, -3605974, -6556598, -7053747, -4608517, -1916321, -1675553, -3049199, -3087383, -910733, 1663430, 3404767, 5131259, 7284051, 8292021, 6769037, 3810679, 1517663, 335364, -406517, -117261, 2673709, 7367962, 10662282, 9897587, 6067072, 2562964, 1511466, 2184850, 2652870, 2007315, 770347, -204718, -678522, -944239, -1143136, -901140, 248973, 2104495, 3602774, 3548203, 1568525, -1617003, -4714568, -6551421, -6567306, -5112183, -3308297, -2158920, -1601037, -879316, -62029, -445667, -2749429, -5541513, -6638101, -5860777, -5083124, -5435725, -5963424, -5585371, -4796539, -4330104, -3562577, -1850511, -352721, -515548, -1395733, -790594, 1093394, 1628025]
3687A628025j648339j210560J300307J856362q08953l070969j767804J350440
3679b371491K659692J903952J547782J995866P17593l292523o768389n712746
3671i320264o14266L750589L762409P24012j470406j235218m28829r67992k092701
3662g892666j770864L89971K842568M101520L885490K615575R39082l68421j082374
3653C659881j992279l565355m330012k202010K174554N058103L692645l06307
3645B189220k881019k179184m4211P69164l75385j833307j680367L08305K250572
3636c476212J927840n53817k420154j496424P25985Q85983j407666k618624k13215
3627h646304L337340L617206L64899k152784j042191J621498K393287J358531
$$ y = [1628025, -20314, -1230874, 69433, 1925795, 1116842, -1954127, -3721931, -2371491, 288201, 2192153, 3739935, 5735801, 6453394, 3160871, -3607518, -9320264, -9934530, -6183941, -2421532, -1697520, -3167926, -4403144, -4831973, -5799965, -7892666, -9663530, -9273559, -6430991, -2329471, 1556019, 4171594, 5110676, 4742255, 3659881, 1667602, -1897753, -6227765, -8429775, -6255221, -1197118, 2495527, 2189220, -691799, -2870983, -2915194, -2146030, -2521415, -4354722, -6035089, -5726784, -3476212, -1548372, -2102189, -4522343, -6018767, -5292782, -4406799, -5814465, -8433089, -8646304, -5308964, -1691758, -1326859, -3479643, -4521834, -2900336, -507049, 851482]
3619H51482J062478J896107J619039m90974j989664r53392J055438J562657R10792
3610E523963R72812J289588m18023l805456n107480k210219J846497K623151Q1065
3601G95898j899650j179726K35767r8175j511598j833404p59266L53220J013186
3592d883748J770402K256794J298959p07551j617146n78888N29351r1553j498561
3583c521941j685989n74840N49718J483797K736089L468547K443232Q05602J045997
3574F750212K825317K871995N3270k555408k440916j483736k359483l713757k499091
3565b551597N85319K024882J089371L73555Q00517L82347j244065j405123O83207
3556G38413J656471o08496k967507j951445L04731m04942k954402k351874J924130
$$ y = [851482, 1913960, 3810067, 5429106, 4938132, 2948468, 1995076, 3050514, 4613171, 5523963, 6496775, 7786363, 7368340, 3562884, -1544596, -3754815, -1908318, 714833, 795898, -1103752, -2283478, -2047711, -2145886, -3657484, -5490888, -6250154, -5896934, -4883748, -3113346, -856552, 442407, -265144, -1882290, -2461178, -1931827, -2023380, -3521941, -5207930, -5782770, -5233052, -3749255, -1013166, 2455381, 4898613, 5704215, 6750212, 9575529, 12447524, 12500794, 9945386, 7504470, 6020734, 3661251, -52506, -2551597, -1966278, 58604, 1147975, 1521530, 2322047, 2704394, 1460329, 55206, 738413, 2394884, 1786388, -1181119, -3132564, -2827833, -3232775, -6187177, -8539051, -6614921]
3547f614921M577204K598129k81970K97445K795250K734482n35284l664686m289402
3538b383753k827344l03117K386306L517131J950634m78746p60168R33948J419488
3529C454379n70742k488068j932324J67333J704950K318281K455693J666058j20553
3520F655007j280418o07935N81485N40266K0342Q06429K324463K254698K5411
3511A1319748k665476m430506m951911l586646o984L614025L912692O72432k525243
3502A352131k957746j868849j748317k588416k504802o84919J840988L507554
3494e652376L250108J137556j209963j801291n29673Q15130J233031J716477L042007
3485B001006L995976L002876L42672k302524l544560k895643r13709P17419O67246
$$ y = [-6614921, -2037717, 560412, 278442, 575887, 3371137, 6105619, 5570335, 1905649, -2383753, -5211097, -5514214, -3127908, 389223, 2339857, 1861111, 1100943, 2034891, 3454379, 2883637, 395569, -1536755, -1369422, 335528, 2653809, 5109502, 6775560, 6655007, 5374589, 4766654, 5348139, 5888405, 5908747, 6715176, 9039639, 11294337, 11319748, 8654272, 4223766, -728145, -4314791, -4321775, -707750, 3204942, 3877374, 1352131, -1605615, -3474464, -5222781, -7811197, -10315999, -11000918, -9159930, -5652376, -2402268, -1264712, -2474675, -4275966, -4805639, -3990509, -2757478, -1041001, 2001006, 5996982, 8999858, 9342530, 7040006, 3495446, 599803, -313906, 403513, 1070759]
3476A070759j30558J72222R62341j57251k736230l036793J15678K717810J553469
3467E31447o79498P9925K505296K287778o66072k448764j616775m84052k07268
3458f97983N03036J358790L7370l091291m273079k109505Q3772k79133j046908
3449i514931O26542L447960M186373K375205M4423j398813j581243j99910J957909
3440e6485K570181O42775j600176j848485j177534j935319l561524l418505j086728
3431a1471800J047977J483261J360537J996868K592141J431714j453749l635828
3423f648879k526450J492139M633635L645897L6015j594495K13500J820800J21588
3414A193750k612708k117272J567134M322597L569097O92041j775278k640477
$$ y = [1070759, 940201, 1112423, 2074764, 1917513, -818717, -3855510, -3739832, -1022022, 531447, -148051, -68126, 2437170, 4724948, 4058876, 1610112, -6663, -490715, -697983, -194947, 1163843, 1201213, -1890078, -6163157, -8272662, -8188890, -8468023, -9514931, -8888389, -5440429, -1254056, 1121149, 1165572, -233241, -1814484, -2014394, -56485, 2513696, 3156471, 1556295, -292190, -1469724, -3405043, -6966567, -10385072, -11471800, -10423823, -8940562, -7580025, -5583157, -2991016, -1559302, -3013051, -6648879, -9175329, -7683190, -3049555, 596342, 632357, -962138, -748638, 1072162, 1193750, -1418958, -3536230, -1969096, 2353501, 5922598, 6614639, 4839361, 2198884]
3406B198884j681941O78387K844169L137798J848555O18982k05229j692301l649169
3397D098135m072176k120297K28091P06546l97578j208978j044856p13722m89727
3388e014562N13509K398262L204830J109736k303865k920043O38912M298309L352656
3379E277744j006355l143289r61816J332923j20628l113525l134321q5603K350355
3370b604515K334639J169449k3859j240517j596918L0700K213718K069277m30371
3361A921603k241742j791011o61836r6059Q71589K450735K434181l67932l404170
3352h84642l446005q08458J574358K082942J486196R54980P87079P06767K09211
3343B662428r93763k136073j812454K1204J493326J158141k02855j112847j463437
$$ y = [2198884, 516943, 1195330, 4039499, 7177297, 9025852, 9644834, 9439605, 7747304, 4098135, 25959, -2094338, -1866247, -1159701, -1557279, -2766257, -3811113, -4524835, -5014562, -4501053, -2102791, 1102039, 2211775, -92090, -3012133, -2373221, 1925088, 5277744, 4271389, 1128100, 166284, 1499207, 1378579, -1734946, -4869267, -4954870, -2604515, -269876, 899573, 875714, -364803, -1961721, -1931021, 282697, 2351974, 1921603, -320139, -2111150, -2772986, -2869045, -1997456, 453279, 2887460, 2519528, -884642, -4330647, -5139105, -3564747, -1481805, 4391, 959371, 1746450, 2453217, 2662428, 1668665, -467408, -2279862, -2258658, -765332, 392809, 189954, -922893, -2386330]
3334b386330j675841j039164J138441L363096L159408O10030j257620l48872J792575
3325C355723K285310P53806p02971q30030n79866q61382r10004j58895m8416j833178
3315D70097l671289k720185J55269J039280j066728k456016n38268K001488J547977
3306e238375r22139k084687j602710j250513o18609J757978M120141L186848j76335
3297b828401j775411p21008l42015j843308k249389j86507J402964O61913J35137
3288g746025J701563K690660Q00210j089490M82434L239050K430413j557333l882749
3279b931267k666381j010776j453626k437862j359947J614863L945898L503068
3271b796030N67123k147038j960218N75369K198829J453093N40883J204161J459849
$$ y = [-2386330, -4062171, -5101335, -3962894, -599798, 2559610, 3169640, 1912020, 1563148, 3355723, 5641033, 6394839, 5691868, 4861838, 4281972, 3420590, 2510586, 2351691, 2303275, 470097, -3201192, -5921377, -5766108, -4726828, -5793556, -8249572, -8787840, -6786352, -5238375, -6160514, -8245201, -9847911, -11098424, -11717033, -9959055, -5838914, -2652066, -2828401, -4603812, -5324820, -5666835, -7510143, -9759532, -9946039, -8543075, -7881162, -7746025, -6044462, -3353802, -2553592, -3643082, -3160648, 78402, 2508815, 951482, -2931267, -5597648, -6608424, -8062050, -10499912, -11859859, -10244996, -6299098, -2796030, -2228907, -4375945, -6336163, -5760794, -3561965, -2108872, -1567989, -363828, 1096021]
3262A096021q88596l872936m004920j668232p9284J35247J325469L949491N152345
3253A144605L013445o66295k828734k476247q97207L4246m28900j048280n1706
3244d205073J929978K131908N6114r59902J237213L829441L375462J183308L72173
3235H950622J80058j837856l998788k724684N13691P18807k325588l602260j316579
3226e442577O46154J46343J63540K290321L102263N45580j609195n011K252750
3217B090168N80191l574530n007357k122176K147524M816524M740927K061343
3209E732614j035284j135803J800813L098742k82133m814499n374344k332351
3201d342245L81919J595124K562799K597078L16618k123780j359359J382213J928576
$$ y = [1096021, 207425, -3665511, -7670431, -9338663, -9417947, -9282700, -7957231, -4007740, 1144605, 4158050, 3491755, 663021, -1813226, -2710433, -2676187, -3105087, -4153367, -4205073, -2275095, -143187, -87073, -1046975, 190238, 4019679, 7395141, 8578449, 8950622, 9130680, 7292824, 3294036, 569352, 1083043, 1801850, -523738, -4125998, -5442577, -4796423, -4650080, -4486540, -2196219, 906044, 1451624, -157571, -162582, 2090168, 2670359, -904171, -5911528, -8033704, -5886180, -1069656, 3671271, 5732614, 4697330, 3561527, 5362340, 8461082, 8178949, 3364450, -2009894, -4342245, -3960326, -2365202, 197597, 2794675, 3111293, 987513, -371846, 1010367, 2938943]
3192B938943R6278l86539J102229Q38641k377575m550546k829168J06913P13205
3183d347619j58028K94283K009057K825628K101419Q06285n93461j940995k154591
3174a158022m19734J949282K643136J145118q08481j301655P6806K263666L666695
3165H056811L267781J328186r15791k219790k006410o89307K77019m52253k134767
3156D511479k162597N40477L443907L393867P30285j559244k017725j698848j403749
3147C777852n93881O97608J302284R17977O73423J010531Q03863o06565k012628
3138E970464j861141k22533J319902J166327q72061l069302l278060j600927m11423
3129b858754p67553p43965Q75358J687764m07619k561493o83275L394151L680362
$$ y = [2938943, 3035221, 2648682, 3750911, 4589552, 2211977, -2338569, -5167737, -5060824, -4347619, -4505647, -4211364, -2202307, 623321, 2724740, 3531025, 2937564, 996569, -1158022, -1577756, 371526, 3014662, 4159780, 3351299, 2049644, 2126450, 4390116, 8056811, 11324592, 12652778, 11736987, 9517197, 7510787, 6821480, 7098499, 6646246, 4511479, 2348882, 2889359, 6333266, 9727133, 10457418, 8898174, 6880449, 5181601, 3777852, 3183971, 3881579, 5183863, 6101840, 6775263, 7785794, 8589657, 7983092, 5970464, 4109323, 3886790, 5206692, 6373019, 5500958, 2431656, -846404, -2447331, -2858754, -3626307, -4370272, -3494914, -1807150, -2214769, -4776262, -5459537, -2065386, 1614976]
3120A614976q72176m342279k408308J816204K937499M13714k307941k912319j727214
3111g787844j28904M11565p00147j857203p90148J805790K722730J059200m94490
3102e759451j22851Q60784J398091K361861L256021J640473j884945k754487N02258
3093e02246K988376J015707j807197r10177J287950j12666l471102l047963J465429
3084c093889M738473M268987K589075J318448o42609k668262k287989m02428q63869
3075B955937l676853m251112r72977K075345J993462J138393J673282J445314
3067B380791j089386k599649K0817L891400M081131P42765k022089k467628k171047
3058G67105k055128j492187p50191q12358j003905K37414K437709L608690L440691
$$ y = [1614976, 742800, -3599479, -6007787, -4191583, -1254084, -840370, -3148311, -6060630, -7787844, -7916748, -7505183, -8205330, -10062533, -10852681, -9046891, -6324161, -5264961, -5759451, -5882302, -5021518, -3623427, -1261566, 1994455, 3634928, 1749983, -1004504, -502246, 2486130, 3501837, 1694640, 784463, 2072413, 1959747, -1511355, -4559318, -3093889, 1644584, 5913571, 8502646, 9821094, 9178485, 6510223, 4222234, 3819806, 2955937, -720916, -4972028, -5945005, -3869660, -1876198, -737805, 935477, 2380791, 1291405, -1308244, -1287427, 2603973, 6685104, 7427869, 5405780, 2938152, 767105, -1288023, -2780210, -3530401, -4342759, -5346664, -5109250, -2671541, 937149, 4377840]
3049D377840L301222L151386J333296k013067l975112k632461O8023Q42491n74965
3040C878653j356510L11144K687099K905353R31242n26270m612P45599k20357
3031I351341j850855j838223l00475O73688M55136K12381Q8815j096768l016552
3022B678488l491294j776583K21342Q29531M57559j02277q17239j164907l16951
3013c482331P05235q3647j802397j189397J772319K630735q10587m350317l276322
3004i886709P95334K831333J605596j66743j000720j481133j089746J267240L854113
2995c271435L439820L71217j370991J97781K645818L109232J752422K81979m70310
2986F685533m51953P2175Q0963j315377l066647l087300j294520K14522L48728
$$ y = [4377840, 7679062, 10830448, 12163744, 10150677, 6175565, 3543104, 3611127, 4453618, 3878653, 2522143, 2833287, 5520386, 8425739, 9356981, 8830711, 8826099, 9571698, 9351341, 7500486, 5662263, 5361788, 6035476, 6490612, 6702993, 6791808, 5695040, 2678488, -812806, -2589389, -2368047, -1538516, -1080957, -1183234, -2000473, -3165380, -3482331, -2777096, -2860743, -4663140, -5852537, -4080218, -1449483, -2260070, -6610387, -9886709, -9091375, -6260042, -4654446, -4821189, -5821909, -7303042, -8392788, -7125548, -3271435, 168385, 539602, -831389, -633608, 2012210, 5121442, 6873864, 7155843, 6685533, 6233580, 6305755, 6386718, 5071341, 2004694, -1082606, -2377126, -2162604, -1813876]
2977a813876K84738J030982J835682J805097J257671O55501j47745q52549n53966
2968C501535N41284P74957o34257k174616j880620L23642K774529L782031K816791
2959I825276P81378o54305o45821l7003m2403o71041j338112j995994k256846
2950B965129p57752K394700L900997J165801k880272k824580J169675K748919
2942G882617j625968p172770p152454j688500L252236L823752J671165O2789r6033
2933a043166N2930m60405j262900r71361J110263L229771K362356j723889n019402
2924c725803l837404J71493J998920n3103k386680j444098J498845K665759J279070
2915c833001J92543J277979K758136K276210O15333J39556O14002m24350k984314
$$ y = [-1813876, -1529138, -498156, 1337526, 3142623, 4400294, 5055795, 4908050, 4055501, 3501535, 4042819, 4817776, 4183519, 2008903, 128283, 451925, 3226454, 7008485, 9825276, 10606654, 9952349, 9306528, 9269525, 9227122, 8556081, 7217969, 5221975, 2965129, 2207377, 4602077, 8503074, 9668875, 6788603, 3964023, 5133698, 7882617, 6256649, -916121, -8068575, -9757075, -6504839, -2681087, -1009922, -947133, -1043166, -990236, -1450641, -2713541, -3684902, -2574639, 655132, 3017488, 1293599, -3725803, -7563207, -7391714, -5392794, -5445897, -7832577, -9276675, -7777830, -5112071, -3833001, -3640458, -2362479, 395657, 2671867, 3287200, 3426756, 4040758, 3616408, 632094]
2906F32094l639460p67408K282618J961673l178M54225K985247L447516Q25960
2897H179287j172848k35153J300414J010096J63090M64397N52556j138188k837368
2888F286283k202987m56518j53739n41887Q67047L069118K265333j938468n025462
2879B168720l664885k40934P28385j349693k993830j737421P87173J343183n28665
2870e487967j917159n82263J663614J306536j491681k481647N73083M013095L139585
2861a264804q12231k216142P68997L524452J790641k197623l093515L7481K885012
2852e77732K176017l55341j250621j36451P46986M65374L17250R68309J098128
2843C451919k13579j721332k045939j875376k319061k354199k26132L279558N375437
$$ y = [632094, -3007366, -3774774, -1492156, 469517, 466339, 920564, 3905811, 7353327, 8179287, 7006439, 6771286, 8071700, 9081796, 9244886, 9709283, 10261839, 9123651, 6286283, 4083296, 3626778, 3473039, 2931152, 3798199, 6867317, 9132650, 7194182, 2168720, -1496165, -1737099, -1008714, -2358407, -5352237, -7089658, -6302485, -4959302, -5487967, -7405126, -7987389, -6323775, -5017239, -6508920, -8990567, -8417484, -4404389, -1264804, -2077035, -4293177, -3524180, 272, 1790913, -406710, -3500225, -3462744, -577732, 1598285, 1242944, -7677, -144128, 602858, 1068232, 1385482, 2353791, 3451919, 3238340, 1517008, -528931, -2404307, -4723368, -7077567, -7303699, -4024141, 1351296]
2834A351296M877826L010635P90117j820958l993104m093948k432530j312386
2826c623052j377392n85264J867433L384972J743224j302390k503866j418927
2818c815262P5422R82442J409452P68968j597282m375963n008451k577696J203638
2809a2934732L675285L286020P66975j248009r02152M02765L0721j345299k71639
2800h540065L536409N533717K838413j186434j978235k62930K91412p28807r73278
2791a469798j16767L08367N24366J543826J727329j032794m406479l815021N27432
2782f209539L567189K811569J055672Q67987J053557J90368n33139o7201L89953
2773C126416L286l0822P96154Q70601m60221j207952o2331J229940Q18011k67039
$$ y = [1351296, 6229122, 9239757, 10029874, 8208916, 4215812, 121864, -2310666, -3623052, -5000444, -5585708, -3718275, -333303, 1409921, 107531, -2396335, -3815262, -3739840, -2757398, -1347946, -578978, -2176260, -6552223, -11560674, -14138370, -12934732, -9259447, -5973427, -5206452, -6454461, -7356613, -6953848, -6923127, -8268426, -8540065, -5003656, 530061, 3368474, 2182040, 203805, -59125, 232287, -496520, -1469798, -1586565, -1278198, -753832, 789994, 2517323, 1484529, -2921950, -6736971, -6209539, -2642350, 169219, 1224891, 2092878, 3146435, 3336803, 2803664, 2736463, 3126416, 3129702, 3098880, 3895034, 4765635, 4305414, 3097462, 3035131, 4265071, 5083082, 4816043]
2763D816043j76288O33756L72113j361635l353440m173831k990888l31438J621969
2754d943639J225848j13654R9601J155580k2630l397185m869106k054692K407629
2745a0512248M880566M828174L252851M42874k498564k952183k17763K714146
2737f2147L068917J749262R95595J064324J220173J507102J477739l07702l482411
2728G230852n183412m110375k410389j604391j19510K685147L930526J972151
2720B390599k3914P59366J655243p18253l794307k824421R75923K182903r9972
2711E03167j420311K56373J904262J390825O27346J101856R49410j230055l305791
2702G77082k847870p47235O60943J068576J616271K101709Q24814k745090o114702
$$ y = [4816043, 4639755, 5273511, 5645624, 4283989, 930549, -3243282, -6234170, -6565608, -4943639, -3717791, -3831445, -3731844, -2576264, -2598894, -5996079, -10865185, -12919877, -10512248, -5631682, -803508, 2449343, 2892217, 393653, -2558530, -2776293, -62147, 3006770, 4756032, 5751627, 6815951, 8036124, 9543226, 11020965, 10713263, 7230852, 2047440, -2062935, -4473324, -6077715, -6197225, -3512078, 418448, 2390599, 2366685, 3126051, 4781294, 4063041, 268734, -2555687, -1579764, 603139, 503167, -917144, -660771, 1243491, 2634316, 3261662, 4363518, 5312928, 4082873, 777082, -2070788, -2818023, -2157080, -1088504, 527767, 2629476, 3454290, 709200, -5405502]
2693e405502n432115J19888N958200O279717J258311k669513j235534K195305
2685A068757K302051m20816j736541q75179n27673j100291l57606J614446K165192
2676B132340R24541K12615M34185k28173j255701K7417K960792L410397M89708
2667I108121j654932o52171M64474j087869l212500l031753j562239r49604n18895
2658c097368R58705K051547J218669Q0175P76969K219146K163849J024790L96912
2649G793394l66468k636442m869637m013316j78688K922421K337443j118687m083933
2640d213913l750270l13486K935404K922869M55932j133795r73577j274293k365475
2631g710604j146981L366692O859999N410078J261947q37866m72240n57926j607561
$$ y = [-5405502, -10837617, -10717729, -4759529, 1520188, 2778499, 108986, -1126548, 1068757, 3370808, 2949992, 1213451, 338272, -189401, -1289692, -1647298, -32852, 2132340, 3056881, 3269496, 3703681, 3475508, 2219807, 2247224, 5208016, 8618413, 9108121, 7453189, 6801018, 7265492, 6177623, 2965123, -66630, -1628869, -2578473, -3097368, -2138663, -87116, 1131553, 1211728, 1988697, 4207843, 6371692, 7396482, 7793394, 7426926, 4790484, -79153, -4092469, -4271157, -1348736, 988707, -129980, -4213913, -7964183, -8277669, -5342265, -2419396, -1963464, -3097259, -4070836, -5345129, -7710604, -8857585, -5490893, 1369106, 6779184, 8041131, 7203265, 6731025, 6173099, 4565538]
2622D565538j636583o64393o92025j513775q58314J062405J158622j558557m025676
2613d162758l314571q7834L147400M904003M876231L307367J253888K0063l30449
2604I613340p47041j438729j767336j754470k038665k408125k041883j070269
2596c653178k03167Q50465K594443L748632K530960K1159m39835K031501M109039
2587A1590019K398040k441546o780857p744553m967217j74219L852416N011082
2579G43165L603045J633516J22250j580028l409193l450582o25898K786407L210714
2570C033396N8180l509516m197257j875696R77314K164111J452906O556q40226
2561b730232k39740J619931L050136J974081j415035l976899l139798m06421O72633
$$ y = [4565538, 2928955, 2264562, 1572537, 58762, -799552, 262853, 1421475, -137082, -4162758, -7477329, -7565163, -4417763, 486240, 5362471, 8669838, 9923726, 9943789, 9613340, 8866299, 7427570, 5660234, 3905764, 1867099, -541026, -2582909, -3653178, -3856345, -3005880, -411437, 3337195, 5868155, 5889314, 5449479, 7480980, 11590019, 13988059, 11546513, 4765656, -2978897, -7946114, -8120333, -4267917, 743165, 4346210, 5979726, 6101976, 4521948, 1112755, -2337827, -2963725, -177318, 3033396, 3091576, -417940, -4615197, -6490893, -5513579, -3349468, -1896562, -1890006, -2730232, -2969972, -1350041, 1700095, 3674176, 2259141, -1717758, -4857556, -5263977, -4591344]
2552d591344m34619q72618P85725K514630K582691K043825J796858N02485k051374
2543B276259k760563J48725L065108J838127j440906j417466K027694L681683
2535G418661J304841j442583j450242m43068q09711j595994j329831j173533k244079
2526a765539k690694n49820K660849M045692L190883J332170j413852n018797
2518b09108p223826n486999p10061L535949N059184M233093K045065m88841j584358
2509h29902j97394J750159J313145j031594j574675J177995L859396K699817j295026
2500E871921l782013k671754P529J677447K311508K934160K778713J73390l949465
2491E351436n789979l251140P40458J565194j017092k579219k73473L097865K973182
$$ y = [-4591344, -5025963, -5898581, -5112856, -2598226, -15535, 2028290, 3825148, 4327633, 2276259, -484304, -335579, 2729529, 4567656, 3126750, 1709284, 3736978, 7418661, 8723502, 7280919, 5830677, 5387609, 4577898, 2981904, 1652073, 478540, -1765539, -4456233, -5006053, -2345204, 1700488, 4891371, 6223541, 4809689, -209108, -7432934, -12919933, -13629994, -10094045, -5034861, -801768, 1243297, 754456, -829902, -1027296, 722863, 2036008, 1004414, -570261, 607734, 4467130, 7166947, 5871921, 2089908, -581846, -574317, 1103130, 3414638, 6348798, 9127511, 9300901, 5351436, -438543, -3689683, -2949225, -1384031, -2401123, -4980342, -5253815, -2155950, 817232]
2482H17232o58739l334520k155246P31901J586811J47011o60709N71394J645683
2473a309182L15238j871128j445734J854628M433816L822908J726472O67562J48060
2464H342640j334632k535414j265314J121515J012416j734820l305917j856735
2456a556261J860m1424p13189o65822j335864l300866l363248P76516N709870
2447d488428O586575M024649J988603O96602k427178n572854l430684L305824
2439F83109O300620J120043n399342m585599J602842M033143p8620m261902l393625
2430c979331l89469o6393j755269j734789M46560K039473J616010J06449j580795
2421e297554k995626k914189m36767K969413M875722N032738M845830M190144
$$ y = [817232, 158493, -3176027, -5331273, -4599372, -3012561, -2865550, -3526259, -2954865, -1309182, -993944, -2865072, -4310806, -2456178, 1977638, 5800546, 7527018, 8194580, 8342640, 7008008, 4472594, 3207280, 4328795, 5341211, 3606391, 300474, -1556261, -1554401, -1595825, -2309014, -2974836, -4310700, -7611566, -10974814, -10198298, -4488428, 2098147, 6122796, 8111399, 8808001, 6380823, 807969, -2622715, 683109, 6983729, 8103772, 2704430, -1881169, -278327, 3754816, 3676196, -585706, -3979331, -4368800, -4435193, -6190462, -7925251, -7478691, -5439218, -3823208, -3716759, -5297554, -8293180, -11207369, -11644136, -8674723, -3799001, 1233737, 6079567, 10269711]
2413A0269711J531854k692616n683278n909967m564799k689618K69333L727053
2405e742327M706681J623892k714674m290804k591972j4707J903278L125216L172714
2396h22703J425521r47121j774551o35077R35553J621663J019493j066046l844073
2387d087341m747078k008070K223193L944079K450729P81100R13693J485498R47268
2378A903071J3672l49123q15236j899374k324109j001590Q88645J508189Q84632
2369a191223L48283M24386O26439N81007K25368n25086j501670k239347k640358
2360e892201k907774k594454q23731K163042M697579N189974L141200q51361m625733
2351b503459m830538m04744M482773M127065j407069n763192m199044J059325
$$ y = [10269711, 11801565, 9108949, 3425671, -2484296, -7049095, -9738713, -9469380, -5742327, -1035646, 588246, -2126428, -6417232, -9009204, -9023911, -7120633, -3995417, -822703, 602818, -344303, -2118854, -2753931, -1818378, -196715, 822778, -243268, -4087341, -8834419, -10842489, -8619296, -4675217, -2224488, -1443388, -529695, 955803, 1903071, 1916743, 1567620, 752384, -1146990, -3471099, -4472689, -3584044, -2075855, -1191223, -842940, -418554, 207885, 788892, 1014260, 489174, -1012496, -3251843, -5892201, -8799975, -11394429, -12218160, -10055118, -5357539, -167565, 2973635, 2122274, -2503459, -7333997, -7738741, -3255968, 871097, -535972, -6299164, -10498208, -9438883]
2343i438883M839003N131442K985088n61941m261849n555743l105494O80495K363508
2334f924374J722585R87761J096334J220425R69947O13258k2817p46830k90444
2325a374155J420268J872392m52799k748618j530736J636723K053280r48064k974952
2316c046661j242627J701864K340540J017729M35855J518708K681377K000253
2308G407038j046553m985703o937020n022238o09738K988958M065869L370604
2300g68783J827896l46512k115096j763649M83927K082623J490880P6104l90517
2291E76873l29254j003905k087224k298352j549407q22605m18737J62752P55741
2282g014118M05701q41316j172060Q28629L572632L552263j65716l845325l272406
$$ y = [-9438883, -4599880, 531562, 3516650, 2954709, -1307140, -6862883, -9968377, -9287882, -6924374, -5201789, -4214028, -3117694, -1897269, -927322, -314064, -336881, -1083711, -1374155, 46113, 1918505, 1465706, -1282912, -2813648, -1176925, 876355, -71709, -3046661, -4289288, -2587424, -246884, 770845, 1206700, 2725408, 5406785, 7407038, 6360485, 1374782, -5562238, -10584476, -11194214, -8205256, -4139387, -768783, 1059113, 712601, -1402495, -3166144, -2682217, -599594, 891286, 967390, 576873, 247619, -756286, -2843510, -5141862, -6691269, -7513874, -7932611, -7769859, -7014118, -6608417, -7449733, -8621793, -7793164, -4220532, -668269, -833985, -4679310, -7951716]
2273g951716O94491L248413K233583M79942O28355J174109j5285j432782o41742
2264a582632J054214O56311j204746j111290J591776L994717M175242K924937
2256A0498529J087591j117038k139554l99329K151575J754894j281058k561905
2248G993705m02426J635068N14148k103025l434763l450627k907713j240017J011671
2239b383979J174031j285241k714180n48416K519527K965561J927837K358880
2231D014020L405807K199516n70744j589584m98748r3336j237380j732908n32104
$$ y = [-7951716, -7257225, -4008812, -1775229, -1295287, -666932, 507177, 491892, -940890, -1582632, -528418, 127893, -1076853, -2188143, -596367, 3398350, 7573592, 10498529, 11586120, 10469082, 8329528, 7930199, 10081774, 11836668, 10555610, 7993705, 7591279, 9226347, 9740495, 7637470, 4202707, 752080, -2155633, -3395650, -2383979, -1209948, -2495189, -5209369, -5757785, -3238258, -272697, 1655140, 4014020, 7419827, 9619343, 9048599, 7459015, 6960267, 6866931, 5629551, 3896643, 3364539]
$$ [...]
##END NTUPLES=NMR SPECTRUM
##END=
