##TITLE=31Pdec_DE-159_TFA
 DMSO+CCl4,64 sc
 26.6.2026
##JCAMPDX= 6.0         $$ Bruker NMR JCAMP-DX V2.0
##DATA TYPE= NMR SPECTRUM
##DATA CLASS= NTUPLES
##ORIGIN= UXNMR, Bruker Analytische Messtechnik GmbH
##OWNER= root
$$ XWIN-NMR		Version 3.5
$$ Fri Jun 26 14:08:38 2026 Russian Standard Time (UT+4h)  she@DPX200
##.OBSERVE FREQUENCY= 81.013821
##.OBSERVE NUCLEUS= ^31P
##.ACQUISITION MODE= SIMULTANEOUS
##.ACQUISITION SCHEME= undefined
##.AVERAGES= 64
##.DIGITISER RES= 17
##SPECTROMETER/DATA SYSTEM= spect
##.PULSE SEQUENCE= zgpg30
##.SOLVENT NAME= CDCl3
##.SHIFT REFERENCE= (INTERNAL, CDCl3, 0, 197.392)
##AUDIT TRAIL= $$ (NUMBER, WHEN, WHO, WHERE, WHAT)
$$ ##TITLE= Audit trail, XWIN-NMR		Version 3.5
$$ ##JCAMPDX= 5.01
$$ ##ORIGIN= Bruker BioSpin GmbH
$$ ##OWNER= she
$$ F:/spectra/data/she/nmr/P31/2/pdata/1/auditp.txt
$$ ##AUDIT TRAIL=  $$ (NUMBER, WHEN, WHO, WHERE, WHAT)
(   1,<2026-06-26 14:07:24.29 +0400>,<she>,<DPX200>,
      <created by zg, POWCHK disabled, PULCHK disabled
       configuration hash MD5:
       00 E9 B6 7A A2 85 ED C7 34 08 36 98 17 FE 4E 26
       data hash MD5: 32K
       16 38 84 01 9D B0 A2 AB B4 9E 5F 68 40 0B C2 DE>)
(   2,<2026-06-26 14:07:26.71 +0400>,<she>,<DPX200>,
      <Start of raw data processing
       efp BC_mod = 2 LB = 1.5 FT_mod = 6 PKNL = 1 PHC0 = 1976.455 PHC1 = -922.7019 SI = 64K 
       data hash MD5: 64K
       62 90 6F B8 46 53 E4 E3 5A 51 DA 15 EF 13 C9 4D>)
(   3,<2026-06-26 14:07:54.26 +0400>,<she>,<DPX200>,
      <pk PHC0 = -326.6644 PHC1 = 919.4007 
       data hash MD5: 64K
       54 49 A8 87 42 AF 15 C3 95 BC 6D 06 56 90 F4 B4>)
$$ ##END=
$$ 
$$ hash MD5
$$ 09 0D C7 EC 11 D3 D5 8B AD F0 CA CF 3E 72 F8 B6
##$RELAX= 
##$RELAX= 
##$RELAX= 
##$RELAX= 
##$RELAX= 
##$RELAX= 
##$RELAX= 
##$RELAX= 
$$ Bruker specific parameters
$$ --------------------------
##$DU= <F:/spectra>
##$EXPNO= 2
##$NAME= <P31>
##$PROCNO= 1
##$TYPE= <nmr>
##$USER= <she>
##$AMP= (0..31)
100 100 100 100 100 100 100 100 100 100 100 100 100 100 100 100 100 100 
100 100 100 100 100 100 100 100 100 100 100 100 100 100 
##$AQSEQ= 0
##$AQ_mod= 1
##$AUNM= <au_zg>
##$AUTOPOS= <>
##$BF1= 81.014009
##$BF2= 200.13
##$BF3= 200.13
##$BF4= 200.13
##$BF5= 200.13
##$BF6= 200.13
##$BF7= 200.13
##$BF8= 200.13
##$BYTORDA= 1
##$CFDGTYP= 0
##$CFRGTYP= 5
##$CHEMSTR= <none>
##$CNST= (0..31)
1 1 145 1 1 1 1 1 1 1 1 1 1 1 1 1 1 1 1 1 1 1 1 1 1 1 1 1 1 1 1 1 
##$CPDPRG= <waltz16>
##$CPDPRG1= <>
##$CPDPRG2= <waltz16>
##$CPDPRG3= <>
##$CPDPRG4= <mlev>
##$CPDPRG5= <mlev>
##$CPDPRG6= <mlev>
##$CPDPRG7= <mlev>
##$CPDPRG8= <mlev>
##$CPDPRGB= <>
##$CPDPRGT= <>
##$D= (0..31)
0 1 0 0 0 0 0 0 0 0.06 0 0.03 2e-05 3e-06 0 0 0.0002 0 0 0 0 0 0 0 0 0 
0 0 0 0 0 0 
##$DATE= 1782468443
##$DBL= (0..7)
120 120 120 11 120 120 24 19 
##$DBP= (0..7)
150 150 150 150 150 150 150 150 
##$DBP07= 0
##$DBPNAM0= <>
##$DBPNAM1= <>
##$DBPNAM2= <>
##$DBPNAM3= <>
##$DBPNAM4= <>
##$DBPNAM5= <>
##$DBPNAM6= <>
##$DBPNAM7= <>
##$DBPOAL= (0..7)
0.5 0.5 0.5 0.5 0.5 0.5 0.5 0.5 
$$ [...]
##$SUBNAM3= <"">
##$SUBNAM4= <"">
##$SUBNAM5= <"">
##$SUBNAM6= <"">
##$SUBNAM7= <"">
##$SUBNAM8= <"">
##$SUBNAM9= <"">
##$SW= 400.765351723535
##$SWIBOX= (0..15)
0 1 3 0 0 0 0 0 0 0 0 0 0 0 0 0 
##$SW_h= 32467.5324675325
##$TD= 32768
##$TD0= 1
##$TE= 0
##$TE2= 300
##$TE3= 300
##$TEG= 300
##$TL= (0..7)
0 120 53 12 22 120 120 120 
##$TP= (0..7)
150 150 150 150 150 150 150 150 
##$TP07= 0
##$TPNAME0= <>
##$TPNAME1= <>
##$TPNAME2= <>
##$TPNAME3= <>
##$TPNAME4= <>
##$TPNAME5= <>
##$TPNAME6= <>
##$TPNAME7= <>
##$TPOAL= (0..7)
0.5 0.5 0.5 0.5 0.5 0.5 0.5 0.5 
##$TPOFFS= (0..7)
0 0 0 0 0 0 0 0 
##$TUNHIN= 0
##$TUNHOUT= 0
##$TUNXOUT= 0
##$USERA1= <user>
##$USERA2= <user>
##$USERA3= <user>
##$USERA4= <user>
##$USERA5= <user>
##$V9= 5
##$VALIST= <valist>
##$VCLIST= <CCCCCCCCCCCCCCC>
##$VD= 0
##$VDLIST= <DDDDDDDDDDDDDDD>
##$VPLIST= <PPPPPPPPPPPPPPP>
##$VTLIST= <TTTTTTTTTTTTTTT>
##$WBST= 1024
##$WBSW= 4
##$XGAIN= (0..3)
0 0 0 0 
##$XL= 0
##$YL= 0
##$YMAX_a= 16602
##$YMIN_a= -6117
##$ZGOPTNS= <>
##$ZL1= 120
##$ZL2= 120
##$ZL3= 120
##$ZL4= 120
##$ABSF1= 0
##$ABSF2= 0
##$ABSG= 0
##$ABSL= 0
##$ALPHA= 0
##$AQORDER= 0
##$ASSFAC= 0
##$ASSFACI= 0
##$ASSFACX= 0
##$ASSWID= 0
##$AUNMP= <proc_1d>
##$AZFE= 0.1
##$AZFW= 0.5
##$BCFW= 0
##$BC_mod= 2
##$BYTORDP= 0
##$COROFFS= 0
##$CY= -3
##$DATMOD= 1
##$DC= 0
##$DFILT= <>
##$DTYPP= 0
##$F1P= 0
##$F2P= 0
##$FCOR= 1
##$FTSIZE= 65536
##$FT_mod= 6
##$GAMMA= 0
##$GB= 0
##$INTBC= 1
##$INTSCL= 9.790993e-09
##$ISEN= 30
##$LB= 1.5
##$LEV0= 0
##$LPBIN= 0
##$MAXI= 10000
##$MC2= 0
##$MEAN= 0
##$ME_mod= 0
##$MI= 50
##$NCOEF= 0
##$NC_proc= -8
##$NLEV= 6
##$NOISF1= 182.463
##$NOISF2= 159.3651
##$NSP= 0
##$NTH_PI= 0
##$NZP= 0
##$OFFSET= 197.3918
##$PC= 4
##$PHC0= 1649.791
##$PHC1= -3.301208
##$PH_mod= 1
##$PKNL= yes
##$PPARMOD= 0
##$PSCAL= 0
##$PSIGN= 0
##$REVERSE= no
##$SF= 81.014063255964
##$SI= 65536
##$SIGF1= 159.3651
##$SIGF2= -187.1042
##$SINO= 113.3802
##$SIOLD= 16384
##$SREGLST= <1H.CDCl3>
##$SSB= 0
##$STSI= 65536
##$STSR= 0
##$SW_p= 32467.5324675325
##$SYMM= 0
##$S_DEV= 0
##$TDeff= 32768
##$TDoff= 0
##$TI= <>
##$TILT= no
##$TM1= 0
##$TM2= 0
##$TOPLEV= 0
##$USERP1= <user>
##$USERP2= <user>
##$USERP3= <user>
##$USERP4= <user>
##$USERP5= <user>
##$WDW= 1
##$XDIM= 65536
##$YMAX_p= 172413453
##$YMIN_p= -287686904
$$ End of Bruker specific parameters
$$ ---------------------------------
##NTUPLES= NMR SPECTRUM
##VAR_NAME=  FREQUENCY,     SPECTRUM/REAL,   SPECTRUM/IMAG
##SYMBOL=    X,             R,               I
##VAR_TYPE=  INDEPENDENT,   DEPENDENT,       DEPENDENT
##VAR_FORM=  AFFN,          ASDF,            ASDF
##VAR_DIM=   65536,         65536,           65536
##UNITS=     HZ,            ARBITRARY UNITS, ARBITRARY UNITS
##FACTOR=    0.49542278885378, 1,            1
##FIRST=     15991.5117654749, 0,            0
##LAST=      -16476.0207020576, 0,           0
##MIN=       -16476.0207020576, -287686904,  0
##MAX=       15991.5117654749, 172413453,    0
$$ Real data points
##PAGE= N=1
##DATA TABLE= (X++(R..R)), XYDATA
$$ [...]
7501E753555j227237l48887Q7620k26990j004924j714344k188187k342846j672764
7492d885004J2149J572426J522694K08785k48415J264491L159533L008483L99152
7483F014294k783376m361937l505292r92064J314745J719353L51696p05297J55435
7474b792443J821693J798888l36715k266241k046012l91919R57631J655040K096033
7465D95955J643888l44767k293856j726044R25820K317943R22250o99775J6768
7456A258182J586325J056899j024542j480250L37485J674179R00609l61556n76850
7447C370481p16114j796947k684462k313059j755401j789577o01321L154737O656081
7438A524418N749830Q12785l553315m536775l584943k649518j458118L20039J347183
$$ y = [5753555, 4526318, 4177431, 4265051, 4038061, 3033137, 1318793, -869394, -3212240, -4885004, -4872855, -3300429, -1777735, -1568950, -1817365, -552874, 2606659, 5615142, 6014294, 3230918, -1131019, -4636311, -5628375, -4313630, -2594277, -2242581, -2947878, -2792443, -970750, 828138, 491423, -1774818, -3820830, -4212749, -3255118, -1600078, 495955, 2139843, 1795076, -498780, -2224824, -1299004, 1018939, 1941189, 1241414, 1258182, 2844507, 3901406, 2876864, 1396614, 1734099, 3408278, 4308887, 3947331, 3370481, 2654367, 857420, -1827042, -4140101, -5895502, -7685079, -8286400, -5131663, 1524418, 7274248, 8087033, 4533718, -3057, -3588000, -6237518, -7695636, -7375597, -6028414]
7429f028414J002537J103861L025968M861125L822874L71668k343717k575123
7421C240779j434813n27067r8218J85819J88946l25786j127016j747388j821583
7412c466327j141437J07025J155578J203448K51652q49594j163381m78108L44969
7403d036175j6934j690981k692949q90981K842320M934953L381775K53163j246810
7394H37381p86986k68462l90216j44911P39011J184267P39723J78668j90795r32742
7384I64938j710788j005673J455788L542336L174142Q77336j188239j920044j946588
7375B243208k164738k564594k390125j039314J069133K605019K792804K465002
7367C016395K720048K876100J260962j916374m220350m019186k256686n97466
$$ y = [-6028414, -5025877, -3922016, -896048, 3965077, 7787951, 8159619, 5815902, 3240779, 1805966, 1278899, 1180681, 1366500, 1555446, 1229660, 102644, -1644744, -3466327, -4607764, -4500739, -3345161, -2141713, -1890061, -2739655, -3903036, -4381144, -4036175, -4053109, -5744090, -8437039, -9328020, -6485700, -1550747, 1831028, 2084191, 837381, 50395, -218067, -608283, -753194, -14183, 1170084, 1909807, 2088475, 1897680, 964938, -745850, -1751523, -295735, 3246601, 6420743, 7298079, 6109840, 4189796, 2243208, 78470, -2486124, -4876249, -5915563, -4846430, -2241411, 551393, 3016395, 5736443, 8612543, 9873505, 7957131, 3736781, -282405, -2539091, -3136557]
7359c136557M80540R29922L47095p89408p89009Q29808K085689J293674l83762
7350H67992q78291k31182K88721N79853R29239L13655j767207l028290j174359
7341d099869J984892K733885J103889K76968O29610p26106l656949l668727P67525
7332d654882M603498L600991R32454J608316L861119K102771l433303o475093
7324B145871m052004j12209J221830O12870q7191j337293l007210k329275J629088
7315e315523M789405L308461n18157j710687k2375O38503q53055j399924M66042
7306f17310J860862L12923k265591k559966l64961K002231K982252K483780P82710
7297D616930j300677k192948j396747o78798j637509k885604j761935J487727
$$ y = [-3136557, -2656017, -1726095, -1379000, -2168408, -2957417, -2127609, -41920, 1251754, 867992, -10299, -241481, 47240, 627093, 1556332, 1869987, 102780, -2925510, -4099869, -2114977, 618908, 1722797, 1999765, 2629375, 1903269, -1753680, -5422407, -4654882, -51384, 3549607, 4482061, 6090377, 9951496, 12054267, 8620964, 2145871, -1906133, -2018342, -796512, -183642, -270833, -1608126, -4615336, -6944611, -5315523, -526118, 2782343, 2264186, 553499, 531124, 1169627, 316572, -1083352, -617310, 1243552, 1556475, -709116, -3269082, -3634043, -1631812, 1350440, 3834220, 4616930, 3316253, 1123305, -273442, -952240, -2589749, -5475353, -7237288, -5749561]
7289e749561L496162K137784p90163k103115j011918P37989J513052J207815L27792
7280b34163r95408k528130l170354j664729J586688M015876L141482n15891l591199
7271c955828l403937n90034K354931M113801M855889M358770J945989j491036
7263H188545l475774k986110j932611k236522k775178j159616K205650M158013
7255a3603L029211P08244l82821m78435j116627k013457j521785J55144N68600
7246a065529j373298l216395j921587J882809M339452L006457l86286k270073
7238a004450j236295R99098J873979L88739k340573m112391l369616n95404J994456
7229g402457K589678J500571L49671n6228k47623o78062q52586j94949J002086
$$ y = [-5749561, -2253399, -115615, -905778, -3008893, -4020811, -3282822, -1769770, -561955, -234163, -1229571, -3757701, -6928055, -8592784, -7006096, -2990220, 151262, -364629, -3955828, -7359765, -7949799, -5594868, -1481067, 3374822, 7733592, 9679581, 8188545, 4712771, 1726661, -205950, -2442472, -5217650, -6377266, -4171616, -13603, 3015608, 3723852, 3341031, 2862596, 1745969, -267488, -1789273, -1634129, -1065529, -2438827, -5655222, -7576809, -5694000, -1354548, 1651909, 1265623, -1004450, -2240745, -1241647, 632332, 1021071, -1319502, -5431893, -8801509, -9396913, -7402457, -4812779, -3312208, -2962537, -3018765, -3266388, -3944450, -4797036, -4991985, -3989899]
7220c989899J957481K227690J831876J053300L97097K28236K00995l75898j395108
7211B135770j925361j636850j325315j497626j484438p73532j36079k77626m52523
7202g373580J4527j35760k193930m270984k857405J960962N731782N413377L261646
7193d49365K809873L343450J662998j932762l394681r86275K025727K249196P54488
7184F082649M13909Q77316n50149l853957n541562l566518l20211P63528k91761
7175e986756p99702M00197J710399J573873N66437J27432O01940J372913J928257
7166A494990J865883O50703j479400k857422j929907O17757K446952K364184J370399
7157D544139O98347J55567q74022j939847k071570j071560O10675K487295L605294
$$ y = [-3989899, -2032418, 195272, 2027148, 3080448, 3477545, 3705781, 3906776, 3530878, 2135770, 210409, -1426441, -2751756, -4249382, -5733820, -6507352, -6643431, -6921057, -7373580, -7359053, -7494813, -9688743, -13959727, -16817132, -14856170, -9124388, -3711011, -449365, 2360508, 5703958, 7366956, 5434194, 2039513, 1053238, 3078965, 5328161, 6082649, 6496558, 7373874, 6823725, 2969768, -2571794, -6138312, -6458523, -5694995, -5986756, -6786458, -6386261, -4675862, -3101989, -2535552, -2408120, -1806180, -433267, 1494990, 3360873, 4011576, 2532176, -325246, -2255153, -1637396, 809556, 3173740, 4544139, 5242486, 5398053, 4524031, 2584184, 512614, -558946, 51729, 2539024, 6144318]
7148F144318K591454m32085k879085k494488n34437o2984j468742k257556j401109
7139b794714q06575j440126j199364J210414L074015J441799j828472k428981
7131d772004r95J634443N11497j050805q28659Q2954O0670k8692J161553K571425
7121f58613K213504J84767j775175k642759k393496j160777K04338L2953j802616
7112g797874k674191n25401K642898L115533O38915j406173q45432R12215J668901
7103d270609J180537L43889l61016o66471k42370N81892R89321J000445J403860
7094d0522K148448K258269J574838R28616K61453j481780l896534m576514k299707
7085e123433Q31338J905647P52083m07987p2229J037589J212589k94017k331237
$$ y = [6144318, 8735772, 8303687, 5424602, 2930114, 2395677, 2332693, 863951, -1393605, -2794714, -3601289, -5041415, -6240779, -5030365, -1956350, -514551, -2343023, -4772004, -4772999, -3138556, -2627059, -3677864, -4506523, -4423569, -4362899, -4391591, -3230038, -658613, 1554891, 1739658, -35517, -2678276, -5071772, -6232549, -6028211, -5995258, -7797874, -10472065, -10997466, -8354568, -5239035, -4600120, -6006293, -6851725, -5939510, -4270609, -3090072, -2746183, -3107199, -3773670, -4016040, -3434148, -2444827, -1444382, -40522, 2107926, 4366195, 5941033, 6869649, 7131102, 5649322, 1752788, -2823726, -5123433, -4292095, -2386448, -1634365, -2042352, -2114581, -1076992, 135597, -158420, -2489657]
7076b489657k730126p10394J817842K457543J473725J065843J765110J868410
7068D518296O56125m92515r17748j803502l286966l327889j191574P20414O53442
7059d471917M32886K088358M110167M057670K606288J679909O28181k017437m689066
7050D425039m686335k663040j238707m27700J161296J848228j023845m937152
7042g542216m122583J461667M928863K236878k235430k685850L91444K938932
7034d628295L576366L142325J443677j286382k298947J21913L023668K609438
7026E703763r7969j303765m75412j21367p22897k93903J402700K283514J618159
7017G992823O55220l64782k137310l223265j133866K839891L967170O54197l038098
$$ y = [-2489657, -5219783, -5930177, -4112335, -1654792, -181067, 884776, 2649886, 4518296, 5174421, 4681906, 3764158, 1960656, -1326310, -4654199, -5845773, -5125359, -4471917, -4039031, -1950673, 2159494, 6217164, 8823452, 10503361, 11131542, 9114105, 4425039, -261296, -2924336, -4163043, -4590743, -3429447, -1581219, -2605064, -7542216, -11664799, -10203132, -5274269, -3037391, -5272821, -7958671, -7567227, -4628295, -1051929, 2090396, 3534073, 2247691, -51256, 70657, 3094325, 5703763, 5605794, 4302029, 3826617, 3705250, 2982353, 2688450, 4091150, 6374664, 7992823, 8648043, 8283261, 6145951, 2922686, 1788820, 4628711, 8595881, 9250078, 6211980]
7008F211980l292726j443532n50346k86030J383542L614227L644289J489354M3911
6999A0814669L30435o1523k614535m667268k869737J494123L434527P92598k602231
6990D051058j944775K008494M072784J907918j029384r12927J073925J265513
6982A0492606p54699k294800k338607k503924l229319k624004q8495K047417J986687
6973F92862R18228L81917k10745j322056j095009J622617L972458K451027j345287
6964F066012k316110O41482K800760P21762k560286k315241O91529J733718m04217
6955E059409j866687o0385K548699K798190J592142J432433J720959K30916k135686
6946A1319990k199347R8916J262711p9746j086273J19469J085713n13285k478342
$$ y = [6211980, 2919254, 1475722, 925376, 639346, 2022888, 5637115, 9281404, 10770758, 10814669, 11145104, 11083581, 8469046, 3801778, 932041, 2426164, 5860691, 6653289, 4051058, 2106283, 4114777, 8187561, 10095479, 9066095, 8153168, 9227093, 10492606, 9737907, 7443107, 5104500, 2600576, -628743, -3252747, -3341242, -1293825, 692862, 1611090, 1993007, 1782262, 460206, -634803, 987814, 4960272, 7411299, 6066012, 3749902, 4391384, 7192144, 7913906, 5353620, 3038379, 3729908, 5463626, 5059409, 3192722, 3132337, 5681036, 8479226, 10071368, 11503801, 13224760, 13455676, 11319990, 9120643, 9219559, 10482270, 10402524, 9316251, 9435720, 10521433, 10008148, 7529806]
6937G529806j738060J60828n15692l233054l699104n46587K775100L367042K264123
6928F364402J259728q7623k265287l438590j895116P20439J093324j365337l630322
6919c244382k666367J033988L821951K802965o50891k105595N53026M218439M663472
6910H426606K232922P09483J174595O32918k539370n344101m388695q41418J279175
6901A342115L24389j636381j934895j35403J911105J976296j63715k111553j585753
6892b013795M39365J063521k17018r91131n5599R17326Q27087J067823K274285
6883C311864K325117J20289j518362K9538K425416J515511k166995l993834j907828
6874A40716J145957J778481J03001j624648j979150j108624n2875J34753m59577
$$ y = [7529806, 5791746, 5952574, 5436882, 2203828, -1495276, -2041863, 733237, 4100279, 6364402, 7624130, 7536507, 5271220, 1832630, -62486, 657953, 1751277, 385940, -3244382, -5910749, -4876761, -1054810, 1748155, 1097264, -1008331, -455305, 3763134, 8426606, 10659528, 11369011, 12543606, 13176524, 10637154, 5293053, 904358, 62940, 1342115, 1666504, 30123, -1904772, -2040175, -129070, 1847226, 1683511, -428042, -2013795, -1574430, -510909, -727927, -1719058, -1774657, -857331, -30244, 1037579, 3311864, 5636981, 5757270, 4238908, 4268446, 6693862, 8209373, 6042378, 2048544, 140716, 1286673, 3065154, 3168155, 1543507, -435643, -1544267, -1597142, -1462389, -1921966]
6865a921966n37259L85404Q03837m00516j560468m35577J952475K287428m26229
6856A47129l635969m705656l414552r12942J598932K836708K107928M88829k45036
6847e734629Q9005M52217Q22226J838655K479075Q70334k145915l031841k53995
6838d614868L294028L925075J494494j169913j794177m23267J373142K150142
6830D234656J961803K195835L358271L702625J580606j630050l216337l170632
6822I016777l621398m398530k815617J254258L817512K233467q53110j491834
6814C141525J82997J208892L95151j165485k633768l611584k919154n5644K758938
6805b698132K714089L35805j160118l88878P07817K57149q01223l53687J792551
$$ y = [-1921966, -2459225, -2073821, -1269984, -1670500, -3230968, -3666545, -1714070, 573358, 147129, -3488840, -8194496, -11609048, -12521990, -10923058, -8086350, -5978422, -5489593, -5734629, -5645624, -5193407, -4371181, -2532526, -53451, 816883, -1329032, -4360873, -4614868, -1320840, 2604235, 4098729, 2928816, 1134639, 711372, 2084514, 4234656, 6196459, 8392294, 11750565, 15453190, 17033796, 15403746, 12187409, 9016777, 5395379, 996849, -1818768, -564510, 3253002, 5486469, 4633359, 3141525, 3324522, 4533414, 4928565, 3763080, 1129312, -2482272, -5401426, -5457070, -2698132, 15957, 351762, -808356, -1197234, -489417, -232268, -1033491, -1387178, 405373]
6796D05373L488551K599024n79404l307822l183682r05563O89306M68975K39030
6787h6212J373286K253717Q95321j464299j862666O1378J668701J057285r42001
6778B954510k569810l047342k475983j443957r17412j157102q58508J110458L376910
6769e028236L373625R64471j331609j997408k106498k540994k058954K61090K556371
6760g908142K390662N08893J44577K572748N172158M631102J006316k435309l128554
6751B954451j884425j103417j185929l32583J928648L098281J135768k042329
6743B568465k927190j477033q80725k239826k760999m25342K567204L167494J949384
6734d58568J538656K226135K173906J111665O86897J223160J055956m24080j653198
$$ y = [405373, 3893924, 6492948, 5913544, 2605722, -577960, -1483523, -794217, -325242, -86212, 1287074, 3540791, 4436112, 2971813, 1109147, 1170525, 2839226, 3896511, 2954510, 384700, -2662642, -5138625, -6582582, -7499994, -8657096, -9515604, -8405146, -5028236, -1654611, -690140, -2021749, -4019157, -6125655, -8666649, -10725603, -10464513, -7908142, -5517480, -5008587, -4864010, -2291262, 2880896, 7511998, 8518314, 6083005, 2954451, 1070026, -33391, -1219320, -1551903, 376745, 3475026, 4610794, 2568465, -358725, -1835758, -2716483, -4956309, -7717308, -8142650, -5575446, -2407952, -458568, 1080088, 3306223, 5480129, 6591794, 7278691, 8501851, 9557807, 9133727, 7480529]
6725G480529j598635j252073j451309j431701p83563p03849j673204j832455L06142
6716b940118L096527L909326K763660J469285L06021j647686l589673l567227
6708a99885k017551j644551l139749l890921j967199J224064L469685M442483
6700c723624M484416L230028J197663L82436J289609J680978L77248l29798J156396
6691I745352J917885j195086n534373n676501j535090J508519N94143j429203
6683a604354j614841q49373m76407M56550K097828K003877m63293j527801J482062
6674d95752M910746L442187j822061m546542j851957K451392L756072K090889
6666G934974L64532l2131N6079k07918m95347k31988K94979K47768l44985j99112
$$ y = [7480529, 5881894, 4629821, 3178512, 1746811, 963248, 259399, -1413805, -3246260, -2940118, 156409, 4065735, 6829395, 8298680, 8604701, 6957015, 3367342, -199885, -2217436, -3861987, -7001736, -10892657, -12859856, -11635792, -8166107, -3723624, 760792, 3990820, 5188483, 5570919, 6860528, 8541506, 8918754, 8588956, 9745352, 11663237, 10468151, 4933778, -742723, -2277813, -769294, -175151, -1604354, -3219195, -4068568, -4544975, -4088425, -1990597, 13280, -450013, -1977814, -495752, 4414994, 7857181, 6035120, 1488578, -363379, 2088013, 5844085, 7934974, 8299506, 8267375, 8323454, 8115536, 7620189, 7388201, 7683180, 7930948, 7585963, 7386851]
6656G386851J244490K100559K79437k668148k794034K74021J891419r23258m531216
6647B260121l797638K96780K545837J661713J561144M339123O716959N129218
6639B0713257O94860l025920m541355m506596l381735j382440M12589R56607P23267
6630F662534Q99077J507118J452623K17831j307390j744965p33866N32161N87664
6621H072787l39476n19012N41640R07187q26638k771924k230867k7039M89937
6612C296595j438251k872500j673560P33759K035258J914967J115728l1548q44140
6603B236308k73521R54053L87408k382032m237028k771500Q8060J054796K29546
6594d713910M0784P70971M43142j160417j591483M13637K627560K183117o83760
$$ y = [7386851, 8631341, 10731900, 11011337, 8343189, 5549155, 5823176, 7714595, 6791337, 2260121, -1537517, -1240737, 1305100, 2966813, 4527957, 8867080, 15584039, 20713257, 21408117, 18382197, 13840842, 9334246, 5952511, 4570071, 4982660, 5939267, 6662534, 7561611, 9068729, 10521352, 10739183, 9431793, 7686828, 6952962, 7485123, 8072787, 7733311, 7214299, 7755939, 8663126, 7836488, 5064564, 2833697, 2806658, 3296595, 1858344, -1014156, -2687716, -1953957, 81301, 1996268, 3111996, 3080448, 2236308, 1962787, 2916840, 3304248, 922216, -3314812, -6086312, -5998252, -4943456, -4713910, -4673126, -3902155, -3459013, -4619430, -6210913, -5797276, -3169716, -986599, -1670359]
6585a670359k970725k384085L04346K211113J400296j014039k140204q20558R54321
6576f129894Q38364n65339n96533J574302L593460L003689M63095j200145o58435
6567C22564M70066K08748q50508m80185J683008L315660K650626Q16805l27291
6558G809493j047422k401483l409102k339923j73174L89641o19745l29951J985964
6549a35702L363477K003693J81227P5209l1528k268853m559771l377750M18892
6540d331106K505960J290387m99336m82744N15338R32588Q40037O99401J4318
6531A484843j484489k861611l229545k837959k228309j366484j82305R37177J621043
6522a0147639J787737J359694M30355m16695p19568p19363n26458N72632K801245
$$ y = [-1670359, -4641084, -7025169, -6720823, -4509710, -3109414, -4123453, -6263657, -7084215, -6129894, -5291530, -5856869, -6453402, -4879100, -1285640, 1718049, 2181144, 980999, 322564, 792630, 1001378, 150870, -329315, 1353693, 4669353, 7319979, 8136784, 7809493, 6762071, 4360588, 951486, -1388437, -1561611, -1171970, -1791715, -2121666, -135702, 3227775, 5231468, 5412695, 5487904, 5456376, 3187523, -1372248, -4749998, -4331106, -1825146, -534759, -1034095, -1516839, -1001501, -68913, 771124, 1470525, 1484843, 354, -2861257, -6090802, -8928761, -11157070, -12523554, -12705859, -11768682, -10147639, -8359902, -7000208, -6569853, -6986548, -7706116, -8425479, -8951937, -8379305, -5578060]
6513e578060M706637M809088L667490K615556J428613n00147j631889l7059K606843
6504A2087072K323490j228517l674038k197970M61822N28607j261964j701811
6496E336691o28949p85861k919258m409429l161215l47540J504309J460650M74472
6487c476130j06731K82529J046521R79819k93348j593380j536806k51745J076109
6478c873162J879499K288473J955740L59686j636626k088731m13279J649056K165609
6469B286265J138504j33855q47511j015799q32583o91629j198711k129539j984285
6460e409143R6015K356116K066042o44620k332056n43752K795049L707737J090753
6451C182141k229008l115769j369556Q11529J411650J88609j502871k005912r10890
$$ y = [-5578060, -871423, 3937665, 7605155, 10220711, 11649324, 11149177, 9517288, 9480229, 12087072, 14410562, 13182045, 9508007, 7310037, 7771859, 8300466, 7038502, 5336691, 4707742, 3921881, 1002623, -3406806, -6568021, -6915561, -5411252, -3950602, -3476130, -3582861, -3300332, -2253811, -1273992, -1567340, -3160720, -4697526, -4949271, -3873162, -1993663, 294810, 2250550, 2610236, 973610, -1115121, -1528400, 120656, 2286265, 3424769, 3290914, 2443403, 1427604, 595021, -96608, -1295319, -3424858, -5409143, -5313128, -2957012, -890970, -1535590, -3867646, -4411398, -1616349, 2091388, 3182141, 953133, -2162636, -3532192, -2720663, -1309013, -1120404, -2623275, -4629187, -5540077]
6442e540077M99253O78229m38512j565530j616636n07592J104256K071577J418272
6433c896760j51426k99962J779303L282448J297359k414099l397367j072338O69884
6424d202958J15922K96320K759496L586051l90572n217979m880094l13666K215657
6415f031823N16574j480350r29095L67418N76746P99569J637475J407371q668
6406c144783K80736L134997M687818J864880k504251l532321r13305J636766J819200
6397C329737M27261j163659k224284k118987q40811N16822J323536K182674K876905
6388D309194J717403j212561k735722j095845P69742k77871k259318j275043J939084
6379a20937L298186J975947P79599N06778q03926k724346j976334J499882L052924
$$ y = [-5540077, -5040824, -4362595, -4801107, -6366637, -7983273, -8490865, -7386609, -5315032, -3896760, -4048186, -4348148, -2568845, 713603, 2010962, -403137, -3800504, -4872842, -4202958, -4087036, -3790716, -1031220, 2554831, 2164259, -3053720, -7933814, -8247480, -6031823, -5515249, -6995599, -7924694, -7557276, -6980530, -6180961, -4543486, -3136115, -3144783, -2864047, 270950, 4958768, 6823648, 4319397, 787076, -126229, 1510537, 3329737, 3756998, 2593339, 369055, -1749932, -2590743, -2073921, -750385, 1432289, 4309194, 6026597, 4814036, 2078314, 982469, 1752211, 1474340, -784978, -2060021, -120937, 3177249, 5153196, 5932795, 6439573, 5635647, 2911301, 934967, 2434849, 5487773]
6370E487773J48626l615946l972621j746091k92473m07541q57818j289861j535178
6361h081130l09088K440847L990503K480452l8861j049591j566099l238991m022849
6352i394807j254546K768378L486587J526402J900279N494015P073760L508817
6344A5108885j222999k172251l43581J50892j293925k090271j455994j039294
6336E641462j320258r63486K08915N22864p38851j989682j492570N26437K362571
6327B757402K533871R62363q54057j197699k40729P2107j011269j696700p06082
6318F19207K8898j769641m362377l729174M94597M095367M012402K036021J421859
6309B847159K313883K468667Q57464j448799l078837l446188k596265j184328
$$ y = [5487773, 5636399, 2020453, -1952168, -3698259, -3990732, -4398273, -5256091, -6545952, -8081130, -8390218, -5949371, -1958868, 521584, 482723, -566868, -2132967, -5371958, -9394807, -10649353, -7880975, -4394388, -2867986, -967707, 4526308, 11600068, 15108885, 13885886, 11713635, 11370054, 11520946, 10227021, 8136750, 6680756, 5641462, 4321204, 3357718, 3566633, 4089497, 3350646, 1360964, -131606, 394831, 2757402, 5291273, 6253636, 5399579, 4201880, 3961151, 4033258, 3021989, 1325289, 619207, 648105, -1121536, -5483913, -9213087, -8718490, -4623123, -610721, 1425300, 2847159, 5161042, 7629709, 8487173, 7038374, 3959537, 513349, -2082916, -3267244]
6301c267244k31615r9084q2261N34157J559875K236881J820021j6540k285232
6292A68958k654676j30254K530437J608130k149397l899939j414466J903067K457782
6283a580358J540514K164097L758569L683680K001686Q35930L00691j012161k393652
6274I298996j913509n13790j050361l167432l355236p86801J130298L97913m01631
6265c61553J296247L734561L815966J751182p0619r16382j694272k449718k384248
6256B721164j608855r24035m62971j6290P7382l11992l03079P86017K164538K510237
6246D632116J451248m80970k311381k695950j150384M17040m30149k658211k465046
6237e691687P78112K688988M24861k282945m98914L958216M779496M59786l695443
$$ y = [-3267244, -3498859, -3597943, -3680204, -3146047, -1586172, 650709, 2470730, 2454190, 168958, -2485718, -2615972, -85535, 1522595, -626802, -4526741, -5941207, -4038140, -1580358, -39844, 2124253, 5882822, 9566502, 11568188, 12404118, 12704809, 11692648, 9298996, 7385487, 6871697, 5821336, 2653904, -701332, -1488133, -357835, 40078, -361553, 934694, 4669255, 8485221, 10236403, 10165784, 9249402, 7555130, 5105412, 2721164, 1112309, 188274, -274697, -290987, -213605, -525597, -828676, -42659, 2121879, 4632116, 6083364, 5602394, 3291013, 595063, -555321, -138281, -568430, -3226641, -5691687, -4913575, -2224587, -1799726, -4082671, -4581585, -623369, 4156127, 4615913, 920470]
6228I20470l452355j012521o17365k276599k642909k47158K800103L776592K184001
6219e67741l64185j953363j829740o11079N36060P75941o6394j331271j558892
6210f970664K99245L189213M563942L475583J870731J674006J857128J64839l049579
6201G074444m766658l090918M16072K444246J140520k271033m479411l212262
6193f745000J03968J738013K66532j693226j313472P89880K376834L093147L755833
6184B372509L703526J756155j103530k833360l429359m114940m129202j587340
6176i365541K541492M570569K772380o88672k897889k839241p83199K245059M030743
6167d14299K900488L63924n13374M16227M39255j222678k099000q24194O69551
$$ y = [920470, -2531885, -3544406, -4161771, -6438370, -9081279, -9328437, -6528334, -2751742, -567741, -931926, -2885289, -4715029, -5326108, -4790048, -4014107, -4080501, -5411772, -6970664, -6671419, -3482206, 1081736, 4557319, 6428050, 8102056, 9959184, 10124023, 7074444, 2307786, -783132, -367060, 2077186, 3217706, 946673, -3532738, -6745000, -6641032, -4903019, -4636487, -6329713, -7643185, -6853305, -4476471, -1383324, 2372509, 6076035, 7832190, 6728660, 3895300, 465941, -3648999, -7778201, -9365541, -6824049, -2253480, 518900, -169772, -3067661, -5906902, -6690101, -4445042, -414299, 2486189, 2850113, 2336739, 2752966, 3192221, 1969543, -129457, -953651, -284100]
6158b84100P69833P77486K020133L136251K227432m69130l523549n619055m910398
6149e875097k38305N484793O647593K011021k963082l512526j731915j865633
6141b043151l023191j462700K253110L881594K364485Q79641J027935P66657j138018
6132C506362k920135l315024l472883l885592k872729L08K101472J612180O31610
6123h614431J778097L702921K991215n50192l454702l255604j093449O65388J318441
6114f512316J530629J736285J968606K346557K694449K318674J105053J72333
6106G360270K45402J9624k094055m810631m849464j568088J697581K239536J421726
6097c38099J413458J118782j178252l128500r80324L696753N051468J432674k139405
$$ y = [-284100, 485733, 1263219, 3283352, 6419603, 8647035, 8177905, 4654356, -964699, -5875097, -6113402, -628609, 6018984, 8030005, 5066923, 1554397, -177518, -2043151, -5066342, -6529042, -4275932, -394338, 1970147, 2849788, 3877723, 4644380, 3506362, 586227, -2728797, -6201680, -10087272, -12960001, -12959693, -10858221, -9246041, -8614431, -6836334, -3133413, -142198, -692390, -4147092, -7402696, -8496145, -7830757, -6512316, -4981687, -3245402, -1276796, 1069761, 3764210, 6082884, 7187937, 7360270, 7605672, 7625296, 5531241, 720610, -4128854, -5696942, -3999361, -1759825, -338099, 1075359, 2194141, 1015889, -2112611, -3092935, 603818, 5655286, 7087960, 4948555]
6088D948555j707885K09991k84060k292683k766738j866746j463846r13766J207177
6079d930001L039614J754372j127622j256597J988052M585045L721025Q83487
6071H657375j362543k376527k459636j643472l39558P65238J726450K544733J926270
6062G438330q85247l785391m068193k328699j087764l80093J476709L254379J706509
6053A340540k266271l265129P96119M798477L227538k353739n811059m167537
6045g701061J94113L507537L989721K081737l23875j114941J53705J821279K168683
6036D776898J171025j15188p53882k45159R69347J167416q04226l296017l562360
6027f92146j772748p45418j386027j482431Q9263J283589N96976k46902O14204
$$ y = [4948555, 3240670, 3450661, 3166601, 873918, -1892820, -3759566, -5223412, -6137178, -4930001, -1890387, -136015, -1263637, -2520234, -532182, 4052863, 7773888, 8657375, 7294832, 4918305, 2458669, 815197, 475639, 1240877, 2967327, 5512060, 7438330, 6553083, 2767692, -1300501, -3629200, -4716964, -5097057, -3620348, -365969, 1340540, -925731, -4190860, -3394741, 1403736, 4631274, 2277535, -3533524, -7701061, -7506948, -3999411, -9690, 2072047, 1748172, 633231, 786936, 2608215, 4776898, 5947923, 5832735, 5078853, 4833694, 5803041, 6970457, 6166231, 2870214, -692146, -2464894, -3210312, -4596339, -6078770, -5989507, -4705918, -4108942, -4355844, -3741640]
6018c741640K122823K524703K148069J714341L70254k063853l215838j343680
6010a484821J560045K589248J970064J517519J047929m57000j820292j318705
6002C603987r5932m07180j509140r90136O14701O10143o73506J56715L568770
5993D878422N190739J899645l224841m637907j340431K296270K181994r46282
5985F297609l091870k111372o3535J8693j431928j242506J526614M029193L980260
5976G911158K688332J880270L57178l259683o723625o669882l524602m84434J194713
5967f630575K344013K500295N23690j904316j662057P78736J718958N3108j241609
5958c519757j90482J459017J693746Q55038l11380j747104k135148M48783M554460
$$ y = [-3741640, -1618817, 905886, 3053955, 4768296, 5138550, 3074697, -141141, -1484821, 75224, 2664472, 4634536, 6152055, 7199984, 6742984, 4922692, 3603987, 3508055, 3100875, 1591735, 601599, 1216300, 1826443, 1152937, 1309652, 4878422, 10069161, 11968806, 8743965, 4106058, 2765627, 5061897, 7243891, 6297609, 3205739, 1094367, 1030832, 1049525, -382403, -1624909, -98295, 3930898, 7911158, 10599490, 12479760, 12836938, 9577255, 2853630, -3816252, -7340854, -7825288, -6630575, -4286562, -1786267, -1262577, -3166893, -4828950, -4050214, -2331256, -2278148, -3519757, -3710239, -2251222, -557476, 297562, -13818, -1760922, -3896070, -3447287, 1107173]
5949A107173N755978K727887p28592j525370j208934j755532j635980N86929K377439
5940E700998R76239j704902k046656m67715j18842j445824k108561j248959m8756
5931b512978J160133K744072L405111J540135j443667k556224j628645r62399
5923b54462r63431J98599K515032L491550K223128O83482J13640n63954j716489
5914E727095j785205o02034o64125l022614m763668l130001J75140J655459J202729
5905e207224J407633K704947K657919K48068k186691k423934j469227j489135
5897e757644k118616j042936K034069M166508K811846p15854k885219k300999
5889e808845o82565L31206J254705K838321L932918K888902Q3745k531102l828753
$$ y = [1107173, 6863151, 9591038, 8862446, 7337076, 6128142, 4372610, 2736630, 3323559, 5700998, 6677237, 4972335, 2925679, 2457964, 2339122, 893298, -1215263, -2464222, -2512978, -1352845, 1391227, 4796338, 6336473, 4892806, 2336582, 707937, -254462, -1217893, -1019294, 1495738, 4987288, 7210416, 7893898, 8007538, 7443584, 5727095, 3941890, 3339856, 2675731, -346883, -5110551, -8240552, -8065412, -6409953, -5207224, -3799591, -1094644, 1563275, 1811343, -375348, -2799282, -4268509, -5757644, -7876260, -8919196, -6885127, -2718619, 93227, -622627, -3507846, -5808845, -6491410, -6160204, -4905499, -2067178, 1865740, 4754642, 4838387, 2307285, -1521468]
5880a521468m055096l496705k123318m11254Q05416J398148J950139K744712L392645
5871a316781L182054J406734j772923m206662k961363J968697O457476O545546
5863I302778K948068n19619j824370j736626j061112J87855J142866N19821j072956
5854G886705j756303j447306j755266k686013k340115m62181O54786j14261p91552
5845b811506M93334K579352L046452J203062j792578m174946m237636j646536
5837g341002J296346J728678j4647j045507m51165l3693j67982J000271K961261
5828b067440K049966k211121m420979o58043N209067O901339M288237J733798
5820A0824824N30124j344127l397306k635759N19526J798981l95517k636319j990184
$$ y = [-1521468, -5576564, -9073269, -11196587, -11607841, -10802425, -9404277, -7454138, -4709426, -1316781, 1865273, 3272007, 1499084, -2707578, -5668941, -3700244, 2757232, 9302778, 12250846, 11731227, 9906857, 8170231, 7109119, 7296974, 8439840, 8959661, 7886705, 6130402, 4683096, 2927830, 241817, -2098298, -2560479, -1905693, -2019954, -2811506, -2318172, 261180, 3307632, 4510694, 2718116, -1456830, -5694466, -7341002, -6044656, -4315978, -4330625, -5376132, -5827297, -5860990, -6028972, -5028701, -2067440, -17474, -2228595, -6649574, -7307617, -2098550, 4802789, 9091026, 10824824, 11354948, 10010821, 6613515, 3977756, 4497282, 6296263, 5900746, 3264427, 1274243]
5811A274243J55730J402111J862569K400156K275552P24341j132181j712418q97237
5802F352866M55855J433510R97108j171014l302018l040840p73685O79747J45335
5793A776864n05449L26047J739503K369276K235803J426026p37990l764394n239829
5784c74143l624594l65457J994857K504274J754715O55493J11751N52157J140259
5775D349312P36503k36579n15989l11493o05476m77715J713463M295471L181798
5766A2129295k035408o445812n982399k107008J331717K729095K337683N21633
5758B478796j309874r43948J298169K369174J407950J112731K118106P74630l985977
5749E319757o570532k652718L057174L247464r95957k662832j81565J405720M2701
$$ y = [1274243, 1429973, 2832084, 4694653, 7094809, 9370361, 10094702, 8962521, 7250103, 6352866, 6808721, 8242231, 9239339, 8068325, 4766307, 1725467, 951782, 1631529, 1776864, 1271415, 1597462, 3336965, 5706241, 7942044, 9368070, 8630080, 4865686, -374143, -3998737, -4364194, -2369337, 134937, 1889652, 2545145, 2656896, 3209053, 4349312, 5085815, 4849236, 4333247, 4021754, 3416278, 2938563, 4652026, 8947497, 12129295, 10093887, 3648075, -2334324, -4441332, -3109615, -380520, 1957163, 2478796, 1168922, 224974, 1523143, 3892317, 5300267, 6412998, 8531104, 9305734, 5319757, -1250775, -3903493, -846319, 2401145, 1405188, -1257644, -1439209, -33489, 9212]
5740I212m44035J806932L141993J106646j340237j248047k08044m27268p94071
5731A603081n9502J01704j406715k119126p4096K248439J747033k13362m23870
5722A403586O08178r6567k448479l127312p37351K362908L719976L431582K468944
5713G585465P11616k072869m577164m696299k021809J019063J402350o84739j465279
5704d799665J473681N016637M152701n87733l138882m15369L144637K154815j909962
5695E090860l299579m42504K423378J688085j301407l066353k383956o45547M47410
5686a489613L41173m60453j214535j734092k197560k126884n47221K196423L943469
5677c289293L192760J130695j14467l57160r05380j847483j652742L96348K781795
$$ y = [9212, -434823, 1372109, 4514102, 5620748, 4280511, 3032464, 2824420, 2397152, 1603081, 1543579, 1645283, 238568, -1880558, -1954654, 293785, 2040818, 1827456, 1403586, 2011764, 1915197, -533282, -3660594, -4397945, -2035037, 1684939, 5116521, 7585465, 8297081, 6224212, 1647048, -3049251, -5071060, -4051997, -2649647, -3334386, -4799665, -3325984, 1690653, 5843354, 5255621, 2116739, 1701370, 4846007, 7000822, 5090860, 1791281, 1348777, 3772155, 5460240, 4158833, 1092480, -1291476, -1937023, -1489613, -1148440, -1608893, -2823428, -4557520, -6755080, -8881964, -9429185, -7232762, -3289293, -96533, 1034162, 919695, 562535, -342845, -2190328, -3843070, -3446722, -664927]
5668f64927L249528J135297j917236l301670j853922Q30232K041126J028134n42873
5659C689j267739j484557j522968n66526J338761K113886N69577j083200k11327
5650b110404J868748J542378j424284l161306j392257J185379J043913q91026
5642c338859q01014K046668L840137J572115k373136l063197M10952L725118L164158
5633E182942K46398j172761n03617m40866k238082l925907l417837r15032K137536
5624e047226M229474L748492M09040k858699k360806J223579L193106J362490
5616C899450j111613j034841K94903L29267l07878J20077O67779m30154k045356
5607C81634j821449j45606P23301K67437l88490q34920r70771J12357K124734
$$ y = [-664927, 2584601, 3719898, 1802662, -1499008, -3352930, -2522698, -481572, 546562, 3689, -1264050, -2748607, -4271575, -4838101, -3499340, -1385454, -815877, -1899077, -2110404, -241656, 1300722, -123562, -3284868, -4677125, -3491746, -2447833, -3338859, -4139873, -2093205, 1746932, 3319047, 945911, -2117286, -1706334, 2018784, 5182942, 5429340, 4256579, 3752962, 3312096, 1074014, -2851893, -6269730, -7184762, -5047226, -817752, 2930740, 3339780, 481081, -1879725, -656146, 2536960, 3899450, 2787837, 1752996, 2047899, 2377166, 2069288, 2189365, 2857144, 2426990, 381634, -1439815, -1585421, -862120, -594683, -983173, -1818093, -2788864, -2676507, -551773]
5598e51773K462811R6277j771957m54724J398178Q8832k493063j854090J293876
5589a785633K165176q6331j613090q87579k66958k50493J427560L942244L056040
5580E700936j482639m312561k586791R6390N43813Q15024K768013L436427K72659
5571E251271l639439m133172j880647K31833J707592K513642R13925k382232k521832
5562c939059J888384M268575m31977o199394l976195L943326O820157J653368
5554D027185l200753j690060J870413J605581r79561j622717p98176j195084j921012
5545c904184m81550K194958L300212K737008K236368J677297Q4803j235269m60733
5536F148910R09798n8750k550994k791235k52458J089722r14887k797355o57937
$$ y = [-551773, 1911038, 2007315, 235358, -219366, 1178812, 1267644, -1225419, -3079509, -1785633, 379543, 293212, -1319878, -2207457, -2474415, -2724908, -1297348, 2644896, 5700936, 4218297, -94264, -2681055, -2584665, -2040852, -1225828, 1542185, 4978612, 5251271, 1611832, -2521340, -4401987, -4170154, -2462562, 51080, 965005, -1417227, -3939059, -2050675, 2217900, 1785923, -4413471, -8389666, -4446340, 2373817, 4027185, 826432, -863628, 1006785, 2612366, 1632805, 10088, -788088, -1983172, -3904184, -4385734, -2190776, 1109436, 3846444, 6082812, 7760109, 7844912, 6609643, 6148910, 7058708, 6999958, 4448964, 1657729, 1405271, 2494993, 1580106, -1217249, -1875186]
5527a875186L573173M631566J498298j335243o18753J121252k20149m004721n711351
5518b941114l242246O37131K439019J915130Q82962K61766j57358l94444k82878
5509h82032J5928M60720J135506J235599l19006k438708k262075M79084J976978
5500e98006l57468l510605l131050j98991Q91706k12922N17249M025950N746960
5491C172823K774253j159955j269225J085197Q45072k993675o188961n326169
5483i060640j646689J545950K689584K400221J878917J745243J595289M16803
5475A564678j959567m032023m023201j849812R61172K788963K646907L88800k476805
5466e990888l039032P3296M275914N418296K666183p44844j808314r03639j48823
$$ y = [-1875186, 1697987, 6329553, 7827851, 6492608, 5873855, 6995107, 6774958, 2770237, -2941114, -6183360, -5546229, -3107210, -1192080, -309118, -47352, -204710, -599154, -882032, -866104, -405384, 730122, 1965721, 1646715, -791993, -3054068, -2574984, -598006, -955474, -4466079, -7597129, -7796120, -6904414, -7117336, -6600087, -2574137, 3172823, 5947076, 4787121, 3517896, 4603093, 5448165, 2454490, -3734471, -9060640, -10707329, -9161379, -6471795, -4071574, -2192657, -447414, 1147875, 1564678, -394889, -4426912, -8450113, -10299925, -9338753, -6549790, -3902883, -3514083, -5990888, -9029920, -8956624, -4680710, 737586, 3403769, 2658925, 850611, -53028, -201851]
5457b01851n52773j793257l104624l174674q09386K789301M046566J359912j956222
5448c397008j662244J417600K594272L29544j642641l30644J911410J262609j616704
5439a133806k653833j18204L588253N314378L880499o3776m407570o084260l743819
5430e422138K188J284182j04944r30300L95029J912309J835294J036910O20656
5421F29186o5058j321855j652090l67987P32636M10893L69138K098298L548271
5412D381432K043175j076028k084322k60508J579303J475960J75884j248156k573859
5403B412881k981182j352570J229089J782527p19265l682697m008002j398641
5395h717860K006229L822420K821985k64580k816383k630289n70506N18437k62926
$$ y = [-201851, -754624, -2547881, -5652505, -8827179, -9636565, -6847264, -2800698, -1440786, -3397008, -5059252, -3641652, -1047380, -717836, -2360477, -2691121, -779711, 482898, -1133806, -3787639, -3905843, -317590, 4996788, 8877287, 8813511, 4405941, -1678319, -5422138, -5419950, -4135768, -4240712, -5171012, -4775983, -2863674, -1028380, 8530, 629186, 564128, -757727, -2409817, -2777804, -2045168, -1634275, -1265137, 833161, 4381432, 6424607, 5348579, 3264257, 3003749, 4583052, 6059012, 6234896, 4986740, 2412881, -568301, -1920871, -691782, 1090745, 371480, -3311217, -7319219, -8717860, -6711631, -2889211, -67226, -331806, -3148189, -5778478, -6348984, -5830547, -6093473]
5386f093473q79794J81845J514201J052882q15905j938354j336159r4134M42430
5377g966461M07773J112780L114373M824127L886805M36838k237348j580810Q31944
5368B830021J694536O96404J77610O91227L70039r20765n78212K011958L217384
5359A0190202K92199l879706m456836j360016J204408J121628N84532J623613
5351E320024K799722J837896p43697k490931k229545q26466M37954P54956m35966
5342D423947k913853m836894l966135m55975K639222K679677O21235l17985J147662
5333i79099K990895K948588J448691M60580N03955K52205j222772l133190m068182
5324g98329l491795j876504j8914J358864J683903P82973o44502j058842N57866
$$ y = [-6093473, -6973267, -6791422, -5277221, -4224339, -5040244, -6978598, -8314757, -8408891, -7966461, -7558688, -6445908, -3331535, 1492592, 5379397, 5816235, 3578887, 1998077, 2830021, 4524557, 5220961, 5398571, 6089798, 6459837, 5539072, 4960860, 6972818, 10190202, 10482401, 6602695, 2145859, 785843, 1990251, 3111879, 3696411, 5320024, 8119746, 9957642, 9213945, 6723014, 4493469, 3667003, 4104957, 4859913, 4423947, 1510094, -3326800, -7292935, -7748910, -5109688, -2430011, -1808776, -2126761, -979099, 2011796, 4960384, 6409075, 6869655, 7373610, 7625815, 6403043, 3269853, -798329, -4290124, -6166628, -6185542, -4826678, -3142775, -2359802, -3004304, -4063146, -3505280]
5315c505280K902996K945961l68451l812150l345112L50604K435000N33132k148430
5306d011730j842187M77963J360628L01655k68337O97071J694023J575434J031258
5297A015778J006014J503057J987522J694941J00563j777061j829804r7545L21184
5288C924649k202534m503199k933115Q93664K527659J385568N37399P20296k66076
5279H4311k124851j512055J770255L172019K59979l253724l129996m77250J049688
5270d161624P17407Q2812n40626j572230j902331l00130K053763K993941K341272
5261b87746J381227N37135m28811j016935p70700n38526j212397k035918j671442
5252f044113j62615J381221K191367J985410P79504n97899r49379l06537J78161
$$ y = [-3505280, -602284, 2343677, 1975226, -1836924, -5182036, -4831432, -2396432, -1863300, -4011730, -5853917, -5375954, -4015326, -3713671, -3982008, -3284937, -1590914, -15480, 1015778, 2021792, 3524849, 5512371, 7207312, 7307875, 5530814, 3701010, 3603465, 3924649, 1722115, -2781084, -5714199, -4820535, -2292876, -907308, -369909, 350387, 84311, -2040540, -3552595, -1782340, 1389679, 1649658, -1604066, -4734062, -5211312, -4161624, -3444217, -3361405, -3902031, -5474261, -7376592, -7676722, -5622959, -2629018, -287746, 1093481, 1630616, 1201805, 184870, -585830, -1124356, -2336753, -4372671, -6044113, -6206728, -4825507, -2634140, -648730, 130774, -467125, -1416504, -1723041, -1544880]
5243a544880K18698N53999R55147L40700p90401p03083K79862j19804j948789
5234b758551k400909o40593M90066n98176j486433l48549O21067m43114j011346
5225h576538J589791M918449M809492J738766o04571j288472k182942l301181
5217b897206k641062k70631J357081J104658J3372j120270k077068j821448J92169
5208h160405K080525J942569J259204K548613M574487L745746o3047k962384k551223
5199B414085n44347M67359k17668k200936m545959n186166k637182J269828L017530
5190h163456K049948J115286J754524K412481J683877N45548J92343L1007p81361
5181H40197j528726r98716O68455K105973K186244J063211K556j43288l25554
$$ y = [-1544880, -1326182, -772183, 182964, 523664, -266737, -969820, -689958, -809762, -2758551, -5159460, -5800053, -5309987, -5908163, -7394596, -7743145, -7122078, -7565192, -8576538, -6986747, -2068298, 2741194, 4479960, 3875389, 2586917, 403975, -2897206, -5538268, -5808899, -4451818, -3347160, -3333788, -4454058, -6531126, -8352574, -8160405, -6079880, -4137311, -2878107, -329494, 4244993, 7990739, 7927692, 4965308, 2414085, 1869738, 2337097, 2119429, -81507, -4627466, -9813632, -12450814, -11180986, -8163456, -6113508, -4998222, -3243698, -831217, 852660, 1398208, 1590551, 1621558, 840197, -688529, -1687245, -1018790, 1087183, 3273427, 4336638, 4339194, 4195906, 3870352]
5172C870352j984499m172409m102403j400528Q18890O57040K69045J729692L163583
5163a151237K143506O2613o50826j001678k743820l709293j046213K652674K298117
5154c146157j376110k428798J094271M369738L420910L45968r95469k46020O77589
5145A715922Q16833K52054o78961j112603o15517n58713k228427m050476l572779
5136a0032667j492331l63550j89904Q18864K054495J584021O16580J836093L808802
5127a359597K679250o95753j518552N81722O96730k454952l802889p20573K214979
5118d379635R77652j437170p49940J569051J893589Q62412J222153K503740K522019
5109D983871J581097R89568k23591l086451n280490l877867N2767K928729L364576
$$ y = [3870352, 1885853, -2286556, -6388959, -7789487, -6970597, -6313557, -6044512, -4314820, -1151237, 992269, 1054882, 404056, -597622, -3341442, -7050735, -8096948, -5444274, -3146157, -4522267, -6951065, -5856794, -1487056, 1933854, 2279822, 1284353, 1038333, 1715922, 2532755, 2784809, 2105848, 993245, 377728, -180985, -2409412, -6459888, -10032667, -11524998, -11888548, -12078452, -11259588, -9205093, -7621072, -7004492, -5168399, -1359597, 1319653, 623900, -894652, -312930, 383800, -2071152, -5874041, -6594614, -4379635, -3401983, -4839153, -5589093, -4020042, -2126453, -1264041, -41888, 2461852, 4983871, 6564968, 7554536, 7330945, 4244494, -1035996, -4913863, -4861096, -1932367, 1432209]
5100A432209K539479J311690k84212j730001k361340k153226j124338N20919J265036
5091e83784j77960j891312p93464J854655J416811k455592m268901j091802K719288
5082e272061K556752M50010O82844K629404K703154M49618j758319k824075k985939
5073c368612j988311l81764j96659j499401j226107J761932L971791K752734O20161
5064D45764N05093P29889j012751k556290r81884J907010K708575J910272J463514
5055E119192J94354l123395n317758l191311M13469Q54433n09452R03587M285753
5046c71128M344655q486m102719m503432k274364M79876K489776K194593o93192
5037b444421l076898k051432N77268J408266J080595K008522K757688M45632k998521
$$ y = [1432209, 3971688, 5283378, 4999166, 3269165, 907825, -1245401, -2369739, -1848820, -583784, -761744, -2653056, -3446520, -1591865, -175054, -2630646, -6899547, -7991349, -5272061, -2715309, -2265299, -1582455, 1046949, 3750103, 4199721, 2441402, -382673, -3368612, -5356923, -5738687, -5935346, -7434747, -8660854, -6898922, -2927131, -174397, 445764, 950857, 1680746, 667995, -1888295, -2870179, -963169, 1745406, 3655678, 5119192, 5313546, 2190151, -3127607, -6318918, -5905449, -5051016, -5560468, -4656881, -371128, 3973527, 3965041, -137678, -4641110, -6915474, -6435598, -3945822, -1751229, -2444421, -5521319, -7572751, -6995483, -5587217, -4506622, -2498100, 259588, 705220, -2293301]
5028b293301l147648m42974R13374L48906P54173J762875J16207l374441m166272
5019i529101j786267n69446j765439j656140J021766K395247M13155j451503j07016
5010a3034744K589174L730032L452022K833711J590093j51089j152584j471221
5002a614606k324089l020494j686849P56342J440243M36945L73085J240103N33868
4993c865452j382376j395020O21518J714572J699873L000050M298340J384319
4985F075824m374567n868063j074471L123875J378780k622791l282962j505808
4977h150183r85715j285320l7816J823233K060709J332048J126570M10770j740416
4968e446120l030058j355335J209695J494466o8579j185729j706102k446727k295788
$$ y = [-2293301, -5440949, -5883923, -4970549, -4621643, -3867470, -2104595, -1988388, -5362829, -9529101, -11315368, -11884814, -13650253, -15306393, -14284627, -11889380, -11476225, -12927728, -13034744, -10445570, -6715538, -3263516, -429805, 1160288, 1009199, -143385, -1614606, -3938695, -6959189, -8646038, -7889696, -6449453, -6012508, -5639423, -4399320, -3865452, -5247828, -6642848, -6021330, -4306758, -2606885, 393165, 4691505, 6075824, 1701257, -4166806, -5241277, -2117402, -738622, -3361413, -6644375, -8150183, -9135898, -10421218, -10459034, -8635801, -6575092, -5243044, -4116474, -3705704, -5446120, -8476178, -9831513, -8621818, -7127352, -7195931, -8381660, -10087762, -12534489, -14830277]
4959a4830277j10730K215607K029721Q8325n06273J279288L444313L774260J894099
4950g21667q43427k387550j720229j70833L3643j360597k595417k436103r86369
4941a3188549J349146L477112L204838J18987k209069m17853L217051L575474
4933h72863J35192k809862k850041j628146n10648R59474K046905J026013j200962
4924e704938k048353j759616k514682l530297k069259J052568K168228O33867
4916a3772482j035558k063874l174330k878062R4767K366291L74578k781276k023126
4907b4893072P49659M51201j374338Q0023K557042M36923l737315l098542M73604
4898b8354815j49513k988429k95330N487320M720448j520026l215185k59728j328089
$$ y = [-14830277, -14941007, -12725400, -10695679, -10607354, -11113627, -9834339, -6390026, -2615766, -721667, -1565094, -3952644, -5672873, -5843706, -5810063, -7170660, -9766077, -12202180, -13188549, -11839403, -8362291, -5157453, -5038466, -7247535, -7665388, -4448337, -872863, -737671, -3547533, -6397574, -8025720, -8536368, -7576894, -5529989, -4503976, -5704938, -7753291, -9512907, -12027589, -15557886, -17627145, -16574577, -14406349, -13772482, -14808040, -16871914, -20046244, -22924306, -22829539, -20463248, -20088670, -22869946, -24893072, -24143413, -23692212, -25066550, -24986527, -22429485, -21992562, -25729877, -28828419, -28354815, -28504328, -31492757, -31788087, -26300767, -21580319, -23100345, -26315530, -26575258, -27903347]
4889b7903347m680711p59231O137453K195861q770967q895802M60800q61325j3278834
4880e6356103j4187342j896002k772635k0237360k3123033q334673k0661026o8016077
4872b15584251p2102653K7825039J58849716J85752299Q7673303j9131503m1645143
4865A11636807j1589327j411820j6013127j7735935l864031L0279o452396m163251
4857E0437199L791409m87265j2093633j0965822J160422M836031k330634n330814
4849B9016893j498728k303396q086415p048987J322664M980726J282442n45709
4841A7119490J464879L750m553625l742314K041011L451688n31379j592331J401168
4832A5062337Q81396l775154m613636k74591J889383J23146N30169L691516K958606
$$ y = [-27903347, -32584058, -33343289, -27205836, -25009975, -33780942, -42676744, -42215944, -43077269, -56356103, -70543445, -72439447, -75212082, -95449442, -118572475, -126907148, -147568174, -215584251, -287686904, -259861865, -101012149, 84740150, 172413453, 153281950, 111636807, 100047480, 98635660, 82622533, 64886598, 61022567, 61052846, 54600450, 50437199, 54228608, 53741343, 41647710, 30681888, 31842310, 36678341, 34347707, 29016893, 27518165, 25214769, 17128354, 10079367, 11402031, 16382757, 17665199, 17119490, 18584369, 18588119, 14034494, 10292180, 12333191, 15784879, 15253500, 13661169, 15062337, 15943733, 12168579, 7554943, 7280352, 9169735, 9292881, 9823050, 13514566, 16473172]
4823A6473172k065873l714138n4823K154081L43473m29477J049341k92061m243769
4814I219926l575853K838664O673101L533309r69872j958824j778124k330266
4806A1652061j003252K105414K377566n59626j486017K06783j119286n678164
4798F495479n607656J582591P257364M947860l3314n11976J551015Q51279j727304
4789A4805338k449980j869532k146448j960111K23597J981960R97053n54371L2438
4780I059944J312909P48503j019144k052603j969003p90913J329853J973162j289589
4771G303119n509387m933058j28812K090282m78130k200351P7205J639607q88184
4762c027709k804284M02844M740857M234658M77454r14126P70800K163686K162549
$$ y = [16473172, 14407299, 10693161, 10638338, 12792419, 13135892, 12706415, 13755756, 13463695, 9219926, 5644073, 8482737, 15155838, 18689147, 17719275, 15760451, 13982327, 11652061, 10648809, 12754223, 15131789, 14572163, 13086146, 13292929, 12173643, 6495479, 887823, 2470414, 9727778, 14675638, 14642324, 14130348, 15681363, 16532642, 14805338, 12355358, 10485826, 8339378, 6379267, 6602864, 8584824, 9581877, 9027506, 9059944, 10372853, 11121356, 10102212, 8049609, 6080606, 5289693, 6619546, 8592708, 7303119, 1793732, -3139326, -3268138, -1177856, -1655986, -3856337, -3779132, -2139525, -3027709, -5831993, -5429149, -688292, 3546366, 4023820, 3109694, 3880494, 6044180, 8206729]
4753H206729J704305J08439l031407m810343k683556J058198K632223K164392
4745E348980J911849J752647L84574j361107j993504j881030j410335M92762L251875
4736F496711L604251P85771j135292L88002J865958k54565l305585l021005o85556
4727D738690j55825q23820N78882L331546L678285J170046j092267j652053j618611
4718H154873j314910j65959R45361Q84687O27184J031172J50492l350708o182962
4709G79230m414026J47783K353724J292413N46861J676215K526227J968676J503335
4700H380438J622539Q68561o97170q69489R10511K337637J693614j23751j557706
4691A2565184k035003j494660m82510m66750j852776k470561o57677J305516K81865
$$ y = [8206729, 9911034, 10019473, 6988066, 2177723, -505833, 552365, 3184588, 5348980, 7260829, 9013476, 9398050, 8036943, 6043439, 4162409, 2752074, 3244836, 6496711, 10100962, 10886733, 9751441, 10139443, 12005401, 11750836, 8445251, 5424246, 4738690, 4582865, 3759045, 4337927, 7669473, 11347758, 12517804, 11425537, 9773484, 8154873, 6839963, 6674004, 7619365, 8504052, 9131236, 10162408, 10312900, 6962192, 779230, -3634796, -3487013, -1133289, 159124, 705985, 2382200, 4908427, 6877103, 8380438, 10002977, 10871538, 10174368, 9304879, 10215390, 12553027, 14246641, 14122890, 12565184, 10530181, 9035521, 8553011, 8086261, 6233485, 3762924, 3105247, 4410763, 4692628]
4682D692628k153322j507093K357202M367339J726331k044091k537161l63549
4674D538284R78410M51508k48040j88637j54973o29646j007939q95265p17831
4665B125871p61045n40592M56505J845263K544675J830619o7219k353993m118086
4656I61998m263436k093358J084706K146058j46994k488604q10014L522614M758089
4647B671059Q46707l278435k686537O42973J299155j448547l121156r33921K567167
4638c441535L440588J213111j444441k394049k039424j880868j890209l28915
4630h765742L186759N626026L664696j425572m595903l187893K50568J983629
4622c263432J174305r82099l162821l523262n22511L949654N295725K242377q85398
$$ y = [4692628, 2539306, 1032213, 3389415, 7756754, 9483085, 7438994, 4901833, 4538284, 5516694, 5968202, 5720162, 5531525, 5376552, 4746906, 3738967, 2843702, 2125871, 1364826, 824234, 1280739, 3126002, 5670677, 7501296, 7434077, 5080084, 961998, -3301438, -5394796, -4310090, -2164032, -2311026, -4799630, -5609644, -2087030, 2671059, 3517766, 239331, -2447206, -1804233, -505078, -1953625, -5074781, -6008702, -3441535, -947, 1212164, -232277, -2626326, -4665750, -6546618, -8436827, -8765742, -5578983, 47043, 3711739, 2286167, -2309736, -5497629, -5247061, -3263432, -2089127, -3071226, -6234047, -9757309, -10279820, -6330166, -1034441, 1207936, 322538]
4613C22538l75929J621005J199410j004980j519967K35191J935102K440653K231553
4604G084576J232824l41666o39540Q06724O85063l345996p446486o098127n66479
4595h629107K585660J051980q43231O4617J364607M52006o93549P11732L256994
4586f78291L595115J561331j19442j75833k30455k020383m816760n982671l682177
4577a2549566R85978M725551N236987L246168R62886m87615j194527j191531n43210
4568h08879J2255j76336q69160j731797k772212l135427j276815K298021M485007
4559c975343L548935J554695Q30611M30204j225818k636977j594621O62302J372222
4550a033790Q15729J153565J985075J091481j224533k509852k338964k346959
$$ y = [322538, -53391, 1567614, 2767024, 1762044, 242077, 477268, 2412370, 4853023, 7084576, 8317400, 7975734, 7336194, 8142918, 8827981, 5481985, -1964501, -8062628, -8629107, -6043447, -4991467, -5834698, -5770081, -4405474, -3953468, -4647017, -3935285, -678291, 2916824, 4478155, 4358713, 4182880, 3952425, 1932042, -2884718, -8867389, -12549566, -11563588, -6838037, -1601050, 1645118, 2608004, 2120389, 925862, -265669, -808879, -796624, -972960, -1842120, -3573917, -6346129, -9481556, -10758371, -8460350, -3975343, -426408, 1128287, 1958898, 2389102, 1163284, -1473693, -3068314, -2406012, -1033790, -218061, 935504, 2920579, 4012060, 2787527, 277675, -2061289, -4408248]
4542d408248k547423j344010J079081K840045L391833L252521J767009j208042
4534B822766k808113p75856J781445M26899k875042k106016K985103O021674L828952
4525I301812M67092m44723r24172l147990m671914l076708o99890o42656j765784
4516e604933j413764J13077J221644K072641K755267J560825j593156l110875
4508c999274o88893K493057K327399o0438p75408L81738L54746j487930k397505
4499c852508p51331J891373L379265L131578J731630K08426n63250r51345k043529
4490B180309l081469j547118K457656M531400J610213k855184l106892Q00834
4482I89749L262079J358284j376912p40974K014212K394634p75628l879069l613929
$$ y = [-4408248, -6955671, -8299681, -7220600, -4380555, -988722, 2263799, 4030808, 2822766, 14653, -761203, 1020242, 1447141, -1427901, -3533917, -548814, 5472860, 9301812, 9768904, 9324181, 8400009, 5252019, 580105, -2496603, -3196493, -3839149, -5604933, -7018697, -6905620, -5683976, -3611335, -856068, 704757, -888399, -3999274, -4688167, -2195110, 132289, 71851, -703557, -321819, 32927, -1455003, -3852508, -4603839, -2712466, 666799, 3798377, 5530007, 5738433, 5175183, 4223838, 2180309, -901160, -2448278, 9378, 4540778, 6150991, 3295807, 188915, 989749, 4251828, 5610112, 4233200, 3492226, 5506438, 7901072, 7125444, 3246375, -367554]
4473c67554j301456o58851k403322l366860j302501J890901L362790L521817M322431
4464C697395M973243L015133r26281l368503l114908k322523j947899l49182K343814
4455B000289K854664P423k554259j756443J33466o13146l250726m051301j885679
4446i115712R95524K549815K521191J398646J44329J31971J532481K686868K378301
4437E223414J335196L93629q51658k266288k339456p27074O44475N96965L58872
4428B368075O65154J36634j563334k215800j060137r11504l356329n238011l413364
4419a4588616J84093K075497K686602L870951L959076N38039l910730m655028
4411i840116j789702N19787R04557J593505K918610K588862P30482L20612J643756
$$ y = [-367554, -1669010, -2327861, -4731183, -8098043, -9400544, -7509643, -4146853, -625036, 3697395, 8670638, 11685771, 10759490, 7390987, 4276079, 1953556, 5657, -343525, 2000289, 4854953, 4862376, 2308117, 551674, 685140, 71994, -3178732, -7230033, -9115712, -8120188, -5570373, -3049182, -1650536, -1506207, -1374236, 158245, 2845113, 5223414, 6558610, 6952239, 6100581, 3834293, 1494837, 767763, 1412238, 2009203, 2368075, 3033229, 3169863, 1606529, -609271, -1669408, -2580912, -5937241, -11175252, -14588616, -14404523, -12329026, -9642424, -5771473, -1812397, -1274358, -5185088, -9840116, -11629818, -11110031, -10205474, -8611969, -5693359, -3104497, -2374015, -2053403, -409647]
4402d09647J262571j957686m228941k319457J851732M224430L575414J719583
4394C717999P58446J400632K488106J767456j292724l880962l247689r13175m11016
4385C87073j542924q35050K243883L890571J878624j148742k044452j401215j386044
4376D1724k139164k459436j966527q24408R17037K455010K535086J518563J100579
4367A178464J307642L20009j894350k772810j352068j68426j001278j706531M6054
4358f043294K407004J996814o78756j822094L11315L585663N310439M832013K680642
4349A2579746m86277l370545m268808k930804j262202j281357k785194l643250
4341g448691k274413N32007K345246J594003p39294k072077q84589J771826L519120
$$ y = [-409647, 852924, -1104762, -5333703, -7653160, -5801428, -1576998, 1998416, 3717999, 4476445, 5877077, 8365183, 10132639, 8839915, 4958953, 1711264, 798089, 387073, -1155851, -1990901, 252982, 4143553, 6022177, 4873435, 2828983, 1427768, 41724, -2097440, -4556876, -6523403, -7347811, -6430774, -3975764, -1440678, 77885, 1178464, 2486106, 2806115, 911765, -1861045, -3213113, -3381539, -4382817, -6089348, -6043294, -3636290, -1639476, -2318232, -4140326, -3829011, -243348, 5067091, 9899104, 12579746, 12093469, 8722924, 4454116, 1523312, 261110, -1020247, -3805441, -7448691, -9723104, -9191097, -6845851, -5251848, -5991142, -8063219, -8947808, -7175982, -3656862]
4332c656862L148609J524662O5828r36159j733947j445317J207721M895164N581238
4323H650937J449218l646352m484925j319584R56861R4772j153719n38654L33230
4314C41784q78K18578K192670L403660J671040p65343r27827m9166p60840j823912
4304C499766k66406K954938M069460K181608l79868k299770l663834l336882n73884
4295B185128J665936j29096m095535n115603k477688k35545k5583P82787L062938
4286d382261L858152J994029M44814R33866J070581o44538j642793j46577J018208
4277B503481r33083l686676l273151j53171J820387R81728p89828j346084l43442
4268e219839J376282K577361K219013M86962j191689j719760j192774j12734J079325
$$ y = [-3656862, -508253, 1016409, 1082237, 146078, -1587869, -3033186, -1825465, 3069699, 8650937, 10100155, 6453803, 1968878, 649294, 1606155, 1700927, 547208, 8554, 341784, 340906, 559484, 2752154, 6155814, 7826854, 7061511, 6133684, 6084518, 5323678, 3499766, 3233360, 6188298, 10257758, 12439366, 12059498, 9759728, 6095894, 2759012, 2185128, 3851064, 3721968, -373567, -5489170, -7966858, -8202403, -8227986, -7445199, -4382261, -524109, 1469920, 1914734, 2848600, 3919181, 3274643, 1631850, 1485273, 2503481, 1570398, -2116278, -5389429, -5542600, -3722213, -2740485, -3530313, -4876397, -5219839, -3843557, -1266196, 952817, 1439779, 248090, -1471670, -2664444, -2777178, -1697853]
4259a697853J695285J368407P87407N58733j0388j351686j913323k24825K337117
4250A548874L305157K509827J164072p37079k899874k675203J252020M901220
4242H369014L619587q00576k967760k377875k762775m003804k148877K182755
4234h90311L172037p15347l883237k718522p48878j612713l126955k019933O25964
4225a1917895K121696K036849P66069j532390k843928p70373K753430L356044
4217f030498J374080R88523K025939J48396m104215m998447j655657O61652P86776
4208a0803451L056392O674846N233420l61611j238389L359424L445521l165928
4200F200224n433374P06566L875671j521642m191566J571889K570637p822029
$$ y = [-1697853, -2568, 1365839, 2153246, 2711979, 2701591, 1349905, -563418, -788243, 1548874, 4854031, 7363858, 8527930, 7790851, 4890977, 2215774, 3467794, 8369014, 11988601, 11188025, 8220265, 5842390, 3079615, -924189, -3073066, -890311, 2281726, 1566379, -2316858, -5035380, -5784258, -7396971, -10523926, -12543859, -11917895, -9796199, -7759350, -6993281, -8525671, -11369599, -12139972, -9386542, -6030498, -4656418, -3667895, -1641956, -1493560, -5597775, -10596222, -12251879, -11590227, -10803451, -7747059, -1072213, 4161207, 3799596, 2561207, 5920631, 9366152, 6200224, 766850, 1473416, 5349087, 3827445, -364121, 1207768, 3778405, -4043624]
4192d043624j3171948n703541j0935178m6820815p6592196m7225991K9360873
4185a75132420Q0075984O3920815J8903362o00002O787140R618747N78911k821969
4177A330568L408285N729667Q45164q12938K824390K826562k071242l640493p33803
4168I706160n62508l604173l019178Q98735P37985l216186k780591K496774L811910
4159D468928p27811k304099K765380O383823K843025j833166p61568L072284L381721
4150A7288517L85799k046977l189178l978588l403107r17034J226486J432044
4142F797962J143933J450807J012096p21898k061458k424521l139810l663338
4134a606227j474639K774376M645347K279831r95226k184043k271735k458351
$$ y = [-4043624, -17215572, -22919113, -33854291, -80675106, -157267302, -204493293, -175132420, -95056436, -31135621, -12232259, -12832261, -6045121, 3573626, 4152537, 1330568, 4738853, 10468520, 11313684, 10500746, 13325136, 16151698, 14080456, 10439963, 9706160, 9143652, 5539479, 2520301, 3419036, 4157021, 940835, -1839756, 657018, 4468928, 3741117, 1437018, 4202398, 10586221, 13429246, 11596080, 10834512, 13906796, 17288517, 17674316, 15627339, 12438161, 8459573, 5056466, 4139432, 5365918, 6797962, 7941895, 9392702, 10404798, 9682900, 7621442, 5196921, 2057111, -1606227, -3080866, -306490, 4338857, 6618688, 5623462, 3439419, 1167684, -1290667]
4126a290667j422801J067957K037908j90611k742144k293691K97998J893944J241851
4117a400256o48054k113893j543925J239298L595116K778051L13013K13037K577348
4108E009735L274654Q16209j257282m18519J255384J627618J765143K052773N7466
4099A4183181m257624n978157k283780K057073J180673l251655n211023l347201
4091f908513j149340O7858K191604M842361M803093J720322o17885o7774J055928
4082E937654N70617q5578P77387J501259k06721l017956l485874r89817J368769
4073B369740Q49757j732352l325492k095280Q87871K864972J962340j145787l811102
4064c175333l622496k82051M281303P318154P022789L665341n47532l074581l137890
$$ y = [-1290667, -2713468, -1645511, 392397, 201786, -2540358, -4834049, -4536051, -2642107, -1400256, -2048310, -4162203, -5706128, -4466830, -871714, 1906337, 2219350, 2432387, 5009735, 8284389, 9100598, 7843316, 7424797, 8680181, 10307799, 12072942, 14125715, 14183181, 9925557, 3947400, 1663620, 3720693, 4901366, 1649711, -3561312, -6908513, -8057853, -7989995, -5798391, -956030, 3847063, 5567385, 4949500, 4881726, 5937654, 6508271, 6422693, 7200080, 8701339, 8494618, 5476662, 1990788, 1000971, 2369740, 3219497, 1487145, -1838347, -3933627, -3045756, -180784, 1781556, 635769, -3175333, -6797829, -7079880, -2798577, 4519577, 11542366, 15207707, 14660175, 11585594, 8447704]
4055H447704k253605k185705k501973j220841J738872L284849R09739l270723
4047B948317m575378j734831J675398K235492M89512j236136k002763j532066
4039c732455Q74887M165616M779550J205168k788616l010444j003590j072924
4031e82808k725779j506499K821651M791770J453022l137922m196256k553022
4023e635843j547141j338285j86033J288310J195665J41734J80390J006868O31302
4014d263033p49018r19787L25121N31685j283900k534624n92792L245958N097484
4005a142906L297679M18879J9235K192493L515932J544554k069655m009842l518525
3996B47844k287130j111051O50567K502673K720478J365848N03846N77242l42904
$$ y = [8447704, 6194099, 4008394, 1506421, 285580, 2024452, 5309301, 6219040, 2948317, -1627061, -3361892, -1686494, 548998, 1038510, -197626, -2200389, -3732455, -2857568, 1308048, 6087598, 7292766, 4504150, 1493706, 490116, -582808, -3308587, -4815086, -1993435, 2798335, 4251357, 1113435, -3082821, -5635843, -7182984, -8521269, -8707302, -7418992, -6223327, -6081593, -5901203, -4894335, -4263033, -5012051, -5931838, -5606717, -5075032, -6358932, -8893556, -9486348, -6240390, -1142906, 2154773, 2573652, 2592887, 4785380, 8301312, 9845866, 7776211, 3766369, 247844, -2039286, -3150337, -2499770, 2903, 2723381, 4089229, 4593075, 5170317, 4827413]
3987D827413k405198k510088P14050L605940K354753j138418j930533Q78507L475251
3978G871677L157331J260953K2930m47779j148338k183196k784018k357239j194799
3969B197522n57213j361614k260910o71790L004503M354946O25380m405820m604894
3960c679890M52337N262087N926019L998403K288049P98860j390347l350647l801482
3951F503389l387391l298935l054268j616148L34862J112914M78433j06456N39479
3942b494121K056331L100126K638120J002149j85919K09110J104538K99570k498782
3933E231122n002634n110165l084813n27530J356221J798424M42617j579623k030680
3924h507061m20142Q67696j05734j742554j253722R86060K157323J680304K002574
$$ y = [4827413, 2422215, -87873, 626177, 4232117, 6586870, 5448452, 3517919, 4396426, 7871677, 11029008, 12289961, 12312891, 11865112, 10716774, 8533578, 5749560, 3392321, 2197522, 1640309, 278695, -1982215, -2654005, 350498, 4705444, 5330824, 925004, -3679890, -3227553, 2034534, 7960553, 11958956, 14247005, 15045865, 13655518, 10304871, 6503389, 3115998, -182937, -3237205, -4853353, -4518491, -3405577, -2927144, -3033600, -2494121, -437790, 2662336, 5300456, 6302605, 6116686, 6325796, 7430334, 7729904, 5231122, 228488, -4881677, -7966490, -8494020, -7137799, -5339375, -4896758, -6476381, -8507061, -8927203, -8059507, -8165241, -9907795, -11161517, -10175457, -8018134, -6337830, -4335256]
3915d335256L981873M627781J503325k928458m240548k145463m58080j064627
3907e059453j334742J120341M042790L562932J1664k473050j814067l56379o45127
3898b945091j686269j216767L27195N65993j002701k326103j860919l02188J087663
3889i359187K093520K698782K071805k60365k828173l122050l27624L448275N040489
3880e44528L212438l06375k616848k243060L4725K378427L345394K457402L00773
3871F018348j675207k236224j633873j172052j267348q74032O60854K234051K398326
3862B452843J321929L04219j7684P8517L51750O53951M85615l77770j201091j272051
3852B780228j039067j126203r21454L30770J646624J392703p8875r68981j092688
$$ y = [-4335256, -353383, 4274398, 5777723, 2849265, -1391283, -3536746, -3994826, -5059453, -6394195, -5273854, -1231064, 2331868, 2343532, -129518, -1943585, -2299964, -2945091, -4631360, -5848127, -5520932, -4954939, -5957640, -8283743, -10144662, -10446850, -9359187, -7265667, -4566885, -2495080, -2755445, -5583618, -8705668, -9033292, -5585017, -544528, 2667910, 2361535, -255313, -2498373, -2463648, -85221, 3260173, 5717575, 6018348, 4343141, 2106917, 473044, -699008, -1966356, -2840388, -2179534, 54517, 2452843, 3774772, 4078991, 4061307, 4139824, 4491574, 5145525, 5631140, 5253370, 4052279, 2780228, 1741161, 614958, -306496, 24274, 1670898, 3063601, 2984726, 2015745, 923057]
3843I23057j969471l460016l016386L79246L824736M004806J508930m21160l27383
3834A446359M87534P69505P49380O62352r9019j595185k498742j586497O38955
3825a025358K487451K804837J770703M40146j19577L65353R91244L60669j874259
3816F201209m236360m688443k842617m71941N98097O98427J504548L081805L256328
3807C101053R17592j472544p66518K073857K815133J06413k168607n70211K433394
3798F469562J918449j940318l807124j014443K481912J931534j447806k550819
3790B040947M35178M192134N128644L069486j57164l038764m362714l302696j025462
3781B979589l88838k353223m140377k790136O57141K633563J887189N56775O98546
$$ y = [923057, -1046414, -4506430, -7522816, -7143570, -3318834, 685972, 2194902, 1773742, 1446359, 1933893, 2703398, 3452778, 4115130, 4016111, 2420926, -77816, -1664313, -1025358, 1462093, 4266930, 6037633, 6477779, 6358202, 6723555, 7714799, 8075468, 6201209, 1964849, -2723594, -5566211, -6038152, -5440055, -4741628, -3237080, -155275, 3101053, 4018645, 2546101, 1779583, 3853440, 6668573, 6774986, 4606379, 4036168, 6469562, 8388011, 6447693, 2640569, 1626126, 4108038, 6039572, 4591766, 2040947, 2476125, 6668259, 11796903, 14866389, 14709225, 11670461, 7307747, 4005051, 2979589, 2590751, 237528, -3902849, -6692985, -6035844, -3402281, -1515092, -958317, -259771]
3772b59771K006270L150616L330194K122843k91816k306381k165321n61776N5441
3763E080299o68131k72606K260782M154800K735165n17594k340903k429528k938128
3754E064156m351642m890355l626349j437595R52474L239088M012411J928641
3746H90829j301719k119908q7969J318959P1379j347742k48518J682997J112466
3737b9226j386546j960401P45220L568020L273091O82764r52727l72872M55232
3728D022555o68450l085313l904003j559232K100072L900812K923918R27052m18428
3719D238983j132064j599561j409877l78674O43074R99652J137743J338425P88794
3710D626495q85982k335318k153157q71130J66178R23950J961531K484581J222224
$$ y = [-259771, 1746499, 4897115, 8227309, 10350152, 10058336, 7751955, 5586634, 5024858, 5080299, 4412168, 4139562, 6400344, 10555144, 13290309, 12772715, 10431812, 8002284, 5064156, 712514, -4177841, -7804190, -9241785, -8289311, -5050223, -1037812, 890829, -410890, -2530798, -2618767, -1299808, -1228429, -2576171, -2824689, -1141692, -29226, -1415772, -3376173, -2630953, 937067, 4210158, 4892922, 3940195, 3567323, 4022555, 3354105, 268792, -3635211, -5194443, -3094371, 806441, 3730359, 4657411, 4238983, 3106919, 1507358, 97481, -281193, 361881, 1361533, 2499276, 3837701, 4626495, 3740513, 1405195, -747962, -1619092, -1452914, -528964, 1432567, 3917148, 5139372]
3701E139372j148839k565212k475757k130221j926683p59001J427965K701767
3693a736609J952213Q08057J251672K707949L141976K032863M99793r02993k656268
3684G098653m611643n519495m610327k470899j0885K321585L883945L671236J761330
3675A513500K6373J55093J400673J587293K05170r85127p65732k63344q33390
3666B040509j448106o2911K851202M216357K304650q62843k081437q00019P54990
3657F912392N64744j224251k924878k886088p25468K088047L087714J130634k218892
3648C803954m298068m041345k340687l12623J479486K342234J649985J16888n20394
3639b120570K78583J116877P68812k11625q47234j357571k041954j694179Q46891
$$ y = [5139372, 3990533, 1425321, -1050436, -3180657, -5107340, -5866341, -4438376, -1736609, 215604, 1023661, 2275333, 4983282, 8125258, 10158121, 10657914, 9754921, 7098653, 2487010, -3032485, -7642812, -10113711, -10124596, -7803011, -3919066, -247830, 1513500, 1539873, 1694966, 3095639, 4682932, 4888102, 3902975, 3137243, 2873899, 2040509, 592403, 529492, 3380694, 7597051, 9901701, 9038858, 6957421, 6157402, 6912392, 7477136, 6252885, 3328007, 441919, -283549, 1804498, 4892212, 6022846, 3803954, -494114, -4535459, -6876146, -7188769, -5709283, -3367049, -1717064, -1600176, -2120570, -1841987, -725110, 43702, -167923, -1015157, -2372728, -4414682, -6108861, -5261970]
3630e261970L976426M351545J073555k959061m623165l864956k373703o41680
3622a0323009J720852L675439L208174M02488j892431j413473P69341J902132
3614a950487J036705l17299n76395O9943L11203n33976j753128k058578j066831
3605f838843K39738Q45000J106863J894700K557173J416418j211993k436904o30594
3596c058442J864893J948968L18434Q8927J647921K191827N77251q23788k97661
3587D458330L80188p09443k187861j927220q54555r99219j276802R44261M503990
3578B331669M783679M14405l884148l342155M97647K255480J68873k068859r64038
3569A92553K091100L164160J119824j355505j620456r9020J080647J033169N36407
$$ y = [-5261970, -1285544, 3066001, 4139556, 1180495, -3442670, -7307626, -9681329, -10323009, -8602157, -4926718, -1718544, -1316056, -3208487, -4621960, -3852619, -1950487, -913782, -1231081, -1807476, -1737533, -1426330, -1960306, -3713434, -5772012, -6838843, -6599105, -5754105, -4647242, -2752542, -195369, 1221049, 9056, -2427848, -3058442, -1193549, 755419, 1073853, 1162780, 2810701, 5002528, 5579779, 4755991, 4458330, 4838518, 4129075, 1941214, 13994, -840561, -1839780, -3116582, -2172321, 2331669, 7115348, 7529753, 3645605, 303450, 801097, 3056577, 3225450, 1156591, 192553, 2283653, 5447813, 6567637, 5212132, 3591676, 3492656, 4573303, 5606472, 6142879]
3560F142879K82723R9114k37674n89286r10944j154663q79704j45487m62188k992902
3550h48132n753809n035550n20048L485700L560082J599122J430304L039845L298973
3541D256487J188502j176158k288834k579977j956489M17102L147551K939996
3533C948180n94008l530524k954335r02288o18618j391272k72503K658764M220748
3524E64144K882442O15431k18198M99653J478417J582350K06505k238731l882361
3515A489652k978594l02245J460037J018436k83480q76042r36979j214982j439094
3506d063291j072160n43356m78507m52120K65133J188875J076390j87455j162090
3497e428581n12967J486321L286701L566895K314924N66618q58312k097191l333210
$$ y = [6142879, 6425602, 6524716, 6287042, 5697756, 4786812, 3632149, 2752445, 2606958, 2144770, -848132, -6601941, -11637491, -12157539, -8671839, -5111757, -3512635, -2082331, 957514, 4256487, 5444989, 4268831, 1979997, -599980, -2556469, -2139367, 1008184, 3948180, 3354172, -176352, -3130687, -4032975, -4651593, -6042865, -6315368, -3656604, 564144, 3446586, 4062017, 3843819, 4343472, 5821889, 7404239, 7610744, 5372013, 1489652, -1488942, -1791187, -331150, 687286, 403806, -472236, -1409215, -2624197, -4063291, -5135451, -5678807, -6157314, -6609434, -6344301, -5155426, -4079036, -4266491, -5428581, -5941548, -4455227, -1168526, 2398369, 4713293, 5279911, 4421599, 2324408, -1008802]
3488a008802l565608j515962J989004M039704L130744J398539J712108L353401
3480I533128K847091q93094m646002n050017k665055l39643Q53945J905847K977455
3471D523655K725006P43135j312041j794171r02349K43535J137812J630809J162061
3462H157452n66681k560832l173990j863339J15599Q36742m51263k437846k991321
3453d935479j695647n30427j086319j926184n73833K281158L217656J273200j87042
3444d162917J589997M517444M806926K321856j23024j369342k506950l562903
3436A511087l028993q12582J326852K579861L539347L695113J721498j107030
3428I425153j352923J267717K436070o42896m663329m707712j059947J747365
$$ y = [-1008802, -4574410, -6090372, -4101368, -61664, 3069080, 4467619, 6179727, 9533128, 12380219, 11487125, 6841123, 1791106, -873949, -1213592, -359647, 1546200, 4523655, 7248661, 7991796, 6679755, 4885584, 3983235, 4226770, 5364582, 6995391, 8157452, 7590771, 5029939, 1855949, -7390, 108209, 944951, 493688, -1944158, -4935479, -6631126, -7161553, -8247872, -10174056, -10747889, -8466731, -5249075, -3975875, -4162917, -2572920, 1944524, 6751450, 9073306, 8950282, 7580940, 5073990, 1511087, -1517906, -2330488, -1003636, 1576225, 5115572, 8810685, 10532183, 9425153, 8072230, 9339947, 11776017, 11133121, 6469792, 1762080, 702133, 2449498]
3420B449498J264734p60535j853744j321463N20693K886886M055748K622074m15725
3411I448166k578710l008706k885599k773301j658634Q16047K995381L085865
3403C440509J350043k93107k87591J129224K021509N97185k365291l674271j462468
3394D55742K075633L296025J686118k00772p89908q95951j112712n75332R15819
3385D854662J911949J460236K41024j231539l335276n303690m943879j924545
3377h271058R58082J655859J769293L281971M580059K878848p81617k519505j195866
3368B356066L35905j48921j436617j537753n37977M47631J086300J274671M87047
3359B326352r89561j624778p84989O995o17230j482398m83129K190477M184195
$$ y = [2449498, 3714232, 2953697, 1099953, -221510, 299183, 3186069, 7241817, 9863891, 9448166, 6869456, 3860750, 975151, -1798150, -3456784, -2640737, 354644, 3440509, 4790552, 4497445, 4209854, 5339078, 7360587, 7957772, 5592481, 1918210, 455742, 2531375, 5827400, 7513518, 7312746, 6522838, 5626887, 4514175, 3938843, 4854662, 6766611, 8226847, 8467871, 7236332, 3901056, -1402634, -6346513, -8271058, -7312976, -5657117, -3887824, -605853, 3974206, 6853054, 6071437, 3551932, 2356066, 2691971, 2543050, 1106433, -431320, -969297, -521666, 564634, 1839305, 2326352, 1336791, -287987, -1072976, -1065981, -1683211, -3165609, -3648738, -1458261, 2725934]
3350B725934L975581K146107j53188k312870l553505k705286K70802L286416L714144
3341G394135J090776k166405l042010j057424J126027Q28907j077861j054428
3333B041717K065418M640146K701500k321566n161832l785262j601912j667553
3325c089344k226828n78818J598776Q07105j974879k277985N70101J966819o41347
3316e846400l390515j826035K469418M839099M495723M048003L741534J282841
3308I813668k766371m502318k729655r61190j471500j622501J031204L785457
3300E76794K867067k95905j400797j97793k73457k449133l300704j050383J455625
3291d068686J411134J06310N0179Q66908O52548n92995j446468j579510j525897
$$ y = [2725934, 6701515, 8847622, 8694434, 6381564, 2828059, 122773, 393575, 3679991, 7394135, 8484911, 6318506, 3276496, 2219072, 3345099, 4174006, 3096145, 2041717, 4107135, 8747281, 11448781, 9127215, 3965383, 180121, -1421791, -3089344, -5316172, -5894990, -4296214, -3489109, -5463988, -7741973, -7171872, -5205053, -5846400, -9236915, -11062950, -8593532, -3754433, 741290, 4789293, 8530827, 9813668, 7047297, 2544979, -184676, -1145866, -2617366, -4239867, -3208663, 576794, 3443861, 3147956, 1747159, 1549366, 1275909, -1173224, -4473928, -5524311, -4068686, -2657552, -2551242, -2501063, -1634155, -981607, -1574602, -3021070, -4600580, -6126477]
3282f126477j076116n361O48295J01155m03969N04168J709530J402537O00519
3273b645719J822548M507145N100875K364613n56078p21865O94507J018821L15599
3264A1900446N08463J677721J934171N55221j084816j889328k477418l655886
3256G468574m742242m252606j789550J241342K733864J715875p68511k651200
3248a044454k605536o16039K555321N328642N229281J012291m580296o495600
3240a216390l288412O47589P97091j418095j192088K349312N096000M193813J615639
3231G584459L42540J63061p25680k250933k942663k473996j584463l89157J266289
3222a010543K353276J467817r85702k891021k820085j323381J71899Q90494J115530
$$ y = [-6126477, -7202593, -7207954, -6559659, -6458504, -6862473, -6358305, -4648775, -3246238, -2645719, -823171, 3683974, 8784849, 11149462, 10593384, 9871519, 10566026, 11584847, 11900446, 12408909, 14086630, 16020801, 16576022, 15491206, 13601878, 11124460, 7468574, 2726332, -1526274, -3315824, -2074482, 659382, 2375257, 1606746, -1044454, -3649990, -4266029, -1710708, 3617934, 8847215, 9859506, 5279210, -1216390, -4504802, -3857213, -3060122, -4478217, -5670305, -3320993, 1775007, 5968820, 7584459, 7926999, 8090060, 7364380, 5113447, 2170784, -303212, -1887675, -2276832, -1010543, 1342733, 2810550, 1824848, -1066173, -3886258, -5209639, -5037740, -4147246, -3031716]
3213c031716J655929K808190L556685K392031n44176k900401k614124m26838J088640
3204A984220O42088o41596j017916p6212J206544J699093J181139L66538j30960
3195E212938o35989j675324k687364k615772j806357j758936k548756k311734
3187a0827294k90187J469572J037946m02323m65623Q03071J418502O92039k33851
3178f798148m23597L67418K431948N004771N337195J798708k664491l503650q89137
3169F61017N98413j020211k563166j515618j46665j086596k417679r37424K152440
3160f275489K999828J238850K10671J314869K030990L36139k057153k280630l1680
3151b513605K596299L601116K450762J63837j260860o06909P66910J03813l029125
$$ y = [-3031716, -1375787, 1432403, 4989088, 7381119, 6836943, 3936542, 1322418, 895580, 1984220, 2626308, 1984712, 966796, 890584, 2097128, 3796221, 4977360, 5343898, 5212938, 4576949, 2901625, 214261, -2401511, -4207868, -5966804, -8515560, -10827294, -11117481, -9647909, -8609963, -9012286, -9477909, -8674838, -7256336, -6564297, -6798148, -7221745, -6854327, -4422379, 582392, 5919587, 7718295, 5053804, 1550154, 661017, 1259430, 239219, -2323947, -3839565, -3986230, -5072826, -7490505, -8427929, -6275489, -3275661, -2036811, -1826140, -511271, 1519719, 1855858, -201295, -2481925, -2513605, 82694, 3683810, 6134572, 6298409, 5037549, 4430640, 5197550, 5301363, 2272238]
3142B272238n430166l881722P00001M166004M048611K167414J676248K552623
3134H271251J668508k342796o013207m720052J046921N456711M148358p63258
3126F752436l957915l409100j362027J2383R32683J796732J463659q12197l337967
3117a921313l478047o46952L138146N314370M814160K538234L84076m50237m90561
3108I201876j035421k185146k544916j229200N62444P40772j059419k714275j831187
3099b094472J361467L852849L108804J64174j632356j021833l23525j631130l385828
3090a601850k771410j93724J407420J152591R38364J356376M65161k042733k990273
3081d280078o07716J673052o5990l696372l627351P03876L644212J597722j847412
$$ y = [2272238, -3157928, -7039650, -6339649, -2173645, 1874966, 4042380, 5718628, 8271251, 9939759, 7596963, 1583756, -3136296, -2089375, 3367336, 7515694, 6752436, 2794521, -614579, -1976606, -1964223, -1031540, 765192, 2228851, 1416654, -1921313, -5399360, -6046312, -2908166, 2406204, 7220364, 9758598, 10142674, 9692437, 9201876, 8166455, 5981309, 3436393, 2207193, 2769637, 3510409, 2450990, -263285, -2094472, -733005, 3119844, 6228648, 6392822, 4760466, 3738633, 3415108, 1783978, -1601850, -4373260, -4566984, -3159564, -2006973, -1068609, 287767, 752928, -1289805, -4280078, -4887794, -3214742, -3280732, -6977104, -10604455, -9900579, -6256367, -4658645, -6506057]
3072f506057j488989K097749M119251K611064K75344k23360M75699M39906o76515
3063A124092j754362j768928n68393Q69083Q73422q96907k022536J41645M318038
3054C15154O098280L696909L21286p24406n96616j993014l930902l088763O05711
3045G03639L460165L140824J043815q08881k062657k517733j468626L07232P90729
3036B588507J32278P61894K702704K360156j688764n290806m451576j324812k82015
3027d492434o24500J537388N557427O303857K262325j865676k205477o69119o23049
3018E180742j581822j170207M85026J338151N97665j031343k735971l407366j863896
3009d189021R02213J647476q77245l502138k787815J81919J800257J198752N03456
$$ y = [-6506057, -7995046, -5897297, -1778046, 833018, 1108362, 885002, 1360701, 1800607, 1124092, -630270, -2399198, -2967591, -2098508, -1225086, -2121993, -4144529, -4002884, 315154, 6413434, 10110343, 10431629, 9707223, 9110607, 7117593, 3186691, 97928, 703639, 4163804, 7304628, 8348443, 7539562, 5476905, 2959172, 1490546, 1797778, 2588507, 2720785, 3482679, 6185383, 8545539, 6856775, 1565969, -2885607, -4210419, -4492434, -5116934, -3579546, 1977881, 8281738, 10544063, 8678387, 6472910, 5803791, 5180742, 3598920, 2428713, 2913739, 4251890, 4849555, 3818212, 1082241, -2325125, -4189021, -3286808, -1639332, -2516577, -6018715, -8806530, -8624611, -6824354, -5625602, -5122146]
3000e122146Q30101J175708J007702J062937J345527P24999j024693k572922k677146
2991e249933j174180J309751L241340K688565r2915j660403M01664L262853K315863
2982E042605j593426k756842P71601L801478J729582k394759k452880J681187
2974C828546M284602K170599j476610k319628l30908J602828J990258J470022
2966A1219709O38388n79904j669907j540327l35194R9851j349279k863170j476563
2957B143604K681262N525079L664905j131366m005073l104628j260633j169480
2949C343670j595912j41346K312209K745822P66361p54292j56438M90928j358956
2940E652046m712143n966937l180722J853680N477198N258262J617291k690575
$$ y = [-5122146, -4292045, -3116337, -2108635, -1045698, 299829, 1024828, 135, -2572787, -5249933, -6424113, -5114362, -1873022, 815543, 722628, -937775, -536111, 2726742, 5042605, 3449179, 692337, 1463938, 5265416, 6994998, 4600239, 2147359, 3828546, 8113148, 10283747, 8807137, 6487509, 6156601, 7759429, 9749687, 11219709, 11858097, 11278193, 9608286, 8067959, 7732765, 7832616, 6483337, 3620167, 2143604, 4824866, 10349945, 14014850, 12883484, 8878411, 5773783, 4513150, 3343670, 1747758, 1606412, 3918621, 6664443, 7430804, 6676512, 6520074, 7011002, 5652046, 939903, -5027034, -8207756, -6354076, -876878, 4381384, 5998675, 3308100]
2932C308100m762557l865320j630896J70680J414649K628104L126506J665519
2924B054785j094692k428496p48465K017963K431071m19610l889550m786187k583694
2915i446875N21366K071315J501921K39021J5091J042792J885810J279691k40221
2906a130089j047872n03148M92772R59753Q52022M20810k79544p23278L0170J677313
2896G48909K207316M46048j853381k165629q01485k71655j219080j446213L45422
2887d009748K238202J978264K58394p85158q93391j226914j577997p19693O99357
2878d038684M43465j490493j991537P43046M014753L968017Q12905j653830j206931
2869c99289M81828Q48520l64043j708746k195633j766356p69668m7290n92468
$$ y = [3308100, -1454457, -5319777, -6950673, -6779993, -5365344, -2737240, 389266, 2054785, 960093, -1468403, -2216868, -198905, 2232166, 1812556, -2076994, -6863181, -9446875, -8925509, -6854194, -5352273, -5113252, -5098161, -4055369, -2169559, -889868, -1130089, -2177961, -2681109, -2188337, -1228584, -376562, 44248, -235296, -958574, -928404, 748909, 2956225, 3402273, 1548892, -616737, -1418222, -1689877, -2908957, -4355170, -4009748, -1771546, 206718, 465112, -320046, -1213437, -2440351, -4018348, -4738041, -4038684, -3595219, -5085712, -7077249, -6334203, -2319450, 1648567, 2461472, 807642, -399289, 82539, 931059, 567016, -1141730, -3337363, -5103719, -5873387, -5920677, -6513145]
2860f513145k000222k156065J54149L042225L595319J746381J02585j19520o48183
2851b796476k716128m308827k841007P83919L141842K768293J353674N39776L9580
2842d035354l67586M93228K783544L828257J237032k989284m206510j204383J951668
2833b509388J247508k090344l525285j166836K327684L590491K293134M72187
2825F39151l93213n22947p92481j593259k529177k623455j082138J617987L749452
2816c530080M044436L002866J790454M06740j754640l740919l275995K9626L184318
2807A56806L013219J28878j825495o71988K033153L362251K244002j88503k232553
2798F019770k697190j268239J025248K131651R29941j175492j626076J47579J872555
$$ y = [-6513145, -8513367, -10669432, -10515283, -7473058, -3877739, -2131358, -2028773, -2148293, -2796476, -5512604, -9821431, -12662438, -11878519, -8736677, -5968384, -4614710, -4074934, -4035354, -4402940, -3909712, -1126168, 2702089, 3939121, 949837, -3256673, -4461056, -2509388, -1261880, -3352224, -6877509, -8044345, -5716661, -2126170, 166964, 639151, 245938, -277009, -1069490, -2662749, -5191926, -7815381, -8897519, -7279532, -3530080, 514356, 3517222, 5307676, 5714416, 3959776, 218857, -3057138, -3027512, 156806, 3170025, 3298903, 1473408, 801420, 2834573, 6196824, 8440826, 8252323, 6019770, 3322580, 2054341, 3079589, 5211240, 6141181, 4965689, 3339613, 3487192, 5359747]
2789E359747J155121j657491l933390l640402j195362J301996K129966J332591
2781H52776M38267P33601J700287J614502l4781j538325j204257J46807L11679
2772C020556j019919j839026q52750Q16581J567440J239244K58573j267215k364016
2763d40532j180620J857612K905553m09849m495679l873531R65683M006483K265628
2754A600748o68782j113388o46913j976997l413506j833809J351708K050315J79451
2745d471173k75335K095291L926545K600868J19401l94888Q55442J540226Q35422
2736F831799j89700n25741R6413J557264L136616L733599L140377K215397J271278
2727B1267302l87551k624223l735244k720457r93326n36990j385992k164553k165181
$$ y = [5359747, 6514868, 4857377, 923987, -2716415, -3911777, -2609781, -479815, 852776, 1291043, 2024644, 3724931, 5339433, 5304652, 3766327, 2562070, 2708877, 3020556, 2000637, 161611, -691139, 125442, 1692882, 2932126, 3190699, 1923484, -440532, -1621152, 236460, 3142013, 2732164, -1763515, -5637046, -4671363, -664880, 1600748, 931966, -181422, -828335, -2805332, -6218838, -8052647, -6700939, -4650624, -4471173, -4746508, -2651217, 1275328, 3876196, 3995597, 3600709, 4456151, 5996377, 6831799, 6642099, 6116358, 6212771, 7770035, 10906651, 14640250, 17780627, 19996024, 21267302, 20879751, 18255528, 14520284, 11799827, 10806501, 10269511, 8883519, 6718966, 4553785]
2718D553785j615884o92314M45452J186239J075829L87639n65693j776503k549986
2709D48564j600856P01799J749871R9782j934508j350093R64370J534017k54971
2700C57975j250220L37294K081300J343053m08598R9771K707907L806287J435908
2691A0510677k143669l717794k970304j830470j437840j471642j696475k185971
2683f943488k097142k71631K359749K967305O84463j490636n86432J940142K295199
2674a142471J05896j086783N74613K420568J503586j011457k005445j091437m66604
2665b199534j038882j391315n43272N19950N78335j84862r00772j210129j113339
2656g483820m48478Q15622K138327K739271K317786J243830M138j336272k700286
$$ y = [4553785, 2937901, 2245587, 2691039, 3877278, 4953107, 5340746, 4775053, 2998550, 448564, -1152292, -450493, 1299378, 1399160, -535348, -1885441, -921071, 612946, 357975, -892245, -554951, 1526349, 2869402, 2460804, 2560575, 5268482, 9074769, 10510677, 8367008, 4649214, 1678910, -151560, -1589400, -3061042, -4757517, -6943488, -9040630, -9312261, -6952512, -3985207, -3300744, -4791380, -5377812, -3437670, -1142471, -1036575, -2123358, -1548745, 871823, 2375409, 1363952, -641493, -1732930, -2199534, -3238416, -4629731, -5173003, -4653053, -4074718, -4259580, -5160352, -6370481, -7483820, -7932298, -7116676, -4978349, -2239078, 78708, 1322538, 1326676, -9596, -2709882]
2647b709882l096273j288883J830648K890960o5638m219842n037508k297965M7744
2638a3946639J86179P16587L270031M985564L219090L36292N8956J589266J516904
2629A932230k90360j130418n83844o00703j071402r543J799956J088455k158631
2620a024260l758949j561594J428340J899605N35261m42010n65752J19009K274124
2611a096226M874076M705415R31204k598155k367161J4618R35824K38873K39322
2602E877790J272893J728001J181868K96775j213752l417579m194952j790548
2594b59504J580624K122452j24126j684399j130779n77316j508806k570127k243359
2585f395340q01339J128904L226099M068364J976911j732883l140851p21487K518908
$$ y = [-2709882, -5806155, -7095038, -5264390, -2373430, -2439068, -6658910, -11696418, -13994383, -13946639, -13760460, -13043873, -9773842, -4788278, -1569188, -1232896, -1173940, 415326, 1932230, 1641870, 511452, -72392, -673095, -1744497, -1754040, 45916, 1134371, -1024260, -4783209, -6344803, -4916463, -3016858, -2481597, -2923607, -3489359, -3370350, -1096226, 3777850, 8483265, 9414469, 6816314, 4449153, 4463771, 5399595, 5638468, 5877790, 7150683, 8878684, 10060552, 10357327, 9143575, 5725996, 1531044, -259504, 1321120, 3443572, 3319446, 1635047, 504268, -73048, -1581854, -4151981, -6395340, -7196679, -6067775, -2841676, 1226688, 3203599, 1470716, -1670135, -2391622, 127286]
2576A27286L334228K243399J508824J416266Q80678R9872P0249L28707n10082
2567I499427k268203l165803k274680n09215R55201J979318K804279K997608J704708
2558A1722640j120962l988751m800474l015075o05883M7529q71531j005330O23453
2549c014384K081021J482072j7244J58687K202649L607944K563090l473k151286
2540F909076l250115l686943l271057j352965J457411K881368J189821k362128
2532a485532m175525j899281K920130O319902N960703L110715N71007n17240j103110
2523I701769k003593k530685j835679o86230o93065j912284k551383j562476k48636
2514d322262j92934p04570r9747J112436O65824j634229k957497j364534J435794
$$ y = [127286, 3461514, 5704913, 7213737, 8630003, 9510681, 9610553, 9680802, 10009509, 9499427, 7231224, 4065421, 1790741, 1281526, 2236727, 4216045, 7020324, 10017932, 11722640, 10601678, 6612927, 1812453, -1202622, -1808505, -1760976, -2632507, -3637837, -3014384, -933363, 548709, 531465, 690152, 2892801, 6500745, 9063835, 9060362, 6909076, 3658961, -27982, -3299039, -4652004, -3194593, -313225, 876596, -1485532, -5661057, -7560338, -4640208, 1679694, 7640397, 10751112, 11322119, 10804879, 9701769, 7698176, 5167491, 3331812, 2645582, 1952517, 40233, -2511150, -4073626, -4322262, -4515196, -5219766, -5319513, -4207077, -3541253, -5175482, -8132979, -9497513, -8061719]
2505h061719K724927K288755J408147M6700k392058m490686l822518m44738K961846
2496i781344M542237M686946L894553J718937j283524k718248r67476K527612
2488B619693M765045M217675J679425j059127k619400k705447k000762j265171
2480C631931o35013j52064l05946j086507j245428K1091J270654N57292j431699
2471F24311k152944r73145K78058O60453J258314K281314J967732j49566j502238
2462B292289o1514K346653K530628L26259j630319j565525j32165J053018R80692
2453F140016j30818r12582l30717N49723j57306j809554j687446K97041O08449
2444B566806k156283l989760j369434K519001K071241k010865l531478q634M057992
$$ y = [-8061719, -5336792, -3048037, -1639890, -1593190, -3985248, -8475934, -12298452, -12743190, -9781344, -5239107, -552161, 3342392, 5061329, 3777805, 1059557, 92081, 2619693, 7384738, 11602413, 13281838, 12222711, 9603311, 6897864, 4897102, 3631931, 2996918, 2844854, 2538908, 1452401, 206973, 228064, 1498718, 2056010, 624311, -1528633, -2501778, -2223720, -1563267, -304953, 1976361, 3944093, 3794527, 2292289, 2230775, 4577428, 7108056, 7434315, 5803996, 4238471, 4106306, 5159324, 6140016, 6009198, 5096616, 4765899, 5315622, 5158316, 3348762, 1661316, 1958357, 2566806, 410523, -3579237, -4948671, -2429670, -358429, -2369294, -5900772, -5909406, -1851414]
2435a851414M074293J080750j093930q38192J002504L014272L473511J121734
2427I983528k640405m477304l368383j776493j325018k87627K568179M627415
2419C303892K977164q41117k975799k712524k379629k783928k392160r08272r4461
2410h806834l66087K50705K508453M025748K786503M22150k04488P42496P27020
2401B085666q48164j635453j74484J522285P57087j822338l043334j720128j08939
2392d987802j82682o10014P32061K765070K460990l14306k191109j188197N95454
2383b920535O36773k24724J07085J169166J109944K77354L47388N69227j462043
2374c90365n038762o055631k785483J307448K490323J701501K017889L483339
$$ y = [-1851414, 2222879, 3303629, 2209699, 1371507, 2374011, 5388283, 8861794, 9983528, 7343123, 2865819, -502564, -2279057, -3604075, -3891702, -1323523, 3303892, 6281056, 5439939, 2464140, -248384, -2628013, -5411941, -7804101, -8712373, -8806834, -9172921, -8922216, -6413763, -2388015, 398488, 820638, 616150, 1358646, 2085666, 1237502, -397951, -572435, 949850, 1706937, -115401, -3158735, -4878863, -4987802, -5170484, -5780498, -5048437, -2283367, 177623, -136683, -2327792, -3515989, -2920535, -2283762, -2508486, -2401401, -1232235, -122291, 155063, 502451, 1071678, -390365, -5429127, -11484758, -14270241, -12962793, -10472470, -8770969, -6753080, -3269741]
2366c269741L713358K340161J394422J573959J349308J34222o24401m72577j383219
2357D755492m467990p170653n863970m88308N031304O786831M363900O31088j196070
2348B381624m41630P78555M16526p97262o20347J046636J775713L61705j286428
2339C615092j284776o86324j259062k078696r65407J589245K676622J081548j148626
2330A539616j552719L7839J901161K279419R01610m17186N03769K790875K509946
2321A0494330j827354n782119m470935N2487J520446j120110k581966k60755J743275
2312b232701K28911j278716J258871M897863M014537p58442l702949k638724p61665
2303i73015l22704J12131J430628J822010M20677p01737p9992N06608j117286
$$ y = [-3269741, 443617, 2783778, 4178200, 5752159, 7101467, 7235689, 6611288, 6138711, 4755492, 287502, -6883151, -12747121, -13235429, -8204125, -1417294, 2946606, 3577694, 2381624, 1939994, 2718549, 3135075, 2337813, 1717466, 2764102, 4539815, 4901520, 3615092, 2330316, 1643992, 384930, -1693766, -2659173, -1069928, 1606694, 2688242, 1539616, -13103, 24736, 1925897, 4205316, 5106926, 4689740, 5193509, 7984384, 10494330, 8666976, 2884857, -1586078, -1533591, -13145, -1133255, -3715221, -3975976, -2232701, -2003790, -3282506, -2023635, 2874228, 6888765, 6130323, 2427374, -211350, -973015, -1295719, -1183588, 247040, 2069050, 2489727, 1787990, 1707998, 2214606, 1097320]
2294A097320m074137n532947l995364m62802K666061L422743J986033N74757P18671
2285c599665J381232J091050N09267O56263J71838k356068m460680k355802K719450
2276f243115N083175K332724j591079k371145n21473J117699J580606J318188
2268G05580M52472m02153j5842J116044Q88443n94421m40865K124095L748242
2259G581595K073216o16486j556427j825133l196844l952318j848732J310998
$$ y = [1097320, -2976817, -8509764, -12505128, -12967930, -10301869, -6879126, -4893093, -4318336, -3599665, -2218433, -1127383, -618116, 38147, 209985, -2146083, -6606763, -8962565, -6243115, -1159940, 1172784, -418295, -2789440, -3310913, -2193214, -612608, 705580, 1158052, 755899, 740057, 1856101, 2744544, 2150123, 1709258, 3833353, 7581595, 9654811, 9038325, 7481898, 5656765, 2459921, -1492397, -3341129, -2030131]
$$ [...]
##END NTUPLES=NMR SPECTRUM
##END=
