##TITLE=31Pdec_DE-158rm4
 ,64 sc
 26.6.2026
##JCAMPDX= 6.0         $$ Bruker NMR JCAMP-DX V2.0
##DATA TYPE= NMR SPECTRUM
##DATA CLASS= NTUPLES
##ORIGIN= UXNMR, Bruker Analytische Messtechnik GmbH
##OWNER= root
$$ XWIN-NMR		Version 3.5
$$ Fri Jun 26 14:51:41 2026 Russian Standard Time (UT+4h)  she@DPX200
##.OBSERVE FREQUENCY= 81.013821
##.OBSERVE NUCLEUS= ^31P
##.ACQUISITION MODE= SIMULTANEOUS
##.ACQUISITION SCHEME= undefined
##.AVERAGES= 64
##.DIGITISER RES= 17
##SPECTROMETER/DATA SYSTEM= spect
##.PULSE SEQUENCE= zgpg30
##.SOLVENT NAME= CDCl3
##.SHIFT REFERENCE= (INTERNAL, CDCl3, 0, 197.392)
##AUDIT TRAIL= $$ (NUMBER, WHEN, WHO, WHERE, WHAT)
$$ ##TITLE= Audit trail, XWIN-NMR		Version 3.5
$$ ##JCAMPDX= 5.01
$$ ##ORIGIN= Bruker BioSpin GmbH
$$ ##OWNER= she
$$ F:/spectra/data/she/nmr/P31/2/pdata/1/auditp.txt
$$ ##AUDIT TRAIL=  $$ (NUMBER, WHEN, WHO, WHERE, WHAT)
(   1,<2026-06-26 14:50:08.14 +0400>,<she>,<DPX200>,
      <created by zg, POWCHK disabled, PULCHK disabled
       configuration hash MD5:
       00 E9 B6 7A A2 85 ED C7 34 08 36 98 17 FE 4E 26
       data hash MD5: 32K
       D3 AC CB 10 0A 2F 5B FA 17 E8 B1 C9 13 A7 3A ED>)
(   2,<2026-06-26 14:50:22.93 +0400>,<she>,<DPX200>,
      <Start of raw data processing
       efp BC_mod = 2 LB = 1.5 FT_mod = 6 PKNL = 1 PHC0 = 1649.791 PHC1 = -3.301208 SI = 64K 
       data hash MD5: 64K
       73 CC 83 02 C6 4E 26 37 56 24 EA CB 01 FF 3D D1>)
$$ ##END=
$$ 
$$ hash MD5
$$ 8D 01 ED 4B B3 D0 44 74 8F 07 5C F5 E7 D6 FD E7
##$RELAX= 
##$RELAX= 
##$RELAX= 
##$RELAX= 
##$RELAX= 
##$RELAX= 
##$RELAX= 
##$RELAX= 
$$ Bruker specific parameters
$$ --------------------------
##$DU= <F:/spectra>
##$EXPNO= 2
##$NAME= <P31>
##$PROCNO= 1
##$TYPE= <nmr>
##$USER= <she>
##$AMP= (0..31)
100 100 100 100 100 100 100 100 100 100 100 100 100 100 100 100 100 100 
100 100 100 100 100 100 100 100 100 100 100 100 100 100 
##$AQSEQ= 0
##$AQ_mod= 1
##$AUNM= <au_zg>
##$AUTOPOS= <>
##$BF1= 81.014009
##$BF2= 200.13
##$BF3= 200.13
##$BF4= 200.13
##$BF5= 200.13
##$BF6= 200.13
##$BF7= 200.13
##$BF8= 200.13
##$BYTORDA= 1
##$CFDGTYP= 0
##$CFRGTYP= 5
##$CHEMSTR= <none>
##$CNST= (0..31)
1 1 145 1 1 1 1 1 1 1 1 1 1 1 1 1 1 1 1 1 1 1 1 1 1 1 1 1 1 1 1 1 
##$CPDPRG= <waltz16>
##$CPDPRG1= <>
##$CPDPRG2= <waltz16>
##$CPDPRG3= <>
##$CPDPRG4= <mlev>
##$CPDPRG5= <mlev>
##$CPDPRG6= <mlev>
##$CPDPRG7= <mlev>
##$CPDPRG8= <mlev>
##$CPDPRGB= <>
##$CPDPRGT= <>
##$D= (0..31)
0 1 0 0 0 0 0 0 0 0.06 0 0.03 2e-05 3e-06 0 0 0.0002 0 0 0 0 0 0 0 0 0 
0 0 0 0 0 0 
##$DATE= 1782471007
##$DBL= (0..7)
120 120 120 11 120 120 24 19 
##$DBP= (0..7)
150 150 150 150 150 150 150 150 
##$DBP07= 0
##$DBPNAM0= <>
##$DBPNAM1= <>
##$DBPNAM2= <>
##$DBPNAM3= <>
##$DBPNAM4= <>
##$DBPNAM5= <>
##$DBPNAM6= <>
##$DBPNAM7= <>
##$DBPOAL= (0..7)
0.5 0.5 0.5 0.5 0.5 0.5 0.5 0.5 
##$DBPOFFS= (0..7)
0 0 0 0 0 0 0 0 
##$DE= 6
##$DECBNUC= <off>
##$DECIM= 4
##$DECNUC= <off>
##$DECSTAT= 4
##$DIGMOD= 1
##$DIGTYP= 9
##$DL= (0..7)
0 0 52 120 120 21 21 25 
##$DP= (0..7)
$$ [...]
##$SUBNAM2= <"">
##$SUBNAM3= <"">
##$SUBNAM4= <"">
##$SUBNAM5= <"">
##$SUBNAM6= <"">
##$SUBNAM7= <"">
##$SUBNAM8= <"">
##$SUBNAM9= <"">
##$SW= 400.765351723535
##$SWIBOX= (0..15)
0 1 3 0 0 0 0 0 0 0 0 0 0 0 0 0 
##$SW_h= 32467.5324675325
##$TD= 32768
##$TD0= 1
##$TE= 0
##$TE2= 300
##$TE3= 300
##$TEG= 300
##$TL= (0..7)
0 120 53 12 22 120 120 120 
##$TP= (0..7)
150 150 150 150 150 150 150 150 
##$TP07= 0
##$TPNAME0= <>
##$TPNAME1= <>
##$TPNAME2= <>
##$TPNAME3= <>
##$TPNAME4= <>
##$TPNAME5= <>
##$TPNAME6= <>
##$TPNAME7= <>
##$TPOAL= (0..7)
0.5 0.5 0.5 0.5 0.5 0.5 0.5 0.5 
##$TPOFFS= (0..7)
0 0 0 0 0 0 0 0 
##$TUNHIN= 0
##$TUNHOUT= 0
##$TUNXOUT= 0
##$USERA1= <user>
##$USERA2= <user>
##$USERA3= <user>
##$USERA4= <user>
##$USERA5= <user>
##$V9= 5
##$VALIST= <valist>
##$VCLIST= <CCCCCCCCCCCCCCC>
##$VD= 0
##$VDLIST= <DDDDDDDDDDDDDDD>
##$VPLIST= <PPPPPPPPPPPPPPP>
##$VTLIST= <TTTTTTTTTTTTTTT>
##$WBST= 1024
##$WBSW= 4
##$XGAIN= (0..3)
0 0 0 0 
##$XL= 0
##$YL= 0
##$YMAX_a= 7367
##$YMIN_a= -3389
##$ZGOPTNS= <>
##$ZL1= 120
##$ZL2= 120
##$ZL3= 120
##$ZL4= 120
##$ABSF1= 0
##$ABSF2= 0
##$ABSG= 0
##$ABSL= 0
##$ALPHA= 0
##$AQORDER= 0
##$ASSFAC= 0
##$ASSFACI= 0
##$ASSFACX= 0
##$ASSWID= 0
##$AUNMP= <proc_1d>
##$AZFE= 0.1
##$AZFW= 0.5
##$BCFW= 0
##$BC_mod= 2
##$BYTORDP= 0
##$COROFFS= 0
##$CY= -3
##$DATMOD= 1
##$DC= 0
##$DFILT= <>
##$DTYPP= 0
##$F1P= 0
##$F2P= 0
##$FCOR= 1
##$FTSIZE= 65536
##$FT_mod= 6
##$GAMMA= 0
##$GB= 0
##$INTBC= 1
##$INTSCL= 9.790993e-09
##$ISEN= 30
##$LB= 1.5
##$LEV0= 0
##$LPBIN= 0
##$MAXI= 10000
##$MC2= 0
##$MEAN= 0
##$ME_mod= 0
##$MI= 50
##$NCOEF= 0
##$NC_proc= -8
##$NLEV= 6
##$NOISF1= 182.463
##$NOISF2= 159.3651
##$NSP= 0
##$NTH_PI= 0
##$NZP= 0
##$OFFSET= 197.3918
##$PC= 4
##$PHC0= 1649.791
##$PHC1= -3.301208
##$PH_mod= 1
##$PKNL= yes
##$PPARMOD= 0
##$PSCAL= 0
##$PSIGN= 0
##$REVERSE= no
##$SF= 81.014063255964
##$SI= 65536
##$SIGF1= 159.3651
##$SIGF2= -187.1042
##$SINO= 113.3802
##$SIOLD= 16384
##$SREGLST= <1H.CDCl3>
##$SSB= 0
##$STSI= 65536
##$STSR= 0
##$SW_p= 32467.5324675325
##$SYMM= 0
##$S_DEV= 0
##$TDeff= 32768
##$TDoff= 0
##$TI= <>
##$TILT= no
##$TM1= 0
##$TM2= 0
##$TOPLEV= 0
##$USERP1= <user>
##$USERP2= <user>
##$USERP3= <user>
##$USERP4= <user>
##$USERP5= <user>
##$WDW= 1
##$XDIM= 65536
##$YMAX_p= 111269691
##$YMIN_p= -358400902
$$ End of Bruker specific parameters
$$ ---------------------------------
##NTUPLES= NMR SPECTRUM
##VAR_NAME=  FREQUENCY,     SPECTRUM/REAL,   SPECTRUM/IMAG
##SYMBOL=    X,             R,               I
##VAR_TYPE=  INDEPENDENT,   DEPENDENT,       DEPENDENT
##VAR_FORM=  AFFN,          ASDF,            ASDF
##VAR_DIM=   65536,         65536,           65536
##UNITS=     HZ,            ARBITRARY UNITS, ARBITRARY UNITS
##FACTOR=    0.49542278885378, 1,            1
##FIRST=     15991.5117654749, 0,            0
##LAST=      -16476.0207020576, 0,           0
##MIN=       -16476.0207020576, -358400902,  0
##MAX=       15991.5117654749, 111269691,    0
$$ Real data points
##PAGE= N=1
##DATA TABLE= (X++(R..R)), XYDATA
$$ [...]
7475a1089616J289304k57406k038275j557827M36730J295563M62538j96143L29859
7466a1325273Q89080L72324o15936p84145L64385K293996L734572L409340J488213
7457a73444j54538l16823l02368j725194l417952k952032p29921M01364j96989
7448i567897O5585K308651L660211J600917j624135j795973J361424L872547K817354
7439B698684l84830k336950j670702l7468J31152j602302l101864k110119Q41533
7430g572866K983498K960908K354814K660146K552869J34303l283217m239331
7422a448876j888202P11204P18901j057150j975100j266709l70106l37398n32797
7413g446233L0800J183357J846741J288198j31490j215414r50790L81333J217059
$$ plain form
7475 -11089616 -9800312 -10057718 -12095993 -13653820 -13217090 -11921527 -11458989 -11655132 -11325273
7466 -11325273 -10436193 -10063869 -10679805 -11463950 -11099565 -8805569 -5070997 -1661657 -173444
7457 -173444 -327982 -644805 -947173 -2672367 -6090319 -9042351 -9772272 -9370908 -9567897
7448 -9567897 -9502312 -7193661 -3533450 -1932533 -3556668 -5352641 -3991217 -118670 2698684
7439 2698684 2313854 -23096 -1693798 -1731266 -1600114 -3202416 -6304280 -8414399 -7572866
7430 -7572866 -4589368 -1628460 726354 3386500 5939369 6073672 2790455 -1448876
7422 -1448876 -3337078 -2625874 -1906973 -2964123 -4939223 -6205932 -6576038 -6913436 -7446233
7413 -7446233 -7415433 -6232076 -4385335 -3097137 -3228627 -4444041 -5394831 -5013498 -3796439
7404c796439M00029j134629j195321Q02424K773461K605837R59417R551J4441
7395A438771q16059k892376l972759k373344M46854J983341J822549J088521K90739
7386b983763l13823L68164K572658L977136K376868p28783k116091j732677k171476
7377g51787l435406k289574K133884N868929N211214J392436j814687k691727
7369C623282j897120n68446n4786j345550k950803j759991K035599L675616J74597
7360I32398m664821m968305o12448L266758L359047J237935j17982K10129J019989
7351c37300L26208k684194n605258m438079R08766N248611M834425K420335K002694
7342B676208J948584j228464m983287l649282J736192L986356Q36566j856122
$$ plain form
7404 -3796439 -3396410 -4531039 -5726360 -4923936 -2150475 455362 1414779 1424330 1438771
7395 1438771 622712 -2269664 -6242423 -8615767 -8168913 -6185572 -4363023 -3274502 -2983763
7386 -2983763 -3297586 -2929422 -356764 3620372 5997240 5268457 3152366 1419689 -751787
7377 -751787 -4187193 -6476767 -4342883 1526046 6737260 8129696 6315009 3623282
7369 3623282 1726162 1157716 1102930 -242620 -3193423 -4953414 -2917815 757801 932398
7360 932398 -3732423 -8700728 -9313176 -6046418 -2687371 -1449436 -1567418 -1357289 -337300
7351 -337300 -11092 -2695286 -8300544 -12738623 -11829857 -6581246 -1746821 673514 2676208
7342 2676208 4624792 3396328 -1586959 -5236241 -3500049 486307 1322873 -533249
7334e33249m4469K367868Q64170k215057k213846K89072J416202M84358J9883
7325D34932J156381K627668K947291J138561k774334o040588m750646N36432L915601
7316h08702J725459k282382k700259q077J740959J687065J720309J564995l98253
7307B241114k676041k130186O49530K035910J044030p7069o06788k113286m258678
7298e891464m346528j864877M82056J180258J641344K565310K247255m0748k148822
7289f176216k125045o33942R57303K429087L442563K854369P09867j050158j100450
7280f92622k94252J15112J01987O685k60457n09977l03358n1686n11908j089166
7270c489642m33259J210869K153621J828586J313468J286402J313636J021614
$$ plain form
7334 -533249 -577718 1790150 2654320 439263 -1774583 -1485511 -69309 415049 434932
7325 434932 1591313 4218981 7166272 8304833 5530499 -510089 -5260735 -4724303 -808702
7316 -808702 916757 -1365625 -4065884 -4073961 -2333002 -645937 1074372 2639367 2241114
7307 2241114 -434927 -2565113 -1915583 120327 1164357 1087288 480500 -1632786 -5891464
7298 -5891464 -10237992 -12102869 -11620813 -10440555 -8799211 -6233901 -3986646 -4027394 -6176216
7289 -6176216 -8301261 -8935203 -7977900 -5548813 -2106250 748119 1457986 407828 -692622
7280 -692622 -986874 -871762 -769775 -763090 -1023547 -1533524 -1836882 -1888568 -2400476 -3489642
7270 -3489642 -3922901 -2712032 -558411 1270175 2583643 3870045 5183681 6205295
7262F205295K43086j389574l122856k627500N62895K730038N63094l361983l936768
7253d134273j186889M48943j75108K04180K379850K943986Q08243o86042k06106
7244C96784q07983l196210k964700J641998N241330L286731r05435k289009k006043
7235a602537l104659l216716J056565N925571M682305j538039n023502k874556
7227e695568K36758Q10952P73372J750857J783503K9142q21970N41533J366813
7218G75392k97096k084043j414719K92422L60976q45899j108057J3617J025008
7209c282399Q19878l58234j350534q26600J211030K534673R48488k543546m683025
7200g530269l961905j688516N47193K054215K139003Q68997M31048K643683N398637
$$ plain form
7262 6205295 6448381 5058807 1935951 -691549 -128654 2601384 3164478 -197505 -4134273
7253 -4134273 -5321162 -4872219 -5047327 -4843147 -2463297 480689 1288932 602890 396784
7244 396784 -411199 -3607409 -6572109 -4930111 311219 3597950 2692515 403506 -1602537
7235 -1602537 -4707196 -7923912 -6867347 -941776 3740529 2202490 -2821012 -5695568
7227 -5695568 -5458810 -4647858 -3874486 -2123629 -340126 -310984 -1132954 -591421 775392
7218 775392 478296 -1605747 -3020466 -2728044 -2367068 -3212967 -4321024 -4307407 -3282399
7209 -3282399 -2462521 -2820755 -4171289 -4997889 -3786859 -1252186 -303698 -2847244 -7530269
7200 -7530269 -11492174 -13180690 -12633497 -10579282 -8440279 -7571282 -7140234 -4496551 902086
7191I02086N037185K053743M00293R56349L35478k767243m808681l021570L71497
7182e40863K000202J781078J116397J46506p02400J71943K274581K250442q38246
7173G659640l044869j543406O08063l50106k485289j820824N57666O88979r44564
7164f74710m66955J782196J127934l164238n535493k316523K693262L952670J703691
7155h98166J56178P98974J552254J397852J844129L323514L374683K20487l708632
7146H061273m299020j449275L03379k079279n550282m906612m3972L922420L665849
7137b375519J262526r3517l61957o44274k28303J395166K192247O82361p25280
7128A103450P15225K887957J589158k359114l639849n05248K348989O12175l734311
$$ plain form
7191 902086 5939271 7993014 8393307 9349656 9685134 6917891 2109210 -912360 -540863
7182 -540863 1459339 3240417 4356814 4503320 3800920 3972863 6247444 8497886 7659640
7173 7659640 4614771 3071365 3679428 3329322 844033 -976791 -419125 269854 -674710
7164 -674710 -1141665 640531 1768465 -1395773 -6931266 -9247789 -6554527 -2601857 -898166
7155 -898166 -741988 56986 1609240 3007092 4851221 8174735 11549418 11769905 8061273
7146 8061273 3762253 2312978 2616357 537078 -5013204 -9919816 -9963788 -6041368 -2375519
7137 -2375519 -1112993 -1206510 -1568467 -2212741 -2441044 -1045878 1146369 1828730 1103450
7128 1103450 1818675 4706632 6295790 3936676 296827 -208421 2140568 2752743 -981568
7119i81568n656734l502031K14483K643812L019792K247437J706590J980287K124989
7110C797057R97669o32042q15213N42545J312716L27000j136879j832766k313222
7101B46865l027771k785500p78287J546981K343936J716146P08402n21461j824433
7092b375122j942422m15099O73924p03811l015421k823758M10638L689393M626763
7083a874915L767840K415668O71193j316031k230327j235393N71777J638522J824663
7074D232997J674870R91021m32286j561924j306129m89219r78729k916545m345242
7065e131186l742799j552960R98623L120927M061064L103423R12282m40252M1196
7056A370318Q12544M9713j609750k081424q64649N90017J123688Q37986N6479
$$ plain form
7119 -981568 -6638302 -10140333 -9925850 -7282038 -4262246 -2014809 -308219 1672068 3797057
7110 3797057 4794726 4162684 3347471 3890016 5202732 5529732 4392853 2560087 246865
7101 246865 -2780906 -5566406 -6344693 -4797712 -2453776 -737630 -29228 -550689 -2375122
7092 -2375122 -4317544 -4732643 -4058719 -4762530 -7777951 -10601709 -10191071 -6501678 -1874915
7083 -1874915 1892925 4308593 4979786 3663755 1433428 198035 769812 2408334 4232997
7074 4232997 5907867 6898888 6466602 4904678 3598549 3109330 2130601 -785944 -5131186
7065 -5131186 -8873985 -10426945 -9428322 -6307395 -2246331 857092 1769374 1329122 1370318
7056 1370318 2182862 2232575 622825 -1458599 -2323248 -1733231 -609543 228443 284922
7047B84922j023463j680888j277651n84956r65715k163396k481642j236289O25825
7038a0503253K351967L888645M470242L005501L93269q59730j10518N88138o9939
7029C154322q58085p07451m64986n29634M47982K629495L539544J802038l65104
7020H648121q53557j026261k485625l480543k152934m94437p75944q07336J983231
7011a445285M141398M60717o368152p706619j375397M939059M894320J561997
7003h97962P86238K223339J893393l46482j222463R4359J099920J27902j878817
6994A879427l290325l285968k067716r04908q42532p81110R87393K901465J315430
6985d088844l138343m671763m86145M382743M074034L2480k311731j704730o57791
$$ plain form
7047 284922 -738541 -2419429 -3697080 -4282036 -5247751 -7411147 -9892789 -11129078 -10503253
7038 -10503253 -8151286 -4262641 207601 3213102 3606371 2746641 2636123 3224261 3154322
7029 3154322 2296237 1588786 1123800 594166 1042148 3671643 7211187 9013225 8648121
7020 8648121 7794564 6768303 4282678 802135 -1350799 -1845236 -2621180 -3428516 -1445285
7011 -1445285 2696113 3156830 -3211322 -10917941 -12293338 -7354279 -2459959 -897962
7003 -897962 -111724 2111615 4005008 3658526 2436063 2530422 3630342 3758244 1879427
6994 1879427 -1410898 -4696866 -6764582 -7669490 -8512022 -9293132 -8305739 -5404274 -4088844
6985 -4088844 -7227187 -11898950 -12385095 -8002352 -3928318 -3895838 -6207569 -7912299 -8570090
6976h570090N61024L484670O245345M926623J61583l043400k572856j245636r12944
6967i65681K37119K875742L933040J392967k049825k789675r28679J131916K117885
6958D954809J829045J26484j928942k115643j95668J059774j50685j827915j385681
6949C65578M06753J097332M51586J26133O25458R69129O16017k63811j677562
6940B716613l215729l454816j729139L68053J014623P49186J126304J783771J221822
6931E80688p3311O4718J889717K861519J114307j985266l615733k550608K20721
6922a493248K707847L093395Q89766k163991l255874j510592Q12343J067895m50245
6913c02704j181712q827J285758P48391j009038j997276j766513j420846j172121
$$ plain form
6976 -8570090 -8009066 -4524396 1720949 6647572 6809155 3765755 1192899 -52737 -965681
6967 -965681 -728562 2147180 6080220 7473187 5423362 2633687 1705008 2836924 4954809
6958 4954809 6783854 6910338 4981396 2865753 2670085 3729859 3579174 1751259 365578
6949 365578 772331 1869663 2321249 2447382 3072840 4041969 4657986 4394175 2716613
6940 2716613 -499116 -3953932 -5683071 -5315018 -4300395 -3551209 -2424905 -641134 580688
6931 580688 507377 572095 2461812 5323331 6437638 4452372 836639 -1713969 -1493248
6922 -1493248 1214599 4307994 5197760 3033769 -222105 -1732697 -920354 147541 -302704
6913 -302704 -1484416 -1493243 -207485 540906 -468132 -2465408 -4231921 -5652767 -6824888
6904f824888m2722J646450J857546K19171l38138K399481N788777N153757K37617
6895A0097051m204905m592197k431289j037019r10076k07728J800143L692943
6887B206923L743680J666440j053431k130930n98059J802246K440752J083149
6879I160770k17102n25897j013850j961118j567559P14612K272369R98283j289552
6870F570956j690257o51815n77553j455717j342928m49612r92425k790712k641378
6861f021441P53507M203753M092949R13884k015857k819573k230612j481382q82103
6852e486875m06452l80083j075345j954288j706997N54411L961668O227441N737321
6843E470801K886163q48198m118962n527110l944384m99610J328843k15559k241037
$$ plain form
6904 -6824888 -6867610 -5221160 -3363614 -3144443 -3482581 -1083100 4705677 9859434 10097051
6895 10097051 5892146 1299949 -1131340 -2168359 -3078435 -3286163 -1486020 2206923
6887 2206923 5950603 7617043 6563612 4432682 3834623 5636869 8077621 9160770
6879 9160770 8943668 8417771 7403921 5442803 3875244 4589856 6862225 7860508 6570956
6870 6570956 4880699 4228884 3651331 2195614 852686 403074 -589351 -3380063 -6021441
6861 -6021441 -5267934 -1064181 3028768 3942652 1926795 -892778 -3123390 -4604772 -5486875
6852 -5486875 -5893327 -6273410 -7348755 -9303043 -11010040 -10455629 -6493961 -266520 5470801
6843 5470801 8356964 7508766 3389804 -2137306 -6081690 -6581300 -5252457 -5468016 -7709053
6834g709053j019132K258255K947331k4446k479652j280357J392192J950116M66519
6825c498227p21557j107850j831030k864669l062264k148513n83566J569612L688386
6816a0559678L778422R99873k063163k320817n86198j55034j431068j335873J468665
6807a2204871M080147L542848R90106l25673N18157J551775R04170j160590k755052
6798d858983k049699R60617L821799L708096Q00335j545195q65470J361125J913793
6789C246418K3160k115291k344682n56057J926577L549618L313255J670476N34020
6780I247494J124060J953884M70850l140594n465702l942729j22975K298445J912221
6771D334954P45040J106298K429747J956331j583084n650270o143531k184018
$$ plain form
6834 -7709053 -8728185 -6469930 -3522599 -3547045 -6026697 -7307054 -5914862 -3964746 -3498227
6825 -3498227 -4219784 -5327634 -7158664 -10023333 -13085597 -15234110 -15817676 -14248064 -10559678
6816 -10559678 -6781256 -5781383 -7844546 -10165363 -10751561 -10906595 -12337663 -13673536 -12204871
6807 -12204871 -8124724 -4581876 -3591770 -3917443 -3399286 -1847511 -943341 -2103931 -4858983
6798 -4858983 -6908682 -5948065 -2126266 1581830 2382165 836970 -28500 1332625 3246418
6789 3246418 3269578 1154287 -1190395 -1746452 180125 3729743 7042998 8713474 9247494
6780 9247494 10371554 12325438 12796288 9655694 4189992 247263 124288 2422733 4334954
6771 4334954 5079994 6186292 8616039 10572370 8989286 3339016 -2804515 -4988533
6763d988533K430090L629137J987800J294205K605084K608110r63019n029439
6755C573435m928969r94862J755596L18512k780127l343089n43122L029676M574621
6746F61671L063085n24629l501458l101386O64649M412446M896593K479666j26097
6737H924540j705950l217603m862655m761899j627520K592734M282286K222315
6729A846248r55161j783755J36179K061729J926330R68011J374667K314388P89185
6720H677821l232660n434222k843684J344673J684689j952503m281999k122041
6712h159926J575679K474839N89478r01750m61091P44010J442734J471101P71942
6703d52984p09277k033739j817192q3607J602987K100849J824419J723502J981765
$$ plain form
6763 -4988533 -2558443 1070694 3058494 4352699 6957783 9565893 8602874 3573435
6755 3573435 -1355534 -2350396 -594800 -276288 -3056415 -6399504 -6942626 -3912950 661671
6746 661671 3724756 3200127 -301331 -3402717 -2738068 1674378 6570971 9050637 8924540
6737 8924540 7218590 4000987 -861668 -5623567 -7251087 -4658353 -376067 1846248
6729 1846248 891087 -892668 -756489 1305240 3231570 4199581 5574248 7888636 8677821
6720 8677821 5445161 10939 -2832745 -1488072 196617 -1755886 -6037885 -8159926
6712 -8159926 -6584247 -4109408 -3519930 -4421680 -4882771 -4138761 -2696027 -1224926 -452984
6703 -452984 -1162261 -3196000 -5013192 -5096799 -3493812 -1392963 431456 2154958 4136723
6694D136723K015832J229502l40554j752585j724231j4538J936031K300258O65448
6685H451886j782005l377083k855133l8134L330804M301299J841555j216808j234113
6676G422268J291805K023886j304775n486944n922332k439890J137005K311634
6668i67343K183245K284177J820611m36839l232443l957069k201624j92076N07497
6659d191864Q52945K009051K810196J255466k158277m432376l499975l02764K705111
6650d952487L795741K546138j78460k182319j504019R41795J800695l35119k590273
6641b658308j820077M73162J49936l089821m591500j100908M527960O894469M574975
6632C359888R67235m49664M07411J363917Q87906o60098j818757j652146q34344
$$ plain form
6694 4136723 6152555 7382057 7041503 5288918 3564687 3550149 5486180 7786438 8451886
6685 8451886 6669881 3292798 437665 399531 3730335 8031634 9873189 8656381 7422268
6676 7422268 8714073 10737959 9433184 3946240 -1976092 -4415982 -3278977 -967343
6668 -967343 1215902 3500079 5320690 4883851 1651408 -2305661 -4507285 -4699361 -4191864
6659 -4191864 -3338919 -1329868 1480328 2735794 577517 -3854859 -7354834 -7657598 -4952487
6650 -4952487 -1156746 1389392 1210932 -971387 -2475406 -1533611 267084 -68035 -2658308
6641 -2658308 -4478385 -4005223 -3855287 -6945108 -11536608 -12637516 -8109556 -1215087 3359888
6632 3359888 4327123 3877459 4284870 5648787 6536693 5876595 4057838 2405692 1571348
6623A571348r62042k479810l763875k930201k05925K286626K935175K050914R71910
6614e25880O04791J001698J617348J620076M79225j347056k628125k579745j616126
6605c373794o59959n2295M91225J171593J908382K663187L249955K820295N02379
6596H720968k918985m837683l397373J76027K924079L580977L290858K965656
6588A0504524J840044m81644k319513k011201p49591j362749m387557o974431
6580e942118o045547j575487L452141N699805M216711J179078l13857M77939J613229
6571B761894J686503J539106J565291k67778m910277q620469o898332j378826
6563a4522888J640578m6157j890966r9665K885770L141990J385868O19636Q80999
$$ plain form
6623 1571348 609306 -1870504 -5634379 -8564580 -8770505 -6483879 -3548704 -1497790 -525880
6614 -525880 78911 1080609 2697957 4318033 4797258 3450202 822077 -1757668 -3373794
6605 -3373794 -4033753 -4086048 -3594823 -2423230 -514848 2148339 5398294 8218589 8720968
6596 8720968 5801983 964300 -2433073 -2257046 667033 4248010 7538868 10504524
6588 10504524 12344568 11862924 9543411 7532210 6782619 5419870 1032313 -5942118
6580 -5942118 -11987665 -13563152 -10111011 -4411206 -194495 984583 670726 1148665 2761894
6571 2761894 4448397 5987503 7552794 7285016 2374739 -6245730 -13144062 -14522888
6563 -14522888 -12882310 -12928467 -14819433 -14919098 -12033328 -8891338 -7505470 -6885834 -6004835
6554f004835O08900Q35714L297934N808908M412282k39500l257995k527268r75990
6545A958150j028138j085401O44113K433318J726309q16950k354375j431538J272371
6536A317859M377327O324991N634761K271431j812669m445596m944091l740988
6528D983025j573430L76699Q72049o1475j222873j986928k620929k649311q67884
6519d751057K210294L849804K326874p25974k343965j406581J035015L207283
6511C401693L525584J517003j221353k281942j283695N3187Q91030J986155K889360
6502I477022J560941j736239l386328j584766M73084m69399k464750j844150L84466
6493D09881K92292k105431k792884n16251J277820L10347j065045j65692J769777
$$ plain form
6554 -6004835 -5395935 -4560221 -1262287 4546621 8958903 8719403 5461408 2934140 1958150
6545 1958150 930012 -155389 488724 2922042 4648351 3831401 1477026 45488 1317859
6536 1317859 5695186 12020177 17654938 19926369 18113700 13668104 8724013 4983025
6528 4983025 3409595 3786294 4658343 4596868 3373995 1387067 -1233862 -3883173 -4751057
6519 -4751057 -2540763 1309041 3635915 2909941 565976 -840605 194410 3401693
6511 3401693 6927277 8444280 7222927 4940985 3657290 3710477 4601507 6587662 9477022
6502 9477022 11037963 9301724 5915396 4330630 4803714 4334315 1869565 25415 409881
6493 409881 702173 -1403258 -4196142 -4712393 -3434573 -3124226 -4189271 -4354963 -2585186
6484b585186K060109P98007R5731O82454J393843J151575q2923j650379k497107
6475f33876j889752m70374L35481L86728J022526K647946L629744K552527K97154
6466G878104j245603j555532j473921j547398j479713r25115m2443O99629R62493
6457A270501Q15022M67660l37765k031399l916203m226544k435503l67766L15789
6448a0446208M72537J562103K834135K895635K721788L876891M756030K589873
6440A1262784j183273k161520j02600K37456k937635m807485j394668L707064
6432B620123M268909k2842m268835n301551l666303m93221L171503M980042L418057
6423D705882P63998K63230J148388L24575j833921j892950N87342K151721J289402
$$ plain form
6484 -2585186 -525077 272930 368661 1051115 2444958 3596533 3513610 1863231 -633876
6475 -633876 -2523628 -2994002 -2658521 -2271793 -1249267 1398679 5028423 7580950 7878104
6466 7878104 6632501 5076969 3603048 2055650 575937 -349178 -391621 308008 1270501
6457 1270501 2085523 2553183 2215418 184019 -3732184 -7958728 -10394231 -10761997 -10446208
6448 -10446208 -9973671 -8411568 -5577433 -2681798 39990 3916881 8672911 11262784
6440 11262784 10079511 7917991 7815391 8052847 5115212 307727 -1086941 2620123
6432 2620123 6889032 6866190 2597355 -2704196 -6370499 -6863720 -3692217 1287825 4705882
6423 4705882 5469880 5733110 6881498 7206073 5372152 3479202 4066544 6218265 7507667
6414G507667N79057J607612K062068j4320k761220l655083k921177j480270J200850
6405B125184M334027M134496j117906o598128o043824l83082L214057J017669
6397F82493k826501k865812L57738K154795N47498j798591j880004j918J408185
6388d222117J025533k37198n97479P94854L063999M137334K447803j262757m053531
6379A096441l471254k46551K340158J999676k69151j693756q65826J119157K121532
6370B130426R85328j541499l409913l004016o10597J922958K907090J936231j22558
6361A193450j441777l40402K376876L041210m64470m555868l838353P25312K349640
6352i54382j230109l585875K53235M870506K263341n062012p072227j170922M472005
$$ plain form
6414 7507667 8086724 9694336 11756404 11742084 8980864 5325781 2404604 924334 2125184
6405 2125184 6459211 10593707 9475801 2877673 -3166151 -3549233 -335176 682493
6397 682493 -2144008 -5009820 -4652082 -2497287 -1949789 -3748380 -5628384 -5630302 -4222117
6388 -4222117 -3196584 -3433782 -4031261 -3236407 -172408 3964926 6412729 5149972 1096441
6379 1096441 -2374813 -2621364 -281206 1718470 1449319 -244437 -1110263 8894 2130426
6370 2130426 3115754 1574255 -1835658 -4839674 -5450271 -3527313 -620223 1316008 1193450
6361 1193450 -248327 -588729 1788147 4829357 4364887 -190981 -4029334 -3304022 -954382
6352 -954382 -2184491 -5770366 -5517131 -646625 1616716 -3445296 -10517523 -11688445 -7216440
6343g216440L760904N82471O64818K817392L111277K019739J741439P39801l005749
6334E215652o301605m464658Q49235L287059P34736k436108k150171P12826K951293
6325a601741K739755J65372k946664l489452j15488M130719M906598K157265k01716
6316E744648Q126R68134N29246r12293j844907j441661N02802L141858M036886
6307A0732839J606591j888124k648659p26033N5172k010037m098101l436612j136490
6298c549454J47549j77013r88117j314467n20691J448283K994646K112409l76177
6289b23032j126266J104152L470010K946719J8751k802600l986978l267568j104328
6280d971140Q31642O80979j025648j907644j442353j328549j578523n1906K810326
$$ plain form
6343 -7216440 -3455536 -2873065 -2208247 609145 3720422 5740161 7481600 8221401 5215652
6334 5215652 -1085953 -5550611 -4701376 -1414317 -679581 -3115689 -5265860 -4553034 -1601741
6325 -1601741 1138014 1303386 -1643278 -5132730 -5248218 -1117499 3789099 5946364 5744648
6316 5744648 5752774 6720908 7250154 6337861 4492954 3051293 3554095 6695953 10732839
6307 10732839 12339430 10451306 7802647 7076614 7131786 5121749 1023648 -2412964 -3549454
6298 -3549454 -3401905 -3578918 -4567035 -5881502 -6402193 -4953910 -1959264 153145 -223032
6289 -223032 -1349298 -245146 3224864 6171583 6190334 3387734 -599244 -3866812 -4971140
6280 -4971140 -4139498 -3458519 -4484167 -6391811 -7834164 -9162713 -10741236 -10793142 -7982816
6271g982816L234763M81314o94072K456645N192199K264913l316501m583428j225486
6262d172469P95099p71392j830676O4915J677155K61069j630004o58337J958824
6253d305816K906845J765702N43277K23875L62542O29492O64673k91329j870560
6244F28701k038862J69950K584820K363025k74324k349848j692357R78983L099018
6235C469106K516486p79921m403364n419846l062126N88930K753724K415824P59272
6226a161915k93365r6423j00631j936898m405500m135387m75050K483377J232770
6217h889022j797821j756218J209585K518472O88317p43092L75688J508855M67980
6208f417256q01785j31122J149491J417820K057632M094096M806668J688943k795153
$$ plain form
6271 -7982816 -4748053 -4266739 -4960811 -2504166 2688033 4952946 1636445 -2946983 -4172469
6262 -4172469 -3377370 -4148762 -5979438 -5914523 -4237368 -3976299 -5606303 -6264640 -4305816
6253 -4305816 -1398971 366731 910008 1133883 1496425 2125917 2790590 2499261 628701
6244 628701 -1410161 -1240211 1344609 3707634 3433310 1083462 -608895 370088 3469106
6235 3469106 5985592 5205671 802307 -4617539 -7679665 -7090735 -4337011 -1921187 -1161915
6226 -1161915 -1455280 -1551703 -1652334 -3589232 -7994732 -12130119 -12605169 -10121792 -8889022
6217 -8889022 -10686843 -12443061 -11233476 -8715004 -8026687 -8769779 -8394091 -6885236 -6417256
6208 -6417256 -7219041 -7350163 -6200672 -4782852 -2725220 1368876 6175544 7864487 5069334
6199E069334m509751l550861k670074j782528J133208M773720N199930J827468
6191E490446j686580k947193l113792l054422j405040J975337M155108K894488
6183B308352j79036k067530k155279j732512j363218n87992N36144J079709L82371
6174c778991r73707j387069K09600K730357L760500K646388J407948J480025J408416
6165G503467k79961j902790j201976N10574L33205j163030q53643J361430K114106
6156F421382J4979k501821l464997l576586l269775j585958P85914J386440L98124
6147e392298J022669L624351M011320K76573l063229j496041K602362L760098
6139E345805J183798j695954l157650l974047l736187j118939K554271L990665
$$ plain form
6199 5069334 559583 -2991278 -5661352 -7443880 -6310672 -1536952 3662978 5490446
6191 5490446 3803866 856673 -2257119 -5311541 -6716581 -4741244 -586136 2308352
6183 2308352 2129316 61786 -2093493 -3826005 -5189223 -5777215 -5241071 -4161362 -3778991
6174 -3778991 -4752698 -6139767 -5930167 -3199810 560690 3207078 4615026 6095051 7503467
6165 7503467 7223506 5320716 4118740 4629314 4962519 3799489 2945846 4307276 6421382
6156 6421382 6436361 3934540 469543 -3107043 -6376818 -7962776 -7176862 -5790422 -5392298
6147 -5392298 -4369629 -745278 3266042 3542615 479386 -1016655 1585707 5345805
6139 5345805 6529603 4833649 1675999 -2298048 -6034235 -7153174 -4598903 -608238
6131f08238K335030j0476p89737K36078K027688K600369L549m489183o096823
6122d791743k634041J340267O64142k312411j303885L439423M908660K79338m523061
6113d933311l710699M81074K389330J112745n1972M86244J369832J498615J222739
6104a35403J053069J291537K090976K560011J306345r72268j604992j07067M78854
6095E961062j428232k571071J73954L864025K977684k214287n491460l321011
6087b049336O35476J228282j488415l729456l629348k326644o31174K039584N060728
6078d890303N789983L001929n71584j282141N96339J420234m47854k490875k245246
6069a119518r16193o46041n49885J242533L106031J607704k515137m308246j545519
$$ plain form
6131 -608238 1726792 1716316 926579 1162657 3190345 5790714 5794263 1305080 -4791743
6122 -4791743 -7425784 -6085517 -5421375 -7733786 -9037671 -5598248 -689588 -410250 -4933311
6113 -4933311 -8644010 -8162936 -5773606 -4660861 -4712833 -4226589 -2856757 -1358142 -135403
6104 -135403 917666 2209203 4300179 6860190 8166535 7194267 5589275 5482208 5961062
6095 5961062 4532830 1961759 2135713 5999738 8977422 6763135 1271675 -2049336
6087 -2049336 -1413860 -185578 -1673993 -5403449 -9032797 -11359441 -11990615 -9951031 -4890303
6078 -4890303 899680 3901609 3330025 2047884 2644223 4064457 3616603 1125728 -1119518
6069 -1119518 -2035711 -2681752 -3231637 -1989104 1116927 2724631 209494 -4098752 -5644271
6060e644271K126738K746563J213249L91988R3311j638759m090393m342722j644949
6051a0789245J487022K482407J033298j503573l186370k266301J311000N131789
6043f299973O312648M282652R28146j403487j403941N55704K323154J706158p10258
6034F290803j950632q68909K7899j453184l635659l677937j819183k10188O76010
6025f620980J412414J152067n89976j164586J936072N864977N169821k53902m709899
6016B196008m808409l114577k331329r92733K268335M661924L339352L73655l90725
6007A201501P99802Q89011n01266r99460q5618K64105m18665p9676K080145L775652
5997F925531K826586L4322k336228l284381l104220k056478m16115Q68161Q79903
$$ plain form
6060 -5644271 -3517533 -770970 442279 834267 927578 -711181 -4801574 -9144296 -10789245
6051 -10789245 -9302223 -6819816 -5786518 -7290091 -10476461 -12742762 -11431762 -6299973
6043 -6299973 12675 4295327 5223473 3819986 2416045 2971749 5294903 7001061 6290803
6034 6290803 4340171 3471262 3499161 2045977 -1589682 -5267619 -7086802 -7296990 -6620980
6025 -6620980 -5208566 -4056499 -4646475 -5811061 -3874989 1989988 7159809 6905907 2196008
6016 2196008 -2612401 -5726978 -8058307 -9051040 -6782705 -2120781 1218571 1592226 1201501
6007 1201501 2001303 2890314 2389048 1389588 1303970 1568075 1149410 1069734 3149879 6925531
5997 6925531 9752117 9786439 7450211 4165830 1061610 -994868 -1410983 -542822 337081
5988C37081M5689j59622Q70258J786881Q23897j572262k680135r55620J365350
5979a38483R04427j908790k928795k8425L733484M318361J972278m9178m52923
5970E421956p04317j545884j760685p13495L77029M32356j41247p84290j722740
5961a141317k794857k876426j393646P27461K287117K903371K446553P57514j383496
5952d67726k327900j480341r8805N31749N97529P37824Q05767N27849K00290j35919
5942a109683r11524j566347n65643J828286K684260K91138k708332k579934L12556
5933d325223K416066K278444J740206K037688K042136Q89645o72129k287704m344527
5924b25398n465026l002402K391962N918524M466383M55014k286965l311299l524537
$$ plain form
5988 337081 382770 223148 1093406 2880287 3704184 2131922 -548213 -1503833 -138483
5979 -138483 765944 -1142846 -4071641 -4100066 -366582 3951779 5924057 5874879 5421956
5970 5421956 4717639 3171755 1411070 697575 1074604 1506960 1365713 581423 -1141317
5961 -1141317 -3936174 -6812600 -8206246 -7478785 -5191668 -2288297 158256 915770 -467726
5952 -467726 -2795626 -4275967 -4374772 -3843023 -3245494 -2507670 -1701903 -1174054 -973764 -1109683
5942 -1109683 -2021207 -3587554 -4153197 -2324911 359349 650487 -2057845 -4637779 -4325223
5933 -4325223 -1909157 369287 2109493 4147181 6189317 7078962 6406833 4119129 -225398
5924 -225398 -5690424 -8692826 -6300864 -382340 4084043 4539057 2252092 -1059207 -4583744
5915d583744j902924J737361L603279N61041l975000m137908m19854J410984j88928
5906g895693n94849K337155M193230J415875k702740l275721q92683N43085j50439
5897g022780j286724j570604k70175L168605O619888N547221o41613n712740m261367
5888e430289P63989K853308J275967O6370J60034q89631k617854j972086J57407
5879e632785n08035l767098m252181k46208L210902K513117P63982J575015L100685
5870c242606K379200R44920J395966J998125l22929m095643n151717k853886l74670
5861i323240K68772J7203L26276J637543L490304M174573J777416k504862m314864
5852d450879j828856J011800J16166k355577j258231L501019O623071M686670
$$ plain form
5915 -4583744 -6486668 -4749307 -1146028 -584987 -4559987 -8697895 -9117749 -7706765 -7895693
5906 -7895693 -8490542 -6153387 -1960157 -544282 -3247022 -6522743 -7415426 -6872341 -7022780
5897 -7022780 -8309504 -9880108 -10150283 -6981678 -361790 5185431 4543818 -1168922 -5430289
5888 -5430289 -4666300 -1812992 -537025 -470655 -310621 -1200252 -3818106 -5790192 -5632785
5879 -5632785 -6140820 -9907918 -14160099 -14406307 -11195405 -8682288 -7918306 -6343291 -3242606
5870 -3242606 -863406 81514 1477480 3475605 3152676 -942967 -6094684 -8948570 -9323240
5861 -9323240 -9054468 -9037265 -8710989 -7073446 -3583142 591431 2368847 -136015 -4450879
5852 -4450879 -6279735 -5267935 -5151769 -7507346 -8765577 -5264558 1358513 6045183
5844F045183o0594l309544l105602n82298J372534M34882k380113l335502j086717
5835f007771J035569M18053j49555K641323N772735L740814k113499m627966j388793
5826f79090K163541J652271l90263l16924M88007q30836k991415k832326n60593
5817d297628J086732J123755N26785l56971j726549k781774k658375j915021j279377
5808a2278423k66631J292024K102671J670734J780487L524860M802035L318195
5800E945952K88020j661285k556522l822728m473710k445211R65182K077828M33580
5791e248894m62527J185069K730568J555260r87406k242029k250422k527017k750521
5782a0997919j518189O19010J596815J023490N90798J210195J805322J384383
$$ plain form
5844 6045183 5984589 2675045 -430557 -1012855 359679 794561 -1585552 -4921054 -6007771
5835 -6007771 -4972202 -4554149 -4703704 -2062381 3710354 7451168 5337669 709703 -679090
5826 -679090 1484451 3136722 2746459 2429535 2917542 2086706 -904709 -3737035 -4297628
5817 -4297628 -3210896 -2087141 -1560356 -1917327 -3643876 -6425650 -9084025 -10999046 -12278423
5808 -12278423 -12545054 -11253030 -9150359 -7479625 -5699138 -2174278 2627757 5945952
5800 5945952 6233972 4572687 2016165 -1806563 -6280273 -8725484 -7760302 -5682474 -5248894
5791 -5248894 -5711421 -4526352 -1795784 -240524 -1227930 -3469959 -5720381 -8247398 -10997919
5782 -10997919 -12516108 -11897098 -10300283 -9276793 -8685995 -7475800 -5670478 -4286095
5774d286095N26308J37098K55584Q73963K452937M496865M943801K545636r73283
5765A0972814k775480k363338j413072o12867R91168L175526L608393J156014
5757A2739158j788999k225750n97456J51903j052810k149282j145874J199719
5749E130609K521988J538033r92849l313544m214305l820155k985191j966063
5741h101477k80041J838969K780173J265095j796513l990548l644956j051878
5733a2981176J814523K555829O18369j265533K52454M198072N463083J658424
5725B314045k893155k860154P37316K662384J281380l21822l95133p01382k002185
5716b178706k027964L45799K679214K660890J135815j82471r48264o17689J882589
$$ plain form
5774 -4286095 -3759787 -3622689 -3367105 -2493142 -40205 4456660 9400461 11946097 10972814
5765 10972814 8197334 5833996 4420924 3808057 4799225 7974751 11583144 12739158
5757 12739158 10950159 8724409 8126953 8278856 7226046 5076764 3930890 5130609
5749 5130609 7652597 9190630 8197781 4884237 669932 -3150223 -6135414 -8101477
5741 -8101477 -8381518 -6542549 -3762376 -2497281 -4293794 -8284342 -11929298 -12981176
5733 -12981176 -11166653 -8610824 -7992455 -9257988 -9005534 -4807462 655621 2314045
5725 2314045 -579110 -3439264 -2701948 -39564 1241816 919994 524861 -176521 -2178706
5716 -2178706 -4206670 -3860871 -1181657 1479233 2615048 2432577 1484313 866624 2749213
5707B749213M932933M302227p98786n101053m071697l64945M70291j713987k395705
5698a991509j34446J454680j91865k852458l333262j853183p76546r97081j406971
5689a2082641r54700J89226J229825J679516J594651J202709P27889Q35523K487812
5680c090190N221451O250421L348107j459376l639143k113219n59291j552870
5672B405890k676746q49725K342628K985929O42526j665910k181757j787462j301023
5663b085650o12121l25248j269091k200475p50003K774707M843642K883676j473942
5654A785495m066319k375651K123005N401689N027294K762977J672153J051743
5646A3382386k469796p962601q935690k323457N344552N801833K84420k990275
$$ plain form
5707 2749213 7682146 11984373 11185587 6084534 2012837 1647892 2118183 404196 -1991509
5698 -1991509 -2125955 -671275 -863140 -3715598 -7048860 -8902043 -9678589 -10675670 -12082641
5689 -12082641 -13037341 -12848115 -11618290 -9938774 -8344123 -7141414 -6413525 -5578002 -3090190
5680 -3090190 2131261 8381682 11729789 10270413 6631270 4518051 3958760 2405890
5672 2405890 -270856 -1120581 1222047 4207976 4850502 3184592 1002835 -784627 -2085650
5663 -2085650 -2697771 -3023019 -4292110 -6492585 -7242588 -4467881 375761 3259437 1785495
5654 1785495 -2280824 -4656475 -2533470 2868219 7895513 10658490 12330643 13382386
5646 13382386 10912590 2949989 -5985701 -8309158 -2964606 2837227 3121647 131372
5638A31372r40534J492064O01545q19494M57695K531628K125208j72224j620695
5629C786565j349662o3046J704736K886412K002147p6528k17598K122274L109030
5620A3904330M2907m193837n135199k758045l52412N96057R75418R77948J4411
5611D071578j000928m88469R02696J004477l43891j038619j35556Q43667N37870
5602D352825l49205o19718n73529j349742k941576l745816k231464J062373L550414
5593b845438L219621J058785j38929N53246J102454m18278l072545m229312k420145
5584g190541J635456N651761O802933L733666j298953l695643j354807K767222
5576G051094M192408J985708j052043k246070j462114j79791L01842l09828j361072
$$ plain form
5638 131372 -809162 682902 1284447 464953 922648 3454276 5579484 5407260 3786565
5629 3786565 2436903 2373857 4078593 6965005 8967152 8890624 8673026 10795300 13904330
5620 13904330 13947237 9753400 4618201 1860156 1507744 2103801 3079219 4057167 4071578
5611 4071578 3070650 2582181 3484877 4489354 4145463 3106844 2971288 3814955 4352825
5602 4352825 4003620 3383902 2810373 1460631 -1480945 -5226761 -7458225 -6395852 -2845438
5593 -2845438 374183 1432968 1294039 1847285 2949739 2531461 -541084 -4770396 -7190541
5584 -7190541 -5555085 96676 6899609 10633275 9334322 5638679 4283872 7051094
5576 7051094 11243502 13229210 12177167 9931097 8468983 8289192 8591034 8281206 6920134
5567F920134k006256k067757j839956j304566m85941k44949j205547k166036j612659
5558f013533o00225j333663k727560j095105L533638N974592L362528L2275R89398
5549B122345L920515K990004j533004l605383j022072J486707J43074k449277
5541B052909k495934j040219r88444j409072O32402M146050M708951R57681l188203
5532C376121l804802j476523J008165K879281M774618N536226L023574j739064
5524A3577596m365475k512065Q75927J766743N28291L51199J486647Q11898k731551
5515I789210n985526o157812m437084l164614k070526K45048L033308M210924
5507d537072L316698J542489j59726j167489n83101J509026L237141L188735K285331
$$ plain form
5567 6920134 4913878 2846121 1006165 -298401 -784342 -1029291 -2234838 -4400874 -6013533
5558 -6013533 -6613758 -7947421 -10674981 -11770086 -8236448 -2261856 1100672 1132947 2122345
5549 2122345 6042860 9032864 7499860 3894477 2872405 4359112 4502186 2052909
5541 2052909 -443025 -1483244 -2471688 -3880760 -3248358 897692 5606643 6564324 3376121
5532 3376121 -428681 -1905204 -897039 1982242 6756860 12293086 15316660 13577596
5524 13577596 9212121 6700056 7575983 9342726 9871017 10222216 11708863 12520761 9789210
5515 9789210 3803684 -2354128 -6791212 -9955826 -12026352 -11781304 -8747996 -4537072
5507 -4537072 -1220374 322115 162389 -1005100 -1588201 -79175 3157966 6346701 8632032
5498H632032J737524Q12449j166289k415385j207051O40596J12468k106303k626601
5489B413440q03501N00688k17863j079683n08546K46841l58617j546658j564657
5480b918556r2657J580605J720419m12361k959269k258594K529551O785861N659312
5471I634311R73149j274692J15093L18816k881322n040330k418731J696329K194700
5462C317323j77830j069043K66483R91661L26412K28254R94691P52000m27799
5453E202152j5973K397728L434988L79441m988444q367747p313668k976546J215061
5444a1033008K347546P74768j04792J748748L662344J735914k896821m722134
5436h487435j340162L201062M176302K114260M96510J99397l48938j001653K15411
$$ plain form
5498 8632032 10369556 11182005 10015716 7600331 6393280 7033876 7146344 5040041 2413440
5489 2413440 1609939 2110627 1892764 813081 304535 551376 192759 -1353899 -2918556
5480 -2918556 -3011213 -1430608 289811 -122550 -3081819 -5340413 -2810862 3974999 9634311
5471 9634311 10607460 9332768 9447861 9766677 6885355 1845025 -573706 1122623 3317323
5462 3317323 3139493 2070450 2336933 3328594 3655006 3883260 4877951 5629951 5202152
5453 5202152 5186179 7583907 11018895 11398336 6409892 -1957855 -9271523 -12248069 -11033008
5444 -11033008 -8685462 -7910694 -8015486 -6266738 -2604394 -868480 -3765301 -8487435
5436 -8487435 -9827597 -6626535 -2450233 -335973 160537 359934 10996 -990657 -775246
5427g75246L047386M263089K031033j448818l078376k721651k273058k265375
5419c221016j459251O62782K893943M044287M249110L933404K558381n31333m321841
5410H808466o226425m511940m29722K575031K100022r02884l364557l417580j766253
5401g135842J75281K114434L931954M194770J600131k349890m226176k814456
5393d509794o02296j70645p89440j78135J623254K294899Q00687j147842j635809
5384d315121j023568j023882k145419k940363j666758J667118M960638N833248
5376f54107L916422J076686q10005j714634k559323l154189k219878M75455L053315
5367b590258L291548J202626p08833q2147K508386L954191K156680j474583l856175
$$ plain form
5427 -775246 2272140 6535229 8566262 7117444 4039068 1317417 -955641 -3221016
5419 -3221016 -4680267 -4017485 -1123542 2920745 7169855 11103259 13661640 13130307 8808466
5410 8808466 2582041 -1929899 -2359621 215410 2315432 1412548 -1952009 -5369589 -7135842
5401 -7135842 -6960561 -4846127 -914173 3280597 4880728 2530838 -1695338 -4509794
5393 -4509794 -5112090 -5282735 -6072175 -6250310 -4627056 -2332157 -1531470 -2679312 -4315121
5384 -4315121 -5338689 -6362571 -8507990 -11448353 -13115111 -11447993 -6487355 -654107
5376 -654107 3262315 4339001 3528996 1814362 -744961 -3899150 -6119028 -5643573 -2590258
5367 -2590258 701290 1903916 1195083 1112936 3621322 7575513 9732193 8257610 4401435
5358D401435l856877k727422j502226p4246J116003R48461n2076K94131K240714
5349G87897K947433O74146k163336k433914p82990k6138p51166j479034j864642
5340e091744k545762k708271j033194J416504K224212J081558n03236k040944
5332i200877l459736k853452J100497N172086M666096M51334j954732p09467L45099
5323f443152q48356j086166J382514K402208j476898o347880n988152o77908L849499
5314a5234291M298791K222385M5731j071187l14395K094838L893020L444984K351278
5305A731154K545554K532840Q9679k999100l243654j361880j149770k885898k871360
5296g612435j9006K041595Q97949r80986o28855R89651J396476O33056L66971
$$ plain form
5358 4401435 544558 -2182864 -3685090 -3759336 -2643333 -1694872 -1746948 -1452817 787897
5349 787897 3735330 4409476 2246140 -187774 -970764 -996902 -1748068 -3227102 -5091744
5340 -5091744 -7637506 -10345777 -11378971 -9962467 -7738255 -6656697 -7159933 -9200877
5332 -9200877 -12660613 -15514065 -14413568 -9241482 -4575386 -4124052 -6078784 -6788251 -6443152
5323 -6443152 -7291508 -8377674 -6995160 -4592952 -6069850 -12417730 -18405882 -19083790 -15234291
5314 -15234291 -10935500 -8713115 -8667384 -9738571 -10052966 -7958128 -4065108 -620124 1731154
5305 1731154 4276708 6809548 6899227 3900127 656473 -705407 -1855177 -4741075 -7612435
5296 -7612435 -7631441 -5589846 -4691897 -5672883 -6301738 -5312087 -3915611 -3282555 -2915584
5287b915584R89909J772766K361183K438001J398753k52589q08675L2720K40491
5278E256975j407638l050586k369408L4551J747579J809587J053280J91541o13944
5269B651937r46593m54987N18790J666904L089633L871814J897281k941567o700604
5260B652608n284877M9648L833438L177793P00634j18947K86585n57100k436054
5251B303728k418508O85613M171615M559501J574210j903332l168140k091820
5243C712867m64115J94080j62662o88998q74112q77945q18200l29834P40772J617930
5233B049783J354954K42737m38839k76508l03335j173206j866547j308647l88876
5224b108484p96502k225055k485049n73373J983337L334018L357409K775558J653260
$$ plain form
5287 -2915584 -1925675 -152909 2208274 4646275 6045028 5792439 4983764 5016484 5256975
5278 5256975 3849337 798751 -1570657 -1536106 211473 2021060 3074340 3265881 2651937
5269 2651937 1705344 1250357 1769147 3436051 6525684 10397498 12294779 9353212 2652608
5260 2652608 -2632269 -2582621 1250817 4428610 5129244 5010297 5296882 4739782 2303728
5251 2303728 -114780 570833 4742448 9301949 10876159 8972827 5804687 3712867
5243 3712867 3248752 3442832 3280170 2591172 1717060 839115 20915 -308919 431853 2049783
5233 2049783 3404737 3647474 3208635 2932127 2628792 1455586 -410961 -1719608 -2108484
5224 -2108484 -2904986 -5130041 -7615090 -8188463 -6205126 -2871108 486301 3261859 4915119
5215D915119k0313j267632j068986J7680L62145o73240k021171k329567j538429
5206c624394q66174j328990k290489j850083P34959L351818K924122p93279m465491
5197h208001m758275j749233J724709L130293J994841m24165k259302k303136
5189a2852269q70229P99878K032038K910406L089747J776309o06612k043527j164278
5180f928537R25096J835312M77914j842156k466231J85131M301000N522258J871966
5171C881753k792322k899976J375494M102556J774773k175314k913202p88638
5163d34876M98491l87171j889551k838385k865989r66003K900937N656866M029524
5154C703843o11758l408406k075227Q55596K020235R90201m02447n70864M93364
$$ plain form
5215 4915119 4894806 3627174 2558188 2575868 2938013 2264773 243602 -2085965 -3624394
5206 -3624394 -4490568 -5819558 -8110047 -9960130 -9225171 -5873353 -2949231 -3742510 -8208001
5197 -8208001 -12966276 -14715509 -12990800 -9860507 -7865666 -8289831 -10549133 -12852269
5189 -12852269 -13722498 -12922620 -10890582 -7980176 -4890429 -3114120 -3720732 -5764259 -6928537
5180 -6928537 -6003441 -4168129 -3690215 -5532371 -7998602 -7813471 -3512471 2009787 3881753
5171 3881753 1089431 -1810545 -435051 3667505 5442278 3266964 353762 -434876
5163 -434876 63615 -323556 -2213107 -5051492 -7917481 -8883484 -5982547 -325681 3703843
5154 3703843 3092085 -316321 -2391548 -1535952 484283 1474484 1072037 501173 994537
5145I94537J215324q4825k757577l821449j748220J082693J559411J6030j048095
5136d592171r39604o65799j96407Q78957R76960j446890l986795k487810K573919
5127i885640N957493M842709K284020J905494K766419J982469l26112j740953
5119G785899j633578j603012k304955k362221r35261L94518l68333k347995k240355
5110e615293J140218M276159L089668j070488k766250j65641K350683R46177k104516
5101H0717k499908k20750J951632L386774M721423M288568L88858m163732m723482
5092C210100j539588O72831m23269k518087k873726r07751K745578N834013M455972
5083H656073j965401p225324n364227L04491J705427j611299k525308J111883
$$ plain form
5145 994537 2209861 2125036 -632541 -4453990 -6202210 -5119517 -3560106 -3544076 -4592171
5136 -4592171 -5531775 -6197574 -6393981 -5515024 -4538064 -5984954 -9971749 -12459559 -9885640
5127 -9885640 -3928147 914562 3198582 5104076 7870495 9852964 9526852 7785899
5119 7785899 6152321 4549309 2244354 -117867 -1053128 -658610 -1026943 -3374938 -5615293
5110 -5615293 -4475075 -198916 2890752 1820264 -945986 -1111627 1239056 2185233 80717
5101 80717 -2419191 -2639941 -688309 2698465 7419888 11708456 12097314 7933582 3210100
5092 3210100 1670512 2343343 1920074 -598013 -3471739 -4379490 -1633912 4200101 8656073
5083 8656073 6690672 -534652 -5898879 -5594388 -3888961 -5500260 -8025568 -6913685
5075f913685K982731m11816l764974k372735K30559o71372k796834j655529J673939
5066a3699716L473729L849751M565137M115566O71960l060875l360429j382225
5058d827102o28466j059760o21715j26637j414844k707350j036100K240570L383964
5049f797440K434937K448104L548958K800109k84603k757050l027362k648395
5041d282742k856134k724535j356780P20465K686176L934878L716979K155176
5033A993483R80530J377150J960938P92368j574992k898594k145957j08055J675246
5024B052117J491501j228593m067984l456412L58502K920607J616808j031922
5016a345376j864874j309063r10455l37187N68045M06419n02493N54390L394478
$$ plain form
5075 -6913685 -3930954 -4342770 -8107744 -10480479 -10249920 -10921292 -13718126 -15373655 -13699716
5066 -13699716 -10225987 -6376236 -1811099 2304467 2976427 -84448 -3444877 -4827102
5058 -4827102 -5455568 -6515328 -7137043 -7263680 -8678524 -11385874 -12421974 -10181404 -6797440
5049 -6797440 -4362503 -1914399 1634559 4434668 4150065 1393015 -1634347 -4282742
5041 -4282742 -7138876 -9863411 -11220191 -10499726 -7813550 -3878672 -161693 1993483
5033 1993483 2974013 4351163 6312101 7104469 5529477 2630883 484926 376871 2052117
5024 2052117 3543618 2315025 -1752959 -5209371 -4850869 -1930262 -313454 -1345376
5016 -1345376 -3210250 -4519313 -5429768 -5766955 -5198910 -4792491 -5294984 -4740594 -1346116
5007a346116L636182j6391k388296l8139K493438R0992m269554m693503j919217
4998h450604o43695q43410P10951K914860J987006j024769j715251j07273n385
4989g177570j557472j298258J025402K164394J354425N53741l16394k225528k569637
4980a0046897J289935N314163L189077l169384n386936j072051L350909L108887
4972c422297P58787j59836p7611N3610R90374K041025J104677q32896n37614J412563
4962A330782J053985j834139k950937o94335J620050J627368M67027j057510l313232
4953c750941m612628k760231L75880J492733J914149M504074O352253K713741
4945F229030l169605l636624N95078J505207k112725k877725J182503K636931
$$ plain form
5007 -1346116 2290066 2273675 -114621 -152760 2340678 2431670 -1837884 -6531387 -8450604
4998 -8450604 -9094299 -9937709 -9226758 -6311898 -4324892 -5349661 -7064912 -7172185 -7177570
4989 -7177570 -8735042 -10033300 -9007898 -6843504 -5489079 -4935338 -5251732 -7477260 -10046897
4980 -10046897 -8756962 -3442799 -253722 -3423106 -8810042 -9882093 -6531184 -3422297
4972 -3422297 -2663510 -2823346 -2900957 -2847347 -1856973 184052 1288729 455833 -81781 1330782
4962 1330782 2384767 550628 -2400309 -3094644 -1474594 152774 619801 -437709 -3750941
4953 -3750941 -8363569 -11123800 -10747920 -9255187 -7341038 -2836964 3515289 6229030
4945 6229030 3059425 -577199 17879 1523086 -589639 -3467364 -2284861 352070
4937C52070j836666n209174k284061K069025K385723J016537J266207P23296k494412
4928d011455m558491k892565j282728k630762l414580m94542L100945L884859
4920a2299319L109529K400282P81426q30982N44277L038671J058563m395008n915900
4911a2508461k443989j011126l067153j467865M926329P027447J390443l201339
4903a0355714j396816K73718k349437k836451J705819L224895j517005l225846
4895a6476837K011499L545396l878660q391326k249287L244282j115251n153000
4887b8463184k1672L408788l835715r095506j858126L860113m271038j1082157
4879e1358497l295766L99211j5672911k6755820j2216303r870651o0211742j12121387
$$ plain form
4937 352070 -1484596 -6693770 -8977831 -6908806 -4523083 -3506546 -2240339 -1517043 -4011455
4928 -4011455 -8569946 -11462511 -12745239 -15376001 -18790581 -19285123 -16184178 -12299319
4920 -12299319 -9189790 -6789508 -6008082 -6839064 -6294787 -3256116 -2197553 -6592561 -12508461
4911 -12508461 -14952450 -15963576 -19030729 -20498594 -15572265 -8544818 -7154375 -10355714
4903 -10355714 -11752530 -11478812 -13828249 -16664700 -14958881 -11733986 -13250991 -16476837
4895 -16476837 -14465338 -10919942 -14798602 -23189928 -25439215 -22194933 -23310184 -28463184
4887 -28463184 -28484856 -25076068 -28911783 -38007289 -39865415 -36005302 -40276340 -51358497
4879 -51358497 -54654263 -54255052 -69927963 -96683783 -108900086 -118770737 -178982479 -291103866
4871b91103866o7297036O9741216J68888525J37837259L7596943j5418522j789860
4864C8454659J2724730k599491j4796623l952953N443974k628347q880944K3133
4856B3788138P262742l29393r065222n572191J045021k89684l493071j028317
4848A2318023J283806j716328l089184J688481M352037r12185o050099l551217
4840D323334P05721o31057l415785j311882K217691J416361q69796O25259L610888
4831F670734L124184N40253J28272J480554J648783N48665n91583j914025k592246
4822I043591o84957K031885Q84351l519704m493960L61727M795584L434081q37634
4813A1014964k766365j833304K40506L127434N334821L690824j108616l879894
$$ plain form
4871 -291103866 -358400902 -288659686 -119771161 18066098 55663041 40244519 38454659
4864 38454659 51179389 48579898 33783275 29830322 35274296 32645949 23765005 23788138
4856 23788138 31050880 30721487 21656265 16084074 17129095 16839411 13346340 12318023
4848 12318023 13601829 11885501 8796317 10484798 14836835 13924650 7874551 4323334
4840 4323334 5029055 4397998 982213 -329669 1888022 3304383 2434587 3059846 6670734
4831 6670734 9794918 10335171 10463443 11943997 13592780 14141445 13549862 11635837 9043591
4822 9043591 8358634 10390519 11274870 7755166 3261206 3622933 8418517 11852598 11014964
4813 11014964 8248599 6415295 6655801 9783235 15118056 18808880 17700264 13820370
4805A3820370k812349k056145l678969l757936o1938L208432K716270J504015
4797H881750K377850K117393k012346n563192l165854K587927M671885J209898
4789A1105311l558152n428135l183008J939478O019415M597044j467988n376259
4781D647706k954588J639467K363744k66450j501538m812J496780J183993l09381
4772F294921j903893k526344j089950J561314K599517J105941l62922R0962R12176
4763F681722L40160p68620j389225k139939k592915o61627K975573M075629J285779
4754G806537r96022M28161K243469M17314k840761k821184J98146K168745J567845
4745H172250p3951j859082l510364l562871j465657L46733J3044k66664K107395
$$ plain form
4805 13820370 11008021 8951876 5272907 1514971 1453033 4661465 7377735 8881750
4797 8881750 11259600 13376993 11364647 5801455 2635601 5223528 9895413 11105311
4789 11105311 7547159 2119024 -1063984 875494 6894909 11491953 10023965 4647706
4781 4647706 1693118 3332585 5696329 5429879 3928341 3923529 5420309 6604302 6294921
4772 6294921 4391028 1864684 774734 2336048 4935565 6041506 5678584 5769546 6681722
4763 6681722 7021882 6253262 4864037 2724098 131183 -530444 2445129 6520758 7806537
4754 7806537 6810515 7238676 9482145 9899459 7058698 4237514 4435660 6604405 8172250
4745 8172250 8098299 6239217 2728853 -834018 -2299675 -1952942 -1939898 -2206562 -99167
4736i9167N276153N606488L222974J023161l2080j003072k064060k864369l987024
4727E079004n055277l719787L77766L425330K629927M44448k00774j209112m895619
4718c124094p711689m641126K218222N785118L684738O8767j464838j163954K00352
4709f148504K424138L571424J583950j632984k191425p0788J417750J352500J491191
4700A797252J516580m91737l005669k241992J224770K814370J538508J164407
4692D316489K621964J805035k599430n350739k470371K291789L063514l6160k607887
4683A034204k605818j078395J216241L734299M296110J229806l280278n040707
4675d94538k819963O13368K007539N76695k007345l269911k086191J10330J050843
$$ plain form
4736 -99167 5176986 10783474 14006448 15029609 14997529 13994457 11930397 9066028 5079004
4727 5079004 23727 -3696060 -3318294 107036 2736963 3181411 2980637 1771525 -3124094
4718 -3124094 -10835783 -15476909 -13258687 -7473569 -3788831 -3720064 -5184902 -6348856 -6148504
4709 -6148504 -3724366 -152942 1431008 -201976 -2393401 -2464189 -1046439 306061 1797252
4700 1797252 3313832 2822095 -183574 -2425566 -1200796 1613574 3152082 4316489
4692 4316489 6938453 8743488 6144058 793319 -1677052 614737 3678251 3642091 1034204
4683 1034204 -1571614 -2650009 -1433768 2300531 6596641 7826447 4546169 -494538
4675 -494538 -3314501 -2701133 -693594 -116899 -2124244 -5394155 -7480346 -7370016 -6319173
4666f319173O62258P73578J715451J720043N04279N85233L234532N597271M338490
4657A2811962N51017j592071l56024J666883J184771j862932m456405m023618
4649C923583j468010k13750j928983m323970m437761k705720j453220o47149J378334
4640a1876646L580124K969367K33910j33731K978340M718191J709302k402117
4632A776740k862472j371377k442888m960117l718813J435909M527766K625824
4624d989428K74720K039592N317244M626145J62118k510992m69860K891236K872285
4615A0213060o90853m003031m114075j683290M23975K26660j618568k690872j445010
4606e382004J099632K702393K596589J765469O82899j279368l392072k856030
$$ plain form
4666 -6319173 -5656915 -4883337 -3167886 -1447843 -943564 -358331 2876201 8473472 12811962
4657 12811962 13362979 11770908 11414884 13081767 14266538 12403606 7947201 3923583
4649 3923583 2455573 2241823 312840 -4011130 -8448891 -11154611 -12607831 -13254980 -11876646
4640 -11876646 -8296522 -5327155 -5093245 -5226976 -2248636 2469555 4178857 1776740
4632 1776740 -1085732 -2457109 -4899997 -9860114 -13578927 -12143018 -7615252 -4989428
4624 -4989428 -4714708 -2675116 2642128 7268273 7430391 4919399 4449539 7340775 10213060
4615 10213060 9522207 5519176 1405101 -278189 145786 372446 -1246122 -3936994 -5382004
4606 -5382004 -4282372 -1579979 1016610 2782079 3464978 2185610 -1206462 -4062492
4598d062492J238810N082668M537715J308747O34310K925316K733043k303454
4590A2094663o663626m753369O83361K897861R47663n24374L23304N71982j078863
4581D498602j954871p22322J28119r55202j870345j135716o75739j707928j750204
4572f145606J073078M049711L738016J169691l75390n68399j242047k120341j357700
4563a778987M75830P31751j035819k282127j292327P22341J763631J332593K51553
4554a111561l50531J68550J126362R62036m73143j147692K43128J962548J732277
4545C111974K31853k44980M80173P86408N06592Q80535J600080J020200n28821
4536G844014p76394M78346M73765k060364m288550l138476J29625J545166k91835
$$ plain form
4598 -4062492 -2823682 2258986 6796701 8105448 8739758 11665074 14398117 12094663
4590 12094663 5431037 677668 1361029 4258890 5206553 4682179 5005483 5577465 4498602
4581 4498602 2543731 1821409 1949528 994326 -876019 -2011735 -2687474 -4395402 -6145606
4572 -6145606 -5072528 -1022817 2715199 3884890 3509500 2941101 1699054 -421287 -1778987
4563 -1778987 -1303157 -571406 -1607225 -3889352 -5181679 -4459338 -2695707 -1363114 -1111561
4554 -1111561 -1462092 -1293542 -167180 794856 321713 -825979 -582851 1379697 3111974
4545 3111974 3343827 3098847 3579020 4365428 4872020 5752555 7352635 8372835 7844014
4536 7844014 7067620 7545966 8019731 5959367 1670817 -1467659 -1338034 207132 -84703
4527h4703k652886k357437M84299K925198K742076Q38842k56678R9852n0899j895760
4517b08096l350018j819422J447811K383220k75315k859089j490866K804570N335824
4508A968619L267656j510750m832258m536879k058757j78380K22485N46498J709157
4499e402609K356567R79369j222454j463086Q18198L064226K859542O50308j271499
4490A368562j386576j27302P29717k79730k515943l435850j637346R27703J385775
4481d970990m5532o71605M34207J573722J958896K867335M285908L767617N82297
4472I781855k042006j502915m5113j094344l456751l224268l57934J125803k55532
4463a071205j033629J515726M836133M722528J198163j846620j709754N99434
$$ plain form
4527 -84703 -2737589 -5095026 -4610727 -1685529 1056547 1895389 1638711 1738563 1687664 -208096
4517 -208096 -3558114 -5377536 -3929725 -1546505 -1821820 -4680909 -6171775 -3367205 1968619
4508 1968619 5236275 3725525 -1106733 -5643612 -7702369 -7880749 -7658264 -7111766 -5402609
4499 -5402609 -3046042 -2066673 -3289127 -4752213 -3934015 -869789 1989753 2640061 1368562
4490 1368562 -18014 -145316 584401 304671 -2211272 -5647122 -7284468 -6356765 -4970990
4481 -4970990 -5016522 -5688127 -5253920 -3680198 -1721302 1146033 5431941 9199558 9781855
4472 9781855 7739849 6236934 6191821 5097477 1640726 -1583542 -1941476 -815673 -1071205
4463 -1071205 -2104834 -589108 4247025 8969553 10167716 8321096 6611342 7210776
4455G210776K286274J534771j287557l917019m029801j733328L43987L32464m14423
4446C26144N70980L142425M696017L720309J346707p28388k044739k611680k072167
4437F345608o23941N03096N82409M23739Q35959J067053R1077j389716j842288
4428E992996j306414j121676j392311o83758J335312K843143K431504J180584
4420I279380Q83258J374040J107892l73261k038008k958801k947088j978235l50540
4411A998637Q59626Q63520M07946N13881L79032j461199l915650l772814k19868
4402d346889L389734L795174J869172M45432q9173j227069k372882r32645L071082
4393C601936N530598L188182j845168m577421l154643l23636Q05046L02510M5723
$$ plain form
4455 7210776 9497050 11031821 9744264 5827245 1797444 64116 408103 740567 326144
4446 326144 897124 4039549 8735566 12455875 13802582 13074194 11029455 8417775 6345608
4437 6345608 5721667 6224763 6807172 7230911 8066870 9133923 9225000 7835284 5992996
4428 5992996 4686582 3564906 2172595 1488837 2824149 5667292 8098796 9279380
4420 9279380 10162638 11536678 12644570 12271309 10233301 7274500 4327412 2349177 1998637
4411 1998637 2858263 3721783 4129729 4643610 5022642 3561443 -354207 -4127021 -4346889
4402 -4346889 -957155 2838019 4707191 5152623 5063450 3836381 1463499 530854 3601936
4393 3601936 9132534 12320716 10475548 5898127 2743484 2419848 3224894 3527404 3573127
4384C573127N03445N13529k97160o27629M37823J724641J414117m06626j844638
4375D990629j652433l52027J109797K399417L043419K138289j54072j972157j882436
4366G668426q01284n03166j000946r50519p4199O32319R44386J778640L165981
4357A0859638L481853J477770j896314m318935m256164k251515n72724j146734
4349A376875l136389l497616j126229J014534J43468j459606M98942M934694N742993
4340D491666P22810m521491m274732l13307J865438J183034P34022J433452J059048
4331B379940p81318j460710J38341J720579J396676L43126K84664P70226M15593
4322E207117q65523k039533k177481r68809Q42480J522286K77297j090230k16318
$$ plain form
4384 3573127 4076572 4590101 4292941 3665312 4103135 5827776 7241893 6835267 4990629
4375 4990629 3338196 2986169 4095966 6495383 9538802 11677091 11523019 9550862 7668426
4366 7668426 6867142 6363976 5363030 4412511 4338312 4970631 5915017 7693657 10859638
4357 10859638 14341491 15819261 13922947 9604012 5347848 3096333 2523609 1376875
4349 1376875 -1759514 -5257130 -6383359 -5368825 -5225357 -6684963 -6186021 -1251327 4491666
4340 4491666 5214476 692985 -3581747 -3895054 -2029616 -846582 -112560 1320892 2379940
4331 2379940 1598622 137912 276253 1996832 3393508 3736634 4021298 4791524 5207117
4322 5207117 4341594 2302061 124580 -844229 -1749 1520537 1797834 707604 491286
4313D91286K350753L703232K470978M3130k014690l411861l808122k380138O68105
4304a887327L769291N285226L972202o36288o207124p716242k981437L258674
4296c143025M785742K153336P39937J835151J894340L34622O27479K380613L67734
4287A1975929n488656p186162o17313O735671O340521O62937k432794j903755
4279H086378j937724k367529J25826L545840K521204j921345l041079Q18440L979854
4270I809865K930516O37353k04412j214414l292244l782129j501399N46921J12689
4261D042746j098072j278137j269543j602655j073154L1892l51477j568992j59750
4252d327142L942356O015907L637221M00206o0022Q25234L99102n65326m27114
$$ plain form
4313 491286 2842039 6545271 9016249 9059379 7044689 3632828 -175294 -2555432 -1887327
4304 -1887327 1881964 7167190 11139392 10503104 4295980 -3420262 -6401699 -3143025
4296 -3143025 1642717 3796053 4535990 6371141 8265481 8600103 9227582 11608195 11975929
4287 11975929 6487273 -698889 -1316202 5419469 11759990 12422927 9990133 8086378
4279 8086378 6148654 3781125 3906951 7452791 9973995 8052650 5011571 5830011 9809865
4270 9809865 12740381 13377734 13173322 11958908 8666664 4884535 3383136 3930057 4042746
4261 4042746 2944674 1666537 396994 -1205661 -2278815 -2246923 -2598400 -4167392 -4327142
4252 -4327142 -384786 5631121 9268342 9668548 9608526 10433760 10832862 10267536 9840422
4243I840422k75931j579126l087507k957219j523723P7843J439138J653200k33714
4234C353383k435757j869707O51409J136743p13734q12133J661405K256542n29681
4225B698470j789360J208873L613526J230814j894639k34632L884467M298962
4217A3016481O59863k264970k150439l14269K174191M454099M245837Q55451k398236
4208A8278008k465450n41200J190350K857764L987085K295472j241588j874574
4200B2485867Q87305J653825o84107P6679N391772P417501L296583J794911O603124
4191D8923460P482136J095884L676152K2060763K8031296p462071o1806236p8471025
4183c6469641m1040982N098019J6529841M108188J577920J1363418J1670228n21606
$$ plain form
4243 9840422 9564491 7985365 4897858 1940639 416916 494759 1933897 3587097 3353383
4234 3353383 917626 -952081 -300672 836071 122337 -689796 971609 3228151 2698470
4225 2698470 909110 2117983 5731509 6962323 5067684 4833052 8717519 13016481
4217 13016481 13676344 11411374 9260935 8946666 11120857 15574956 19820793 20676244 18278008
4208 18278008 15812558 15271358 16461708 19319472 23306557 25602029 24360441 22485867
4200 22485867 23373172 25026997 24342890 24419569 29811341 37228842 40525425 42320336 48923460
4191 48923460 56405596 57501480 61177632 83238395 111269691 103807620 42001384 -36469641
4183 -36469641 -77510623 -72412604 -55882763 -51774575 -50196655 -38833237 -27163009 -27684615
4175b7684615o523702K76594O285465L546029K33049K105186K988556j017017
4167a9790455l543174j08583M029018L641740J192094J44519p25190k271262j787891
4158a9219184J492530M061248L907757K851835J678980q88982l392318k446153
4150a1954287O63432J089984r55631k16820L657855M419874L2102l064596m30187
4141f758274L147433J909570j793453k414219k28398N22444q75580j500996j79127
4132h170600J495944K238602J899631M61869j323207j634809J97229K536453L613501
4123A314613L093987J053099j956235l474008j298104K213798K128763j548695
4115A527218l009403N98884M431499L313360n96280j949743n85152n73723k855792
$$ plain form
4175 -27684615 -34208317 -33931723 -27646258 -24100229 -23867180 -21761994 -18773438 -19790455
4167 -19790455 -23333629 -23442212 -19413194 -15771454 -14579360 -14434841 -15160031 -17431293 -19219184
4158 -19219184 -17726654 -13665406 -9757649 -6905814 -5226834 -6115816 -9508134 -11954287
4150 -11954287 -11290855 -10200871 -11156502 -11373322 -7715467 -3295593 -3263491 -6328087 -6758274
4141 -6758274 -3610841 -1701271 -3494724 -5908943 -6137341 -5614897 -6490477 -7991473 -8170600
4132 -8170600 -6674656 -4436054 -2536423 -2074554 -3397761 -5032570 -4835341 -2298888 1314613
4123 1314613 4408600 5461699 3505464 31456 -1266648 947150 3075913 1527218
4115 1527218 -1482185 -883301 3548198 6861558 6265278 4315535 3730383 3156660 300868
4106C00868m054322k271747L05684J171731N77462r1796o11758j385280k019893
4097h079051j638636k72052P76897L45870q97628r79509P05962K359831K409279
4088e269037J753252J737201J504704j67163j857918j455490J8595L0369j002594
4079d708081p61381L99828M19163K26702K154609M162596K048782k245082j953936
4070b56800L185850N062348K06215l652540L0874N208024K469798n808446r196438
4061b751115n147840j268648k114801l208798j84801M083164N059162L368525
4053b165152K101767J503191J95864j172741j007618K94368J246298J774470K486210
4044E256657K517688M48929k973259m975264l960510j359485K95771L94291L86287
$$ plain form
4106 300868 -3753454 -6025201 -5719517 -4547786 -3970324 -4062120 -4673878 -6059158 -8079051
4097 -8079051 -9717687 -9989739 -9212842 -8866972 -9764600 -10744109 -10038147 -7678316 -5269037
4088 -5269037 -3515785 -1778584 -273880 -441043 -2298961 -3754451 -3735856 -3705487 -4708081
4079 -4708081 -5469462 -5069634 -4650471 -4423769 -2269160 1893436 3942218 1697136 -256800
4070 -256800 2929050 7991398 8197613 4545073 4575947 9783971 12253769 6445323 -2751115
4061 -2751115 -7898955 -9167603 -11282404 -14491202 -14676003 -10592839 -5533677 -2165152
4053 -2165152 -63385 1439806 1635670 462929 -544689 -250321 995977 2770447 5256657
4044 5256657 7774345 8223274 5250015 274751 -3685759 -5045244 -4749473 -4355182 -3968895
4035c968895J045797J030520p78685k698691k084807O28542K157279R28353j043793
4026d784380j506142o94728K35834R82752J156005J42856r06698K09453K766563
4017b398485L124076L33281j990224j497010n62908j035113k68736L312779N284402
4008D302062J596290l748898m013695j45266J254357j182931k309407J43022K340009
3999a764457J565724o0289p17806j613952k697391j456834J810253K998970P86955
3990a148827j077190m34622j12536j792881k205073P39499L304279J935361p72863
3981a564853j047350n64411k438683m157354j088635M880761O756818K281520
3973C057813l092060l746517k29034K867676K290871j314612m204186k936639
$$ plain form
4035 -3968895 -2923098 -1892578 -2671263 -5369954 -7454761 -6826219 -4668940 -3740587 -4784380
4026 -4784380 -6290522 -6985250 -6749416 -5766664 -4610659 -4467803 -5374501 -5165048 -2398485
4017 -2398485 725591 1058872 -931352 -2428362 -2991270 -4026383 -4295119 -982340 4302062
4008 4302062 5898352 2149454 -1864241 -2009507 -755150 -1938081 -4247488 -4104466 -1764457
3999 -1764457 -198733 -259022 -976828 -2590780 -5288171 -6745005 -4934752 -1935782 -1148827
3990 -1148827 -2226017 -2660639 -2773175 -4566056 -6771129 -6031630 -2727351 -791990 -1564853
3981 -1564853 -2612203 -3176614 -5615297 -9772651 -10861286 -5980525 776293 3057813
3973 3057813 -34247 -3780764 -4009798 -1142122 1148749 -165863 -4370049 -7306688
3965g306688J535526M294555K628780k82654l15398J470962J305075p82825j487249
3956A060084j91887L36188r08066j721000q24904M30117J072454J668529J929644
3947B851159O20359j519342k117895j057667o55728j388405j078229Q05523J885692
3938a654533J223744J082783K588477L378444J811911j3858j06018j55936k166726
3929E988288m338154l803707j299228L51819O00226N91836q3583k276262m066668
3920h335433k624095J168165L581082L308356K293756J415966o14209l316300
3912c122712l434543K71646M346436M905422K246196p58175k597513l147072j740355
3903c030670J815995N188789N266790J995093j522616k831735k353656j688482
$$ plain form
3965 -7306688 -5771162 -1476607 1152173 869519 554121 2025083 3330158 2547333 1060084
3956 1060084 868197 1204385 296319 -1424681 -2249585 -1819468 -747014 921515 2851159
3947 2851159 3471518 1952176 -165719 -1223386 -1879114 -3267519 -4345748 -3540225 -1654533
3938 -1654533 -430789 651994 3240471 6618915 8430826 8416968 8310950 8155014 5988288
3929 5988288 1650134 -2153573 -3452801 -3100982 -2500756 -1908920 -1992503 -4268765 -8335433
3920 -8335433 -10959528 -9791363 -6210281 -2901925 -608169 807797 193588 -3122712
3912 -3122712 -6557255 -6285609 -1939173 2966249 5212445 4454270 1856757 -1290315 -3030670
3903 -3030670 -1214675 3974114 9240904 11235997 9713381 6881646 4527990 2839508
3895B839508j363324q82291P7000J178142J633596P08917j444361l417343l623906
3886d294062j890691M35820J879127J867168O64957q89731j543791l71674K161646
3877a981231M205253L989212J465982j364500k001951k3182J877770O12095l068385
3868C711063m696218j833952J978387J597925k369121m141607j083508K439699
3860d397332J636923j565589j578289K439378N471667L929248J42027j731489
3852D346544j196918o55568j185842j662432j202079j43234J256292L057190M230400
3843F844353K853669j215892n016461n242047k058635R97409J096640q85232j997480
3834d623676j056368K62611J08666r54202p97057J359084L760105L966356J493099
$$ plain form
3895 2839508 1476184 593893 670893 1849035 3482631 4191548 2747187 -670156 -4294062
3886 -4294062 -6184753 -5748933 -3869806 -2002638 -1337681 -2227412 -3771203 -4142877 -1981231
3877 -1981231 2224022 6213234 7679216 6314716 4312765 4289583 6167353 6779448 3711063
3868 3711063 -985155 -2819107 -840720 757205 -1611916 -5753523 -6837031 -4397332
3860 -4397332 -2760409 -4325998 -5904287 -3464909 2006758 5936006 6078033 4346544
3852 4346544 3149626 2494058 1308216 -354216 -1556295 -1699529 -443237 2613953 6844353
3843 6844353 9698022 8482130 3465669 -1776378 -3835013 -2837604 -1740964 -2626196 -4623676
3834 -4623676 -5680044 -5417433 -5308767 -6262969 -7060026 -5700942 -1940837 2025519 3518618
3825C518618j518337k249300m4871K685092K935358O28586j182814j88218K146342
3816F730456K642777P44437j022351q20345K49756K95169p63818j873222k628081
3807C554778k836066j529090J494557L739936K127399k514877n324785l078991
3799d367139J624183L597058J463847j262762j259585O85358J585446L46092j434566
3790I77932j780434q6657K820303M993898M203419J02567m432694n751119l546639
3781b499424j001488l71003l03079J285788L468920L534900J061454j488836k169898
3772A517334j562384r92510n11886L77476J146015O43777j167350k737251k472852
3763e759631o06908Q28016L28474j007278p74977J207797K279786Q28763r55109
$$ plain form
3825 3518618 2000281 -249019 -293890 2391202 5326560 5955146 4772332 4584114 6730456
3816 6730456 9373233 10117670 9095319 8274974 8524730 8819899 8056081 6182859 3554778
3807 3554778 718712 -810378 684179 4424115 6551514 4036637 -1288148 -4367139
3799 -4367139 -2742956 854102 2317949 1055187 -204398 480960 2066406 2412498 977932
3790 977932 -802502 -889159 1931144 6925042 11128461 11231028 6798334 1047215 -2499424
3781 -2499424 -3500912 -3871915 -4174994 -2889206 579714 4114614 5176068 3687232 1517334
3772 1517334 -45050 -1037560 -1549446 -1171970 -25955 617822 -549528 -3286779 -5759631
3763 -5759631 -6366539 -5538523 -5210049 -6217327 -6992304 -5784507 -3504721 -2675958 -3631067
3754c631067j97157K152799K680621P42948q57395o46017n01507j627611j726539
3745c610925J322698N126003N080688K32554n500547p670779n210983m52864L152360
3736g531795L555909J645876J36307L19311Q66743O40535R18939K911513M625152
3727H088490L109297p76282k961888j826712k81560j126708k943935k499291M53959
3718g64630K917908K561338J78146j744473j798207p19791j42660n61684q12247
3709h86300J84299J723294K222403J387484K53874o28886j457624j708747m76868
3700F12929J226881Q02531k046623l874811j928262J640846K509542J34440j858731
3691b781258j034182R53811J463138L87284o86382r68593o12566L00947J402675
$$ plain form
3754 -3631067 -3828224 -1675425 1005196 1748144 890749 244732 -256775 -1884386 -3610925
3745 -3610925 -2288227 2837776 7918464 8151018 2650471 -5020308 -10231291 -10684155 -7531795
3736 -7531795 -3975886 -2330010 -2193703 -1874392 -1007649 -367114 551825 3463338 8088490
3727 8088490 11197787 10421505 7459617 5632905 5351345 4224637 1280702 -1218589 -764630
3718 -764630 2153278 4714616 4892762 3148289 1350082 630291 487631 -74053 -886300
3709 -886300 -702001 1021293 3243696 4631180 4885054 4256168 2798544 1089797 612929
3700 612929 1839810 2642341 595718 -3279093 -5207355 -3566509 -1056967 -922527 -2781258
3691 -2781258 -3815440 -2861629 -1398491 -1011207 -1697589 -2666182 -3278748 -2977801 -1575126
3682a575126J599933M32278q37702p70306L03566J147591J599232K091222J981315
3673E972003M52567j291116j151379L59120L22359k052096l693419k049069J043152
3664b087878K007963L59910j512509k118557j852750j070192J79029R70380N89303
3655d535301L38097J590770K595995N36438l363002m689804k441612n69521j434659
3646a1972599k136502m5117K198688J166743j199753p00159K100398L132567J870292
3637e585442J686580L288699L208435n3792l216847l452425k303198k050718j798985
3628a0277693k3546J886965J816204O43402P39933K078013K582011J478343r3549
3619H30083j181911j678502j408105l97326L42676j65941j412428k069194j519472
$$ plain form
3682 -1575126 24807 457085 -380617 -1150923 -847357 300234 1899466 3990688 5972003
3673 5972003 6424570 5133454 3982075 4341195 4663554 2611458 -1081961 -3131030 -2087878
3664 -2087878 -79915 279995 -1232514 -3351071 -5203821 -6274013 -6094984 -5124604 -4535301
3655 -4535301 -4197204 -2606434 -10439 525999 -2837003 -7526807 -9968419 -10537940 -11972599
3646 -11972599 -14109101 -14154218 -11955530 -10788787 -11988540 -12688699 -10588301 -7455734 -5585442
3637 -5585442 -3898862 -610163 2598272 2544480 -672367 -4124792 -6427990 -8478708 -10277693
3628 -10277693 -10301239 -8414274 -6598070 -5954668 -5214735 -3136722 -554711 923632 830083
3619 830083 -351828 -2030330 -3438435 -3835761 -3493085 -3659026 -5071454 -7140648 -8660120
3610h660120R8748K231437L360589J770755j693190l428911j589646R78049P73895
3601f158394j065285p35442K062830L681224K182559j91672r25022l71936J89092
3592a332046Q40296J785928K059249J150864K57417M05733O97425k66770k334572
3583C263524m143759m440541k582440P07166K687410R23460k879359l931525o94948
3574a1091012K600164J952237p39544j253781J30949j44238k082606j686221K082566
3565a0231486M755126K850712r35270j920039n46J273659M01579p72718p55451
3556e334434j85634K28602R19571K001787K659526K704432L035183L774609L478360
3547A3282002J156155k101771m397860m887321l648517j025065J780304K740991
$$ plain form
3610 -8660120 -8561372 -6329935 -2969346 -1198591 -2891781 -6320692 -7910338 -6932289 -6158394
3601 -6158394 -7223679 -7959121 -5896291 -2215067 -32508 -224180 -1149202 -1521138 -1332046
3592 -1332046 -491750 1294178 3353427 4504291 4761708 5167441 5864866 5598096 3263524
3583 3263524 -880235 -5320776 -7903216 -7196050 -4508640 -3585180 -6464539 -10396064 -11091012
3574 -11091012 -8490848 -6538611 -7278155 -8531936 -8400987 -8545225 -10627831 -12314052 -10231486
3565 -10231486 -5476360 -2625648 -3560918 -5480957 -5481503 -4207844 -3806265 -4578983 -5334434
3556 -5334434 -5520068 -5291466 -4371895 -2370108 289418 2993850 6029033 9803642 13282002
3547 13282002 14438157 12336386 7938526 3051205 -597312 -1622377 157927 2898918
3539B898918J254685n14319l13909Q39713J20669k548943l987353k445904k67390
3530d963833k79701j614748j428908N50641J948638J747734J508405K153323K232328
3521A853879O93334q10375l06951J282184J528016K73475l25532O12296J447074
3512F247400R59720L64662J015502J761471O20257j684946k157596J99581K515997
3503I842048J594027j937641m458982l702470p52061K028355L330436K855367
3495H799079P56836j752865k627667j342612o9984q30963k306855j648973R69676
3486e4328K298088Q84242p96626l42047J020575Q60549n59635j271854r56416
3477A082548o47902k13698J026423J928672Q39893j053745q93049J267902K352165
$$ plain form
3539 2898918 4153603 3639284 3325375 4165088 4285757 1736814 -2250539 -4696443 -4963833
3530 -4963833 -5243534 -6858282 -8287190 -7736549 -5787911 -4040177 -2531772 -378449 1853879
3521 1853879 2547213 1736838 1429887 2712071 4240087 4513562 4188030 4800326 6247400
3512 6247400 7207120 7571782 8587284 10348755 10969012 9284066 7126470 7326051 9842048
3503 9842048 11436075 9498434 5039452 1336982 584921 2613276 5943712 8799079
3495 8799079 9555915 7803050 5175383 3832771 3762787 2931824 624969 -1024004 -54328
3486 -54328 2243760 3128002 2331376 1989329 3009904 3870453 3310818 2038964 1082548
3477 1082548 434646 220948 1247371 3176043 4015936 2962191 2069142 3337044 5689209
3468E689209J183944J1154J41344k22369k006823k723760n04603K363230K922135
3459F853461J906701J355571M25121k399613m896497l574831L72709K230080O93640
3450B966342q23318j09408J109300J230718J149870J046428r59099m698962o292212
3441e380341l401255Q96595K400959J342165O82337J246292J843797K404553L525889
3432E560991M028057K188545j186514l587489m086007l494729k188922k55065
3424c021133J100686Q89242K65617N84632O09297j356852l576954k762264N25237
3415f742492K205860P88529n50738J012092M110604N704121M731141J987305j211734
3406A2034688l095608k502126r36916j257237l387456l954697j310801J883484
$$ plain form
3468 5689209 6873153 6884307 7025651 6803282 4796459 2072699 1568096 3931326 6853461
3459 6853461 8760162 10115733 10540854 8141241 3244744 -330087 42622 2272702 2966342
3450 2966342 2143024 2033616 3142916 4373634 5523504 6569932 5610833 911871 -5380341
3441 -5380341 -8781596 -7885001 -5484042 -4141877 -3459540 -2213248 -369451 2035102 5560991
3432 5560991 9589048 11777593 10591079 7003590 2917583 -577146 -2766068 -3021133
3424 -3021133 -1920447 -1031205 -765588 -180956 428341 -928511 -4505465 -7267729 -6742492
3415 -6742492 -4536632 -3748103 -4298841 -3286749 823855 6527976 11259117 13246422 12034688
3406 12034688 8939080 6436954 5500038 4242801 855345 -3099352 -4410153 -2526669
3398b526669K587369J165819m52185j625149j980992l49157K741953M018898J774555
3389E354442j030595j034660M08404J2960j561447j140422P91304M72128k345228
3380g3114l098543L77029L766208K327156k130537l889261j267270J664506J066374
3371a257452j975444l620420k172408O25384K333278K334426J451957K83272j050169
3362c047576k005937j833541q30416j30778P4113O65922J449863P88693j431235
3353f300892k552208r10808J019579J09793k188188j708031J836882M197370L108468
3344c388035J346221J574808K005496R7472k454562k238411J48674R70481o11573
3335b549429j365892N15049K257861N92463l381624n548715l805781M6621K842925
$$ plain form
3398 -2526669 60700 1226519 774334 -850815 -2831807 -3180964 -439011 3579887 5354442
3389 5354442 4323847 3289187 3697591 3710551 2149104 1008682 1799986 2272114 -73114
3380 -73114 -3171657 -2794628 971580 3298736 1168199 -2721062 -3988332 -2323826 -1257452
3371 -1257452 -3232896 -6853316 -9025724 -8400340 -6067062 -3732636 -2280679 -1997407 -3047576
3362 -3047576 -5053513 -6887054 -7717470 -7848248 -7774135 -7108213 -5658350 -4869657 -6300892
3353 -6300892 -8853100 -9763908 -8744329 -8634536 -10822724 -12530755 -10693873 -6496503 -3388035
3344 -3388035 -2041814 -467006 1538490 1635962 -818600 -3057011 -2908337 -1937856 -2549429
3335 -2549429 -3915321 -3400272 -1142411 -549948 -3931572 -9480287 -13286068 -13239447 -10396522
3326a0396522L071389J642109P02171J527289K921394K203386j365706m782144
3318d476634m328308k42664L235210K913577K25019j195933j72033J386519J777088
3309h78159J410535J211514R35812O7379p76015n56373O14816J669863K043012
3300E742384J963559J439506K6795k052463l389137k736042o65057Q33239O54134
3291A816918p4246L76498J676672J654275m42794k350613j759284K32829O04100
3282A734355j183799k618714k092079q91853m42200k1697J307778K620157K771359
3273A183307K308344J828212L11528k515167l937077j526632K421248L217520
3265C291283K45890k349172j707659M35736J353575R30138J03258j364645l349576
$$ plain form
3326 -10396522 -7325133 -5683024 -4980853 -3453564 -532170 1671216 305510 -4476634
3318 -4476634 -8804942 -9047606 -5812396 -2898819 -2673800 -3869733 -4041766 -2655247 -878159
3309 -878159 532376 1743890 2679702 2747081 1971066 1414693 2029509 3699372 5742384
3300 5742384 7705943 9145449 9172244 7119781 3730644 994602 329545 1162784 1816918
3291 1816918 1742672 2119170 3795842 5450117 5007323 2656710 897426 1130255 1734355
3282 1734355 550556 -2068158 -4160237 -5052090 -5494290 -5515987 -4208209 -1588052 1183307
3273 1183307 3491651 5319863 5631391 3116224 -820853 -2347485 73763 3291283
3265 3291283 3537173 1188001 -519658 -83922 1269653 2199791 2303049 938404 -2411172
3256b411172l831907j456828J722932K480504O65636q78647k79860J362025J950497
3247f76820Q39789r99183k189099j909441k81667J758765L055949K899619J462634
3238C960546j04342m19298O31409J516021J021225L9943P6662M97377p14656l377561
3228C127326m543804k334373J585861M401812N208375M431427K049513j661095
3220A2265042m721145m828372j962213J537645L214570K251813j53863j525130
3212F078347l13531J921490J925003q30091k931375j620653J265018J955962j80907
3203G269263k594697l394435k641952o17167K347175M490561L858576J256720
3195I974044m15886k31299l01180k066616l824678l289331r13954Q95078Q95940
$$ plain form
3256 -2411172 -6243079 -7699907 -5976975 -3496471 -2830835 -3709482 -3989342 -2627317 -676820
3247 -676820 162969 -836214 -3025313 -4934754 -5216421 -3457656 -401707 2497912 3960546
3238 3960546 3856204 3436906 4068315 5584336 6605561 6645504 6722166 7219543 6504887 3127326
3228 3127326 -1416478 -3750851 -2164990 2236822 7445197 11876624 13926137 12265042
3220 12265042 7543897 2715525 753312 2290957 5505527 7757340 7603477 6078347
3212 6078347 5764816 7686306 9611309 8781218 5849843 4229190 5494208 7450170 7269263
3203 7269263 4674566 1280131 -1361821 -1978988 368187 4858748 8717324 9974044
3195 9974044 9558158 9326859 9025679 6959063 3134385 -154946 -1068900 -173822 722118
3186G22118J3315k64057M80779J337502R54768j066735l448352m217705k521351
3177h009718O96613L468696L956558J677648j515431k482277j27413K901212L271214
3168C837102J091410q18698j226565j580110k609024k542646o2205K929876L328700
3159B347840O97170k365029l296249j934491J818R86276J036397J108778J371989
3150d5501Q74791n82783j412756m29400R28897N68930p57275n00071J300714J724837
3140A670383k45090j770791n82699J410398J249837m69747q98515M66987J329300
3131B160063L11119j309617j712965n97782J066426K042700J516216k16883j855059
3122A404218k602101l047377l755320l846906k157469R14700L861009N561606
$$ plain form
3186 722118 735433 471376 952155 2289657 3244425 2177690 -1270662 -5488367 -8009718
3177 -8009718 -7313105 -3844409 112149 1789797 274366 -2207911 -2335324 565888 3837102
3168 3837102 4928512 4109814 2883249 1303139 -1305885 -3848531 -3910736 -980860 2347840
3159 2347840 3045010 679981 -2616268 -4550759 -4548941 -3562665 -2526268 -1417490 -45501
3150 -45501 829290 246507 -1166249 -1595649 -666752 -97822 -855097 -1355168 -54454 1670383
3140 1670383 1425293 -345498 -928197 482201 1732038 1262291 363776 830763 2160063
3131 2160063 2471182 1161565 -551400 -1149182 -82756 1959944 3476160 3259277 1404218
3122 1404218 -1197883 -4245260 -8000580 -11847486 -14004955 -13090255 -9229246 -3667640
3114c667640N266633K394617j950055m530473l353812o59987l3397j198124p28328
3105h460566K140372L897909J997367j418270k851568k027006r03072m0307J381365
3096f283776K958341L147712J831643O58123N15837L22853j093289l045463l623992
3087d612011j845218J153702K948757K068255l65607j716125r22900K68334j05160
3078c127973j390346j529902m87973l84435j868094k434117K08180M333280N669499
3069a011881K531426k094952m072132k545894J3309J408542J918026K706650L395822
3060B248916K527548J69684j404595m04950J939181K669764P39740j782381k453012
3051D249895j383252o43377j363214k480648k315180m79469J987226L645295L506832
$$ plain form
3114 -3667640 1598993 3993610 2043555 -2486918 -5840730 -6500717 -6534114 -7732238 -8460566
3105 -8460566 -6320194 -2422285 -424918 -1843188 -4694756 -6721762 -7624834 -7665141 -6283776
3096 -6283776 -3325435 -177723 1653920 2312043 2827880 3150733 2057444 -988019 -4612011
3087 -4612011 -6457229 -5303527 -2354770 -286515 -652122 -2368247 -3291147 -3022813 -3127973
3078 -3127973 -4518319 -6048221 -6536194 -6920629 -8788723 -11222840 -11014660 -6681380 -1011881
3069 -1011881 1519545 -575407 -4647539 -7193433 -7180124 -5771582 -3853556 -1146906 2248916
3060 2248916 4776464 4946148 3541553 3136603 5075784 7745548 8485288 6702907 4249895
3051 4249895 2866643 2223266 860052 -1620596 -3935776 -4415245 -2428019 1217276 4724108
3042D724108J631580n46473j124359K28320J550539Q17078j438017k856758k455149
3033E30869j556335j167693k34264K163332M285435L539428L72900j843708j199797
3024D890167M08181J58845k116068m466813n543754n128525k984862O51798L681902
3015a0449129L538452O64072j268168J75942K900818L067507K73933k071609j508456
3006d676638M08556P40975o95889j546100o48326M52252K59160o7664J612266
2997d161408M771665O039540L167204k047062n680221n783355l586143j202657
2989h482437M43367J323013J364575O69207q5000l44957m47773r72105j601078
2980h133188j400733j59231J282370K145778K516109K738623K505882J052515
$$ plain form
3042 4724108 6355688 5809215 4684856 4913176 6463715 7280793 5842776 2986018 530869
3033 530869 -1025466 -2193159 -2427423 -264091 4021344 7560772 7933672 6089964 4890167
3024 4890167 5298348 5457193 3341125 -1125688 -6669442 -11797967 -14782829 -14131031 -10449129
3015 -10449129 -6910677 -6246605 -7514773 -7338831 -4438013 -1370506 -1096573 -3168182 -4676638
3006 -4676638 -4268082 -3527107 -4222996 -5769096 -6417422 -5965170 -5706010 -5773674 -4161408
2997 -4161408 610257 6649797 9817001 7769939 2089718 -3693637 -7279780 -8482437
2989 -8482437 -8039070 -6716057 -5351482 -4682275 -4767275 -5112232 -5560005 -6532110 -8133188
2980 -8133188 -9533921 -9693152 -8410782 -6265004 -3748895 -1010272 1495610 2548125
2972B548125j753193m745914o075086m703975j431581J749228L438527L711377
2964g262492L137952J661801p85002l057555l466572j887127j19319L96613L25862
2955a1055839J116681K663366L433135K699490J467202Q98889Q01205L16093n61474
2946A778748j072339j029379j010105j010869R384K411801M435196L767197N25304
2937H804938k508037k958798j214060O51002J241509N41376p16525j528777j313609
2928I99019q88171j727723l399484l201701J02003L595005L465420K6054k969644
2919c999222l355002k117347l74943J829176L351874K135353j130787k649919
2911f310817n07788K686861L806492L057375J987888O83999o53402l53970J583118
$$ plain form
2972 2548125 794932 -3950982 -10026068 -14730043 -16161624 -14412396 -10973869 -7262492
2964 -7262492 -4124540 -2462739 -3247741 -6305296 -9771868 -11658995 -11778314 -11381701 -11055839
2955 -11055839 -9939158 -7275792 -3842657 -1143167 324035 1222924 2024129 2340222 1778748
2946 1778748 706409 -322970 -1333075 -2343944 -2334560 77241 4512437 8279634 8804938
2937 8804938 6296901 3338103 2124043 2775045 4016554 4557930 3841405 2312628 999019
2928 999019 110848 -1616875 -5016359 -8218060 -8116057 -4521052 -1055632 -1029578 -3999222
2919 -3999222 -7354224 -9471571 -9846514 -8017338 -4665464 -2530111 -3660898 -6310817
2911 -6310817 -6818605 -4131744 -325252 2732123 4720011 5404010 4750608 4396638 5979756
2902E979756J944586p01341k515901k07486K531600n100o008720q082139m277420
2893a1342165m79950p79788k088670p88289J310951J362010Q71776K267262L801844
2884e865019K533928k49147j067365J49297O82267q3947l29985M95387J191354
2875b543230J412785J635296J258712j85374q31558J138792L678731L192889L14955
2866I071998p45611J011811J564444j670627n396059m957261o20312L370026M260154
2857E888563K726472M38293j700547k976513k646777j016981L32231J65315r09721
2848C00335j154198M3808J220430P38868p99215j232556O9923J364152J286885
2839A838432O63348N01577R7041j149442j819477o92610N97182j53787j901879
$$ plain form
2902 5979756 7924342 7223001 4707100 4499614 7031214 7026114 1017394 -7064745 -11342165
2893 -11342165 -11822115 -12601903 -14690573 -15478862 -14167911 -12805901 -11934125 -9666863 -5865019
2884 -5865019 -3331091 -3580238 -4647603 -4498306 -3816039 -3899986 -4229971 -3734584 -2543230
2875 -2543230 -1130445 504851 1763563 1578189 746631 1885423 5564154 8757043 9071998
2866 9071998 8326387 9338198 10902642 9232015 3835956 -1121305 -1741617 1628409 5888563
2857 5888563 8615035 9053328 7352781 4376268 1729491 712510 1044741 1210056 300335
2848 300335 -853863 -810055 410375 1149243 350028 -882528 -812605 551547 1838432
2839 1838432 2501780 3003357 3100398 1950956 131479 -561131 36051 -117736 -2019615
2830b019615j896474k75784L14026n82919o98229L71807K2518k504621l810706
2821a1079997j226590K818670M024470J874521n32369r66775J9882Q40012M86769
2812c741407j112110k834227k897133p39174K160464L927860L808335J823343
2804C95951j217404k802084m57495M078451N220431O22136m539939l792240J860125
2795f32068N463733L687876L93022j5848J430620J079417j527203l474434k757492
2786C647623l68833J480305J602815L89713q36709r91738k40943K90837k9284
2777D943786o55351p88134l37053L50085J083108J698984J741018O90162j511528
2768G215077m037320n114434l101710J384306M885693M167171N2958l225703k981767
$$ plain form
2830 -2019615 -3916089 -4191873 -3877847 -4460766 -5158995 -4787188 -4764670 -7269291 -11079997
2821 -11079997 -12306587 -9487917 -5463447 -3588926 -4121295 -5088070 -5068188 -4228176 -3741407
2812 -3741407 -4853517 -7687744 -10584877 -11324051 -9163587 -5235727 -1427392 395951
2804 395951 -821453 -3623537 -4081032 -2581 5217850 5839986 1300047 -2492193 -632068
2795 -632068 4831665 8519541 8912563 8896715 10327335 11406752 9879549 6405115 3647623
2786 3647623 3278790 4759095 6361910 6751623 5914914 4923176 4682233 4973070 4943786
2777 4943786 4288435 3500301 3163248 3513333 4596441 6295425 8036443 8726605 7215077
2768 7215077 3177757 -1936677 -5038387 -3654081 1231612 5398783 5451741 2226038 -755729
2759g55729r23240k44105j342411j934564n56785J777353L223347K944190J239817
2750C427873q20173j603596l3181K868191M531515L647793J551690L8631j124601
2741A2484142l079361m990728m405856q87060K595976L052443R50384j041221
2733D678719j721443j959071k181287j476097L47673J654517J018948p67925j780454
2724b186420j241565K24911J834244K954471K736820Q67307j325906j846067n27989
2715A489806N17407l14527j760443j309773J094027K473610O17133k729252l927605
2706c849617k216572m99807r75127k035402j025006J497354K603756J472628L86813
2697d640980Q96286J446854J15071k091493k469058l45776K023888K186120R3919
$$ plain form
2759 -755729 -1678969 -1923074 -3265485 -5200049 -5756834 -3979481 -756134 2188056 3427873
2750 3427873 2607700 1004104 970923 3839114 8370629 12018422 13570112 13608743 12484142
2741 12484142 9404781 4414053 8197 -878863 1717113 4769556 5719940 4678719
2733 4678719 2957276 998205 -1183082 -2659179 -2311506 -656989 361959 -405966 -2186420
2724 -2186420 -3427985 -3203074 -1368830 1585641 4322461 5189768 3863862 2017795 1489806
2715 1489806 2007213 1692686 -67757 -1377530 -283503 2190107 2807240 77988 -3849617
2706 -3849617 -6066189 -6565996 -7541123 -9576525 -10601531 -9104177 -6500421 -5027793 -4640980
2697 -4640980 -3744694 -2297840 -2182769 -4274262 -6743320 -7089096 -5065208 -2879088 -2785169
2688b785169k100856k332473n86909J361441K157362K219336K310145J727640
2680A970517m38253k763914k540999K75658K497034J995553L56634q2893L29780
2671A599117k0176r88075j355616j264163j600858j828434p74025R28025J404728
2662c899477L46501o78053n28709N71930K040635L141827K688538M52086j592464
2653B542814j481168k39991l41534j649293j742023k90876R9256j729994l303234
2644h136043k264811J72385J442137J342327J438673K104371K270482J477745
2636a52734M60983q6682k12436l45545q35483j494741j461466l19262P02948M5376
2626c699042j541418j527859O55918K461394J846299N0794o58873j18059N70654
$$ plain form
2688 -2785169 -4886025 -7218498 -7805407 -6443966 -4286604 -2067268 242877 1970517
2680 1970517 1532264 -1231650 -3772649 -3496991 -999957 995596 1352230 1269337 1599117
2671 1599117 1578941 590866 -764750 -2028913 -3629771 -5458205 -6232230 -5304205 -3899477
2662 -3899477 -3552976 -4231029 -4759738 -4187808 -2147173 994654 3683192 4135278 2542814
2653 2542814 1061646 821655 480121 -1169172 -2911195 -3202071 -3102815 -4832809 -8136043
2644 -8136043 -10400854 -10228469 -8786332 -7444005 -6005332 -3900961 -1630479 -152734
2636 -152734 308249 221567 9131 -336414 -1171897 -2666638 -4128104 -4447366 -3744418 -3699042
2626 -3699042 -5240460 -6768319 -6112401 -3651007 -1804708 -1753914 -2412787 -2530846 -1960192
2617a960192J191013J681030Q52451j785342m177054m162983k677596j894297
2609a2932970j303281J065577M101031M210048J032574j216087L16489L069621
2601a656998L163390Q69443q01800j049211j552423k667005k630259q31926P85496
2592f371293M82069j016839j962034j775828p66623J068099L554310N292172M494122
2583B998155J041663k927658m649580k951826O51454K891751J613122j661147
2575b994066k842541O9827M160783M780635J146024k881647l612411j284282J486018
2566a971660L015953L020001J416167j295261l194986k500504P7268K061649K261167
2557B889794J620099J063519L00626p09798q70249K67683J016118n70531l654758
$$ plain form
2617 -1960192 -769179 911851 1764302 -21040 -4198094 -8361077 -11038673 -12932970
2609 -12932970 -14236251 -13170674 -9069643 -4859595 -3827021 -5043108 -4726619 -1656998
2601 -1656998 1506392 2375835 1574035 524824 -1027599 -3694604 -6324863 -7156789 -6371293
2592 -6371293 -5889224 -6906063 -8868097 -10643925 -11410548 -10342449 -6788139 -1495967 2998155
2583 2998155 4039818 1112160 -3537420 -6489246 -5837792 -2946041 -1332919 -2994066
2575 -2994066 -5836607 -5766780 -1605997 3174638 4320662 1439015 -2173396 -3457678 -1971660
2566 -1971660 1044293 4064294 5480461 4185200 990214 -1510290 -1433022 628627 2889794
2557 2889794 4509893 5573412 5874038 5164240 4293991 4561674 5577792 5007261 1352503
2548A352503m854335j987780L074579N969013M308181J32978k561558k358080
2540C075501j348019j456815j667051k55313J747790J727715m48373k158957k046347
2531b829869j713272k492195k937548j206752J807178L646775L504143K468806
2523B47266J313645j74937j892147k910362k438709n65068J766870L069395K267386
2514F83339M534j734597j954079j647590j735049j336147N49687K786685L285419
2505a097798J802079o6849j147201j353836o91686N61973J051394l00849k227722
2496c470495k393809q14820J04309o47060j058498P46684L563846M681539L166859
2487C878555L30487k103263l104384k450792r85006k47821p75234j157465J84990
$$ plain form
2548 1352503 -3501832 -5489612 -2415033 3553980 7862161 7995139 5433581 3075501
2540 3075501 1727482 270667 -1396384 -1651697 96093 1823808 1375435 -783522 -2829869
2531 -2829869 -4543141 -7035336 -9972884 -11179636 -9372458 -5725683 -2221540 247266
2523 247266 1560911 1385974 -506173 -3416535 -5855244 -6420312 -4653442 -1584047 683339
2514 683339 687873 -1046724 -3000803 -4648393 -6383442 -7719589 -7169902 -4383217 -1097798
2505 -1097798 704281 637432 -509769 -1863605 -2555291 -1993318 -941924 -1242773 -3470495
2496 -3470495 -5864304 -6679124 -6574815 -7221875 -8280373 -7533689 -3969843 711696 3878555
2487 3878555 4209042 2105779 -998605 -3449397 -4434403 -4682224 -5457458 -6614923 -6429933
2478f429933K582788L569446J836093j125539k675655j833624m4872O73198o8915
2469c517013r05003n38976Q46210K100124K384431J586704J35425j042034j091341
2460d1473m45412n65035j545120j273817J309427L398684J537634k847450m515323
2451d987885j562132K017568K457431J373378J995342L238428J630857k360295
2443C802692m361692k395757P44889K024257J503669J42011k126296m208540l064465
2434g939232J937578O183926M772403q67282m601411l357046o9547J268530L50652
2425b321429p07913q04314l04751L75485J046597J445839J708162K327602K953735
2416E719013K364157M76491r14227n54357M04467M25157K11126J295377K831805
$$ plain form
2478 -6429933 -3847145 -277699 1558394 432855 -2242800 -4076424 -4121296 -3448098 -3517013
2469 -3517013 -4422016 -4960992 -4114782 -2014658 369773 1956477 2091902 1049868 -41473
2460 -41473 -486885 -1051920 -2597040 -3870857 -2561430 837254 2374888 -472562 -4987885
2451 -4987885 -6550017 -4532449 -2075018 -701640 1293702 4532130 6162987 3802692
2443 3802692 -559000 -2954757 -2209868 -185611 1318058 1460069 -666227 -4874767 -7939232
2434 -7939232 -6001654 182272 4954675 4087393 -514018 -3871064 -3940611 -2672081 -2321429
2425 -2321429 -3029342 -3833656 -4138407 -3762922 -2716325 -1270486 437676 2765278 5719013
2416 5719013 8083170 8559661 7645434 7091077 7495544 7920701 8131827 9427204 12259009
2407A2259009K249246q82653l925798m655875l690985k638523j761270q74560
2399c921409r32693k601829l952065j966275L071004O537899M382988j617022
2391i99402n272790l044347J851487L671066J358428p29162P12428L453215L260493
2382D261416p7477k704284j910253R18769K600094J670786o33445j804224n41610
2373A779772J480997J202175j553760l115020j139991J335220J93383l166334
2365b983558l845736j136267R49285R19565J795774M444266M950056J593494j222282
2356E464597j85123R34915k178385o258667n301366l88292K347442J649383J723953
2347b191543L698654M002487J783955O72803J599826Q21590k493076l499311n408
$$ plain form
2407 12259009 14508255 13625602 9699804 5043929 1352944 -1285579 -3046849 -3921409
2399 -3921409 -4854102 -7455931 -11407996 -13374271 -10303267 -3765368 617620 -999402
2391 -999402 -6272192 -9316539 -7465052 -3793986 -2435558 -3164720 -2452292 1000923 4261416
2382 4261416 4183939 1479655 -430598 488171 3088265 4759051 4125606 2321382 1779772
2373 1779772 3260769 4462944 2909184 -205836 -1345827 -10607 182776 -2983558
2365 -2983558 -6829294 -7965561 -7016276 -6096711 -4300937 143329 5093385 6686879 5464597
2356 5464597 5279474 6214389 4036004 -2222663 -7524029 -7912321 -5564879 -3915496 -2191543
2347 -2191543 1507111 5509598 7293553 7966356 9566182 10387772 7894696 4395385 4389977
2338D389977K746843K82433l564432k874989R28256K130387J51997p23986M97522
2329C964008K72152k512908m189480k218740J161638K841659K723449K035546
2321D077324Q81901o49700j317855m82070O71025J019365J075621J520739J751117
2312H547467J167187N06043M59601P5442j873878m533989n540404l954994j462008
2303f609533k41160l62473J9422J972739M031233L801173J091752j542134j718927
2294D42092J70011J836090J750604J65187j767523k871451k404032o58915J028326
2285b309611J517833Q34619m43343j924299k863432k039569M96450K426908J644752
2276b659692o71634j284287P22710K549732J331472k109601m162153k564667J142195
$$ plain form
2338 4389977 7136820 7419253 3854821 979832 1908088 4038475 4190472 3466486 3964008
2329 3964008 4236160 1723252 -2466228 -4684968 -3523330 -681671 2041778 4077324
2321 4077324 4959225 4309525 2991670 2509600 3180625 4199990 5275611 6796350 8547467
2312 8547467 9714654 10220697 10680298 10755740 8881862 4347873 -1192531 -5147525 -6609533
2303 -6609533 -6850693 -7213166 -7193744 -5221005 -1189772 2611401 3703153 2161019 442092
2294 442092 612103 2448193 4198797 4363984 2596461 -274990 -2679022 -3337937 -2309611
2285 -2309611 -791778 42841 -400502 -2324801 -5188233 -7227802 -6731352 -4304444 -2659692
2276 -2659692 -3331326 -4615613 -3892903 -1343171 -11699 -2121300 -6283453 -8848120 -7705925
2267g705925L359548K303682k87905j619434j343148j286821j915971j329448
2259i825422J244205L301660K556530P79353J258298L468619L663303P38552j923807
$$ plain form
2267 -7705925 -4346377 -2042695 -2330600 -3950034 -5293182 -6580003 -8495974 -9825422
2259 -9825422 -8581217 -5279557 -2723027 -1943674 -685376 2783243 6446546 7185098 5261291
$$ [...]
##END NTUPLES=NMR SPECTRUM
##END=
