##TITLE=31Pdec_DE-157_oil_N2
 CCl4,64 sc
 10.6.2026
##JCAMPDX= 6.0         $$ Bruker NMR JCAMP-DX V2.0
##DATA TYPE= NMR SPECTRUM
##DATA CLASS= NTUPLES
##ORIGIN= UXNMR, Bruker Analytische Messtechnik GmbH
##OWNER= root
$$ XWIN-NMR		Version 3.5
$$ Wed Jun 10 13:45:16 2026 Russian Standard Time (UT+4h)  she@DPX200
##.OBSERVE FREQUENCY= 81.013821
##.OBSERVE NUCLEUS= ^31P
##.ACQUISITION MODE= SIMULTANEOUS
##.ACQUISITION SCHEME= undefined
##.AVERAGES= 64
##.DIGITISER RES= 17
##SPECTROMETER/DATA SYSTEM= spect
##.PULSE SEQUENCE= zgpg30
##.SOLVENT NAME= CDCl3
##.SHIFT REFERENCE= (INTERNAL, CDCl3, 0, 197.392)
##AUDIT TRAIL= $$ (NUMBER, WHEN, WHO, WHERE, WHAT)
$$ ##TITLE= Audit trail, XWIN-NMR		Version 3.5
$$ ##JCAMPDX= 5.01
$$ ##ORIGIN= Bruker BioSpin GmbH
$$ ##OWNER= she
$$ F:/spectra/data/she/nmr/P31/2/pdata/1/auditp.txt
$$ ##AUDIT TRAIL=  $$ (NUMBER, WHEN, WHO, WHERE, WHAT)
(   1,<2026-06-10 13:44:08.64 +0400>,<she>,<DPX200>,
      <continue with go, POWCHK disabled, PULCHK disabled
       configuration hash MD5:
       00 E9 B6 7A A2 85 ED C7 34 08 36 98 17 FE 4E 26
       data hash MD5: 32K
       79 A2 A9 B5 9D 1A 3B C9 E9 D3 9F D8 8A BD 2F EB>)
(   2,<2026-06-10 13:44:11.31 +0400>,<she>,<DPX200>,
      <Start of raw data processing
       efp BC_mod = 2 LB = 1.5 FT_mod = 6 PKNL = 1 PHC0 = 1378.932 PHC1 = -221.8995 SI = 64K 
       data hash MD5: 64K
       FC 12 3F 82 65 C7 43 F0 17 52 47 69 81 BC 46 36>)
(   3,<2026-06-10 13:44:37.98 +0400>,<she>,<DPX200>,
      <pk PHC0 = 233.179 PHC1 = 273.4001 
       data hash MD5: 64K
       44 51 E1 BD 06 E6 80 7F 7C FC 16 69 2E B8 DE DA>)
(   4,<2026-06-10 13:44:45.17 +0400>,<she>,<DPX200>,
      <abs ABSG = 5 
       data hash MD5: 64K
       E6 71 9E D8 10 93 29 03 CC 99 B0 14 10 A3 20 BE>)
$$ ##END=
$$ 
$$ hash MD5
$$ F6 A7 EA 7E 82 37 81 1A A7 34 91 D0 85 7E 93 D8
##$RELAX= 
##$RELAX= 
##$RELAX= 
##$RELAX= 
##$RELAX= 
##$RELAX= 
##$RELAX= 
##$RELAX= 
$$ Bruker specific parameters
$$ --------------------------
##$DU= <F:/spectra>
##$EXPNO= 2
##$NAME= <P31>
##$PROCNO= 1
##$TYPE= <nmr>
##$USER= <she>
##$AMP= (0..31)
100 100 100 100 100 100 100 100 100 100 100 100 100 100 100 100 100 100 
100 100 100 100 100 100 100 100 100 100 100 100 100 100 
##$AQSEQ= 0
##$AQ_mod= 1
##$AUNM= <au_zg>
##$AUTOPOS= <>
##$BF1= 81.014009
##$BF2= 200.13
##$BF3= 200.13
##$BF4= 200.13
##$BF5= 200.13
##$BF6= 200.13
##$BF7= 200.13
##$BF8= 200.13
##$BYTORDA= 1
##$CFDGTYP= 0
##$CFRGTYP= 5
##$CHEMSTR= <none>
##$CNST= (0..31)
1 1 145 1 1 1 1 1 1 1 1 1 1 1 1 1 1 1 1 1 1 1 1 1 1 1 1 1 1 1 1 1 
##$CPDPRG= <waltz16>
##$CPDPRG1= <>
##$CPDPRG2= <waltz16>
##$CPDPRG3= <>
##$CPDPRG4= <mlev>
##$CPDPRG5= <mlev>
##$CPDPRG6= <mlev>
##$CPDPRG7= <mlev>
##$CPDPRG8= <mlev>
##$CPDPRGB= <>
##$CPDPRGT= <>
##$D= (0..31)
0 1 0 0 0 0 0 0 0 0.06 0 0.03 2e-05 3e-06 0 0 0.0002 0 0 0 0 0 0 0 0 0 
0 0 0 0 0 0 
##$DATE= 1781084530
##$DBL= (0..7)
120 120 120 11 120 120 24 19 
##$DBP= (0..7)
150 150 150 150 150 150 150 150 
##$DBP07= 0
##$DBPNAM0= <>
##$DBPNAM1= <>
$$ [...]
##$SUBNAM3= <"">
##$SUBNAM4= <"">
##$SUBNAM5= <"">
##$SUBNAM6= <"">
##$SUBNAM7= <"">
##$SUBNAM8= <"">
##$SUBNAM9= <"">
##$SW= 400.765351723535
##$SWIBOX= (0..15)
0 1 3 0 0 0 0 0 0 0 0 0 0 0 0 0 
##$SW_h= 32467.5324675325
##$TD= 32768
##$TD0= 1
##$TE= 0
##$TE2= 300
##$TE3= 300
##$TEG= 300
##$TL= (0..7)
0 120 53 12 22 120 120 120 
##$TP= (0..7)
150 150 150 150 150 150 150 150 
##$TP07= 0
##$TPNAME0= <>
##$TPNAME1= <>
##$TPNAME2= <>
##$TPNAME3= <>
##$TPNAME4= <>
##$TPNAME5= <>
##$TPNAME6= <>
##$TPNAME7= <>
##$TPOAL= (0..7)
0.5 0.5 0.5 0.5 0.5 0.5 0.5 0.5 
##$TPOFFS= (0..7)
0 0 0 0 0 0 0 0 
##$TUNHIN= 0
##$TUNHOUT= 0
##$TUNXOUT= 0
##$USERA1= <user>
##$USERA2= <user>
##$USERA3= <user>
##$USERA4= <user>
##$USERA5= <user>
##$V9= 5
##$VALIST= <valist>
##$VCLIST= <CCCCCCCCCCCCCCC>
##$VD= 0
##$VDLIST= <DDDDDDDDDDDDDDD>
##$VPLIST= <PPPPPPPPPPPPPPP>
##$VTLIST= <TTTTTTTTTTTTTTT>
##$WBST= 1024
##$WBSW= 4
##$XGAIN= (0..3)
0 0 0 0 
##$XL= 0
##$YL= 0
##$YMAX_a= 6499
##$YMIN_a= -3048
##$ZGOPTNS= <>
##$ZL1= 120
##$ZL2= 120
##$ZL3= 120
##$ZL4= 120
##$ABSF1= 197.3918
##$ABSF2= -203.3724
##$ABSG= 5
##$ABSL= 3
##$ALPHA= 0
##$AQORDER= 0
##$ASSFAC= 0
##$ASSFACI= 0
##$ASSFACX= 0
##$ASSWID= 0
##$AUNMP= <proc_1d>
##$AZFE= 0.1
##$AZFW= 0.5
##$BCFW= 0
##$BC_mod= 2
##$BYTORDP= 0
##$COROFFS= 0
##$CY= -3
##$DATMOD= 1
##$DC= 0
##$DFILT= <>
##$DTYPP= 0
##$F1P= 0
##$F2P= 0
##$FCOR= 1
##$FTSIZE= 65536
##$FT_mod= 6
##$GAMMA= 0
##$GB= 0
##$INTBC= 1
##$INTSCL= 9.790993e-09
##$ISEN= 30
##$LB= 1.5
##$LEV0= 0
##$LPBIN= 0
##$MAXI= 10000
##$MC2= 0
##$MEAN= 0
##$ME_mod= 0
##$MI= 50
##$NCOEF= 0
##$NC_proc= -8
##$NLEV= 6
##$NOISF1= 182.463
##$NOISF2= 159.3651
##$NSP= 0
##$NTH_PI= 0
##$NZP= 0
##$OFFSET= 197.3918
##$PC= 4
##$PHC0= 1612.111
##$PHC1= 51.50058
##$PH_mod= 1
##$PKNL= yes
##$PPARMOD= 0
##$PSCAL= 0
##$PSIGN= 0
##$REVERSE= no
##$SF= 81.014063255964
##$SI= 65536
##$SIGF1= 159.3651
##$SIGF2= -187.1042
##$SINO= 113.3802
##$SIOLD= 16384
##$SREGLST= <1H.CDCl3>
##$SSB= 0
##$STSI= 65536
##$STSR= 0
##$SW_p= 32467.5324675325
##$SYMM= 0
##$S_DEV= 0
##$TDeff= 32768
##$TDoff= 0
##$TI= <>
##$TILT= no
##$TM1= 0
##$TM2= 0
##$TOPLEV= 0
##$USERP1= <user>
##$USERP2= <user>
##$USERP3= <user>
##$USERP4= <user>
##$USERP5= <user>
##$WDW= 1
##$XDIM= 65536
##$YMAX_p= 382000659
##$YMIN_p= -107877718
$$ End of Bruker specific parameters
$$ ---------------------------------
##NTUPLES= NMR SPECTRUM
##VAR_NAME=  FREQUENCY,     SPECTRUM/REAL,   SPECTRUM/IMAG
##SYMBOL=    X,             R,               I
##VAR_TYPE=  INDEPENDENT,   DEPENDENT,       DEPENDENT
##VAR_FORM=  AFFN,          ASDF,            ASDF
##VAR_DIM=   65536,         65536,           65536
##UNITS=     HZ,            ARBITRARY UNITS, ARBITRARY UNITS
##FACTOR=    0.49542278885378, 1,            1
##FIRST=     15991.5117654749, 0,            0
##LAST=      -16476.0207020576, 0,           0
##MIN=       -16476.0207020576, -107877718,  0
##MAX=       15991.5117654749, 382000659,    0
$$ Real data points
##PAGE= N=1
##DATA TABLE= (X++(R..R)), XYDATA
$$ [...]
##PAGE= N=2
##DATA TABLE= (X++(I..I)), XYDATA
$$ plain form
7485 3092529 3557626 2167809 -518964 -4146870 -8654525 -12720087 -13641518 -10346276 -5409330
7476 -5409330 -2186632 -707548 1466673 4728916 6268874 3937218 -748569 -4423180
7468 -4423180 -5374348 -4439824 -3560244 -4264046 -6650346 -8973294 -8840465 -5641710 -1509249
7459 -1509249 651259 -145496 -2549636 -4787213 -6404476 -7972717 -9456136 -9660203 -7868821
7450 -7868821 -5416509 -4318195 -4419360 -3665541 -1724603 -1208276 -3780694 -6954912 -7092472
7441 -7092472 -4350849 -2022688 -1701701 -1978618 -1758101 -1859646 -2746665 -3299296 -2794258
7432 -2794258 -1981950 -1415632 -814743 -763870 -2550713 -5168186 -5077123 -854942 3976316
7423 3976316 4940983 1948823 -1436114 -2810047 -2775130 -2733158 -3038348 -3319556 -3209021
$$ packed form
7485C092529M65097j389817k686773l627906m507655m065562r21431L295242M936946
7476e409330L222698J479084K174221L262243J539958k331656m685787l674611
7468d423180r51168R34524Q79580p03802k386300k322948J32829L198755M132461
7459a509249K160508p96755k404140k237577j617263j568241j483419k04067J791382
7450g868821K452312J098314j01165P53819J940938N16327k572418l174218j37560
7441g092472K741623K328161L20987k76917K20517j01545q87019n52631N05038
7432b794258Q12308N66318O00889N0873j786843k617473R1063M222181M831258
7423C976316R64667k992160l384937j373933L4917M1972l05190k81208J10535
$$ plain form
7414 -3209021 -2769949 -2907297 -4658561 -7312314 -8343096 -6301636 -2602917 754649 3819003
7405 3819003 7385509 10465420 11261078 9862929 7866239 5915244 3663318 1526142
7397 1526142 209155 -1056385 -3398769 -5685867 -5604979 -3409342 -1856866 -1980937 -1795488
7388 -1795488 -198435 769939 -568688 -2194625 -1097534 2166221 4233969 3513026 1552071
7379 1552071 109350 -717285 -1048120 -143284 2077745 3967335 4055526 3156731 3105571
7370 3105571 3878124 3656666 1884633 496570 1178613 2833503 3349186 3039133 4303420
7361 4303420 7873591 11335628 12063818 10180734 7829472 6691466 6927979 7403844 6263396
7352 6263396 2530898 -2167689 -4903039 -5161937 -5419604 -6999612 -7764654 -5824904 -3085631
$$ packed form
7414c209021M39072j37348j751264k653753j030782K041460L698719L357566L064354
7405C819003L566506L079911P95658j398149j996690j950995k251926k137176
7397A526142j316987j265540k342384k287098Q0888K195637J552476j24071J85449
7388a795488J597053R68374j338627j625937J097091L263755K067748p20943j960955
7379A552071j442721q26635l30835R04836K221029J889590Q8191q98795n1160
7370C105571P72553k21458j772033j388063O82043J654890N15683l10053J264287
7361D303420L570171L462037P28190j883084k351262j138006K36513M75865j140448
7352F263396l732498m698587k735350k58898k57667j580008p65042J939750K739273
$$ plain form
7343 -3085631 -2171551 -1778078 1184679 5921541 8332794 7094343 5142921 4639241 4371888
7334 4371888 3147106 1887376 834157 -1565244 -4919354 -5740063 -2816288 -358374
7326 -358374 -2207306 -5653140 -5234638 -851660 2445530 1875703 -440552 -2283267 -4245946
7317 -4245946 -6666774 -7490684 -5225567 -1398637 1798243 4200880 6338442 7454241
7309 7454241 6859154 5710142 5393518 5270676 4033348 2443644 2621203 4947791 7574226
7300 7574226 8957297 9203163 8811144 7801386 6574394 6118442 6517258 6395408 4848860
7291 4848860 3091278 3015749 4535686 5523051 4399330 1831839 -367337 -1233059 -1143059
7282 -1143059 -966335 -1320659 -2366683 -3756148 -4838062 -5332319 -5799560 -7096279 -9291962
$$ packed form
7343c085631R14080L93473K962757M736862K411253j238451j951422n03680k67353
7334D371888j224782j259730j053219k399401l354110q20709K923775K457914
7326c58374j848932l445834M18502M382978L297190n69827k316255j842715j962679
7317d245946k420828q23910K265117L826930L196880K402637K137562J115799
7309G454241n95087j149012l16624j22842j237328j589704J77559K326588K626435
7300G574226J383071K45866l92019j009758j226992m55952L98816j21850j546548
7291D848860j757582p5529J519937R87365j123721k567491k199176q65722R0000
7282a143059J76724l54324j046024j389465j081914m94257m67241j296719k195683
$$ plain form
7273 -9291962 -11382779 -12218593 -11629844 -10545951 -9937941 -9633091 -8422421 -5679137 -2669056
7264 -2669056 -1562721 -2978608 -5167987 -5951534 -4804670 -2670253 -600921 679966
7256 679966 717561 -113902 -609074 -399652 -963757 -3541464 -6573885 -7055582 -4384298
7247 -4384298 -988737 1093818 2216522 3044124 2672088 384794 -2218292 -2737649 -953891
7238 -953891 1203076 2268590 2621110 3550554 5929870 9512860 12762105 13774525 12079377
7229 12079377 9042308 6008201 3022659 175028 -1154744 -24434 1953416 2136805
7221 2136805 212554 -1718788 -2271193 -2088895 -1771816 -429486 2701798 6504843 9009851
7212 9009851 9508080 8737569 7425005 5529655 2910285 175426 -1411737 -945080 1149325
$$ packed form
7273i291962k090817q35814N88749J083893O08010L04850J210670K743284L010081
7264b669056J106335j415887k189379p83547J146864K134417K069332J280887
7256F79966L7595q31463m95172K09422n64105k577707l032421m81697K671284
7247d384298L395561K082555J122704Q27602l72036k287294k603086n19357J783758
7238i53891K156967J065514L52520R29444K379316L582990L249245J012420j695148
7229A2079377l037069l034107k985542k847631j329772J130310J977850J83389
7221B136805j924251j931342n52405J82298L17079J342330L131284L803045K505008
7212I009851M98229p70511j312564j895350k619370k734859j587163M66657K094405
$$ plain form
7203 1149325 3269817 3911902 2698115 285192 -2108482 -2936079 -1120036 2499853 5164776
7194 5164776 4719513 1911533 -593108 -1081209 136067 1878971 3020051 2568606 358924
7185 358924 -2094493 -2609128 -645510 2070621 3307636 2038498 -1324723 -5246628 -7565528
7176 -7565528 -6883140 -3967890 -1178738 -340682 -1591389 -3853592 -5509988 -5100974 -2721284
7167 -2721284 -556366 -695347 -2606603 -4245109 -5307983 -7336679 -10540338 -12932560
7159 -12932560 -13338360 -12913505 -12487108 -10676162 -6476256 -1903935 188193 -193573 -803626
7150 -803626 -649404 -702978 -1568283 -2555870 -3066755 -3072718 -2105098 542688 4337919 7770972
7140 7770972 10427054 13297870 16558710 18590238 18128912 16190504 14757121 14375836 14136489
$$ packed form
7203A149325K120492O42085j213787k412923k393674q27597J816043L619889K664923
7194E164776m45263k807980k504641m88101J217276J742904J141080m51445k209682
7185C58924k453417n14635J963618K716131J237015j269138l363221l921905k318900
7176g565528O82388K915250K789152Q38056j250707k262203j656396M09014K379690
7167b721284K164918j38981j911256j638506j062874k028696l203659k392222
7159a2932560m05800M24855M26397J810946M199906M572321K092128l81766o10053
7150h03626J54222n3574q65305r87587n10885n963R67620K647786L795231L433053
7140G770972K656082K870816L260840K031528m61326j938408j433383l81285k39347
$$ plain form
7131 14136489 13348030 11923167 9387923 5043244 -337468 -4064629 -3931266 -918777
7123 -918777 1392274 491718 -2403224 -3738159 -1393836 3376699 7622463 9676827 10189815
7114 10189815 10549879 10815379 9524710 5590323 80077 -4366076 -5974437 -5243033 -3819978
7105 -3819978 -2741815 -2302443 -2885648 -4826377 -7554104 -9659841 -9846871 -7538922 -3185295
7096 -3185295 1349142 3523483 2465233 58534 -1472960 -2304717 -3759513 -5196436
7088 -5196436 -4543807 -1719080 1075553 2755047 4419947 6426441 7203668 6126915 4819625
7079 4819625 4122411 2620825 152972 -250853 3115984 6690792 5812191 1116908 -2939103
7070 -2939103 -4566318 -5495517 -6162081 -4768527 -1634087 -66453 -1473007 -3260231 -3210162
$$ packed form
7131A4136489p88459j424863k535244m344679n380712l727161J33363L012489
7123i18777K311051r00556k894942j334935K344323M770535M245764K054364N12988
7114A0189815L60064K65500j290669l934387n510246m446153j608361P31404J423055
7105c819978J078163M39372n83205j940729k727727k105737j87030K307949M353627
7096c185295M534437K174341j058250k406699j531494q31757j454796j436923
7088e196436O52629K824727K794633J679494J664900K006494P77227j076753j307290
7079D819625o97214j501586k467853m03825L366837L574808q78601m695283m056011
7070b939103j627215r29199o66564J393554L134440J567634j406554j787224N0069
$$ plain form
7061 -3210162 -2508672 -2454542 -1520792 1552773 4495329 4660613 3589225 4871784 8351607
7052 8351607 9934596 7303813 2906223 428493 435955 656037 -751242 -3426205 -5820839
7043 -5820839 -7097162 -7762402 -8448443 -8462532 -6422309 -2488731 1171559 2777528 2631917
7034 2631917 1566783 -819085 -4603201 -7295243 -5701635 -192281 5057209 6769088
7026 6769088 5707604 4226211 2592900 -312581 -3677422 -4639973 -1972461 1939872
7018 1939872 3944582 3786826 3429085 3371743 1748563 -2397228 -6834691 -8639473 -7863278
7009 -7863278 -6978232 -7284276 -7805421 -7583571 -6950034 -6126046 -4624347 -2884594 -2569763
7000 -2569763 -4038195 -5340074 -5271093 -5641303 -8329048 -11433335 -11108320 -6809171 -2117079
$$ packed form
7061c210162P01490N4130R33750L073565K942556J65284j071388J282559L479823
7052H351607J582989k630783m397590k477730P462K20082j407279k674963k394634
7043e820839j276323o65240o86041j4089K040223L933578L660290J605969j45611
7034B631917j065134k385868l784116k692042J593608N509354N249490J711879
7026F769088j061484j481393j633311k905481l364841r62551K667512L912333
7018A939872K004710j57756l57741n7342j623180m145791m437463j804782P76195
7009g863278Q85046l06044n21145K21850O33537Q23988J501699J739753L14831
7000b569763j468432j301879O8981l70210k687745l104287L25015M299149M692092
$$ plain form
6991 -2117079 -187029 -662589 -1512922 -1705217 -1187604 -86205 955095 999953 320531
6982 320531 409216 1678097 2577835 2033749 1254968 1671156 2384358 1579018 -291039 -770669
6972 -770669 1211740 3896698 4844027 3282618 209618 -2640279 -3742145 -2841957 -1368979
6963 -1368979 -879457 -1006501 -19318 2510265 4922827 5697051 5108031 4081295 2765846
6954 2765846 1175986 54721 -84357 107471 -33531 41643 931511 1770669 1420068
6945 1420068 513999 588235 1592655 2182297 2316296 3411233 5554668 6638609 5010156
6936 5010156 1190020 -3721277 -9242637 -14027191 -15523558 -13155674 -10114582 -9656934
6928 -9656934 -10917914 -10883105 -9343624 -8732861 -9438997 -8814288 -5668002 -2684878 -2749322
$$ packed form
6991b117079J930050m75560q50333j92295N17613J101399J041300M4858o79422
6982C20531Q8685J268881Q99738n44086p78781M16188P13202q05340j870057m79630
6972g70669J982409K684958R47329j561409l073000k849897j101866R00188J472978
6963a368979M89522j27044R87183K529583K412562P74224n89020j026736j315449
6954B765846j589860j121265j39078J91828j41002P5174Q89868Q39158l50601
6945A420068r06069P4236J004420N89642J33999J094937K143435J083941j628453
6936E010156l820136m911297n521360m784554j496367K367884L041092M57648
6928i656934j260980L4809J539481O10763p06136O24709L146286K983124o4444
$$ plain form
6919 -2749322 -5084269 -6826684 -6798485 -5954294 -5348425 -5358458 -5933472 -6025596 -3751533 1078847
6909 1078847 5301210 5248273 1120584 -3160134 -4423326 -3000833 -1033121 112906 162276
6900 162276 -662653 -1422333 -694749 1747051 4038697 4120287 2292046 834726 1041855
6891 1041855 1676600 882861 -1219352 -2849833 -3124039 -2969469 -3145107 -2738915 -873991
6882 -873991 1005176 437004 -2474065 -4656363 -3968033 -1979782 -1813323 -4403270 -8148210
6873 -8148210 -11298786 -13190794 -13634604 -12561446 -10251831 -7066979 -3365398 -435734
6865 -435734 -413960 -3622219 -6759074 -5921275 -1340679 2972161 4356399 3836155 2808885
6856 2808885 353477 -4182137 -8097788 -7764049 -3488768 518956 1141370 -621835 -1946681
$$ packed form
6919b749322k334947j742415K8199Q44191O05869j0033n75014r2124K274063M830380
6909A078847M222363n2937m127689m280718j263192J422493J967712J146027M9370
6900A62276q24929p59680P27584K441800K291646Q1590j828241j457320K07129
6891A041855O34745p93739k102213j630481k74206J54570j75638M06192J864924
6882h73991J879167n68172k911069k182298O88330J988251J66459k589947l744940
6873h148210l150576j892008m43810J073158K309615L184852L701581K929664
6865d35734K1774l208259l136855Q37799M580596M312840J384238n20244j027270
6856B808885k455408m535614l915651L33739M275281M007724O22414j763205j324846
$$ plain form
6847 -1946681 -1799212 -1464442 -2521949 -5097791 -7707166 -8556947 -7411363 -6067008 -6285255
6838 -6285255 -7465469 -7476840 -5798075 -4346185 -4584388 -5246968 -4158527 -1315496 1389231
6829 1389231 3040412 4617893 6873246 8758953 8688936 6505542 3533491 1238804 314364
6820 314364 517524 869340 475830 -367990 -378970 955445 2506908 3146999 3561807 5196322
6810 5196322 7630324 8396181 5803567 1006383 -3169622 -4750904 -3710488 -1435905
6802 -1435905 347043 782922 547128 777531 1117288 -149233 -3326664 -5833115 -4931155
6793 -4931155 -1412263 1033178 193922 -2311957 -3446308 -2248767 -202821 873789
6785 873789 260368 -1725356 -3978438 -4878147 -3490734 -959645 147398 -1355391 -3567920
$$ packed form
6847a946681J47469L34770j057507k575842k609375q49781J145584J344355k18247
6838f285255j180214j1371J678765J451890k38203o62580J088441K843031K704727
6829A389231J651181J577481K255353J885707p0017k183394k972051k294687r24440
6820C14364K03160L51816l93510q43820j0980J334415J551463O40091M14808J634515
6810E196322K434002P65857k592614m797184m176005j581282J040416K274583
6802a435905J782948M35879k35794K30403L39757j266521l177431k506451R01960
6793d931155L518892K445441q39256k505879j134351J197541K045946J076610
6785H73789o13421j985724k253082q99709J387413K531089J107043j502789k212529
$$ plain form
6776 -3567920 -3516838 -796853 1795256 1611882 -859098 -3230835 -4637022 -6385663 -9211504
6767 -9211504 -11522868 -11295850 -8725335 -5915452 -4474665 -4412621 -5008846 -5626011 -5735415
6758 -5735415 -5254159 -5087580 -6361945 -8688070 -10044813 -9053606 -6707226 -4960025 -4043246
6749 -4043246 -2419767 433354 2544800 1799801 -998408 -2936234 -2816866 -2545408 -4085353
6740 -4085353 -6695744 -8592140 -9960308 -12098793 -14205161 -13685246 -10025740 -5883752
6732 -5883752 -3385088 -1669280 438901 1613185 238589 -2099297 -2123213 658558 3395120
6723 3395120 3651506 1606761 -1317129 -3666822 -3576232 348234 6722401 11721824 12807235
6714 12807235 10924283 8437530 6424669 4804220 3512728 2318858 659689 -1196260
$$ packed form
6776c567920N1082K719985K592109j83374k470980k371737j406187j748641k825841
6767i211504k311364K27018K570515K809883J440787O2044n96225o17165j09404
6758e735415M81256J66579j274365k326125j356743R91207K346380J747201R16779
6749d043246J623479K853121K111446p44999k798209j937826J19368K71458j539945
6740d085353k610391j896396j368168k138485k106368N19915L659506M141988
6732e883752K498664J715808K108181J174284j374596k337886k3916K781771K736562
6723C395120K56386k044745k923890k349693R0590L924466O374167M999423J085411
6714A2807235j882952k486753k012861j620449j291492j193870j659169j855949
$$ plain form
6706 -1196260 -1875312 -792702 865571 2149831 3898624 6634135 8199955 5884531
6698 5884531 519642 -3870575 -4773825 -3498366 -2227726 -901312 1529191 4265756
6690 4265756 5191621 3880023 2213822 1623752 1172059 -771470 -4022026 -6976709 -8917566
6681 -8917566 -10409140 -11416417 -10685243 -7767701 -4371599 -2502914 -2111483 -1837392 -1353796
6672 -1353796 -1378228 -1768545 -1485309 -622192 -677638 -2169950 -3522384 -3247606 -1998381
6663 -1998381 -1331731 -1333754 -700884 1191342 3260017 3781754 2243066 340866 835392
6654 835392 4414490 7871711 7059554 2103206 -2141397 -1814659 1559775 3845604 3567886
6645 3567886 2092449 -95722 -4096852 -9525548 -13612056 -14436863 -13138794 -11794361
$$ packed form
6706a196260o79052J082610J658273J284260J748793K735511J565820k315424
6698E884531n364889m390217r03250J275459J270640J326414K430503K736565
6690D265756R25865j311598j666201n90070m51693j943529l250556k954683j940857
6681h917566j491574j007277P31174K917542L396102J868685L91431K74091M83596
6672a353796k4432l90317K83236Q63117n5446j492312j352434K74778J249225
6663a998381O66650k023O32870J892226K068675N21737j538688j902200M94526
6654H35392L579098L457221q12157m956348m244603L26738L374434K285829k77718
6645C567886j475437k188171m001130n428696m086508q24807J298069J344433
$$ plain form
6637 -11794361 -10647864 -8748663 -6247580 -4596832 -4767677 -6153169 -7064852 -5915758
6629 -5915758 -2440075 1713122 4097778 3815940 2423729 1995627 2688192 2871376 1413880
6620 1413880 -924881 -2498170 -2682403 -2522842 -3546027 -5966217 -8148272 -8112932 -5636340
6611 -5636340 -2519602 -645620 -223323 -255000 -180376 -339927 -1045000 -2014956 -2834282 -3251409
6601 -3251409 -2798442 -858008 2362551 5419813 6765941 5997374 3672342 606479 -1960140
6592 -1960140 -2423324 -565256 1068776 -670615 -5647057 -10269159 -11725283 -10740943 -9367188
6583 -9367188 -8018558 -6284547 -4913071 -4633309 -4024509 -1126740 3148466 5634670 5024724
6574 5024724 3197373 2239079 2313278 2878562 3786258 4407408 3734360 2331875 2315168 4259801
$$ packed form
6637a1794361J146497J899201K501083J650748j70845j385492r11683J149094
6629e915758L475683M153197K384656k81838j392211m28102O92565J83184j457496
6620A413880k338761j573289j84233J59561j023185k420190k182055L5340K476592
6611e636340L116738J873982M22297l1677P4624j59551p05073r69956q19326m17127
6601c251409M52967J940434L220559L057262J346128p68567k325032l065863k566619
6592a960140m63184J858068J634032j739391m976442m622102j456124R84340J373755
6583i367188J348630J734011J371476K79762O08800K897769M275206K486204o09946
6574E024724j827351r58294P4199N65284R07696O21150o73048j402485j6707J944633
$$ plain form
6564 4259801 5784277 4395777 403484 -3878824 -6355364 -5878393 -2709760 657655
6556 657655 1152617 -978759 -1840093 1001856 5085623 6639483 5598088 4653184 4995533
6547 4995533 5757229 6515312 7552676 8348205 8330671 8451730 9603642 10359014 9010582
6538 9010582 7036207 7368084 9620886 10419051 8523469 6160577 4761999 3039051 581159
6529 581159 -99812 2663107 6430262 7617799 6056534 4398618 4240319 4969072 5700354
6520 5700354 6366692 6994385 7274540 6985874 6138476 4694064 2447650 -838726 -4845669
6511 -4845669 -7773366 -6933758 -1884768 3435654 3872857 -1204589 -7134941 -9403556 -7936588
6502 -7936588 -5314626 -2962421 -687884 1573284 3436816 4870611 6065787 6921691
$$ packed form
6564D259801J524476j388500l992293m282308k476540M76971L168633L367415
6556F57655M94962k131376q61334K841949M083767J553860j041395r44904L42349
6547D995533P61696P58083J037364P95529j7534J21059J151912P55372j348432
6538I010582j974375L31877K252802P98165j895582k362892j398578j722948k457892
6529E81159o80971K762919L767155J187537j561265j657916j58299P28753P31282
6520E700354O66338O27693K80155k88666q47398j444412k246414l286376m006943
6511d845669k927697Q39608N048990N320422M37203n077446n930352k268615J466968
6502g936588K621962K352205K274537K261168J863532J433795J195176Q55904
$$ plain form
6494 6921691 7342293 7436519 7004678 5649831 3657333 1694671 -510884 -3779201 -7562079
6485 -7562079 -10171900 -11311973 -12327535 -13256786 -12053405 -8148315 -4495207 -3999047 -5610916
6476 -5610916 -6223573 -5204362 -4688749 -6029087 -8059054 -8644222 -6430881 -1550934 3885203
6467 3885203 6540883 4803452 848640 -1550798 -1050774 588703 1442074 1610383 2428562
6458 2428562 4534140 6981661 7947185 6551858 4109910 2874592 3457621 4591781 5499595
6449 5499595 6714230 8067564 8145405 7004493 7101889 9485937 11079367 8420839 2743217
6440 2743217 -1539346 -2582585 -2439943 -3012489 -3696096 -3492954 -2839933 -2301659 -1290339
6431 -1290339 804499 3378856 5360701 6409967 6746623 6254083 4228104 108445 -5381419
$$ packed form
6494F921691M20602R4226m31841j354847j992498j962662k205555l268317l782878
6485g562079k609821j140073j015562r29251J203381L905090L653108M96160j611869
6476e610916o12657J019211N15613j340338k029967n85168K213341M879947N436137
6467C885203K655680j737431l954812k399438N00024J639477Q53371J68309Q18179
6458B428562K105578K447521R65524j395327k441948j235318N83029J134160R07814
6449E499595J214635J353334P7841j140912R7396K384048J593430k658528n677622
6440B743217m282563j043239J42642n72546o83607K03142O53021N38274J011320
6431a290339K094838K574357J981845J049266L36656m92540k025979m119659n489864
$$ plain form
6422 -5381419 -10136806 -12635583 -13854974 -15736962 -17725922 -17113209 -13488285 -10040400
6414 -10040400 -8870687 -7954959 -5185471 -2459761 -2255110 -2686531 -496649 2682290 2283985
6405 2283985 -1368678 -2597645 1278772 5996372 6691496 4106894 1952311 1376200 1019463
6396 1019463 369158 214825 879427 1943549 2889507 2955361 1624432 55172 309781
6387 309781 2296090 3507838 2924795 2906220 5518803 8998546 9953630 7628044 3970836
6378 3970836 692227 -1659648 -2526578 -1387373 1058673 3111550 3576579 2564690 1285805
6369 1285805 1352688 3301658 5327474 4666112 902786 -3216074 -4867066 -3850830 -1733838
6360 -1733838 172831 1193139 1135700 710825 840228 879949 -929815 -4475570 -6982670
$$ packed form
6422e381419m755387k498777j219391j881988j988960O12713L624924L447885
6414a0040400J169713R15728K769488K725710K04651m31421K189882L178939l98305
6405B283985l652663j228967L876417M717600O95124k584602k154583n76111l56737
6396A019463o50305j54333O64602J064122R45958O5854j330929j569260K54609
6387C09781J986309J211748n83043j8575K612583L479743R55084k325586l657208
6378C970836l278609k351875q66930J139205K446046K052877M65029j011889j278885
6369A285805O6883J948970K025816o61362l763326m118860j650992J016236K116992
6360a733838J906669J020308n7439m24875J29403L9721j809764l545755k507100
$$ plain form
6351 -6982670 -6338555 -3693995 -1671869 -1429710 -2467946 -3786866 -4212576 -3120398 -1704143
6342 -1704143 -1785538 -2653336 -1415875 2392211 5208492 4196786 1126863 -589111 -441167
6333 -441167 -78268 -162133 -506219 -1469174 -2685648 -2297622 -43977 967963 -1394620
6324 -1394620 -4173771 -3028827 1581293 5566889 7065350 7197587 6341958 4210123 2917422
6315 2917422 5071417 8624280 8366765 3348459 -1624002 -2984716 -2475841 -2600954 -2407535
6306 -2407535 -406841 1843990 2065339 631815 -963281 -2778682 -5107839 -6557177
6298 -6557177 -5975237 -4666865 -4379677 -4547914 -3656735 -1893977 -363006 894091 1971029
6289 1971029 1709703 -331363 -1770718 64687 4214792 7160074 7311363 6070770 4841064
$$ packed form
6351f982670O44115K644560K022126K42159j038236j318920m25710J092178J416255
6342a704143q1395q67798J237461L808086K816281j011706l069923j715974J47944
6333d41167L62899q3865l44086r62955j216474L88026K253645J011940k362583
6324a394620k779151J144944M610120L985596J498461J32237q55629k131835j292701
6315B917422K153995L552863k57515n018306m972461j360714N08875j25113J93419
6306b407535K000694K250831K21349j433524j595096j815401k329157j449338
6298f557177N81940J308372K87188j68237Q91179J762758J530971J257097J076938
6289A971029k61326k041066j439355J835405M150105K945282J51289j240593j229706
$$ plain form
6280 4841064 3538864 2166980 1439526 1260423 551957 -684563 -842613 823460 2521637
6271 2521637 1807764 -1548881 -5366342 -7220417 -6242939 -3241123 216311 2766109 3738696
6262 3738696 3189547 1866132 1059779 1769513 3560758 4746930 4257552 2937838 2380350
6253 2380350 2803206 2880465 1648415 -159710 -991781 -300842 924459 1462135 1305778
6244 1305778 1309642 1460896 502447 -1970592 -3911790 -2808249 944126 4250126 5120005
6235 5120005 4617832 4401009 4049348 2180112 -965456 -3643358 -4786184 -4789835 -4530737
6226 -4530737 -4739384 -5945438 -7799573 -8656430 -7094874 -3898657 -1384428 -613173 -459514
6217 -459514 114063 105904 -2041038 -5557545 -7376952 -5434441 -955839 3298753 6269729
$$ packed form
6280D841064j302200j371884p27454j79103p08466j236520j58050J666073J698177
6271B521637p13873l356645l817461j854075R77478L001816L457434K549798R72587
6262C738696n49149j323415q06353P09734J791245J186172m89378j319714n57488
6253B380350M22856P7259j232050j808125q32071O90939J225301N37676j56357
6244A305778L864J51254r58449k473039j941198J103541L752375L306000Q69879
6235E120005n02173k16823l51661j869236l145568k677902j142826l651K59098
6226d530737k08647j206054j854135q56857J561556L196217K514229P71255J53659
6217d59514N73577q159k146942l516507j819407J942511M478602M254592K970976
$$ plain form
6208 6269729 8731907 10574973 10078078 6859547 3731092 3710060 6200604 8206530 8598447
6199 8598447 8650160 8577055 6632952 2591720 -619300 -486827 1897221 3979556 5224041
6190 5224041 6292374 6324354 3858587 -49468 -2308391 -1763172 -720959 -1888889 -5205317
6181 -5205317 -8372487 -9501229 -8503922 -6444334 -4252105 -2265228 -878196 -970293 -2775675
6172 -2775675 -4580984 -4058622 -1324527 879971 836658 35287 543401 1902532 2338055
6163 2338055 1522874 27865 -2640957 -6833112 -10404746 -10493384 -7560075 -4995482 -4478202
6154 -4478202 -4261269 -2472985 487773 3608440 6704617 8964454 8492619 5136268 1891375
6145 1891375 1427386 2538776 2155575 -72002 -1507870 -581638 1131266 1479967 792388
$$ packed form
6208F269729K462178J843066m96895l218531l128455k1032K490544K005926L91917
6199H598447N1713p3105j944103m041232l211020J32473K384048K082335J244485
6190E224041J068333L1980k465767l908055k258923N45219J042213j167930l316428
6181e205317l167170j128742R97307K059588K192229J986877J387032r2097j805382
6172b775675j805309N22362K734095K204498m3313q01371N08114J359131M35523
6163B338055q15181j495009k668822m192155l571634q8638K933309K564593N17280
6154d478202K16933J788284K960758L120667L096177K259837m71835l356351l244893
6145A891375m63989J111390l83201k227577j435868R26232J712904L48701o87579
$$ plain form
6136 792388 1263668 3987097 7624874 9994898 10180018 8648652 5934523 2324702 -1084035
6127 -1084035 -2444312 -1272773 434327 428688 -1122172 -2424034 -2679080 -2293118 -1294225
6118 -1294225 228885 583789 -1881896 -5363821 -5697720 -1796083 2652052 4156358 3446554
6109 3446554 2813222 2148580 312918 -1544947 -1236349 792982 1907039 1077554 -124424
6100 -124424 -88713 1370755 3751450 5950788 6033089 3227113 -114350 -1046667 -417153
6091 -417153 -1910200 -6407052 -10390758 -11043437 -9938403 -9812234 -10254282 -9181871 -6812363
6082 -6812363 -5199889 -4595731 -3142919 -342981 1563134 516615 -2575939 -4882177
6074 -4882177 -4613856 -2341530 5392 873651 171490 -924735 -1226525 -568806 442121
$$ packed form
6136G92388M71280K723429L637777K370024J85120j531366k714129l609821l408737
6127a084035j360277J171539J707100n639j550860j301862k55046L85962R98893
6118a294225J523110L54904k465685l481925l33899L901637M448135J504306p09804
6109C446554o33332o64642j835662j857865L08598K029331J114057q29485j201978
6100a24424L5711J459468K380695K199338Q2301k805976l341463r32317O29514
6091d17153j493047m496852l983706o52679J105034J26169m42048J072411K369508
6082f812363J612474O04158J452812K799938J906115j046519l092554k306238
6074d882177K68321K272326K346922Q68259p02161j096225l01790O57719J010927
$$ plain form
6065 442121 1274691 1581937 858660 -1094952 -3222041 -3523296 -926189 3365112 6788690
6056 6788690 7692653 6515186 4816429 3542378 2537230 1485154 563598 -180166 -1376109
6047 -1376109 -3360778 -5000197 -4655068 -2487322 -686943 -897880 -2399272 -3545546 -4050537
6038 -4050537 -4727832 -5592534 -5626056 -4437994 -2994513 -2317907 -2226690 -1802030 -656041
6029 -656041 627623 1120536 473407 -643050 -1047265 -188088 1275683 2143933 1731940
6020 1731940 231689 -1459071 -2042006 -720802 1560939 2514778 1141463 -564378 186555
6011 186555 3321784 5916917 6029523 5028797 5433343 7643223 9802920 10116879 8282646
6002 8282646 5119346 1819118 -522363 -1458478 -1492356 -1487982 -1747280 -1891110 -1595228 -1201451
$$ packed form
6065D42121Q32570L07246p23277j953612k127089l01255K597107M291301L423578
6056F788690R03963j177467j698757j274051j005148j052076r21556p43764j195943
6047a376109j984669j639419L45129K167746J800379k10937j501392j146274n04991
6038d050537o77295q64702l3522J188062J443481O76606R1217M24660J145989
6029f56041J283664M92913o47129j116457m04215Q59177J463771Q68250m11993
6020A731940j500251j690760n82935J321204K281741R53839j373315j705841P50933
6011A86555L135229K595133J12606j000726M04546K209880K159697L13959j834233
6002H282646l163300l300228k341481r36115l3878M374k59298j43830K95882L93777
$$ plain form
5992 -1201451 -1451882 -2469966 -3029110 -1412462 2419760 5928961 6136610 2568714 -2609404
5983 -2609404 -6904852 -8758972 -7119924 -2020799 3909226 6725066 5303993 2611755
5975 2611755 1525872 1148149 -858112 -3907740 -5186984 -3970245 -2440896 -2211060 -2627734
5966 -2627734 -2957209 -3701485 -4739138 -4409360 -1984030 597561 1154152 282141 257556
5957 257556 1680072 2990090 3146128 3133333 4297390 6197031 6948981 5553300 3312500
5948 3312500 2520187 3772007 5195627 4796914 2917921 1450356 1137393 1020036 370964
5939 370964 -470962 -1429987 -3087211 -5037183 -5542392 -3950235 -1988531 -1300853 -1063176
5930 -1063176 207040 1607195 870657 -2002039 -4476091 -5137307 -5491437 -7200729 -9230566
$$ packed form
5992a201451k50431j018084n59144J616648L832222L509201K07649l567896n178118
5983b609404m295448j854120J639048N099125N930025K815840j421073k692238
5975B611755j085883l77723k006261l049628j279244J216739J529349K29836m16674
5966b627734l29475p44276j037653L29778K425330K581591N56591q72011k4585
5957B57556J422516J310018J56038j2795J164057J899641P51950j395681k240800
5948C312500p92313J251820J423620l98713j878993j467565l12963j17357o49072
5939C70964q41926r59025j657224j949972n05209J592157J961704O87678K37677
5930a063176J270216J400155p36538k872696k474052o61216l54130j709292k029837
$$ plain form
5921 -9230566 -9247556 -6988321 -4649930 -3992693 -4365553 -4148983 -3250951 -3045861 -3939019
5912 -3939019 -4270802 -2446479 722447 3122225 4347372 5882703 8087055 8918951 6700238
5903 6700238 2611054 -982316 -3461676 -5513610 -6699710 -5641281 -2501526 689302
5895 689302 2571235 3746459 5020180 5782898 5030749 3053806 1141954 -21494 -1029517
5886 -1029517 -2893179 -5719038 -8201460 -8679048 -7026393 -5082016 -4570050 -5013224 -4562309
5877 -4562309 -2507892 149839 2383772 4015638 4831961 4292694 2647995 1143747 456433
5868 456433 -58217 -865851 -996537 786430 4241934 7949478 10803610 12358096 12202615
5859 12202615 10124854 6910374 4130969 2814698 2612436 2309217 950770 -1362525
$$ packed form
5921i230566j6990K259235K338391O57237l72860K16570Q98032K05090q93158
5912c939019l31783J824323L168926K399778J225147J535331K204352Q31896k218713
5903F700238m089184l593370k479360k051934j186100J058429L139755L190828
5895F89302J881933J175224J273721P62718p52149j976943j911852j163448j008023
5886a029517j863662k825859k482422m77588J652655J944377N11966m43174M50915
5877d562309K054417K657731K233933J631866Q16323n39267j644699j504248o87314
5868D56433n14650q07634j30686J782967L455504L707544K854132J554486j55481
5859A2202615k077761l214480k779405j316271k02262l03219j358447k313295
$$ plain form
5851 -1362525 -3440130 -3851360 -2208284 302920 1873336 1676319 555352 184289 1517256
5842 1517256 3890738 5565026 5233126 3093007 571708 -765460 -51635 2576792 5993431
5833 5993431 8573688 9164358 7675744 4694919 897781 -2858469 -5350362 -5616034 -3809315
5824 -3809315 -1155806 821101 1055654 -320497 -1555623 -457349 3113452 6513610
5816 6513610 6990576 4524662 1104751 -1944207 -4411319 -5661956 -4733246 -2128669 244582
5807 244582 1328939 1628896 1475552 432995 -959045 -828170 1357219 3261861 2399396
5798 2399396 -570762 -2774333 -2815989 -2192505 -3156791 -6098036 -9052249 -9484612 -6929058
5789 -6929058 -3930308 -3422212 -4938319 -4864062 -1204430 3546543 5748956 5371238 5227310
$$ packed form
5851a362525k077605m11230J643076K511204J570416j97017j120967l71063J332967
5842A517256K373482J674288l31900k140119k521299j337168P13825K628427L416639
5833E993431K580257N90670j488614k980825l797138l756250k491893k65672J806719
5824c809315K653509J976907K34553j376151j235126J098274L570801L400158
5816F513610M76966k465914l419911l048958k467112j250637R28710K604577K373251
5807B44582J084357K99957j53344j042557j392040J30875K185389J904642q62465
5798B399396k970158k203571m1656O23484r64286k941245k954213m32363K555554
5789f929058K998750N08096j516107P4257L659632M750973K202413l77718j43928
$$ plain form
5780 5227310 6235156 6042274 2773988 -1968603 -4971958 -5094558 -4041656 -3985737 -5073740
5771 -5073740 -5120583 -1775924 4487491 9774752 10256533 6457250 2883722 2875465 5095229
5762 5095229 6091891 5023864 3965133 4081728 3888588 1994723 -407622 -1286986 -691326
5753 -691326 -77651 516966 2475356 5791886 8373802 8760271 7819419 7004273 6562443
5744 6562443 6323325 6482926 6396394 4332207 -60451 -4704446 -8150245 -11709971 -16283160
5735 -16283160 -19140115 -17214349 -12271256 -8994688 -8520093 -7804871 -5274539 -2760881
5727 -2760881 -1188866 1194951 4764447 6910594 6639328 6753761 8673302 8922346 4504432
5718 4504432 -1346371 -3175123 -1030119 265121 -1618093 -4296670 -5305478 -4911203
$$ packed form
5780E227310J007846j92882l268286m742591l003355j22600J052902N5919j088003
5771e073740m6843L344659O263415N287261M81781l799283l573528q257K219764
5762E095229R96662j068027j058731J16595j93140j893865k402345q79364N95660
5753f91326O13675N94617J958390L316530K581916L86469r40852q15146m41830
5744F562443k39118J59601q6532k064187m392658m643995l445799l559726m573189
5735a6283160k856955J925766M943093L276568M74595P15222K530332K513658
5727b760881J572015K383817L569496K146147k71266J14433J919541K49044m417914
5718D504432n850803j828752K145004J295240j883214k678577j008808L94275
$$ plain form
5710 -4911203 -4039439 -2836652 -1881235 -1987136 -2259845 -849713 1946371 3770765 3834445
5701 3834445 4013857 5546959 6791776 5418286 1503780 -2339379 -3173541 -144705 4376805
5692 4376805 6590408 5368591 3637510 4151045 5324745 3751603 -317932 -3216796
5684 -3216796 -3108142 -1687505 -681833 -23091 140065 -935877 -2113354 -831552 2724943
5675 2724943 4958098 3785938 1400756 586318 1134093 1788421 3041649 5633617 8361022
5666 8361022 9717277 10117399 10524066 10457761 9244050 7599244 6034112 3287098 -1529434
5657 -1529434 -6518713 -8738525 -7307688 -3298559 1880640 6285126 7566270 5735048
5649 5735048 4244930 5686835 7727468 6267193 1697306 -1238536 344598 4395487
$$ packed form
5710d911203Q71764J202787R55417j05901k72709J410132K796084J824394O3680
5701C834445J79412J533102J244817j373490l914506l843159q34162L028836M521510
5692D376805K213603j221817j731081N13535J173700j573142m069535k898864
5684c216796J08654J420637J005672O58742J63156j075942j177477J281802L556495
5675B724943K233155j172160k385182q14438N47775O54328J253228K591968K727405
5666H361022J356255M00122M06667o6305j213711j644806j565132k747014m816532
5657a529434m989279k219812J430837M009129N179199M404486J281144j831222
5649E735048j490118J441905K040633j460275m569887k935842J583134M050889
$$ plain form
5641 4395487 7367515 8045928 7191346 5609384 3755892 1952515 157610 -1673709 -2770153
5632 -2770153 -2038188 424440 3108338 4486079 4124469 2725498 1578670 1374383 1088204
5623 1088204 -900660 -3990631 -5364794 -4077317 -3155962 -5461270 -9131326 -9966998 -7221753
5614 -7221753 -3928220 -2203888 -1648111 -2158495 -4532153 -7546556 -8009143 -5183852 -2262217
5605 -2262217 -1885625 -2929151 -3469068 -4169603 -6262078 -8353345 -8123722 -5871180 -3686455
5596 -3686455 -2025208 310241 3378541 5900937 7704433 9843589 11937771 11711455
5588 11711455 8146574 3416688 593907 561906 2097587 3901975 5302955 5562711 3919585
5579 3919585 600163 -2969874 -5413882 -6627125 -7457579 -8250626 -8110571 -5968621 -2229720
$$ packed form
5641D395487K972028O78413q54582j581962j853492j803377j794905j831319j096444
5632b770153P31965K462628K683898J377741l61610j398971j146828k04287k86179
5623A088204j988864l089971j374163J287477R21355k305308l670056q35672K745245
5614g221753L293533J724332N55777n10384k373658l014403m62587K825291K921635
5605b262217L76592j043526n39917p00535k092475k091267K29623K252542K184725
5596c686455J661247K335449L068300K522396J803496K139156K094182k26316
5588A1711455l564881m729886k822781l2001J535681J804388J400980K59756j643126
5579C919585l319422l570037k444008j213243q30454p93047J40055K141950L738901
$$ plain form
5570 -2229720 1332061 3726619 6237146 10867209 17318382 22456523 23340616 20257254
5562 20257254 16104352 13129325 11180334 9198986 7313493 6588681 7190763 7844094 7252290
5553 7252290 5357650 2961825 732568 -983385 -1812154 -1414667 123356 2237325 4207416
5544 4207416 5461536 5711625 4951542 3398641 1613219 590694 965612 1609891 33488
5535 33488 -4379208 -8129994 -6775049 -703641 4432523 4176472 214639 -2684308 -2765489
5526 -2765489 -1911168 -1511126 -899915 116579 169359 -1254735 -2502611 -2110446 -869937
5517 -869937 -392857 -1054700 -2600868 -5357546 -9066408 -11422453 -9913509 -5227004 -1129018
5508 -1129018 -272458 -1210986 -480846 2902241 6090445 5764238 2112508 -1331586 -1770989
$$ packed form
5570b229720L561781K394558K510527M630063O451173N138141Q84093l083362
5562B0257254m152902k975027j948991j981348j885493p24812O02082O53331n91804
5553G252290j894640k395825k229257j715953q28769L97487J538023K113969J970091
5544D207416J254120K50089p60083j552901j785422j022525L74918O44279j576403
5535C3488m412696l750786J354945O071408N136164k56051l961833k898947q1181
5526b765489Q54321M00042O11211J016494N2780j424094j247876L92165J240509
5517h69937M77080o61843j546168k756678l708862k356045J508944M686505M097986
5508a129018Q56560r38528P30140L383087L188204l26207l651730l444094m39403
$$ plain form
5499 -1770989 -183073 275988 -1749751 -4474167 -5512571 -4670138 -3716836 -4070727 -5313312
5490 -5313312 -5714838 -3813823 320325 5035277 8350225 9424060 8764343 7143613 4766587
5481 4766587 1705368 -1207952 -2436159 -972759 2394088 5241681 5394346 2880515
5473 2880515 -242995 -2114797 -2635469 -2655733 -2467771 -1843814 -907356 72558 1380777
5464 1380777 3257214 4841651 4939283 3799339 2827910 2388086 1355548 -625577 -1976574
5455 -1976574 -1330841 396322 1514906 2235014 3993963 6385300 6833324 4010644 -98715
5446 -98715 -2824546 -4279227 -6383467 -8974132 -9196230 -5449559 3675 3810499 5503562
5437 5503562 6853011 8279349 8414220 7083240 6059684 6112325 5706349 3941964 2652083
$$ packed form
5499a770989J587916M59061k025739k724416j038404Q42433R53302l53891j242585
5490e313312m01526J901015M134148M714952L314948J073835o59717j620730k377026
5481D766587l061219k913320j228207J463400L366847K847593J52665k513831
5473B880515l123510j871802n20672k0264J87962O23957R36458R79914J308219
5464A380777J876437J584437R7632j139944r71429m39824j032538j981125j350997
5455a976574O45733J727163J118584P20108J758949K391337M48024k822680m109359
5446i8715k725831j454681k104240k590665k22098L746671N453234L806824J693063
5437E503562J349449J426338J34871j330980j023556N2641m05976j764385j289881
$$ plain form
5428 2652083 3757259 6207706 7613358 7596158 7302266 6663454 4697384 1993662 344723
5419 344723 11705 -248028 -408109 1015564 3876661 5531851 4044567 407128 -3243473
5410 -3243473 -5802814 -6767180 -5601965 -2866380 -498833 281755 231592 383399 493501
5401 493501 159646 8999 553746 1123379 1073330 801571 534821 -367038 -1664702 -1557639
5391 -1557639 541417 2218450 1160117 -1433092 -3012029 -3938408 -6443089 -9962280
5383 -9962280 -11090815 -8698318 -5839442 -5283727 -5908422 -5397354 -4302558 -4925518 -7297880
5374 -7297880 -8736943 -7260247 -3619274 254118 3398790 5901138 7687590 7908848
5366 7908848 5554653 848491 -3843849 -5170634 -1733472 4249765 8923200 10361733
$$ packed form
5428B652083J105176K450447J405652j7200k93892o38812j966070k703722j648939
5419C44723l33018k59733j60081J423673K861097J655190j487284l637439l650601
5410c243473k559341r64366J165215K735585K367547P80588n0163J51807J10102
5401D93501l33855j50647N44747N69633n0049k71759k66750r01859j297664J07063
5391a557639K099056J677033j058333k593209j578937r26379k504681l519191
5383i962280j128535K392497K858876N55715o24695N11068J094796o22960k372362
5374g297880j439063J476696L640973L873392L144672K502348J786452K21258
5366G908848k354195m706162m692340j326785L437162N983237M673435J438533
$$ plain form
5358 10361733 9533949 8023661 6108693 3614447 1516127 1358844 3193307 5124673
5350 5124673 5322328 3965971 2748629 2658890 2772785 1558343 -775785 -1916166 -110131
5341 -110131 3129805 4295672 2403284 902575 3596238 9393070 13110719 11584918
5333 11584918 7013553 3573653 2670158 2943742 3413424 4451154 6114260 7475620 7899691
5324 7899691 7697403 7155994 5838760 3253788 -277760 -3644026 -5668201 -5993605 -5399960
5315 -5399960 -4828417 -4038387 -2058889 887395 3222889 4290060 5169170 6243176 5817108
5306 5817108 2887679 -430346 -1600947 -1476595 -2687912 -5199816 -6633642 -6569081 -6967509
5297 -6967509 -7930903 -6679743 -2169780 2365292 3582735 2536661 2765906 5255921 7385019
$$ packed form
5358A0361733q27784j510288j914968k494246k098320j57283J834463J931366
5350E124673J97655j356357j217342q9739J13895j214442k334128j140381J806035
5341a10131L239936J165867j892388j500709K693663N796832L717649j525801
5333A1584918m571365l439900r03495K73584M69682J037730J663106J361360M24071
5324G899691k02288n41409j317234k584972l531548l366266k024175l25404N93645
5315e399960N71543P90030J979498K946284K335494J067171Q79110J074006m26068
5306E817108k929429l318025j170601J24352j211317k511904j433826O4561l98428
5297f967509r63394J251160M509963M535072J217443j046074K29245K490015K129098
$$ plain form
5288 7385019 6314353 2054413 -2528601 -4163665 -2188282 764996 1932768 1778541
5280 1778541 2456449 3505460 2074826 -2038452 -4871730 -3521277 -170425 1346187
5272 1346187 888655 1366669 4079722 7109301 7757776 4943130 -163175 -4667842 -6057598
5263 -6057598 -4821109 -3884584 -4742789 -5902503 -6019681 -6133304 -7123863 -7398032 -5385424
5254 -5385424 -2214169 583014 3882742 8495704 11845069 10857953 7098453 5242140
5246 5242140 6819013 8974918 9330057 8517308 7503302 5830058 3586643 2326642 2810362
5237 2810362 4079024 5683529 8430439 11707531 12487953 8987117 3788425 1289376
5229 1289376 2754398 5567326 6985606 6943410 6800121 6712956 5576352 3319061 1706146
$$ packed form
5288G385019j070666m259940m583014j635064J975383K953278J167772j54227
5280A778541O77908J049011j430634m113278k833278J350453L350852J516612
5272A346187m57532M78014K713053L029579O48475k814646n106305m504667j389756
5263f057598J236489R36525q58205j159714j17178j13623r90559k74169K012608
5254e385424L171255K797183L299728M612962L349365r87116l759500j856313
5246E242140J576873K155905L55139q12749j014006j673244k243415j260001M83720
5237B810362J268662J604505K746910L277092P80422l500836n198692k499049
5229A289376J465022K812928J418280m2196j43289q7165j136604k257291j612915
$$ plain form
5220 1706146 1946982 2747117 2474174 2376292 4984156 9339199 11007501 7914945 3106307
5211 3106307 36645 -1728586 -3699955 -4542630 -2541013 405951 1369914 1406526 3701193
5202 3701193 7658867 9337857 7645577 5765762 5893421 6569911 6265634 5944072 6559491
5193 6559491 7019749 6288628 5227943 5022677 5665363 6850469 8490625 9824523 10017897
5184 10017897 9932680 11051901 12495307 11742487 8663170 6005779 5348006 5491837 5517367
5175 5517367 6170936 7093331 5987065 2329041 -907025 -1199663 187992 604384 -500985
5166 -500985 -2248404 -4308707 -6299179 -7054102 -6274021 -5255441 -4545919 -2758837 803892
5157 803892 4385327 6327310 7480205 9314488 11447239 12790651 13334496 12993591 10611863
$$ packed form
5220A706146K40836Q00135k72943r7882K607864M355043J668302l092556m808638
5211C106307l069662j765231j971369q42675K001617K946964R63963L6612K294667
5202C701193L957674J678990j692280j879815J27659O76490l04277l21562O15419
5193F559491M60258p31121j060685k05266O42686J185106J640156J333898J93374
5184A0017897q5217J119221J443406p52820l079317k657391o57773J43831K5530
5175E517367O53569R22395j106266l658024l236066k92638J387655M16392j105369
5166e00985j747419k060303j990472p54923P80081J018580P09522J787082L562729
5157H03892L581435J941983J152895J834283K132751J343412N43845l40905k381728
$$ plain form
5148 10611863 6232390 2642582 2304473 3984280 4570059 3129318 1163499 -28951
5140 -28951 -121138 1156806 3514812 5255877 4890478 3248282 2335832 2468780 2149937
5131 2149937 624739 -928352 -986218 442073 1801304 1591831 -10265 -1323276 -1286788
5122 -1286788 -777352 -905220 -937253 403736 2381780 3247065 3193234 3579065 3591012 1083744
5112 1083744 -2990229 -4692745 -2637120 148899 1235126 2016461 4061733 5826441
5104 5826441 5555788 4437103 4166821 4037791 3107869 2676193 3749050 4454434 3047196
5095 3047196 1396171 2319276 5162882 7099132 7368643 7296658 7331479 6864355 6055861
5086 6055861 5512136 5134313 5138808 6726530 9831360 11961329 11317307 9249879 7715484
$$ packed form
5148A0611863m379473l589808l38109J679807N85779j440741j965819j192450
5140b8951r2187J277944K358006J741065l65399j642196r12450J32948l18843
5131B149937j525198j553091n7866J428291J359231k09473j602096j313011L6488
5122a286788N09436j27868l2033J340989J978044Q65285n3831L85831J1947k507268
5112A083744m073973j702516K055625K786019J086227P81335K045272J764708
5104E826441k70653j118685k70282j29030r29922m31676J072857P05384j407238
5095C047196j651025R23105K843606J936250K69511p1985L4821m67124q08494
5086F055861n43725l77823M495J587722L104830K129969o44022k067428j534395
$$ plain form
5077 7715484 6522165 5177164 4803911 5570628 4833898 870293 -3948604 -6715367 -8085437
5068 -8085437 -9526399 -9433854 -6224209 -2872996 -3600598 -7511214 -9935783 -8916783 -6269254
5059 -6269254 -3449349 -488313 2046122 3849117 6281947 9291336 9075545 3466500
5051 3466500 -2390868 -1284894 6278431 13001172 14580173 12896681 10194991 6515985
5043 6515985 3383842 3845678 7330238 9507763 8512897 6712951 5601183 3981557 2147528
5034 2147528 2642194 5545749 7999238 9593347 12842487 16800112 16133544 9273876 2186388
5025 2186388 732573 3712929 6599809 7834962 7967665 6495832 3433909 1044195
5017 1044195 625073 211531 -1665088 -2819337 -1060719 1696494 2169414 364660 -1416294
$$ packed form
5077G715484j193319j345001l73253P66717p36730l963605m818897k766763j370070
5068h085437j440962R2545L209645L351213p27602l910616k424569J019000K647529
5059f269254K819905K961036K534435J802995K432830L009389k15791n609045
5051C466500n857368J105974P563325O722741J579001j683492k701690l679006
5043F515985l132143M61836L484560K177525r94866j799946j111768j619626j834029
5034B147528M94666K903555K453489J594109L249140L957625o66568o859668p087488
5025B186388j453815K980356K886880J235153J32703j471833l061923k389714
5017A044195m19122m13542j876619j154249J758618K757213M72920j804754j780954
$$ plain form
5008 -1416294 -2274946 -2743816 -2856442 -2540335 -2367887 -2109882 -365397 2838694 5247647
4999 5247647 5654126 5563919 6156210 6342018 5497059 5176981 6186445 6894524 6505095 6869098
4989 6869098 8651706 8881529 5280009 310509 -2183320 -2014053 -1235854 99154 3315548
4980 3315548 7607910 10259537 9746059 6695312 2865273 704526 2265898 6801121
4972 6801121 10934281 12516810 12411027 11511193 8978014 5230563 3525670 5792550 9289278
4963 9289278 10157974 8302935 6187961 4829520 3802134 3599649 5099984 7508652 8980198
4954 8980198 8692384 7138380 5506076 5533806 8249652 12120166 14465474 15177649 16426755
4945 16426755 18284631 18152203 15638521 14256165 16391384 19857852 21337022 20232105
$$ packed form
5008a416294q58652m68870j12626L16107J72448K58005J744485L204091K408953
4999E247647M06479r0207N92291J85808q44959l20078J009464P08079l89429L64003
4989F869098J782608K29823l601520m969500k493829J69267P78199J335008L216394
4980C315548M292362K651627n13478l050747l830039k160747J561372M535223
4972F801121M133160J582529j05783q99834k533179l747451j704893K266880L496728
4963I289278Q68696j855039k114974j358441j027386k02485J500335K408668J471546
4954H980198k87814j554004j632304K7730K715846L870514K345308P12175J249106
4945A6426755J857876j32428k513682j382356K135219L466468J479170j104917
$$ plain form
4937 20232105 17548356 14221329 12116705 13232883 16281069 17481221 16038281 14995900
4929 14995900 15647643 15823567 15097149 16298414 19776351 21730708 20785742 20473159 22254944
4920 22254944 22175799 18139048 14497246 15100441 17401195 17879541 17725874 18536349 18054929
4911 18054929 15178876 13685047 15876544 17897360 16282339 13535741 12422151 11005555
4903 11005555 8430950 8729756 13265848 16651168 16049077 16554289 20959517 23235662 19755501
4894 19755501 17260701 20742974 23617954 20367692 18423621 25328492 34390752 36505607
4886 36505607 35961094 40170561 44832994 45207982 49622038 63191509 72183294 67179022
4878 67179022 66283449 86862035 111274865 119290235 138496233 205986899 279683403 255267840
$$ packed form
4937B0232105k683749l327027k104624J116178L048186J200152j442940j042381
4929A4995900O51743J75924p26418J201265L477937J954357r44966l12583J781785
4920B2254944p9145m036751l641802O03195K300754M78346j53667Q10475m81420
4911A8054929k876053j493829K191497K020816j615021k746598j113590j416596
4903A1005555k574605K98806M536092L385320o02091N05212M405228K276145l480161
4894A9755501k494800L482273K874980l250262j944071O904871R062260K114855
4886C6505607n44513M209467M662433L74988M414056J3569471Q991785n004272
4878F7179022q95573K0578586K4412830Q015370J9205998O7490666P3696504k4415563
$$ plain form
4870 255267840 100661082 -81123684 -166359788 -147457042 -108795675 -101325604 -102852415
4863 -102852415 -87893908 -70874834 -68375986 -68148291 -56750545 -44620266 -44091870 -47428561
4855 -47428561 -43950220 -38819123 -39280652 -39304410 -32402981 -25345305 -25759539 -28386572 -25744095
4846 -25744095 -21298105 -20613261 -19756077 -13978634 -8918562 -11708220 -18224519 -19890359
4838 -19890359 -17108827 -16070766 -17483924 -17844181 -17571648 -19168768 -20696086 -18757217
4830 -18757217 -15015938 -13129651 -12334003 -10265948 -8946743 -11756997 -17131418 -20861063
4822 -20861063 -22129975 -22294958 -20659286 -16674567 -13528258 -14139912 -15781332 -13699694
4814 -13699694 -8231927 -3778145 -2507879 -3289012 -5029294 -7003919 -7502237 -5851042
$$ packed form
4870B55267840j54606758j81784766q5236104J8902746L8661367P470071j526811
4863a02852415J4958507J7019074K498848K27695J1397746J2130279N28396l336691
4855d7428561L478341N131097m61529k3758O901429P057676m14234k627033K642477
4846b5744095M445990O84844Q57184N777443N060072k789658o516299j665840
4838a9890359K781532J038061j413158l60257K72533j597120j527318J938869
4830a8757217L741279J886287P95648K068055J319205k810254n374421l729645
4822b0861063j268912j64983J635672L984719L146309o11654j641420K081638
4814a3699694N467767M453782J270266p81133j740282j974625m98318J651195
$$ plain form
4806 -5851042 -4211970 -4275653 -4281886 -2369208 -277817 -310601 -1344510 -1627493 -2785439
4797 -2785439 -6758482 -11131552 -12115442 -10373315 -9354198 -9306046 -7512907 -3500154 354581
4788 354581 2740277 3874997 2684338 -2226255 -8756265 -12380380 -11628733 -9427990 -8567922
4779 -8567922 -8661766 -8139979 -6771086 -5419486 -4939030 -5632792 -6643436 -6266236 -4142769
4770 -4142769 -2371423 -2949352 -5039963 -6431054 -6668581 -6843273 -7184996 -6913521 -5908881
4761 -5908881 -4799311 -3936177 -3611558 -4343980 -5620316 -5649396 -3932440 -2685821 -3952102
4752 -3952102 -6676900 -8474813 -8837906 -8647612 -8054039 -7038871 -6650567 -7395835 -7738220
4743 -7738220 -6413238 -4774882 -4588228 -5240849 -5710449 -7249085 -10754207 -13247840 -11045010
$$ packed form
4806e851042J639072o3683o233J912678K091391l2784j033909k82983j157946
4797b785439l973043m373070r83890J742127J019117M8152J793139M012753L854735
4788C54581K385696J134720j190659m910593o530010l624115P51647K200743Q60068
4779h567922r3844N21787J368893J351600M80456o93762j010644L77200K123467
4770d142769J771346n77929k090611j391091k37527j74692l41723K71475J004640
4761e908881J109570Q63134L24619p32422j276336k9080J716956J246619j266281
4752c952102k724798j797913l63093J90294N93573J015168L88304p45268l42385
4743g738220J324982J638356J86654o52621m69600j538636l505122k493633K202830
$$ plain form
4734 -11045010 -5503614 -1598789 -1266208 -2096604 -2249978 -2306665 -2009846 274638 3725872
4725 3725872 4888462 3011417 1806037 3808767 6422199 6113102 3625134 2101928
4717 2101928 2343272 3056864 4084024 5947027 7002595 4403402 -1810734 -8016275 -10875746
4708 -10875746 -10098130 -7149464 -3318746 85308 1447292 381130 -1195975 -941160
4700 -941160 1109506 2602989 1645936 -1413674 -4935252 -7543002 -8414870 -7345737 -5467362
4691 -5467362 -4824244 -5914749 -6503655 -4493078 -1251005 24574 -1119758 -2056064 -1516332
4682 -1516332 -1344813 -2662835 -3327951 -1450170 997842 936801 -1195566 -2724650 -3447626
4673 -3447626 -5515134 -8954197 -10998872 -10613012 -10408364 -12516301 -15127471 -15210658 -12975075
$$ packed form
4734a1045010N541396L904825L32581q30396j53374n6687K96819K284484L451234
4725C725872J162590j877045j205380K002730K613432l09097k487968j523206
4717B101928K41344P13592J027160J863003J055568k599193o214136o205541k859471
4708a0875746P77616K948666L830718L404054J361984j066162j577105K54815
4700i41160K050666J493483r57053l059610l521578k607750q71868J069133J878375
4691e467362O43118j090505n88906K010577L242073J275579j144332r36306N39732
4682a516332J71519j318022o65116J877781K448012o1041k132367j529084p22976
4673c447626k067508l439063k044675L85860K04648k107937k611170q3187K235583
$$ plain form
4664 -12975075 -11406548 -12204136 -14228851 -15838473 -16959029 -18197383 -18977432 -17655119
4656 -17655119 -13505468 -7942811 -3334738 -875421 -129632 -358928 -1270206 -2329973 -2619332
4647 -2619332 -2119108 -2114003 -3373177 -4832380 -5176252 -4851297 -5126547 -5844102 -5747882 -4764266
4637 -4764266 -4318815 -5278565 -6900890 -7964809 -7845068 -6529343 -4812812 -4424454 -6512447
4628 -6512447 -9752752 -11278639 -9828680 -6782893 -3903150 -1633743 -254278 -981014
4620 -981014 -4403347 -8715784 -11139107 -11052178 -10575798 -11813277 -14269478 -15416703 -13482099
4611 -13482099 -9280422 -5290959 -3221868 -2763150 -2588478 -1993153 -1269499 -1002852 -1545349
4602 -1545349 -2860682 -4341812 -5077159 -4872194 -4641323 -5006353 -4833937 -2310015 2393996
$$ packed form
4664a2975075J568527p97588k024715j609622j120556j238354p80049J322313
4656a7655119M149651N562657M608073K459317P45789k29296r11278j059767k89359
4647b619332N00224N105j259174j459203l43872L24955k75250p17555R6220R83616
4637d764266M45451r59750j622325j063919J19741J315725J716531L88358k087993
4628f512447l240305j525887J449959L045787K879743K269407J379465p26736
4620i81014l422333m312437k423323Q6929M76380j237479k456201j147225J934604
4611a3482099M201677L989463K069091M58718J74672N95325P23654K66647n42497
4602a545349j315333j481130p35347K04965K30871l65030J72416K523922M704011
$$ plain form
4593 2393996 6654141 8179329 7449348 6572568 6281121 5241242 2494803 -542771 -1527831
4584 -1527831 -298341 670963 -597925 -2904243 -3267807 -562935 3283648 5536223 5022858
4575 5022858 2416666 -404572 -953513 2294807 7768250 11207556 9548638 4100508
4567 4100508 -1026123 -3271467 -3486291 -3801833 -4946921 -6158856 -6946504 -7876486 -9239472
4558 -9239472 -9590610 -6896011 -1627447 2524784 2449053 -535734 -2376481 -1558559 -549472
4549 -549472 -1641730 -3684652 -4189173 -2829976 -1190790 -330765 -393607 -1802019 -4989265
4540 -4989265 -9101452 -12346653 -13762257 -13873435 -13699343 -13709389 -13677308 -13263229 -12800202
4531 -12800202 -13145343 -14102065 -13669294 -10359892 -5807819 -2963575 -1837338 245272 3711530
$$ packed form
4593B393996M260145J525188p29981q76780k91447j039879k746439l037574r85060
4584a527831J229490R69304j268888k306318l63564K704872L846583K252575n13365
4575E022858k606192k821238n48941L248320N473443L439306j658918n448130
4567D100508n126631k245344k14824l15542j145088j211935p87648r29982j362986
4558i239472l51138K694599N268564M152231p5731k984787j840747Q17922J009087
4549e49472j092258k042922n04521J359197J639186Q60025o2842j408412l187246
4540d989265m112187l245201j415604j11178J74092j0046L2081M14079M63027
4531a2800202l45141r56722M32771L309402M552073K844244J126237K082610L466258
$$ plain form
4522 3711530 5315922 3135701 -61098 -678646 1061780 2830007 4017723 4781950 3493603
4513 3493603 -1005509 -5868285 -6906472 -4377664 -2569803 -3715174 -5720719 -6177334
4505 -6177334 -5269692 -3915551 -1976864 466660 2313881 3010965 3159342 2851288 1207246
4496 1207246 -1696454 -4135652 -4800187 -4231357 -3647746 -3587131 -4148637 -5398898 -7071870
4487 -7071870 -8613153 -9521119 -9095521 -6654089 -3054281 -876061 -1480585 -2971006 -2945455
4478 -2945455 -2041659 -2422873 -4015766 -5197966 -6254141 -8714155 -11667842 -12300419 -10156041
4469 -10156041 -7453818 -5070593 -1897155 1457692 2408428 900809 185467 1453573
4461 1453573 1478071 -2203303 -7068610 -9097307 -7796578 -5369633 -3300243 -2106289 -2263915
$$ packed form
4522C711530J604392k180221l196799o17548J740426J768227J187716P64227j288347
4513C493603m499112m862776j038187K528808J807861j145371k005545m56615
4505f177334R07642J354141J938687K443524J847221O97084J48377l08054j644042
4496A207246k903700k439198o64535N68830N83611O0615n61506j250261j672972
4487g071870j541283r07966M25598K441432L599808K178220o04524j490421K5551
4478b945455R03796l81214j592893j182200j056175k460014k953687o32577K144378
4469a0156041K702223K383225L173438L354847R50736j507619p15342J268106
4461A453573K4498l681374m865307k028697J300729K426945K069390J193954j57626
$$ plain form
4452 -2263915 -3050275 -2420876 -65015 1485334 660282 -711024 -924934 -1597832 -4491280
4443 -4491280 -7706727 -8484292 -7719867 -7908748 -8228799 -5972069 -2153476 -1249138 -4843965
4434 -4843965 -9294402 -10851005 -10097400 -9843333 -10964567 -12108726 -12123646 -11127866 -9660130
4425 -9660130 -7832996 -5440039 -2725714 -924707 -1472487 -4346351 -7847420 -10411112
4417 -10411112 -11750800 -11875536 -10502982 -8401509 -7654355 -8982257 -10147791 -8899754
4409 -8899754 -6395946 -5588501 -7040751 -8659520 -9109444 -9043974 -8925066 -8034893 -6295383
4400 -6295383 -5120724 -5501365 -6564524 -6871264 -6129910 -4888427 -3354368 -1351206 862837
4391 862837 2273661 1712243 -1059864 -4672713 -6892886 -6474817 -4075096 -1130347 1616884
$$ packed form
4452b263915p86360O29399K355861J550349q25052j371306k13910o72898k893448
4443d491280l215447p77565P64425j88881l20051K256730L818593R04338l594827
4434d843965m450437j556603P53605K54067j121234j144159j4920R95780J467736
4425i660130J827134K392957K714325J801007n47780k873864l501069k563692
4417a0411112j339688j24736J372554K101473P47154j327902j165534J248037
4409h899754K503808Q07445j452250j618769m49924O5470J18908Q90173J739510
4400f295383J174659l80641j063159l06740P41354J241483J534059K003162K214043
4391H62837J410824n61418k772107l612849k220173M18069K399721K944749K747231
$$ plain form
4382 1616884 4048684 5781004 6127856 4790930 2213350 -518842 -2117192 -2127194 -1664093
4373 -1664093 -2262937 -3812507 -4639985 -3834903 -2204255 -563458 1417113 4003517 6534658
4364 6534658 8570773 10384504 11408134 9903990 5519235 739433 -1572726 -859811
4356 -859811 1908330 5865129 9586897 10728976 8496584 5130748 2922064 1196020
4348 1196020 -1501582 -3824516 -3236657 -306262 1733053 1444318 298801 -657256 -2246975
4339 -2246975 -4665655 -6262950 -6071704 -5634883 -6987089 -9977620 -12567519 -13051695 -11496277
4330 -11496277 -9581312 -9108703 -10054331 -10385370 -8584505 -5808864 -4522179 -5618948 -8028328
4321 -8028328 -10251707 -10792112 -8165254 -2732569 2079018 2861020 404148 -1578298 -1842104
$$ packed form
4382A616884K431800J732320L46852j336926k577580k732192j598350j0002M63101
4373a664093n98844j549570q27478Q05082J630648J640797J980571K586404K531141
4364F534658K036115J813731J023630j504144m384755m779802k312159P12915
4356h59811K768141L956799L721768J142079k232392l365836k208684j726044
4348A196020k697602k322934N87859K930395K039315k88735j145517r56057j589719
4339b246975k418680j597295J91246M36821j352206k990531k589899m84176J555418
4330a1496277J914965M72609r45628l31039J800865K775641J286685j096769k409380
4321h028328k223379n40405K626858N432685M811587P82002k456872j982446k63806
$$ plain form
4312 -1842104 -2928737 -6457445 -9899519 -9657708 -5499191 -287767 3402575 4895592
4304 4895592 4595445 3124015 1078736 -1200767 -3518817 -5297543 -5817668 -5291165 -4933865
4295 -4933865 -5504766 -6372185 -6413999 -5311412 -3682418 -2463984 -2290903 -2815270 -2509199
4286 -2509199 9625 4075549 7142652 7377962 5510066 3541861 2211388 668434
4278 668434 -1476271 -2954868 -2396773 -384396 1165795 1500929 1588389 1940634 1491949
4269 1491949 -463073 -2797827 -4385626 -5774383 -7169422 -6588033 -2905147 759285
4261 759285 499679 -2284726 -2618486 289198 2003768 595609 27310 3290672 7100697
4252 7100697 7159066 4712343 3598818 3955016 3482317 2601774 3553012 5783851 6686963
$$ packed form
4312a842104j086633l528708l442074K41811M158517N211424L690342J493017
4304D895592l00147j471430k045279k279503k318050j778726n20125N26503L57300
4295d933865n70901q67419m1814J102587J628994J218434J73081n24367L06071
4286b509199K518824M065924L067103K35310j867896j968205j330473j542954
4278F68434k144705j478597N58095K012377J550191L35134Q7460L52245m48685
4269A491949j955022k334754j587799j388757j395039N81389L682886L664432
4261G59285k59606k784405l33760K907684J714570j408159n68299L263362L810025
4252G100697N8369k446723j113525L56198m72699q80543R51238K230839R03112
$$ plain form
4243 6686963 6094815 6086594 6926554 6782067 5031673 2723858 373457 -1776884 -2206133
4234 -2206133 92173 3029766 3554565 1654642 -274075 -911198 -358253 1438684 3821874
4225 3821874 4566103 2655356 165247 -1144335 -2610879 -5238748 -6786692 -5948326 -5826304
4216 -5826304 -8667687 -10810158 -8386315 -4644855 -5268583 -9276778 -11287424 -10317757 -9419675
4207 -9419675 -9027415 -7983977 -8723772 -13589192 -18404420 -18024206 -15601277 -17188291 -20178052
4198 -20178052 -17772386 -12040249 -10300330 -11164923 -8260105 -5396985 -11224988 -20649413
4190 -20649413 -22873117 -28627823 -61490241 -112120023 -130578122 -86418921 -14752596
4183 -14752596 24545045 18677600 3976015 6444176 14401412 11304323 3377746 2789268
$$ packed form
4243F686963n92148q221Q39960j44487j750394k307815k350401k150341m29249
4234b206133K298306K937593N24799j899923j928717o37123N52945J796937K383190
4225C821874P44229j910747k490109j309582j466544k627869j547944Q38366J22022
4216e826304k841383k142471K423843L741460o23728m008195k010646R69667Q98082
4207i419675L92260J043438p39795m865420m815228L80214K422929j587014k989761
4198b0178052K405666N732137J739919q64593K904818K863120n828003r424425
4190b0649413k223704n754706l2862418n0629782j8458099M4159201P1666325
4183a4752596L9297641n867445j4701585K468161P957236l097089p926577n88478
$$ plain form
4175 2789268 6494816 6222287 3977319 4804069 5746454 3137473 1303114 4035263 5777679
4166 5777679 842962 -5750956 -5889619 -976115 1712299 490710 -1015819 -1735186 -3134261
4157 -3134261 -4245135 -3362493 -2247830 -2873148 -2655747 1310109 5764147 5028045 -334699
4148 -334699 -4183809 -3256270 -63153 2124651 2733159 2294871 1039717 -494507 -1799150
4139 -1799150 -3245108 -4948518 -5701804 -4771388 -3569599 -3697101 -4524926 -4548141 -4000733
4130 -4000733 -4331349 -5918087 -7680235 -8278091 -7042994 -4710080 -3286001 -3607883 -3426619
4121 -3426619 -428124 3260267 3188906 -514017 -2561569 -56170 3557993 3991475 1578998
4112 1578998 -1133412 -3530781 -5795226 -6835192 -6297784 -5945123 -6447195 -5640254 -2532603
$$ packed form
4175B789268L705548k72529k244968Q26750R42385k608981j834359K732149J742416
4166E777679m934717o593918j38663M913504K688414j221589j506529p19367j399075
4157c134261j110874Q82642J114663o25318K17401L965856M454038p36102n362744
4148c34699l849110R27539L193117K187804O08508m38288j255154j534224j304643
4139a799150j445958j703410p53286R30416J201789j27502q27825k3215N47408
4130d000733l30616j586738j762148n97856J235097K332914J424079l21882J81264
4121c426619K998495L688391p1361l702923k047552K505399L614163M33482k412477
4112A578998k712410k397369k264445j039966N37408L52661n02072Q06941L107651
$$ plain form
4103 -2532603 39453 -354372 -1893773 -2055039 -1999708 -3825949 -6121708 -6193813 -4612032
4094 -4612032 -3669439 -3154222 -1515009 361609 498529 -208632 790753 3260907 4452212
4085 4452212 3302338 1278508 -434181 -1740968 -2232986 -1633384 -1005300 -1153226 -830735
4076 -830735 1039484 2690134 1822462 -702362 -2444999 -3388488 -5150282 -7332945 -8111527
4067 -8111527 -7635397 -7400053 -6968283 -4922608 -2482420 -2248446 -3514561 -2922261 -169936
4058 -169936 1061015 -1011828 -3312558 -2676612 -440069 9084 -1992880 -4376394 -5654118
4049 -5654118 -6038511 -5790908 -4206930 -676959 3744592 6390442 5394695 2256012 689519
4040 689519 2042046 3392867 1749600 -1544909 -3007460 -2318929 -2322317 -4189249 -5908349
$$ packed form
4103b532603K572056l93825j539401j61266N5331j826241k295759p2105J581781
4094d612032R42593N15217J639213J876618J36920p07161R99385K470154J191305
4085D452212j149874k023830j712689j306787m92018N99602O28084j47926L22491
4076h30735J870219J650650q67672k524824j742637r43489j761794k182663p78582
4067h111527M76130K35344M31770K045675K440188K33974j266115N92300K752325
4058a69936J230951k072843k300730O35946K236543M49153k001964k383514j277724
4049e654118l84393K47603J583978L529971M421551K645850r95747l138683j566493
4040F89519J352527J350821j643267l294509j462551O88531l388j866932j719100
$$ plain form
4031 -5908349 -6035348 -5901975 -6900240 -7949439 -7231148 -4936320 -2905612 -2413746 -3213538
4022 -3213538 -4139605 -4160895 -3392956 -3194178 -4604972 -6780546 -7758591 -6638312 -4211108
4013 -4211108 -1695494 290493 1747248 3062358 4488031 5385634 4724653 2860196 1669698
4004 1669698 2106715 2958134 3076955 3265588 4458609 5592419 5116862 3296895 1180537
3995 1180537 -1306472 -4249689 -6265195 -6447804 -6405870 -7967922 -10371486 -12299816 -14789136
3986 -14789136 -18631912 -20582610 -16670651 -8819996 -3686966 -4482525 -7885715 -9618942
3978 -9618942 -9072173 -7359282 -4776441 -2094326 -1223443 -2551206 -3997156 -4300499 -4874910
3969 -4874910 -6808749 -8369623 -7443663 -4723929 -2666726 -2483103 -3493770 -4426604 -4416975
$$ packed form
4031e908349j26999J33373r98265j049199P18291K294828K030708M91866p99792
4022c213538r26067k1290P67939J98778j410794k175574r78045J120279K427204
4013d211108K515614J985987J456755J315110J425673Q97603o60981j864457j190498
4004A669698M37017Q51419J18821J88633J193021J133810m75557j819967k116358
3995A180537k487009k943217k015506j82609M1934j562052k403564j928330k489320
3986a4789136l842776j950698L911959P850655N133030p95559l403190j733227
3978i618942N46769J712891K582841K682115Q70883j327763j445950l03343n74411
3969d874910j933839j560874R25960K719734K057203J83623j010667r32834R629
$$ plain form
3960 -4416975 -3650034 -3448176 -4732332 -6558665 -7569928 -8221203 -9369850 -9438137 -6197618
3951 -6197618 -1222896 1166545 4700 -1135891 -208891 166700 -2215235 -4758928 -3946772
3942 -3946772 -859619 565004 -976344 -3386954 -4536643 -3731369 -974967 2726262
3934 2726262 5149777 5046708 3751287 2932003 1980863 -417301 -3366819 -4686291 -3966652
3925 -3966652 -2641826 -1616722 -675438 325225 1418928 3180697 5808405 7967943
3917 7967943 7897624 5226126 793441 -4264660 -8097199 -8320890 -4653847 -492377 242811
3908 242811 -2436879 -4845007 -3939790 23410 4603051 7355165 7229692 5244282 3662830
3899 3662830 3498700 3247103 1057383 -2508092 -5063766 -5180939 -3444013 -1303232 15
$$ packed form
3960d416975P66941K01858j284156j826333j011263o51275j148647o8287L240519
3951f197618M974722K389441j161845j140591R27000L75591k381935k543693Q12156
3942c946772L087153J424623j541348k410610j149689Q05274K756402L701229
3934B726262K423515j03069j295421q19284r51140k398164k949518j319472P19639
3925c966652J324826J025104R41284J000663J093703J761769K627708K159538
3917G967943p0319k671498m432685n058101l832539k23691L667043M161470P35188
3908B42811k679690k408128R05217L963200M579641K752114j25473j985410j581452
3899C662830j64130k51597k189720l565475k555674j17173J736926K140781J303247
$$ plain form
3890 15 -88564 -930615 -1097290 -58710 1209737 1916796 2548270 3375042 3398548 2227279
3880 2227279 1502353 2462422 3245456 1004663 -3799037 -7560579 -8026725 -6635688 -6050642
3871 -6050642 -7032094 -8337386 -8544796 -7336660 -5531404 -4133550 -3164830 -1666187 968047
3862 968047 4206355 7056283 8646953 8096500 5276851 2067252 957806 1612267 982581
3853 982581 -1875916 -3554879 -1012968 3591642 5588015 3817848 1054623 -475662
3845 -475662 -924807 -882552 -670898 -1221590 -2783849 -3148765 -245997 3749643 4372672
3836 4372672 1164482 -1609456 -1348977 -516390 -2025833 -4664822 -5598230 -4869460 -4596342
3827 -4596342 -5322436 -5800175 -5404141 -4512625 -3202393 -1488391 -207225 137189 763773
$$ packed form
3890A5q8579q42051j66675J038580J268447P07059O31474Q26772K3506j171269
3880B227279p24926R60069P83034k240793m803700l761542m66146J391037N85046
3871f050642r81452j305292k07410J208136J805256J397854R68720J498643K634234
3862I68047L238308K849928J590670n50453k819649l209599j109446O54461o29686
3853I82581k858497j678963K541911M604610J996373j770167k763225j530285
3845d75662m49145M2255K11654n50692j562259l64916K902768L995640O23029
3836D372672l208190k773938K60479Q32587j509443k638989r33408P28770K73118
3827d596342p26094m77739L96034Q91516J310232J714002J281166L44414O26584
$$ plain form
3818 763773 2948076 5411573 5438544 2671365 -97216 -428884 987041 1813213 1133612
3809 1133612 29250 -293459 64816 146352 -532543 -1338625 -1231238 -158982 523150
3800 523150 -401485 -2051355 -1939667 935413 4267273 4930106 2954221 1344425 1632464
3791 1632464 1688567 -567151 -3083081 -1983408 2666308 6383205 6076385 3685128 2848193
3782 2848193 4235328 5840049 6017852 4222897 179710 -5350724 -9714643 -10429906 -7935260
3773 -7935260 -4768084 -2414571 -457269 1658854 3691460 5215812 5757943 4627761
3765 4627761 1997638 -270140 -370607 1200855 2567884 3130890 3663798 4230744 3965046
3756 3965046 2874142 2061617 2031727 2306321 2658338 3128884 2984510 1455260 -576826
$$ packed form
3818G63773K184303K463497K6971k767179k768581l31668J415925Q26172o79601
3809A133612j104362l22709L58275Q1536o78895q06082J07387J072256O82132
3800E23150r24635j649870J11688K875080L331860O62833j975885j609796K88039
3791A632464N6103k255718k515930J099673M649716L716897l06820k391257q36935
3782B848193J387135J604721J77803j794955m043187n530434m363919p15263K494646
3773g935260L167176K353513J957302K116123K032606J524352N42131j130182
3765D627761k630123k267778j00467J571462J367029N63006N32908N66946k65698
3756C965046j090904q12525k9890K74594L52017M70546j44374j529250k032086
$$ plain form
3747 -576826 -1554312 -1883973 -3431248 -6142009 -7548868 -6428711 -4743787 -4710972 -5726064
3738 -5726064 -5636024 -3773999 -1335950 402518 1080586 1025642 864525 982738 995741 236188
3728 236188 -1189884 -2535799 -3466212 -4079115 -4203448 -3893315 -4248215 -6185526 -8655458
3719 -8655458 -9769575 -9341316 -8272292 -5954899 -1245591 3892765 5321290 2602357
3711 2602357 685857 3697164 9747206 14131823 15041647 13359376 9333224 3262791
3703 3262791 -1907894 -2796400 -360415 862430 -1364959 -4745801 -6489831 -6557184 -5839259
3694 -5839259 -3997224 -1104928 512452 -1536250 -6402966 -10658859 -11944101 -10711348
3686 -10711348 -8827413 -7909269 -8835468 -11197907 -12719553 -10636189 -4738673 1747208
$$ packed form
3747e76826r77486l29661j547275k710761j406859J120157J684924L2815j015092
3738e726064R0040J862025K438049J738468O78068n4944j61117J18213J3003p59553
3728B36188j426072j345915r30413o12903j24333L10133l54900j937311k469932
3719h655458j114117M28259J069024K317393M709308N138356J428525k718933
3711B602357j916500L011307O050042M384617R09824j682271m026152o070433
3703C262791n170685q88506K435985J222845k227389l380842j744030o7353P17925
3694e839259J842035K892296J617380k048702m866716m255893j285242J232753
3686a0711348J883935R18144r26199k362439j521646K083364N897516O485881
$$ plain form
3678 1747208 5391455 6097132 6230797 6823554 6551731 4669731 2740981 2184118 1822837
3669 1822837 -288445 -3756692 -6602179 -8310467 -9837080 -10932778 -9999156 -6954667
3661 -6954667 -3991257 -2813846 -3068958 -4089273 -5981965 -7960821 -7849111 -5000618 -2138169
3652 -2138169 -2406913 -5539295 -8453435 -8824467 -6786529 -4067200 -2815170 -4342976 -7507349
3643 -7507349 -9099660 -7367304 -4465386 -3828528 -5721989 -7206411 -6232538 -3863811 -2191701
3634 -2191701 -1711703 -1465791 -685463 507918 1545115 2040355 2138972 2332826 2805515
3625 2805515 3152946 2967735 2358837 1587679 632333 -444109 -1114861 -928072 -173363
3616 -173363 413314 414994 -12290 -330179 55916 1201759 2264888 2271552 1233840 -139097
$$ packed form
3678A747208L644247P05677J33665N92757k71823j882000j928750n56863l61281
3669A822837k111282l468247k845487j708288j526613j095698R33622L044489
3661f954667K963410J177411k55112j020315j892692j978856J11710K848493K862449
3652b138169k68744l132382k914140l71032K037938K719329J252030j527806l164373
3643g507349j592311J732356K901918O36858j893461j484422R73873K368727J672110
3634b191701M79998K45912P80328J193381J037197M95240R8617J93854M72689
3625B805515L47431j85211o08898p71158r55346j076442o70752J86789P54709
3616a73363N86677J680m27284l17889L86095J145843J063129O664j037712j372937
$$ plain form
3606 -139097 -1616068 -3273047 -4307754 -3493205 -1028041 1562584 3674753 6062046 8548319
3597 8548319 9376847 7937857 6217601 6051546 6609730 6216886 5009745 3880776 2409421
3588 2409421 319323 -182186 3496776 9971209 14115643 12232352 5551571 -1386772
3580 -1386772 -4405090 -2154401 3004792 6248636 4136686 -2031048 -7495611 -8750956
3572 -8750956 -6235071 -2862841 -1281549 -2342784 -4736295 -5928861 -4568519 -1974442
3564 -1974442 -364527 -108219 4796 448638 779886 1455324 3635236 6803091 8525252
3555 8525252 7367623 4654188 2686050 2411316 3276305 4046401 3295759 530179 -2463174
3546 -2463174 -2788139 25497 2786214 2133843 -1444108 -4210926 -3380487 268411 3741480
$$ packed form
3606a39097j476971j656979j034707Q14549K465164K590625K112169K387293K486273
3597H548319Q28528j438990j720256j66055N58184l92844j207141j128969j471355
3588B409421k090098n01509L678962O474433M144434j883291o680781o938343
3580a386772l018318K250689N159193L243844k111950o167734n464563j255345
3572h750956K515885L372230J581292j061235k393511j192566J360342K594077
3564a974442J609915K56308J13015M43842L31248O75438K179912L167855J722161
3555H525252j157629k713435j968138k74734Q64989P70096p50642k765580k993353
3546b463174l24965K813636K760717o52371l577951k766818Q30439L648898L473069
$$ plain form
3537 3741480 4778862 3211573 94401 -3697805 -7707797 -11165917 -12950532 -12740608
3529 -12740608 -11627239 -10912430 -10642820 -9966560 -8588613 -7081029 -5899870 -4845184 -3527442
3520 -3527442 -1831500 105819 1991572 3420123 3957037 3134068 680122 -2604010 -4512632
3511 -4512632 -3191485 631217 4342018 6405775 7145312 6699458 4665699 2402590 2743920
3502 2743920 5724672 7340248 4953267 1411273 745366 2045794 1506338 -1006283 -1995983
3493 -1995983 -535267 245013 -1317507 -2555562 -921277 1841446 2096241 -1100980 -5457802
3484 -5457802 -8009269 -7134191 -3423405 613902 2884325 3992994 5761325 7726032
3476 7726032 7428271 4417148 1410367 682526 1588535 2599313 3597527 4929863 5940386
$$ packed form
3537C741480J037382j567289l117172l792206m009992l458120j784615K09924
3529a2740608J113369P14809K69610O76260J377947J507584J181159J054686J317742
3520c527442J695942J937319J885753J428551N36914q22969k453946l284132j908622
3511d512632J321147L822702L710801K063757P39537m45854k033759k263109L41330
3502B743920K980752J615576k386981l541994o65907J300428n39456k512621r89700
3493a995983J460716P80280j562520j238055J634285K762723K54795l197221m356822
3484e457802k551467Q75078L710786M037307K270423J108669J768331J964707
3476G726032k97761l011123l006781p27841R06009J010778R98214J332336J010523
$$ plain form
3467 5940386 5670475 3911854 1118450 -1505379 -2030625 209380 2851062 2875831 464729
3458 464729 -1908621 -3488085 -4995272 -5027569 -1239130 4461290 6834501 4900065 3774716
3449 3774716 6811503 10773298 11753444 11051836 11147445 10158641 5405218 -577638 -2882082
3440 -2882082 -1178314 962488 2131254 3775625 5960307 6992036 6678771 5963092 4045015
3431 4045015 -167132 -4497204 -5479792 -3345450 -1103655 553343 3083932 5558070
3423 5558070 5287636 3027827 2509905 4224252 4680587 2780477 1707291 2924666 3622200
3414 3622200 2473825 2596745 5351412 6192609 1465484 -4465947 -4421094 1545096 6862668
3405 6862668 8094360 8182454 9720877 10441743 7660840 3240546 839667 379197 -1315667
$$ packed form
3467E940386k69911j758621k793404k623829n25246K240005K641682K4769k411102
3458D64729k373350j579464j507187l2297L788439N700420K373211j934436j125349
3449C774716L036787L961795R80146p01608R5609r88804m753423n982856k304444
3440b882082J703768K140802J168766J644371K184682J031729l13265p15679j918077
3431D045015m212147m330072r82588K134342K241795J656998K530589K474138
3423E558070k70434k259809n17922J714347M56335j900110j073186J217375O97534
3414C622200j148375J22920K754667Q41197m727125n931431M4853N966190N317572
3405F862668J231692Q8094J538423P20866k780903m420294k400879m60470j694864
$$ plain form
3396 -1315667 -4901492 -6685350 -3479356 2673555 6480458 5424757 1930917 -559698
3388 -559698 -1612250 -2829384 -4637436 -5978481 -6268950 -5696821 -4176997 -1987611 -828775
3379 -828775 -1845206 -2901441 -612987 4650326 8661969 8945850 7522827 6828295 6015705
3370 6015705 3584974 1106716 1224393 3297096 3991963 1704966 -2018311 -5106180 -6683234
3361 -6683234 -6255878 -3579208 -92032 1225997 -1380080 -6373320 -10162065 -10150155 -6648467
3352 -6648467 -2394942 -280672 -1034277 -2917247 -3758662 -3085091 -2113829 -2047789 -2718478
3343 -2718478 -2713641 -744881 2833569 6012680 7194752 7010648 7121976 7449011 6131275
3334 6131275 2602957 -912538 -1928446 -506054 1467604 2759291 3447111 3986610 4766433
$$ packed form
3396a315667l585825j783858L205994O152911L806903j055701l493840k490615
3388e59698j052552j217134j808052j341045k90469N72129J519824K189386J158836
3379h28775j016431j056235K288454N263313M011643K83881j423023o94532q12590
3370F015705k430731k478258J17677K072703O94867k286997l723277l087869j577054
3361f683234M27356K676670L487176J318029k606077m993240l788745J1910L501688
3352f648467M253525K114270p53605j882970q41415O73571R71262O6040o70689
3343b718478M837J968760L578450L179111J182072j84104J11328L27035j317736
3334F131275l528318l515495j015908J422392J973658J291687O87820N39499P79823
$$ plain form
3325 4766433 5915424 6573646 5176139 1602863 -1779901 -2654785 -1763369 -1799087 -3523310
3316 -3523310 -4684573 -3169001 194578 2821537 3548455 3646248 4810463 6923484 8213862
3307 8213862 7310536 4502674 921547 -2621822 -5349958 -5994885 -3931388 -531270 1994782
3298 1994782 3037313 3524578 3591936 2127488 -1041931 -4289546 -6088947 -6206371 -4695191
3289 -4695191 -1796548 543725 -395849 -4268258 -7071505 -6151225 -3545007 -2296117 -1872604
3280 -1872604 -163841 2001941 1991813 -131465 -2000918 -3264140 -5586314 -8252577 -7873610
3271 -7873610 -3672011 450310 927119 -1115841 -2347750 -1719658 -508597 121242 -495029
3262 -495029 -3012050 -6875446 -9817956 -10468388 -10447845 -11987136 -14315815 -14391874 -10797350
$$ packed form
3325D766433J148991O58222j397507l573276l382764q74884Q91416l5718j724223
3316c523310j161263J515572L363579K626959P26918R7793J164215K113021J290378
3307H213862r03326k807862l581127l543369k728136o44927K063497L400118K526052
3298A994782J042531M87265O7358j464448l169419l247615j799401j17424J511180
3289d695191K898643K340273r39574l872409k803247R20280K606218J248890M23513
3280a872604J708763K165782j0128k123278j869453j263222k322174k666263L78967
3271g873610M201599M122321M76809k042960j231909O28092J211061O29839o16271
3262d95029k517021l863396k942510o50432K0543j539291k328679p6059L594524
$$ plain form
3253 -10797350 -5260668 -655715 1149647 88842 -1824202 -1522961 1985836 5702536
3245 5702536 5553652 1187825 -3765604 -6114378 -5874499 -4507010 -2673368 -724054 465243
3236 465243 597109 659457 1246412 1336187 166106 -793919 385630 2994388 4432840
3227 4432840 4005403 3948872 6196750 9845052 12623782 13454097 12630117 10769072 8722180
3218 8722180 7420406 6479241 3856484 -1559881 -7588116 -10598729 -9567218 -6907140
3210 -6907140 -5437351 -5964988 -7738187 -9527179 -9891916 -7999507 -4843998 -2369255 -889889
3201 -889889 1132698 4134153 6122232 5667655 4644160 5947471 9175522 10603099 7582499
3192 7582499 1581123 -3437194 -4742733 -2801671 -245388 879974 1031742 2129178
$$ packed form
3253a0797350N536682M604953J805362j060805j913044L01241L508797L716700
3245E702536j48884m365827m953429k348774K39879J367489J833642J949314J189297
3236D65243J31866O2348N86955Q9775j170081r60025J179549K608758J438452
3227D432840m27437n6531K247878L648302K778730Q30315q23980j861045k046892
3218H722180j301774r41165k622757n416365o028235l010613J031511K660078
3210f907140J469789n27637j773199j788992l64737J892409L155509K474743J479366
3201h89889K022587L001455J988079m54577j023495J303311L228051J427577l020600
3192G582499o001376n018317j305539J941062K556283J125362J51768J097436
$$ plain form
3184 2129178 4596634 6357836 5275871 1607170 -2724824 -6235264 -8292236 -8684195
3176 -8684195 -8255753 -8887002 -10993091 -11916904 -9014266 -3794574 -470567 -480488 -1218810
3167 -1218810 -678752 -319892 -1846710 -3897788 -4464404 -4796078 -7828286 -13272405 -17199426
3158 -17199426 -17037770 -14671115 -13405042 -13549065 -12742547 -9893224 -6814014 -5524289 -5392444
3149 -5392444 -4164977 -1216654 1632133 2622672 2024041 931133 -730802 -3720744 -7497300
3140 -7497300 -10036735 -9766002 -6942559 -3172750 -202075 1050759 1022577 906781 943191
3131 943191 -126462 -2964743 -5725722 -5789778 -3159811 -489106 312265 -183833 -838124
3122 -838124 -1776878 -3479560 -5427206 -6643418 -6704568 -5620084 -3643677 -1628830 -465083
$$ packed form
3184B129178K467456J761202j081965l668701m331994l510440k056972l91959
3176h684195M28442o31249k106089r23813K902638N219692L324007r921p38322
3167a218810N40058L58860j526818k051078n66616l31674l032208n444119l927021
3158a7199426J61656K366655J266073j44023Q06518K849323L079210J289725J31845
3149e392444J227467K948323K848787R90539n98631j092908j661935k989942l776556
3140g497300k539435K70733K823443L769809K970675J252834k8182j15796L6410
3131I43191j069653k838281k760979o4056K629967K670705Q01371m96098o54291
3122h38124r38754j702682j947646j216212o1150J084484J976407K014847J163747
$$ plain form
3113 -465083 267752 1852948 4231002 5733471 5645952 5360363 5981304 6457189 5466244
3104 5466244 3681836 2524659 1875166 812558 -301398 -321683 689210 1563899 1485946
3095 1485946 -157915 -4368411 -10792103 -15972472 -15952144 -11012787 -5787277 -4123620 -5600972
3086 -5600972 -7619538 -8885243 -9550261 -9423183 -7875510 -5214808 -2848940 -1782291 -1471735
3077 -1471735 -541919 1303125 2370572 661711 -3342411 -6514769 -6424140 -4003041 -1933116
3068 -1933116 -1301600 -1265587 -1257895 -1630946 -2287292 -2461526 -1989940 -1297777 -199848 1570191
3058 1570191 2671761 1051549 -3089467 -7183426 -9617449 -11049041 -11751711 -10189322
3050 -10189322 -5791756 -1030950 1291899 1326621 842400 134883 -1411365 -2862441 -2693063
$$ packed form
3113d65083P32835J585196K378054J502469q7519k85589O20941M75885r90945
3104E466244j784408j157177o49493j062608j113956k0285J010893Q74689p7953
3095A485946j643861m210496o423692n180369K0328M939357N225510J663657j477352
3086e600972k018566j265705o65018J27078J547673K660702K365868J066649L10556
3077a471735R29816J845044J067447j708861m004122l172358R0629K421099K069925
3068a933116O31516L6013P692l73051o56346j74234M71586O92163J097929J770039
3058A570191J101570j620212m141016m093959k434023j431592p02670J562389
3050a0189322M397566M760806K322849L4722m84221p07517j546248j451076J69378
$$ plain form
3041 -2693063 -1914132 -3425848 -7632566 -11005171 -10268563 -6551651 -3960749 -4734813 -7114325
3032 -7114325 -7944559 -6281491 -3716788 -1642977 406251 2961544 4454818 2823028
3024 2823028 -1016130 -3633122 -3587518 -3088283 -3973097 -4498914 -2254442 1757823 4688595
3015 4688595 6073732 7424853 8402586 6751063 2165990 -2706592 -5633282 -6692633
3007 -6692633 -6457722 -4847109 -2396693 -274285 1577636 3921543 5453865 3574200
2999 3574200 -1101282 -4210757 -3332328 -1260526 -1569229 -3787771 -5528616 -6623789 -7833774
2990 -7833774 -7675528 -4480761 -407473 504376 -2091086 -4624594 -4799650 -3728174 -2784566
2981 -2784566 -1540625 603020 3484115 7380201 12484518 16712422 16842021 12629178
$$ packed form
3041b693063P78931j511716m206718l372605P36608L716912K590902p74064k379512
3032g114325q30234J663068K564703K073811K049228K555293J493274j631790
3024B823028l839158k616992M5604M99235q84814n25817K244472M012265K930772
3015D688595J385137J351121R77733j651523m585073m872582k926690j059351
3007f692633K34911J610613K450416K122408J851921K343907J532322j879665
2999C574200m675482l109475Q78429K071802l08703k218542j740845j095173j209985
2990g833774J58246L194767M073288R11849k595462k533508j75056J071476R43608
2981b784566J243941K143645K881095L896086N104317M227904J29599m212843
$$ plain form
2973 12629178 7179101 2553260 -2033892 -6651432 -8692773 -6596773 -2825991 -644761
2965 -644761 10416 968703 2013260 1574041 160643 194905 2608412 5792639 7869026
2956 7869026 8288038 7388815 6017345 5480993 6440372 7841938 7963294 6205606 2977640
2947 2977640 -1377911 -6186501 -9679521 -10277459 -8407310 -5817653 -3592529 -2142422
2939 -2142422 -2340298 -4657755 -7388706 -7815798 -5622686 -3636499 -4601011 -8221697 -11708957
2930 -11708957 -12324064 -9210340 -3679918 1832965 5427089 6453631 4866960 1030264
2922 1030264 -3357041 -5732660 -5424243 -4620726 -5007800 -4876695 -1810765 2971800 5838193
2913 5838193 5757924 5058477 5132485 4478655 1779220 -1705867 -3874141 -3879224 -1821891 1524631
$$ packed form
2973A2629178n450077m625841m587152m617540k041341K096000L770782K181230
2965f44761O55177R58287J044557m39219j413398L4262K413507L184227K076387
2956G869026M19012q99223j371470n36352R59379J401566J21356j757688l227966
2947B977640m355551m808590l493020n97938J870149K589657K225124J450107
2939b142422j97876k317457k730951m27092K193112J986187r64512l620686l487260
2930a1708957o15107L113724N530422N512883L594124J026542j586671l836696
2922A030264m387305k375619L08417Q03517l87074J31105L065930M782565K866393
2913E838193q0269o99447P4008o53830k699435l485087k168274n083K057333L346522
$$ plain form
2903 1524631 4086689 3958523 2304947 2405613 4950598 6937870 6367892 5054996 4994280
2894 4994280 4891074 2851197 79853 -1054943 -801909 -847984 -868521 474348 2001485
2885 2001485 812571 -3513446 -8258210 -11109454 -11967675 -11299310 -9191737 -6388646 -4194134
2876 -4194134 -2967305 -2282756 -2396270 -3688507 -4961971 -4537508 -2992097 -2465144 -3148823
2867 -3148823 -3017708 -1490192 -718991 -2284644 -4948008 -6805959 -7475896 -6887230 -4172452
2858 -4172452 446633 4490830 5918309 5625549 5411128 4817231 2273957 -1473460 -3577023
2849 -3577023 -2704910 -433894 1213847 1855571 1873891 1113309 -404066 -1342304 54100
2840 54100 3849777 7932432 9995787 9682889 8316850 6750386 4454588 1144702 -1843227
$$ packed form
2903A524631K562058j28166j653576J00666K544985J987272n69978j312896o0716
2894D994280j03206k039877k771344j134796K53034m6075k0537J342869J527137
2885B001485j188914m326017m744764k851244q58221O68365K107573K803091K194512
2876d194134J226829O84549j13514j292237j273464M24463J545411N26953o83679
2867c148823J31115J527516P71201j565653k663364j857951o69937N88666K714778
2858d172452M619085M044197J427479k92760k14421n93897k543274l747417k103563
2849c577023Q72113K271016J647741O41724J8320p60582j517375r38238J396404
2840E4100L795677M082655K063355l12898j366039j566464k295798l309886k987929
$$ plain form
2831 -1843227 -3086495 -3296278 -4292197 -5987644 -6410391 -5029780 -3869862 -4351082 -5120352
2822 -5120352 -4555848 -3567562 -3828349 -4643574 -4065184 -2304102 -1411079 -1798336 -1672315
2813 -1672315 -227090 989851 580411 -949797 -2770011 -4977361 -7082695 -7203159 -4516656
2804 -4516656 -1191006 -56740 -1167277 -2198041 -1502891 715599 3499416 5725559
2796 5725559 6194241 4817818 3202396 2354201 644910 -3513252 -7584687 -6960736 -1767635
2787 -1767635 1939201 -226001 -5179852 -7029309 -5184567 -4045836 -5736333 -7369391
2779 -7369391 -6026031 -2819883 -517084 209332 340051 274665 -70152 -212027 165887
2770 165887 353256 -89967 17041 2153275 5969773 9555724 11266642 10525737 7801386
$$ packed form
2831a843227j243268k09783r95919j695447m22747J380611J159918m81220p69270
2822e120352N64504R88286k60787q15225N78390J761082Q93023l87257J26021
2813a672315J445225J216941m09440j530208j820214k207350k105334j20464K686503
2804d516656L325650J134266j110537j030764O95150K218490K783817K226143
2796E725559M68682j376423j615422q48195j709291m158162m071435O23951N193101
2787a767635L706836k165202m953851j849457J844742J138731j690497j633058
2779g369391J343360L206148K302799P26416J30719o5386l44817j41875L77914
2770A65887J87369m43223J07008K136234L816498L585951J710918p40905k724351
$$ plain form
2761 7801386 4835507 3836901 5112446 6371072 5683834 4118652 3875536 4888608 5352751
2752 5352751 4901868 4912903 5889796 6897698 7703373 9133480 10843903 11011574 9108318
2743 9108318 6970772 6029212 5233340 2974762 -409164 -3322246 -4826847 -4655870 -2558672
2734 -2558672 949552 4125770 5609331 5704334 4962788 2645131 -1766006 -6356406 -8106064
2725 -8106064 -6411293 -3736234 -2563873 -2880057 -2842761 -903295 2938910 7076475 9186933
2716 9186933 7862080 3733362 -1097402 -4468185 -4878214 -1837457 3347261 7592981
2708 7592981 8173987 5012090 224486 -4162095 -7076988 -7725812 -5961313 -3471784 -2705567
2699 -2705567 -3836485 -4300092 -2240116 1070385 3455792 4985634 7019222 9155988
$$ packed form
2761G801386k965879r98606J275545J258626o87238j565182k43116J013072M64143
2752E352751m50883J1035R76893J007902Q05675J430107J710423J67671j903256
2743I108318k137546r41560p95872k258578l383926k913082j504601J70977K097198
2734b558672L508224L176218J483561R5003p41546k317657m411137m590400j749658
2725h106064J694771K675059J172361l16184L7296J939466L842205M137565K110458
2716I186933j324853m128718m830764l370783m10029L040757N184718M245720
2708G592981N81006l161897m787604m386581k914893o48824J764499K489529P66217
2699b705567j130918m63607K059976L310501K385407J529842K033588K136766
$$ plain form
2691 9155988 9611663 8465777 7897169 8400837 7220527 2301723 -3976500 -7402285 -7399488
2682 -7399488 -7360500 -9585960 -12400013 -13020127 -11097089 -8093474 -4903489 -1839091 183462
2673 183462 373814 -490026 -931467 -797301 -1069665 -2026683 -3006585 -3716076 -4283959 -4164972
2663 -4164972 -2514126 312187 2974875 4753023 5506637 4436887 987766 -2913824
2655 -2913824 -3915958 -1423140 1250808 970345 -1702519 -4121032 -4880170 -4178000 -2547906
2646 -2547906 -964695 -987828 -3079013 -5625566 -6986955 -7469964 -7910191 -7613728 -5580033
2637 -5580033 -2758078 -1026572 -564244 -182653 279616 -55727 -1035673 -1389159 -613046
2628 -613046 832402 2949609 5821105 7949822 7288664 4309921 1923746 1689766 2038996
$$ packed form
2691I155988M55675j145886n68608N03668j180310m918804o278223l425785K797
2682g399488L8988k225460k814053o20114J923038L003615L189985L064398K022553
2673A83462J90352q63840m41441J34166k72364r57018r79902p09491n67883J18987
2663d164972J650846K826313K662688J778148P53614j069750l449121l901590
2655b913824j002134K492818K673948k80463k672864k418513p59138P02170J630094
2646b547906J583211k3133k091185k546553j361389m83009m40227K96463K033695
2637e580033K821955J731506M62328L81591M62269l35343r79946l53486P76113
2628f13046J445448K117207K871496K128717o61158k978743k386175k33980L49230
$$ plain form
2619 2038996 1041064 -933529 -2360425 -2724147 -2330705 -1357073 -378818 -672978 -2640557
2610 -2640557 -4849045 -5900693 -6274971 -6809310 -6271641 -2609526 3409514 7955607 8471355
2601 8471355 6800472 6689355 9041691 11226911 10863336 8523091 6057571 3822027 1076510
2592 1076510 -1730223 -3038699 -2551094 -1717432 -1341109 -333315 2242658 5248053 6708868
2583 6708868 5958944 3576683 330076 -2628160 -3626066 -2058501 531620 2198916 2772568
2574 2772568 3239524 3869051 4149442 3660991 1893446 -1578294 -5547378 -7528147 -7325559
2565 -7325559 -8216725 -12206531 -16226432 -16251146 -13270117 -11115512 -9846922 -6321543 -907029
2556 -907029 1908391 522538 -1384327 -1164253 -938601 -2591257 -3741516 -2017550 627718
$$ packed form
2619B038996r97932j974593j426896l63722L93442R73632R78255k94160j967579
2610b640557k208488j051648l74278n34339N37669L662115O019040M546093N15748
2601H471355j670883j11117K352336K185220l63575k340245k465520k235544k745517
2592A076510k806733j308476M87605Q33662L76323J007794K575973L005395J460815
2583F708868p49924k382261l246607k958236r97906J567565K590121J667296N73652
2574B772568M66956O29527K80391m88451j767545l471740l969084j980769K02588
2565g325559q91166l989806m019901k4714K981029K154605J268590L525379N414514
2556i07029K815420j385853j906865K20074K25652j652656j150259J723966K645268
$$ plain form
2547 627718 1495735 1561864 2501520 2585594 -39741 -2713665 -1844962 763886 324489 -3266639
2537 -3266639 -5332212 -3772138 -1529774 -1116941 -1311405 -703192 -536316 -1953740 -3336164
2528 -3336164 -2521678 210574 2985590 4768611 5840920 6897944 8220286 8917992 7387783
2519 7387783 3843140 1391199 2328218 4319480 3359169 -42882 -1461790 475053 2022496
2510 2022496 503164 -1699589 -1745669 -1214868 -3008046 -6045507 -6839626 -4855087 -2735039
2501 -2735039 -1932553 -1420217 -616324 -544253 -1464534 -1739908 -93754 2576295 4645551
2492 4645551 5969401 7615437 9831822 11199973 10146234 7063736 4343093 3808878
2484 3808878 4461549 3524384 -393262 -5928739 -10466438 -11968165 -9695766 -4751324 -57597
$$ packed form
2547F27718Q68017O6129R39656Q4074k625335k673924Q68703K608848m39397l591128
2537c266639k065573J560074K242364M12833j94464O08213J66876j417424j382424
2528c336164Q14486K732252K775016J783021J072309J057024J322342O97706j530209
2519G387783l544643k451941R37019J991262r60311l402051j418908J936843J547443
2510B022496j519332k202753m6080N30801j793178l037461p94119J984539K120048
2501b735039Q02486N12336Q03893P2071r20281k75374J646154K670049K069256
2492D645551J323850J646036K216385J368151j053739l082498k720643n34215
2484C808878O52671r37165l917646n535477m537699j501727K272399M944442M693727
$$ plain form
2475 -57597 1814101 1253053 737083 1273421 1498032 544474 -492435 -824969 -1423630 -2824629
2465 -2824629 -3503805 -2117182 272625 1833687 2295021 2083353 833848 -1377204 -2915202
2456 -2915202 -2807958 -2715898 -4527461 -7232962 -8391466 -7502405 -5653427 -3141384 -83224
2447 -83224 1809705 1124426 -363442 170242 2081855 2126402 -482813 -3393019 -5516722
2438 -5516722 -8246613 -11489499 -12368963 -9578672 -5757056 -3485258 -1749815 1304781
2430 1304781 4558120 5559733 4357483 3171853 3354503 4741321 6917551 9047334
2422 9047334 9378288 7039434 3847325 2611266 4069883 6812178 9408276 11113429
2414 11113429 11336246 10188244 9020294 8830685 8700342 7288362 5089234 3457646 2189263
$$ packed form
2475e7597J871698n61048n15970N36338K24611r53558j036909l32534n98661j400999
2465b824629o79176J386623K389807J561062M61334k11668j249505k211052j537998
2456b915202J07244R2060j811563k705501j158504Q89061J848978K512043L058160
2447h3224J892929o85279j487868N33684J911613M4547k609215k910206k123703
2438e516722k729891l242886q79464K790291L821616K271798J735443L054596
2430A304781L253339J001613j202250j185630J82650J386818K176230K129783
2422I047334L30954k338854l192109j236059J458617K742295K596098J705153
2414A1113429K22817j148002j167950j89609j30343j411980k199128j631588j268383
$$ plain form
2405 2189263 178991 -2063975 -2928529 -2571891 -2817130 -3928480 -3966707 -2094719 -188112
2396 -188112 39737 -528395 -366825 87112 -301432 -829899 5939 1530456 1304411 -1255721
2386 -1255721 -3687979 -3658566 -1719862 177546 1578745 3261977 4741671 4095519 774406
2377 774406 -3014093 -4847302 -5042110 -5768153 -7746269 -9280446 -8565476 -5684244 -2104721
2368 -2104721 648132 1521490 361787 -1571760 -2461196 -1857262 -944197 -639188 -677364
2359 -677364 -960718 -2049484 -3289576 -2348882 1496715 5034648 4490782 602873 -2068856
2350 -2068856 -807878 2504625 4574866 4571710 4098750 4855820 7128709 9576530 10068601
2341 10068601 7626439 3648586 274844 -2151591 -4600048 -6775067 -7126025 -5586601
$$ packed form
2405B189263k010272k242966q64554L56638k45239j111350l8227J871988J906607
2396a88112K27849n68132J61570M53937l88544n28467Q35838J524517k26045k560132
2386a255721k432258K9413J938704J897408J401199J683232J479694o46152l321113
2377G74406l788499j833209j94808p26043j978116j534177P14970K881232L579523
2368b104721K752853Q73358j159703j933547q89436O03934R13065L05009l8176
2359f77364k83354j088766j240092R40694L845597L537933n43866l887909k671729
2350b068856J260978L312503K070241l156m72960P57070K272889K447821M92071
2341A0068601k442162l977853l373742k426435k448457k175019l50958J539424
$$ plain form
2333 -5586601 -4139705 -4073967 -4631636 -4933270 -5113019 -4847053 -3158136 -758344 -47279
2324 -47279 -1279075 -1378276 1360842 4044405 3454266 1200041 1011542 2571710 2269653
2315 2269653 -532418 -2379272 -1384479 -42915 -1060236 -3673429 -5843579 -7385353
2307 -7385353 -8944056 -9961479 -9599641 -8111697 -5743696 -1925107 2866929 6127362
2299 6127362 6057978 3927909 2021733 743004 -340101 -262340 1828468 3984995 3294166
2290 3294166 192240 -1760899 -588953 2094985 4119348 5257058 5929976 5864271 5401719
2281 5401719 6153717 8623497 10579430 9572586 6181582 3148820 1952450 1810801 1690296
2272 1690296 1699608 2374227 3749488 5418727 6833797 7539309 7671267 8026416 9061849
$$ packed form
2333e586601J446896O5738n57669l01634j79749K65966J688917K399792P11065
2324d7279j231796r9201K739118K683563n90139k254225j88499J560168l02057
2315B269653k802071j846854R94793J341564j017321k613193k170150j541774
2307g385353j558703j017423L61838J487944K368001L818589M792036L260433
2299F127362o9384k130069j906176j278729j083105P7761K090808K156527o90829
2290C294166l101926j953139J171946K683938K024363J137710O72918o5705m62552
2281E401719P51998K469780J955933j006844l391004l032762j196370j41649j20505
2272A690296R312O74619J375261J669239J415070P05512J31958L55149J035433
$$ plain form
2263 9061849 10173872 10580028 10324498 9562806 7686812 4615113 2296396 2858764 5286934
2254 5286934 6243402 4829123 4133446 6578278 9847296 9796108 6172757 2863037 2883009
$$ packed form
2263I061849J112023M06156k55530p61692j875994l071699k318717N62368K428170
2254E286934R56468j414279o95677K444832L269018n1188l623351l309720J9972
$$ [...]
##END NTUPLES=NMR SPECTRUM
##END=
