##TITLE=31Pdec_DE-157R_TFA
 DMSO+CCl4,64 sc
 23.6.2026
##JCAMPDX= 6.0         $$ Bruker NMR JCAMP-DX V2.0
##DATA TYPE= NMR SPECTRUM
##DATA CLASS= NTUPLES
##ORIGIN= UXNMR, Bruker Analytische Messtechnik GmbH
##OWNER= root
$$ XWIN-NMR		Version 3.5
$$ Tue Jun 23 15:03:26 2026 Russian Standard Time (UT+4h)  she@DPX200
##.OBSERVE FREQUENCY= 81.013821
##.OBSERVE NUCLEUS= ^31P
##.ACQUISITION MODE= SIMULTANEOUS
##.ACQUISITION SCHEME= undefined
##.AVERAGES= 64
##.DIGITISER RES= 17
##SPECTROMETER/DATA SYSTEM= spect
##.PULSE SEQUENCE= zgpg30
##.SOLVENT NAME= CDCl3
##.SHIFT REFERENCE= (INTERNAL, CDCl3, 0, 197.392)
##AUDIT TRAIL= $$ (NUMBER, WHEN, WHO, WHERE, WHAT)
$$ ##TITLE= Audit trail, XWIN-NMR		Version 3.5
$$ ##JCAMPDX= 5.01
$$ ##ORIGIN= Bruker BioSpin GmbH
$$ ##OWNER= she
$$ F:/spectra/data/she/nmr/P31/2/pdata/1/auditp.txt
$$ ##AUDIT TRAIL=  $$ (NUMBER, WHEN, WHO, WHERE, WHAT)
(   1,<2026-06-23 15:02:28.82 +0400>,<she>,<DPX200>,
      <created by zg, POWCHK disabled, PULCHK disabled
       configuration hash MD5:
       00 E9 B6 7A A2 85 ED C7 34 08 36 98 17 FE 4E 26
       data hash MD5: 32K
       27 17 E0 23 BF B8 8B 47 31 53 EF FF 2A 41 CD 48>)
(   2,<2026-06-23 15:02:31.26 +0400>,<she>,<DPX200>,
      <Start of raw data processing
       efp BC_mod = 2 LB = 1.5 FT_mod = 6 PKNL = 1 PHC0 = 1783.736 PHC1 = -362.6993 SI = 64K 
       data hash MD5: 64K
       6D 25 89 E7 DC 43 17 DD 5D 9A 15 1B B4 90 C3 CE>)
(   3,<2026-06-23 15:02:47.68 +0400>,<she>,<DPX200>,
      <pk PHC0 = -42.55413 PHC1 = 0 
       data hash MD5: 64K
       EE 1B 15 48 7F 1B 9A 72 A5 0E 4E 77 2A 13 CD F3>)
(   4,<2026-06-23 15:02:56.82 +0400>,<she>,<DPX200>,
      <abs ABSG = 5 
       data hash MD5: 64K
       D2 3E 26 19 2F E9 41 B3 17 5F DC FF EA D2 E3 67>)
$$ ##END=
$$ 
$$ hash MD5
$$ 0A 27 63 64 D5 A3 B1 74 13 AB 33 DB 27 51 23 3A
##$RELAX= 
##$RELAX= 
##$RELAX= 
##$RELAX= 
##$RELAX= 
##$RELAX= 
##$RELAX= 
##$RELAX= 
$$ Bruker specific parameters
$$ --------------------------
##$DU= <F:/spectra>
##$EXPNO= 2
##$NAME= <P31>
##$PROCNO= 1
##$TYPE= <nmr>
##$USER= <she>
##$AMP= (0..31)
100 100 100 100 100 100 100 100 100 100 100 100 100 100 100 100 100 100 
100 100 100 100 100 100 100 100 100 100 100 100 100 100 
##$AQSEQ= 0
##$AQ_mod= 1
##$AUNM= <au_zg>
##$AUTOPOS= <>
##$BF1= 81.014009
##$BF2= 200.13
##$BF3= 200.13
##$BF4= 200.13
##$BF5= 200.13
##$BF6= 200.13
##$BF7= 200.13
##$BF8= 200.13
##$BYTORDA= 1
##$CFDGTYP= 0
##$CFRGTYP= 5
##$CHEMSTR= <none>
##$CNST= (0..31)
1 1 145 1 1 1 1 1 1 1 1 1 1 1 1 1 1 1 1 1 1 1 1 1 1 1 1 1 1 1 1 1 
##$CPDPRG= <waltz16>
##$CPDPRG1= <>
##$CPDPRG2= <waltz16>
##$CPDPRG3= <>
##$CPDPRG4= <mlev>
##$CPDPRG5= <mlev>
##$CPDPRG6= <mlev>
##$CPDPRG7= <mlev>
##$CPDPRG8= <mlev>
##$CPDPRGB= <>
##$CPDPRGT= <>
##$D= (0..31)
0 1 0 0 0 0 0 0 0 0.06 0 0.03 2e-05 3e-06 0 0 0.0002 0 0 0 0 0 0 0 0 0 
0 0 0 0 0 0 
##$DATE= 1782212548
##$DBL= (0..7)
120 120 120 11 120 120 24 19 
##$DBP= (0..7)
150 150 150 150 150 150 150 150 
##$DBP07= 0
##$DBPNAM0= <>
##$DBPNAM1= <>
$$ [...]
##$SUBNAM3= <"">
##$SUBNAM4= <"">
##$SUBNAM5= <"">
##$SUBNAM6= <"">
##$SUBNAM7= <"">
##$SUBNAM8= <"">
##$SUBNAM9= <"">
##$SW= 400.765351723535
##$SWIBOX= (0..15)
0 1 3 0 0 0 0 0 0 0 0 0 0 0 0 0 
##$SW_h= 32467.5324675325
##$TD= 32768
##$TD0= 1
##$TE= 0
##$TE2= 300
##$TE3= 300
##$TEG= 300
##$TL= (0..7)
0 120 53 12 22 120 120 120 
##$TP= (0..7)
150 150 150 150 150 150 150 150 
##$TP07= 0
##$TPNAME0= <>
##$TPNAME1= <>
##$TPNAME2= <>
##$TPNAME3= <>
##$TPNAME4= <>
##$TPNAME5= <>
##$TPNAME6= <>
##$TPNAME7= <>
##$TPOAL= (0..7)
0.5 0.5 0.5 0.5 0.5 0.5 0.5 0.5 
##$TPOFFS= (0..7)
0 0 0 0 0 0 0 0 
##$TUNHIN= 0
##$TUNHOUT= 0
##$TUNXOUT= 0
##$USERA1= <user>
##$USERA2= <user>
##$USERA3= <user>
##$USERA4= <user>
##$USERA5= <user>
##$V9= 5
##$VALIST= <valist>
##$VCLIST= <CCCCCCCCCCCCCCC>
##$VD= 0
##$VDLIST= <DDDDDDDDDDDDDDD>
##$VPLIST= <PPPPPPPPPPPPPPP>
##$VTLIST= <TTTTTTTTTTTTTTT>
##$WBST= 1024
##$WBSW= 4
##$XGAIN= (0..3)
0 0 0 0 
##$XL= 0
##$YL= 0
##$YMAX_a= 7534
##$YMIN_a= -3236
##$ZGOPTNS= <>
##$ZL1= 120
##$ZL2= 120
##$ZL3= 120
##$ZL4= 120
##$ABSF1= 197.3918
##$ABSF2= -203.3724
##$ABSG= 5
##$ABSL= 3
##$ALPHA= 0
##$AQORDER= 0
##$ASSFAC= 0
##$ASSFACI= 0
##$ASSFACX= 0
##$ASSWID= 0
##$AUNMP= <proc_1d>
##$AZFE= 0.1
##$AZFW= 0.5
##$BCFW= 0
##$BC_mod= 2
##$BYTORDP= 0
##$COROFFS= 0
##$CY= -3
##$DATMOD= 1
##$DC= 0
##$DFILT= <>
##$DTYPP= 0
##$F1P= 0
##$F2P= 0
##$FCOR= 1
##$FTSIZE= 65536
##$FT_mod= 6
##$GAMMA= 0
##$GB= 0
##$INTBC= 1
##$INTSCL= 9.790993e-09
##$ISEN= 30
##$LB= 1.5
##$LEV0= 0
##$LPBIN= 0
##$MAXI= 10000
##$MC2= 0
##$MEAN= 0
##$ME_mod= 0
##$MI= 50
##$NCOEF= 0
##$NC_proc= -8
##$NLEV= 6
##$NOISF1= 182.463
##$NOISF2= 159.3651
##$NSP= 0
##$NTH_PI= 0
##$NZP= 0
##$OFFSET= 197.3918
##$PC= 4
##$PHC0= 1741.182
##$PHC1= -362.6993
##$PH_mod= 1
##$PKNL= yes
##$PPARMOD= 0
##$PSCAL= 0
##$PSIGN= 0
##$REVERSE= no
##$SF= 81.014063255964
##$SI= 65536
##$SIGF1= 159.3651
##$SIGF2= -187.1042
##$SINO= 113.3802
##$SIOLD= 16384
##$SREGLST= <1H.CDCl3>
##$SSB= 0
##$STSI= 65536
##$STSR= 0
##$SW_p= 32467.5324675325
##$SYMM= 0
##$S_DEV= 0
##$TDeff= 32768
##$TDoff= 0
##$TI= <>
##$TILT= no
##$TM1= 0
##$TM2= 0
##$TOPLEV= 0
##$USERP1= <user>
##$USERP2= <user>
##$USERP3= <user>
##$USERP4= <user>
##$USERP5= <user>
##$WDW= 1
##$XDIM= 65536
##$YMAX_p= 382924562
##$YMIN_p= -22720019
$$ End of Bruker specific parameters
$$ ---------------------------------
##NTUPLES= NMR SPECTRUM
##VAR_NAME=  FREQUENCY,     SPECTRUM/REAL,   SPECTRUM/IMAG
##SYMBOL=    X,             R,               I
##VAR_TYPE=  INDEPENDENT,   DEPENDENT,       DEPENDENT
##VAR_FORM=  AFFN,          ASDF,            ASDF
##VAR_DIM=   65536,         65536,           65536
##UNITS=     HZ,            ARBITRARY UNITS, ARBITRARY UNITS
##FACTOR=    0.49542278885378, 1,            1
##FIRST=     15991.5117654749, 0,            0
##LAST=      -16476.0207020576, 0,           0
##MIN=       -16476.0207020576, -22720019,   0
##MAX=       15991.5117654749, 382924562,    0
$$ Real data points
##PAGE= N=1
##DATA TABLE= (X++(R..R)), XYDATA
$$ [...]
7491f896669l425934q61110Q36013R65925q4518j217247p67314K139844N654409
7482c656601O285358L041833r81277k367999j237378K7470K76299k6586n53837
7473H07282j118347q64337M95183J428828N71074q75688q59575K24781L56608
7464A65809o75919j311125j224340j426243j556393k23270J761248J832122L0702
7455b627409n25834J288280K603732J454313J69329J159425K402649O76794k917171
7446C684108m541641l352789j738136o48826J152989L156100K629636p21534l211435
7437c591528k173780K92862P81404m33167m38573J648528L720288L942236K716981
7428F465251J248431n2250j178997j777808j499997n72220L34652M73284o78656
$$ y = [-6896669, -10322603, -11183713, -10347700, -9381775, -9466293, -10683540, -11450854, -9311010, -3656601, 2628757, 5670590, 4689313, 2321314, 1083936, 1111406, 1387705, 1361119, 807282, -311065, -1175402, -680219, 748609, 1319683, 443995, -415580, -190799, 165809, -510110, -1821235, -3045575, -4471818, -6028211, -6251481, -4490233, -2658111, -2627409, -3153243, -1864963, 738769, 2193082, 2362411, 3521836, 5924485, 6601279, 3684108, -857533, -4210322, -5948458, -6597284, -5444295, -2288195, 341441, -380093, -3591528, -5765308, -5472446, -4691042, -5124209, -5562782, -3914254, -193966, 3748270, 6465251, 7713682, 7661432, 6482435, 4704627, 3204630, 2632410, 2967062, 3440346, 2761690]
7419B761690k820809m453051l923976j342915J147184J641404N86897j50260M4812
7410f509024N9645o00255n70966J151910K978682K538995K28513j147847m25084
7401b295431M45962j61542p85647O79059L234182L734434J183051j832562k196876
7392B004630M39227L561925M235053J750076j658656l182010k741513k704642
7384A704090l826581l662752p28995K046223J109972j942441k243514J087090
7376f456908L690507K649749L59993J6274Q78854O48286k92936j54413O40349
7367A979755K89116j011397j422689n97025J31632K95604N79017P53888j90592
7358H07309j632920j394835R84753K923073J883153j331972l424472k263134R20580
$$ y = [2761690, -59119, -4512170, -8436146, -9779061, -8631877, -6990473, -6403576, -6553836, -6509024, -6449379, -7049634, -7620600, -6468690, -3490008, -951013, -722500, -1870347, -2295431, -1849469, -2011011, -2796658, -2117599, 1116583, 4851017, 6034068, 4201506, 2004630, 2443857, 6005782, 10240835, 11990911, 10332255, 7150245, 4408732, 1704090, -2122491, -5785243, -6514238, -4468015, -3358043, -5300484, -7543998, -6456908, -2766401, -116652, 243341, 259615, 1138469, 1786755, 1493819, 1339406, 1979755, 2268871, 1257474, -165215, -762240, -630608, -335004, 244013, 997901, 807309, -825611, -2220446, -1235693, 1687380, 3570533, 2238561, -1185911, -3449045, -2528465]
7349b528465K851882J611127j239757k347276n87384J523997J165817j115620
7341f65679k436861j539147K0L19688o03857j577845j606175m29434J274002K132248
7331e133040J586059J084964K457806M995712N667251K773220j833426m751265
7323F847281m205450q29769L311364N608490M194146r1439l652453l607927j160805
7314F413438q4175j798873l644675k799364k31890J013187M20499L23328J592959
7305A204434J978879J45650j394137k6223K367693K120937j60629n92843J116689
7296F760450P54813l104159n828763l615181N80163J825975M72048M4537N98237
7287a511880m30997k214508j134279K630229M461992K200405r79052j915658j436486
$$ y = [-2528465, 323417, 1934544, 694787, -1652489, -2239873, -715876, 449941, -665679, -3102540, -4641687, -4641667, -4321979, -4925836, -6503681, -8109856, -8539290, -7265288, -5133040, -3546981, -2462017, -4211, 4991501, 10658752, 13431972, 11598546, 6847281, 2641831, 1812062, 5123426, 10731916, 14926062, 14834623, 11182170, 7574243, 6413438, 6329263, 4530390, 885715, -1913649, -2145539, -1132352, -711853, -388525, 1204434, 3183313, 3328963, 1934826, 1908603, 4276296, 6397233, 6236604, 5643761, 6760450, 7515263, 4411104, -1417659, -5032840, -4452677, -2626702, -2154654, -2110117, -1511880, -1942877, -4157385, -5291664, -2661435, 1800557, 4000962, 3021910, 1106252, -330234]
7278c30234j313711j228535q33991j254969k244288j199582K402819M755697K962942
7269A716148j74341q7953K889794M482832K814360J22662j366400j894502k275465
7260F227135k336448j942992j616934j480926r48487J21495R74373Q81773j31271
7251b52282j320573j527342r6566J919077K420335R16605o17699n39808J68894
7242A070641j56752r81424o13260P56718J273117L98055l40988K62252J547079
7233C215438K124070J441133M3925r81908r83068o58949j285096k379578j526095
7224i90128K024467M959759L450601j522403m906661l730910j96550J876984J473029
7215B438188J76735o05746o06813J06922J218681J656894L71035k035465l351998
$$ y = [-330234, -1643945, -2872480, -3706471, -4961440, -7205728, -8405310, -6002491, -1246794, 1716148, 1541807, 1453854, 4343648, 8826480, 11640840, 11763502, 10397102, 8502600, 6227135, 3890687, 1947695, 330761, -1150165, -2098652, -1977157, -1002784, -121011, -252282, -1572855, -3100197, -3196763, -1277686, 1142649, 2059254, 1441555, 901747, 1070641, 913889, -67535, -680795, 75923, 1349040, 1747095, 1406107, 1668359, 3215438, 5339508, 6780641, 6824566, 5842658, 4859590, 4200641, 2915545, 535967, -990128, 1034339, 5994098, 9444699, 7922296, 3015635, -715275, -911825, 965159, 2438188, 2614923, 2009177, 1402364, 1509286, 2727967, 4384861, 4755896, 2720431, -631567]
7206f31567k148059L17436J527391J063315J224134L449488N460341L898207p50406
7197A3410280m277731m107508k149473j416614k099999k534561k127828j389893
7189f693327m47953N27865N11107q67223j880719o69723K004027L708136L517071
7180b90739K614325K152740K034400J589404L36253j611625l177873l128010j856044
7171a337169j129757j353718q14789J298189L176973L218209K436015K140878
7163G634831J368151j018932l606238m343304l418289j861930N27614L193633
7155a524464L409569L35070k169117r59864Q15808j272940m748569l510141J927849
7146g696799M737490K594676Q00659K823309M790191K668260j122003k418948
$$ y = [-631567, -2779626, -2462190, -934799, 128516, 1352650, 4802138, 10262479, 14160686, 13410280, 9132549, 5025041, 2875568, 1458954, -641045, -3175606, -5303434, -6693327, -7141280, -6613415, -6102308, -6969531, -8850250, -9519973, -7515946, -3807810, -290739, 2323586, 4476326, 6510726, 8100130, 8436383, 6824758, 3646885, 518875, -1337169, -2466926, -3820644, -4635433, -3337244, -160271, 3057938, 5493953, 7634831, 9002982, 7984050, 4377812, 34508, -3383781, -5245711, -4718097, -1524464, 1885105, 2220175, 51058, -908806, -92998, -1365938, -6114507, -9624648, -7696799, -2959309, -364633, 436026, 3259335, 8049526, 10717786, 9595783, 7176835]
7138G176835j869111k379006l659372l540294k073374p34198K50993R54447N35214
7129e337866n59717L3713K561642L590139J160459j797459k199312j485835k095966
7120f130202k745280j330632N82358O39257K46754J550059K598924P94722j268439
7111e062479N94744M418658M465585N93018j587182k34974N7265l103566n297488
7102e156419k647107J692443K678983J001769R45500L261632M713232L448841
7094I938874Q91268j275604k696692k886969j073709J801417L078313J466194
7086I243092j185551k267506j696434j565411k769005l454529j610858J859295
7078c446907M140192M139522L228861K204896r9457l888756o256069m341962L59053
$$ y = [7176835, 5307724, 2928718, -730654, -4270948, -6344322, -7078520, -6827527, -5873080, -5337866, -5897583, -5863870, -3302228, 287911, 1448370, -349089, -2548401, -4034236, -6130202, -8875482, -10206114, -9623756, -8984499, -8737745, -7187686, -4588762, -3794040, -5062479, -4467735, -49077, 4416508, 5009526, 3422344, 3187370, 3244635, 141069, -5156419, -7803526, -6111083, -3432100, -2430331, -1484831, 1776801, 6490033, 9938874, 10830142, 9554538, 6857846, 3970877, 2897168, 4698585, 7776898, 9243092, 8057541, 5790035, 4093601, 2528190, -240815, -3695344, -5306202, -3446907, 693285, 4832807, 8061668, 10266564, 10167107, 6278351, 22282, -4319680, -3960627]
7069c960627L234816J979978j042090k065342k53029J643425N33452l099072m916059
7060g944548j582578M371971O890463M050860L84857J52542J770778J665945L63254
7051A0123544N79646J519156K5091l406876m604186j984047J342823K469367J986335
7042H050853J356756L41882j469114l038541l145415j683837P06356K704689K401243
7033F224872m68960k967665k297418l0692J43101j826645k670039j429937l30192
7024e653575R9941J847598M471445M436309J114872j489147j277688j339534l702357
7015a492136m802923j434218K988541L208977J82157r63754R46964K370394J456327
7006B460329J67641l6447j88151p80243m26975J335977K705668K191380N37103
$$ y = [-3960627, -725811, 1254167, 212077, -1853265, -2106294, -462869, 70583, -3028489, -7944548, -9527126, -5155155, 1735308, 5786168, 6171025, 6323567, 8094345, 9760290, 10123544, 10703190, 12222346, 12247437, 8840561, 4236375, 2252328, 3595151, 6064518, 8050853, 9407609, 9749491, 8280377, 5241836, 2096421, 412584, 1118940, 3823629, 6224872, 5755912, 2788247, 490829, 460137, 603238, -1223407, -3893446, -5323383, -5653575, -5553634, -3706036, 765409, 5201718, 6316590, 4827443, 3549755, 2210221, -1492136, -6295059, -7729277, -4740736, -1531759, -1349602, -2313356, -1366392, 1004002, 2460329, 2627970, 2591523, 2403372, 1623129, 1196154, 2532131, 5237799, 7429179, 7966282]
6997G966282p22033j039049p20996l81776p99303k181620l518466l574047k293809
6988g264817n08138J088025J921680J607362R53136J487935K830655K309437j142882
6979C282393m604380m839651k555347m43286J138148L189063M301667K110264
6971A578871j858702l134861p84422J106565j20888j576634L25675L856632M257983
6962C650219O64764k674380k206764N44585J469421q79337m030266n019977l509652
6953a1991387j099508J088817K835985L596132K727300J044358L28173Q05014
6945f65116R03243J13882j04788O04638O0067k752270m836491l025182R53305
6936h748712K714618J659869J362912L459505N086595L709693J124836L87753
$$ y = [7966282, 7244249, 6205200, 5484204, 5102428, 4303125, 2121505, -1396961, -4971008, -7264817, -7772955, -6684930, -4763250, -3155888, -2202752, -714817, 2115838, 4425275, 3282393, -1321987, -6161638, -8716985, -9160271, -8022123, -4833060, -531393, 1578871, -279831, -3414692, -4199114, -3092549, -3213437, -4790071, -4464396, -607764, 3650219, 4314983, 1640603, -566161, -21576, 1447845, 568508, -3461758, -8481735, -11991387, -13090895, -12002078, -9166093, -5569961, -2842661, -1798303, -1470130, -665116, 238127, 352009, 247221, 851859, 911926, -1840344, -6676835, -9702017, -8748712, -6034094, -4374225, -3011313, 448192, 5534787, 9244480, 10369316, 10757069]
6928A0757069J112051N56926j790468l432755k586626m67903Q48910J206339J620917
6919G824460J681046k51233l831230n739686l586243M41247K072441M74963j254447
6910b168682q38112R70835L105760N449441O343608K979064l391454o583732l267062
6901B599666J755081K165952r50540j816923O96022K326260J075367m37882n46289
6892F866714p41329j274643M191K682599K799783p49606l505564k119475M41678
6883D404348j04334k678330l164975q51055J479766K209584J965505J145023l38127
6874D067405j469397j022228M15192J331723J382052Q05190q56069l297736m188714
6865b832582j932633J455840K776718J805351M32634r27474k747283l319608m28705
$$ y = [10757069, 11869120, 12426046, 10635578, 7202823, 4616197, 4148294, 4997204, 6203543, 7824460, 9505506, 9254273, 5423043, -316643, -3902886, -3461639, -1389198, -914235, -2168682, -3006794, -2035959, 1069801, 6519242, 12862850, 15841914, 12450460, 5866728, 2599666, 4354747, 6520699, 5570159, 3753236, 4449258, 6775518, 7850885, 7413003, 6866714, 6125385, 4850742, 4854933, 7537532, 10337315, 9587709, 6082145, 3962670, 4404348, 4300014, 1621684, -1543291, -2394346, -914580, 1295004, 3260509, 4405532, 4067405, 2598008, 1575780, 1990972, 3322695, 4704747, 5509937, 4653868, 1356132, -2832582, -4765215, -3309375, -532657, 1272694, 1705328, 777854, -1969429, -5289037, -5717742]
6856e717742L904225M533522J72863m316452m311475j071429J083487O90553l06783
6847e339231j84128J047000K804997M230685L806031Q73711k568764l571928j926330
6838h27957l79838p74803j750511j191991N81887J551635J036658L65973P01717
6829f87230J610555K026424J528994L00919j262178k438323k446638j341685o7676
6820b776838P14576J181519J449810J048610j65279j404362j846564j351985N9566
6811c090947K183324L515044J933063k151889m963518l596358J64265K367223
6803c639793K086936J522402J705982J178790r34536l291888m361137l887010
6795i620254j993725Q93631K888921J945760r46499k269103n62414J808275K414007
$$ y = [-5717742, -1813517, 2720005, 2892868, -1423584, -5735059, -6806488, -5723001, -5032448, -5339231, -5523359, -4476359, -1671362, 2559323, 6365354, 7239065, 4670301, 1098373, -827957, -1207795, -1982598, -3733109, -4925100, -4343213, -2791578, -1754920, -1388947, -687230, 923325, 2949749, 4478743, 4779662, 3517484, 1079161, -1367477, -2709162, -2776838, -2062262, -880743, 569067, 1617677, 1452398, 48036, -1798528, -3150513, -3090947, -907623, 2607421, 4540484, 2388595, -2574923, -6171281, -6007016, -3639793, -1552857, -30455, 1675527, 2854317, 1919781, -1372107, -5733244, -9620254, -11613979, -10720348, -7831427, -5885667, -6832166, -9101269, -9663683, -7855408, -5441401]
6786e441401J842359J728350K023627J850077J199225K91142j051305k153399
6778B88675j531955N33895J550071L38697j169862j210062p71406r59112m12785
6769c343844J933552L815197K615416k72889j408232m11185K54086k94370o67783
6760B219948n24003j043744j957389j401275O86649J951565J145307l54190j280130
6751e57262k094461k877316k244995M6012J602164M68393j782276k018946K54275
6742i204412K492184K534413Q91470m47423l05467R23340K002888J820267Q5891
6733G93151k226232l214394j698750J037877K061841K70291j815781j233892J218774
6724d807115K192151Q22049l94505j63702l31157j716776j628026J584592M515166
$$ y = [-5441401, -3599042, -1870692, 152935, 2003012, 3202237, 3493379, 2442074, 288675, -1243280, -709385, 840686, 1179383, 9521, -1200541, -1971947, -2931059, -3343844, -1410292, 2404905, 5020321, 4747432, 3339200, 2928015, 3182101, 2887731, 2219948, 1695945, 652201, -1305188, -2706463, -2019814, -68249, 1077058, 722868, -557262, -2651723, -5529039, -7774034, -7728022, -6125858, -5657465, -7439741, -9458687, -9204412, -6712228, -4177815, -3286345, -3733768, -4039235, -3115895, -1113007, 707260, 793151, -1433081, -4647475, -6346225, -5308348, -3246507, -2976216, -4791997, -6025889, -4807115, -2614964, -1792915, -2187420, -2351122, -2682279, -4399055, -6027081, -4442489, 72677]
6715G2677L160434n91920j321218J957463M583945L105613p25869l562533m380692
6706B297900l518001j060896J970810L285281K026964O8319q01180j192557k204277
6697H72363k965280j910732O35662K833136L567019K986382J446352p04880k479092
6688D280930k563017o93773J623274K167810J76959k463531k872875m52748K268708
6679A471737K696474J086843m81469q45070j64998J116366K005614R20853j915036
6670E891314l241544o13859L406587M067236R88676j623087j496943j123504k795987
6661C458889m497058l215905J32840J974040J059865l06717J94311J955233K540334
6652C295832R96628p39918l40353J461962J711481j4914m08179K136209L909185
$$ y = [72677, 3233111, 2641191, 1319973, 3277436, 7861381, 10966994, 10241125, 6678592, 2297900, -1220101, -2280997, -310187, 2975094, 5002058, 5070377, 4269197, 3076640, 872363, -2092917, -4003649, -3367987, -534851, 3032168, 6018550, 7464902, 6760022, 4280930, 1717913, 1024140, 2647414, 4815224, 4992183, 2528652, -344223, -796971, 1471737, 4168211, 5255054, 4773585, 3928515, 3763517, 4879883, 6885497, 7806350, 5891314, 2649770, 2035911, 5442498, 9509734, 10498410, 8875323, 7378380, 6254876, 3458889, -1038169, -4254074, -4121234, -2147194, -1087329, -1394046, -1199735, 755498, 3295832, 4292460, 3552542, 3212189, 4674151, 6385632, 6370718, 5962539, 8098748, 12007933]
6643A2007933J268132k892584k967756N71007K019329k86392j969025r00573p85320
6634F064751l778164n754755l050538J201007K184313O64608J35979K90988j143962
6625c185773k705236j134924K430335L640302J607548m54296q29189r06432j318119
6616b855784r36862m9472m39510j720728j292960J337699L537482L503669K130570
6607C214104M26856j669521l223698k430490J6237P72286j387878l276322j551986
6598i110412K717324N510752M559697J232562j401106j485040J21921J017492
6590C163190K41805p16477o79633q41455k183143k775893p88964J367495Q4621
6581c128454k964778k305777K795983O306805L888010j053262k642592k85108
$$ y = [12007933, 13276065, 10383481, 7415725, 7986732, 10006061, 9719669, 7750644, 6850071, 6064751, 2286587, -3468168, -6518706, -5317699, -3133386, -2468778, -2332799, -2041811, -3185773, -5891009, -7025933, -4595598, -955296, 652252, 197956, -631233, -1537665, -2855784, -3792646, -3842118, -4281628, -6002356, -7295316, -5957617, -2420135, 1083534, 3214104, 3640960, 1971439, -1252259, -3682749, -3666512, -2894226, -4282104, -7558426, -9110412, -6393088, -882336, 3677361, 4909923, 3508817, 2023777, 2145698, 3163190, 3404995, 2688518, 2008885, 1167430, -1015713, -3791606, -4580570, -3213075, -3128454, -6093232, -8399009, -5603026, 703779, 4591789, 3538527, 895935, 610827]
6573F10827K228464K652858J699737K38757j425366k276013j455134n5878J20839
6564B339091q13206j268881o96836M1088L28196K71582m2298m82279n96119m51768
6554a371430q98199j899174j821050J04438J813643Q98503j723947k791937j090929
6545h780082J161157J504574J28665r30513l72514J089216J585204K51052j320448
6536e683689o38525K124410L497056J029769k943788l926925j025900K245321
6528e322271K944955K051924J970264K724155K290578j96415l079865l966698
6520e83373k164293O54809J984119Q87369j083158j721127p44788J75971j46899
6511b741370j069168j485551j354121j115985o25659K82384R37564Q07296P98289
$$ y = [610827, 2839291, 5492149, 7191886, 7430643, 6005277, 3729264, 2274130, 2218252, 2339091, 1525885, 257004, -439832, -398744, -70548, 201034, 158736, -323543, -919662, -1371430, -2269629, -4168803, -5989853, -5885415, -4071772, -3173269, -4897216, -7689153, -8780082, -7618925, -6114351, -5985686, -6916199, -7288713, -6199497, -4614293, -4363241, -5683689, -6322214, -4197804, -700748, 329021, -2614767, -6541692, -7567592, -5322271, -2377316, -325392, 1644872, 4369027, 6659605, 6463190, 3383325, -583373, -2747666, -2092857, -108738, 778631, -304527, -2025654, -2770442, -2594471, -2741370, -3810538, -5296089, -6650210, -7766195, -8391854, -8109470, -7171906, -6364610, -5566321]
6502e566321K131040M144252M818569L585034J922547P96187n51505k368476l065878
6493E845449j788179m39197q91960j806367j090126j25167j711059m412239l605667
6484a0024512J116615M396673K889326m2824l38326N97979p9588o05690J774011
6475c16336M186052J925869k663659k541127K657120N232334J377215k840449
6467G017019j290323K779630K543113j821707m557369l523752j779770j255367
6459a888526o12105O16303P61244l14351l80063J218420K162241R64965o66357
6450A861771o80467L66766O18231m98584k153545l284626l046608j254986R43755
6441g128293J821076R03286p80450k237361l116203k899818j081583J537879L115354
$$ y = [-5566321, -3435281, 708971, 5527540, 9112574, 11035121, 11831308, 11279803, 8911327, 5845449, 4057270, 3618073, 2726113, 919746, -170380, -295547, -2006606, -6418845, -10024512, -8907897, -4511224, -1621898, -1664722, -2003048, -1405069, -1484657, -2090347, -316336, 3869716, 5795585, 3131926, 590799, 3247919, 8480253, 9857468, 7017019, 5726696, 8506326, 11049439, 9227732, 4670363, 1146611, -633159, -1888526, -2500631, -1884328, -1123084, -1437435, -1817498, -599078, 1563163, 2528128, 1861771, 1181304, 1548070, 2166301, 1667717, -485828, -3770454, -6817062, -8072048, -7128293, -5307217, -4403931, -5184381, -7421742, -10537945, -13437763, -14519346, -12981467, -9866113]
6432i866113K767418J280009k52618j271996j244680J56236K008507K646389J661598
6423b115250K95380l69284l85404K458Q17609J552751J378587N80034L57038P58679
6413B872598L70396j326321k883700l036556k417383k088229j763129p51247M89443
6404a0534128J100557J262881J634383K072220K055613J696354J271306M98732
6396A057918o52016j290466r45234o07677r59486o09454J810378M463105L864940
6387F132008j57273l640034l542515j345374j48091k42767J79878J246836J124488
6378c92844n91650j758207p73740J076085J562251N26560m07700l64221j7889
6369a141355q5300k51383J67016J230117K248865K257639P91249j268197j994755
$$ y = [-9866113, -7098695, -5818686, -6071304, -7343300, -8587980, -8431744, -6423237, -3776848, -2115250, -1819870, -2189154, -2574558, -2572100, -1754491, -201740, 1176847, 1756881, 2113919, 2872598, 3242994, 1916673, -967027, -4003583, -6420966, -8509195, -10272324, -11023571, -10534128, -9433571, -8170690, -6536307, -4464087, -2408474, -712120, 559186, 1057918, 405902, -884564, -1829798, -2437475, -3396961, -4006415, -2196037, 2267068, 6132008, 5974735, 2334701, -1207814, -2553188, -2701279, -2944046, -2764168, -1517332, -392844, -984494, -2742701, -3516441, -2440356, -878105, -351545, -759245, -1123466, -1141355, -1226655, -1478038, -1311022, -80905, 2167960, 4425599, 5216848, 3948651, 1953896]
6360A953896n21831J353888R65535j581644l006046r93752K436605L222222M34356
6351D263229k503533k103437J052115L387099K738312M22151j041996j015863
6343E198077p82493j217696j665902j276437l90437O6129r6701l83587n01749
6334a050796l65209L53790J602768K108029M87385k537308m276598l089914l87067
6325g154920J147804O94213k13440l1779Q68955R28820l80090j662811j290704
6316g093952L64836J305953O81499k9640O14672J728913J554817J69849r84795
6307a687848j366692j067859P03565M006254N678277K288117l978563o539590
6299a964339l140593P15829k48274l534397l332831M15516K605612J325800J75727
$$ y = [1953896, 1432065, 2785953, 3751488, 2169844, -836202, -1829954, 606651, 3828873, 4263229, 1759696, -343741, 708374, 4095473, 6833785, 7255936, 6213940, 5198077, 4415584, 3197888, 1531986, 255549, -134888, -68759, -165460, -549047, -1050796, -1416005, -1062215, 540553, 2648582, 3135967, 598659, -3677939, -6767853, -7154920, -6007116, -5312903, -5526343, -5558122, -4689167, -3760347, -4140437, -5803248, -7093952, -6729116, -5423163, -4741664, -4771304, -4156632, -2427719, -872902, -703053, -1687848, -3054540, -4122399, -3418834, 587420, 6265697, 8553814, 4575251, -1964339, -5104932, -4389103, -4637377, -8171774, -11504605, -11089089, -8483477, -7157677, -6981950]
6290f981950J731382L495322K230768j154597l382400l217381j963116r53597
6282a0195569l55194K76822J430108L088156M172701L310488O13176k128338l349077
6273c136727k954369j557048L28930J964344K430184J643159N73112L9470n2282
6264g21227q5979j04432l6176N6500J05019L8285j59689j22883N14844J027897
6254E12159Q4543j846030k136633M32727L302555L402497J390630J02732M4983
6245E290163m69432j609732k029576k139623l469450m715458k724449J812982
6237a0054575M163722K638839J336207L274049N185640K917557j554674l149306
6229D757459j404156k77115j333233j991646p40369K14351j202743l570019m115799
$$ y = [-6981950, -5250568, -1755246, 475522, -679075, -4061475, -7278856, -9241972, -10195569, -10550763, -10273941, -8843833, -5755677, -1582976, 1727512, 2340688, 212350, -3136727, -6091096, -7648144, -7319214, -5354870, -2924686, -1281527, -708415, -668945, -721227, -807206, -911638, -947814, -891314, -786295, -748010, -907699, -1030582, -515738, 512159, 596702, -1249328, -3385961, -2953234, 349321, 3751818, 5142448, 5245180, 5290163, 4820731, 3210999, 1181423, -958200, -4427650, -9143108, -11867557, -10054575, -5890853, -3252014, -1915807, 1358242, 6543882, 9461439, 7906765, 4757459, 3353303, 3076188, 1742955, -248691, -989060, -774709, -1977452, -5547471, -9663270]
6220i663270k291813K10135J842770K531068L091137L769108L411328Q11659k748047
6211I64075l801052q92114K916836L709783J780138N72701J279522J556215m5479
6202H040625j408257j56548K442405K951347K94625k949869l739924j809128O36229
6193D301505J611691R52949m61458j862379k393941j011365J872652L372037R71737
6184G353428l541612n334169k383891K139032M226323L317132R64664j967196
6176D773711m555476m774529k139057M18505K94139q13641O6321J801080R10768
6167d018179k140544l008160j65591K814934K875168J434261Q85079N55808j266189
6158b033413l681566m211140k138457J135577L921084M902202L338040L02220
$$ y = [-9663270, -11955083, -11744948, -9902178, -7371110, -4279973, -510865, 2900463, 3712122, 964075, -2836977, -3729091, -812255, 2897528, 4677666, 5250367, 6529889, 8086104, 8040625, 6632368, 6475820, 8918225, 11869572, 12164197, 9214328, 5474404, 3665276, 4301505, 5913196, 6866145, 6404687, 4542308, 2148367, 1137002, 3009654, 6381691, 7353428, 3811816, -1522353, -3906244, -1767212, 2459111, 5776243, 6740907, 4773711, 218235, -4556294, -6695351, -6276846, -5982707, -6796348, -6730027, -4928947, -4018179, -6158723, -9166883, -9332474, -6517540, -3642372, -2208111, -1323032, -767224, -2033413, -5714979, -9926119, -12064576, -10928999, -7007915, -2105713, 1232327, 1534547]
6150A534547j394685k36559J842190J886845j39895j438892j82865K147158K621278
6141F639122M33637j942343j570107J039247K038979p01178l987614k999538K005625
6132I55830N536886L785693j077477m461053m539467k432411L03734K281389K214713
6123B567837M31086p70921l6113J049364N28020q75008j256877o68680m36909
6114E31799n27082j09942J08992j165765l007328l133072j493172l22103m39379
6105i557052k23637J174053K325108K259179K109122K531827J952278m46308k033456
6096I1114L905L754064M235965J63466l957535l718874l80363J477994K83567
6087A953303j194625m51221J501773K319204J704690J068469J011371Q39390R4433
$$ y = [1534547, 139862, -96697, 1745493, 3632338, 3492443, 2053551, 1870686, 4017844, 6639122, 7072759, 5130416, 3560309, 4599556, 6638535, 5937357, 1949743, -1049795, 955830, 6492716, 10278409, 9200932, 4739879, 200412, -2231999, -1928265, 353124, 2567837, 2998923, 2228002, 2191889, 3241253, 3769273, 2894265, 1637388, 968708, 531799, 4717, -105225, 3767, -1161998, -4169326, -7302398, -8795570, -9117673, -9557052, -9780689, -8606636, -6281528, -4022349, -1913227, 618600, 2570878, 2124570, 91114, 95019, 3849083, 8085048, 8248514, 4290979, 572105, 191742, 1669736, 1953303, 758678, 307457, 1809230, 4128434, 5833124, 6901593, 7912964, 8752354, 8846787]
6078H846787q43530j457404j313526k7317J774451K056032l73105l542934m254576
6069H64878k332392p10246q63225p21841J576500M205463M027104R57429k198033
6060D805637l314245k361049p8020K546914L793789K378504n96099k425349j809033
6051B941049J56253J966186L219425L873265L380191J294007j883336m811666
6043A0135374o054114n112184l237073k443610k834075j956550J684747N554309
6035d263176N787135K442210n82801r40680k71814n49820r94989k92861O78343
6026A011547O67424O98512K252138M051663L479712O64488j496372j329007k1395
6017I978710Q09445P68406m52825l263076o209511o217258k418525K054499L791000
$$ y = [8846787, 8003257, 6545853, 5232327, 5205010, 6979461, 9035493, 8662388, 5119454, 864878, -1467514, -2177760, -3040985, -3762826, -2186326, 2019137, 6046241, 7003670, 4805637, 1491392, -869657, -947677, 1599237, 5393026, 7771530, 7175431, 4750082, 2941049, 3097302, 5063488, 8282913, 12156178, 15536369, 16830376, 14947040, 10135374, 4081260, -1030924, -4267997, -6711607, -9545682, -11502232, -9817485, -4263176, 1523959, 3966169, 3383368, 2442688, 2170874, 1621054, 626065, 333204, 1011547, 1678971, 2377483, 4629621, 8681284, 12160996, 12825484, 11329112, 10000105, 9978710, 10788155, 11556561, 11103736, 7840660, 1631149, -4586109, -7004634, -4950135, -1159135]
6008a159135L015805J986934J255511J58381k59644J687466M421264L874471o77176
5999A4303877m689937m226692j197855j29737j659393k570433j392874k87163
5991a850207r12662j723659q82115O36199R17030M23417J071738K775716L288882
5982C744339J586963o48868j665803k091226l367290m753226l847779k15832L375007
5973g883715M396977L743183L646424L520515P85707m029149o422293l903588
5965f145939P9195R73627m97217m82224J192832J137738j051554j618388P53494
5956e658436K228238K94358j572923M59872L875373L475080m86317k902662j595303
5947a882720M17987M87478l99374p99684j201920j701856p50494J782222L054614
$$ y = [-1159135, 1856670, 3843604, 5099115, 5257496, 4997852, 6685318, 11106582, 14981053, 14303877, 9613940, 5387248, 4189393, 4059656, 2400263, -170170, -1563044, -1850207, -2762869, -4486528, -5368643, -4732444, -3815414, -3391997, -2320259, 455457, 3744339, 5331302, 4682434, 3016631, 925405, -2441885, -7195111, -11042890, -11258722, -7883715, -3486738, 256445, 3902869, 7423384, 8209091, 4179942, -2242351, -6145939, -6066744, -5093117, -5590334, -6072558, -4879726, -3741988, -4793542, -6411930, -5658436, -3430198, -3135840, -4708763, -4248891, -373518, 3101562, 2615245, -287417, -1882720, -1464733, -977255, -1376629, -2176313, -3378233, -5080089, -5830583, -4048361, -993747]
5938i93747J017716k226608k968754m81300K655647L753437K150506q12371k662826
5929e68300j526004J890815M687215M735537K375513r79349m186737n784970m283906
5920c640186m78738K321941K006163P4841j153890j884253l273836m260371k813519
5911a3101848N15547L089527L840540L829416L441431J903165j05539k16646K207355
5902E402948M632995M465765J826416j623783m584142n687375l423331J453261
5894B462754M998549L988462O7052k194814j061023P45398L60462j480475k094132
5885E792233p16939Q56175R65722l6647q44829j097276j447050k114923k304936
5876i48470j352606K22355J400136J914724K045748J555178m7462k248969l788853
$$ y = [-993747, 23969, -2202639, -5171393, -5652693, -2997046, 756391, 2906897, 2094526, -568300, -2094304, -203489, 4483726, 9219263, 11594776, 10615427, 6428690, 643720, -3640186, -4118924, -1796983, 209180, 284021, -869869, -2754122, -6027958, -10288329, -13101848, -12586301, -9496774, -5656234, -1826818, 1614613, 3517778, 3412239, 3195593, 5402948, 10035943, 14501708, 16328124, 14704341, 10120199, 4432824, 1009493, 2462754, 7461303, 11449765, 11516817, 9322003, 8260980, 9006378, 9366840, 7886365, 5792233, 5075294, 5931469, 6897191, 6860544, 6015715, 4918439, 3471389, 1356466, -948470, -2301076, -2078721, -678585, 1236139, 3281887, 4837065, 4789603, 2540634, -1248219]
5867a248219m340831m566804m172101j744898K397759N071734L905034Q86207
5859c812119j55916J106851J446810o22049k453227j258164J911960L833777L139227
5850C137150J049536p00709j119135q1040J344811J416067k46073j921897k084457
5841G94253j279662n78289L06586J638828J976488K42043j770336j729806o40287
5832a040182j113137k342376p80054L670594O251727L873446m42958k022195o08652
5823E446213P27945M59601o55377k048065l446110l524423j415577J009796J124982
5814b321015n36364j022388M81566J580103N99716q99268n87353J423540L022424
5805A740961K799180J435402P10341J300248J577583n51884m215887n606199k822573
$$ y = [-1248219, -5589050, -10155854, -14327955, -16072853, -13675094, -8603360, -4698326, -3812119, -3968035, -2861184, -1414374, -2036423, -4489650, -5747814, -3835854, -2077, 3137150, 4186686, 3485977, 2366842, 2285802, 3630613, 5046680, 4800607, 2878710, 794253, -485409, -1063698, -757112, 881716, 2858204, 3100247, 1329911, -399895, -1040182, -2153319, -4495695, -5275749, -1605155, 4646572, 8520018, 8077060, 6054865, 5446213, 6174158, 6633759, 5978382, 3930317, 484207, -3040216, -4455793, -3445997, -2321015, -2857379, -3879767, -3398201, -1818098, -1218382, -2117650, -2705003, -1281463, 1740961, 4540141, 5975543, 6685884, 7986132, 9563715, 9011831, 4795944, -810255, -3632828]
5796c632828R77577J477647j079083k829037k052716p62380o90551j003001o15342
5787a0209714O1714N38401J038632J294106Q64616Q93746K766642M763097L436467
5778E447707r28354l931635l360190j883609j637681n55315K818467N043357K690264
5769C703011j582401k708178p76014R5705j102758j589283n79306l69567j382833
5760f291624j260429K03285J72021j643316j300859K997010O988273N954555J079820
5751F898736k957597m129192l533063j920688O45143K879783L253143K238553
5743C374818J106724n03406l167543m990197l640382n70352L17448j516524k211656
5734a1801070O90087M554671N575306L865412K276840J853181J211033j98959
$$ y = [-3632828, -2655251, -1177604, -2256687, -5085724, -7138440, -7900820, -8591371, -9594372, -10209714, -10148000, -9609599, -8570967, -7276861, -6412245, -5518499, -2751857, 2011240, 5447707, 4519353, 587718, -2772472, -4656081, -6293762, -6849077, -4030610, 1012747, 3703011, 2120610, -587568, -1363582, -1267877, -2370635, -3959918, -4539224, -4908791, -6291624, -7552053, -7348768, -7176747, -8820063, -10120922, -7123912, -135639, 5818916, 6898736, 3941139, -188053, -3721116, -5641804, -4996661, -2116878, 1136265, 3374818, 4481542, 3978136, 810593, -4179604, -7819986, -8390338, -8072890, -9589414, -11801070, -11110983, -6556312, -981006, 2884406, 5161246, 7014427, 8225460, 8026501]
5726H026501r27397j13319Q00181J15465j535487k101039j193358o88152j764876
5717F18519k755673j422097J269454J746789j278708m516114m160933p83871J882023
5708i400611K088876J455166J413637J208392L50826L74896K187825L578543J892589
5699E150139j727787l341288j365491J537718K209338O74512q57191j131735o49112
5690D99103j90999P0512K05436K72909M56121P56396N53133q18468k807896l581610
5680d585363j855913J299437L152017K208697L8410m89917J298142L028295K221007
5671F314812p96401l572767m355198l328002j682920n98471p20664j420905q65923
5662a1026439J837902M816933N309022L270004J281876P41408L41602r72356j904646
$$ y = [8026501, 7099104, 6985785, 7785966, 7901431, 6365944, 4264905, 3071547, 2383395, 618519, -2137154, -3559251, -2289797, -543008, -1821716, -6337830, -10498763, -11282634, -9400611, -7311735, -5856569, -4442932, -3234540, -2883714, -2508818, -320993, 3257550, 5150139, 3422352, 81064, -1284427, 253291, 2462629, 3137141, 2279950, 1148215, 499103, 308104, 378616, 584052, 856961, 1313082, 2069478, 2622611, 1804143, -1003753, -4585363, -6441276, -5141839, -1989822, 218875, 257285, -232632, 1065510, 4093805, 6314812, 5518411, 1945644, -2409554, -5737556, -7420476, -8018947, -8739611, -10160516, -11026439, -9188537, -4371604, 937418, 4207422, 5489298, 6230706, 6572308, 5599952, 3695306]
5653C695306j136426K25317M17630k60549m87615m28143j067040j996488k066516
5644c104524j527661j351825j098513J77391J452477Q45507j014151j588364n78989
5635g788652m55867k112281l012060j092544K068182L736742L527119K579975
5627b549386J203606n15830j272020k1750J974545K561053J454659j0519j024047
5618A800311j468804q77656P67865J843622Q22464j097659j231653P17021K116866
5609C392377J161923p54793j284822k67394N14311j05460j433035k030556j416626
5600b224075n08076m43426j105161j248912k74478Q20526Q35475O1246l24383
5591d411264j07456j55351p43853q90393J97196J686387J805887k6829k152864
$$ y = [3695306, 2558880, 2784197, 3201827, 2941278, 2453663, 2025520, 958480, -1038008, -3104524, -4632185, -5984010, -7082523, -6905132, -5452655, -4607148, -5621299, -7209663, -7788652, -8244519, -10356800, -13368860, -14461404, -12393222, -8656480, -5129361, -2549386, -1345780, -1861610, -3133630, -3155380, -1180835, 1380218, 2834877, 2824358, 1800311, 331507, -546149, 221716, 2065338, 2887802, 1790143, 558490, 1275511, 3392377, 4554300, 3799507, 2514685, 2247291, 2761602, 2656142, 1223107, -807449, -2224075, -2732151, -3175577, -4280738, -5529650, -5804128, -4983602, -4148127, -4086881, -4411264, -4518720, -4674071, -5417924, -6308317, -6111121, -4424734, -2618847, -2645676, -4798540]
5582d798540k230145R673K188766K086404L25805q84674j015746j304685j757633
5573g380775n92875K486868M837771M225629J771214j00167r07180j407382j274542
5564A658561J58811J877812K188552J109334j05562j014116j750606j813840j135615
5555A173331j214850k888509m172454k978089p80039m03036j149459N3970L003525
5546i355610L904436J304490j602991j828012k27420J137380J947834K177211
5538b542682Q23398j765783k981427j594301O1530k40683j064346P8055K511586
5529f714653L503661K242719K81243r81484j225762o16660Q209m90068j571018
5520e563813j062376J276815K468576P64777j040667K36601K882594K942405N91386
$$ y = [-4798540, -7028685, -7019012, -4830246, -2743842, -2418037, -3302711, -4318457, -5623142, -7380775, -7973650, -5486782, -649011, 3576618, 5347832, 5247665, 4340485, 2933103, 1658561, 1817372, 3695184, 5883736, 6993070, 6887508, 5873392, 4122786, 2308946, 1173331, -41519, -2930028, -7102482, -10080571, -10860610, -11263646, -12413105, -12359135, -9355610, -5451174, -4146684, -5749675, -7577687, -7805107, -6667727, -4719893, -2542682, -1719284, -3485067, -6466494, -8060795, -7999265, -8239948, -9304294, -9226239, -6714653, -3210992, -968273, -687030, -1668514, -2894276, -3510936, -3502727, -3992795, -5563813, -6626189, -5349374, -2880798, -2116021, -3156688, -2920087, -37493, 2904912, 3496298]
5511C496298n29345L96134M79855j149268j532638O87313K312477O28089j949298
5502B839617j437814J717506L521032K102289n57993k140669k437950k034335
5494A571683r09525P01748J608318R48757n73742j532561j351041m71038M95415
5485D88014J068876Q02108j58802n39412Q92333L261536L814046J117697k696446
5476H049950m009910j703856J885394L651822K392936p07045l022551k375485
5468D161255N61008K223398K52941k985737l346514q56707N38562o36712j285079
5459a373585N72615K206089J046174o24123K88245J998660R16692j731320j765761
5450A533686M07766n2685m170513o643635l642420J531253L506202K027860P45044
$$ y = [3496298, 2966953, 3363087, 3842942, 2693674, 1161036, 1848349, 4160826, 4788915, 2839617, 1401803, 3119309, 6640341, 8742630, 8184637, 6043968, 3606018, 1571683, 662158, 1363906, 2972224, 3920981, 3347239, 1814678, 463637, -7401, 488014, 1556890, 2358998, 2200196, 1660784, 2553117, 5814653, 9628699, 10746396, 8049950, 4040040, 2336184, 4221578, 7873400, 10266336, 9559291, 6536740, 4161255, 4722263, 6945661, 7198602, 4212865, 866351, 9644, 548206, -88506, -1373585, -800970, 1405119, 2451293, 1827170, 2115415, 4114075, 5030767, 3299447, 1533686, 1941452, 1888767, -2281746, -8925381, -12567801, -11036548, -7530346, -5502486, -4757442]
5441d757442J251859J816361Q94899r77164k442537k504780p64896K078374M246385
5432a158941M377779K719751N24088q96424m78846J606894K936492Q41751l702322
5423F770222o336336m697826j366138J72691J89377R74174K385306K252984L70023
5414G14477r13999q1182J874734L287256L472664K472883P97255m66521n96866
5405A0560701k10252k44933n65405q15865j678906l488081m521745k958405P6704
5396c846187J877776K110165K610345L446742K507188l59616k133755j008462
5388E204196Q86231R63321j66450o61562p77653j599739k190280r63892J050880
5379A745052J220312o91234k043053r89329J410902L011759K817404J130763j097538
$$ y = [-4757442, -3505583, -1689222, -794323, -1771487, -4214024, -6718804, -7483700, -5405326, -1158941, 3218838, 5938589, 6462677, 5566253, 5087407, 6694301, 9630793, 10472544, 6770222, 433886, -4263940, -5630078, -5457387, -5268010, -4293836, -1908530, 344454, 714477, -199522, -280704, 1594030, 4881286, 8353950, 10826833, 11624088, 11157567, 10560701, 10350449, 10105516, 9540111, 8724246, 7045340, 3557259, -964486, -3922891, -3846187, -1968411, 141754, 2752099, 6198841, 8706029, 8346413, 6212658, 5204196, 6090427, 7053748, 6887298, 6225736, 5448083, 3848344, 1658064, 694172, 1745052, 2965364, 2274130, 231077, -758252, 652650, 3664409, 6481813, 7612576, 6515038]
5370F515038k730998l219502k940746k199490o91610J083621J276180o23312j916350
5361e447169j34721K688421K482356n98402k282321r54470j8856j865786l648866
5352i779814j989152J463280K825198J946459J626977K416847K299040R04939
5344A713774J24986M81035M41303k61826J4539J412971J684810j44113k027303
5335C440176k136600j247870m36428R61041L063773L504791N24457l416481m003970
5326B52889o60562K640040K350431p14303l000722k510567n63251L63171k58749
5317b101623o98588K49060J363214J019271J05200P38204K283976J425558k792284
5308A591988o491992n490883o96711L141946L192603J088525R0474J358366L189849
$$ y = [6515038, 3784040, 564538, -2376208, -4575698, -5267308, -4183687, -2907507, -3530819, -5447169, -5581890, -2893469, -411113, -1009515, -3291836, -4246306, -4265162, -6130948, -9779814, -11768966, -10305686, -7480488, -5534029, -3907052, -1490205, 808835, 1713774, 1838760, 2319795, 2761098, 2499272, 2513811, 3926782, 5611592, 5467479, 3440176, 1303576, 55706, -380722, 580319, 3644092, 7148883, 7673340, 4256859, 252889, -407673, 2232367, 4582798, 3868495, 867773, -1642794, -2206045, -1842874, -2101623, -2800211, -2551151, -1187937, -168666, -63466, 674738, 2958714, 4384272, 1591988, -4900004, -10390887, -11087598, -7945652, -4753049, -3664524, -3574050, -2215684, 974165]
5299I74165L078713M92035k190341k121238M92080K488192J771733k63998j103279
5290C618062l02773Q18789J227830O06704r58015k426098k238967n41103N07407
5281C11836q3507m89992O77799J556745q1743k871585l729792k442357j212574
5272h365170n28197J003655K960954K947801P61938o39611L73470J511751K61320
5263B87911k021179j937396J156350M234822M294979J517883j592587l332770
5255B608013m097307m449413l190207R31479N931654P504774M174724o39460l042424
5246E731833k942800k246000j342678o7505N3513k083083m232203l410311l73633
5237a0912867J829570K625445L515558L949044J980089j220760k024861J3575
$$ y = [974165, 4052878, 4544913, 2354572, 233334, 725414, 3213606, 4985339, 4721341, 3618062, 3315289, 4134078, 5361908, 5968612, 5010597, 2584499, 345532, -195571, 311836, 228329, -261663, 416136, 1972881, 1891138, -980447, -4710239, -7152596, -8365170, -8893367, -7889712, -4928758, -1980957, -1219019, -1858630, -1485160, 26591, 287911, -1733268, -3670664, -2514314, 1720508, 6015487, 7533370, 5940783, 2608013, -1489294, -5938707, -9128914, -8197435, -2265781, 5238993, 9413717, 8774257, 5731833, 2789033, 543033, -799645, -867150, -813637, -2896720, -7128923, -10539234, -10912867, -9083297, -6457852, -2942294, 1006750, 2986839, 1766079, -258782, -245207]
5229b45207J374145J98918j327389j219662l56686L61047J654636L092839K345523
5220E878164q98449l486706l104821j124099L00315Q81480O15955r81328k481903
5211d401392j078480K545859L665931J99439l757639l825432j237668K35701j0710
5202g664391j61932L91250J442589L377766N169483L836650r01953m481324l486372
5193b478234o07498K46451K31702K085646L742992J659048j699319o34831M166627
5184F712584N716294J192511m029607m725472k627012k005367k929529k632065
5176e327663q26816N9046r86631j936211m97761K692606M325383K249215j247368
5167a496200j651164J653314L910184J472009k828785l789159j162994R05527
$$ y = [-245207, 1128938, 1327856, 467, -1219195, -1575881, -1214834, 439802, 3532641, 5878164, 4979715, 1493009, -1611812, -2735911, -2435596, -1554116, -938161, -1919489, -4401392, -5479872, -2934013, 731918, 931357, -2826282, -6651714, -7889382, -7653681, -7664391, -7826323, -7435073, -5992484, -2614718, 2554765, 6391415, 5489462, 1008138, -2478234, -3085732, -2839281, -2607579, -521933, 3221059, 4880107, 3180788, 2545957, 6712584, 12428878, 13621389, 9591782, 4866310, 2239298, 233931, -2695598, -5327663, -6154479, -6095433, -7082064, -9018275, -9516036, -6823430, -2498047, -248832, -1496200, -3147364, -1494050, 2416134, 3888143, 1059358, -2729801, -3892795, -2987268]
5159b987268K90478j413719k708009l422498k525117R79051M873152N593240L494604
5150B173914K152686K287536J102719j639153k116563J069277L743541K299777
5142A1073734j008987k059441p88580K14649L17658N26597N31072n13851j489433
5133F803418o42719J289800J822566K02385j818545k409590j422779p2734J74362
5124C926164j061977k309137j789059m8469N54337n11897r59542N80359K088164
5115D68943J243265q62346j349633K62446J725210J368300j69800j382632j606984
5106c03231j184537p90097o90157m22830M48356J312962J133450J55007j86754
5097e27831O45311J520712J337892K66597j045551k167749k413291j165527P46959
$$ y = [-2987268, -2696790, -4110509, -6818518, -10241016, -12766133, -11787082, -6913930, -1320690, 2173914, 4326600, 6614136, 7716855, 6077702, 3961139, 5030416, 8773957, 11073734, 10064747, 8005306, 7216726, 7431375, 7749033, 8275630, 8806702, 8292851, 6803418, 6160699, 7450499, 9273065, 9475450, 7656905, 5247315, 3824536, 3751802, 3926164, 2864187, 555050, -1234009, -1282478, -728141, -1240038, -2199580, -1619221, 468943, 1712208, 849862, -499771, -237325, 1487885, 2856185, 2686385, 1303753, -303231, -1487768, -2277865, -2968022, -3390852, -2942496, -1629534, -496084, -341077, -527831, 117480, 1638192, 2976084, 3242681, 2197130, 29381, -2383910, -3549437, -2802478]
5088b802478J439874M34414n55026M6341J734364K895638K646099J320376J27020
5079G286622L14925J501109J266302j804761n215129n193321k018070L89001N03229
5070b970093J159660M089135O146913L702864j749477n395578n013468k432140
5062b462184j66463Q58846P29998j14054q58164q79956k88302O24558J734264
5053h21457K421606J779484K16796m69078M94695J716998J823931J257673P53957
5044I174605l55791k653003m627291m090827j226010J254929J071311j272436
5036b724513l157366k632168m85891Q76984P82658J151974K965954L784492J278790
5027A840914k296592k721711j96519J000940o24584j710724N7244K335311K432775
$$ y = [-2802478, -1362604, -928190, -1483216, -1436875, 297489, 3193127, 5839226, 7159602, 7286622, 7601547, 9102656, 10368958, 8564197, 3349068, -1844253, -3862323, -3473322, -2970093, -1810433, 2278702, 8425615, 12128479, 10379002, 4983424, -30044, -2462184, -2628647, -1769801, -1039803, -1153857, -2012021, -2891977, -3180279, -2555721, -821457, 1600149, 3379633, 3596429, 3127351, 3622046, 5339044, 7162975, 8420648, 9174605, 8818814, 6165811, 1538520, -2552307, -3778317, -2523388, -1452077, -2724513, -5881879, -8514047, -8999938, -8122954, -7340296, -6188322, -3222368, 562124, 1840914, -455678, -3177389, -3373908, -2372968, -2997552, -4708276, -4651032, -2315721, 117054]
5018A17054J331256Q67396L72324r62608j394095M37823K286377J345593j258452
5009C142668k151797n28497J540500K462015K180838Q54700j108908k346250j826970
5000B218299l18938P18310P86703k1661j567709k857618k457841p23813L58945
4991c865323M12107J211269K958376L133149P82797j249952p04182M67613m83669
4982B662185k694230l491796k323538k81212K038726L744115L127050M13816j429488
4973A765628r44600l52939j149959j179565P77141J480098j445534m244954k217920
4964g512604K566346M172342J452357j630095k852137l322402l012295l40049
4956a0478537L506022M768993K513827j13776p27633l60043o54412j460691j935873
$$ y = [117054, 1448310, 2315706, 2688030, 1725422, 331327, 769150, 3055527, 4401120, 3142668, 990871, 462374, 2002874, 4464889, 6645727, 7500427, 6391519, 4045269, 2218299, 1899361, 2617671, 3404374, 3382713, 1815004, -1042614, -3500455, -4224268, -3865323, -3453216, -2241947, 716429, 3849578, 4632375, 3382423, 2678241, 3145854, 2662185, -32045, -3523841, -5847379, -6128591, -4089865, -345750, 2781300, 3195116, 1765628, 821028, 468089, -681870, -1861435, -1084294, 395804, -1049730, -5294684, -7512604, -4946258, -773916, 678441, -951654, -3803791, -7126193, -10138488, -10478537, -6972515, -2203522, 310305, 196529, -531104, -891147, -1545559, -3006250, -4942123]
4947d942123j675206l91334J643402K973225K450350Q68160k12642k26206Q43049
4938A330675K763042L739570J488834k743854m413674j993576N28402k3206j303891
4929f27678m05564P81648m74535k238873j251100J341410K407101K179117K557179
4920D268705K796093J370421m89136j155722j584630k420034j856967K49471Q86730
4911B064931k2871J946049P032261Q239501K380060l656808m104415l215281n312762
4902E350665n451760K54068M470887L81075n359480l995154M7482q62611j846044
4893g010872M141299R593321M433241l901389k496441L195736j19956p269451
4885E65488m105662L950030J363007n778565K00891J1787797O867120o732436
$$ y = [-4942123, -6617329, -7008663, -5365261, -2392036, 58314, 926474, 713832, 487626, 1330675, 4093717, 7833287, 9322121, 6578267, 2164593, 171017, 699419, 676213, -627678, -1033242, -251594, -726129, -2965002, -4216102, -2874692, -467591, 1711526, 4268705, 7064798, 8435219, 7946083, 6790361, 5205731, 2785697, 928730, 1178201, 2064931, 2042060, 3988109, 11020370, 19259871, 21639931, 17983123, 13878708, 10663427, 5350665, -101095, 152973, 4623860, 5004935, -354545, -4349699, -4302217, -5164828, -7010872, -2869573, 6723748, 11156989, 7255600, 4759159, 7954895, 7834939, 565488, -3540174, 409856, 1772863, -4005702, -3804811, 7982986, 14850106, 8117670]
4877H117670j053629J6994926J3889672J877787L7459092J17125204J42252770
4870C36663492M6261070r3515041j43627579q4354295j5232837n450281k1626428
4863A9118101j3766801O007780M925395q690716q713525P81142O19354n384775
4855e104045j973578O200538M843309k287274k050575L236523K747143j237437
4847D374604J48968L300266m71171o444881m307101K352059K317519l215195l958433
4838e903365Q33853L217834K231024L453537N912350L749620j330865k504691
4830I659297n88372j860888n207921l836780J521241L073409q05739l685532k388856
4821d120141l99618L9249L56801L43957j482888k727731J05292M633856N640074
$$ y = [8117670, 7064041, 24058967, 37948639, 39826426, 77285518, 194410722, 336663492, 382924562, 289409521, 145781942, 61427647, 46194810, 40744529, 19118101, 5351300, 11359080, 16284475, 7593759, -1119766, -338624, 280730, -5104045, -7077623, -877085, 3966224, 1678950, -371625, 2864898, 5612041, 4374604, 4523572, 7823838, 7352667, 907786, -3399315, -1047256, 1270263, -1944932, -5903365, -5069512, -1851678, 379346, 3832883, 9745233, 13494853, 12163988, 9659297, 9070925, 7210037, 2002116, -1834664, -313423, 2759986, 1954247, -1731285, -4120141, -4519759, -4480510, -4123709, -3779752, -5262640, -7990371, -7885079, -3251223, 2388851]
4812B388851L600887K900371L405683J515655k072344l393389k575281k740825
4804C029608l191043j115383J703877J529087J56809J896451M887146L713916
4796A2610468p79982k794547j605329j714117l676106l444210p17520M82653k99490
4787a938180L53364K055398Q78810k423995k774900J10666J253568l14284l50818
4778c150371J644618J245784j629725j493866K292505L111486j497085m857866
4770d334520j942042K937896M072067K615311J675813k2233l719253n717047l028534
4761g462542P13473P24759j558205j936367n57061j57089l55528Q81042K390074
4752g317444J458563j255396k686564j945690m59529J002931K287046K360801
$$ y = [2388851, 5989738, 8890109, 12295792, 13811447, 11739103, 8345714, 5770433, 3029608, -161435, -1276818, 427059, 1956146, 2112955, 4009406, 8896552, 12610468, 11830486, 9035939, 7430610, 5716493, 2040387, -1403823, -2121343, -1638690, -1938180, -1584816, 470582, 1349392, -1074603, -3849503, -3738837, -2485269, -2799553, -3150371, -1505753, -259969, -1889694, -3383560, -1091055, 2020431, 523346, -4334520, -6276562, -3338666, 733401, 3348712, 5024525, 5002292, 1283039, -4434008, -7462542, -6749069, -6024310, -7582515, -9518882, -10075943, -10233032, -10588560, -9707518, -7317444, -5858881, -7114277, -9800841, -11746531, -12206060, -11203129, -8916083, -6555282]
4744f555282Q41874l73760L74260J762185J532891j68020j492379j367748L22662
4735e123317L112682N067503L892529M87454j240005K04148J605867J63107k261843
4726E908125k552049j004100L41536J345318K559780K685659N67970k020610k647736
4717E183893j766552j326971j520662j542606j776602k411899j698355J367696
4709e492058M264549M063867J880875Q57801R85830l42941l323965n098400m175548
4700f379990k125402n09242P68277J431733J68735k763157m607541l284043N8197
4691a7242433K837274M018555M109463L409702J885928L37802J21839J343360
4683H21490K336955J649630p7640j139357j241628j471816j727895k74459K961203
$$ y = [-6555282, -5713408, -6087168, -5712908, -3950723, -2417832, -2585852, -4078231, -5445979, -5123317, -2010635, 3056868, 6949397, 7436851, 6196846, 6400994, 8006861, 8169968, 5908125, 3356076, 2351976, 2693512, 4038830, 6598610, 9284269, 9852239, 7831629, 5183893, 3417341, 2090370, 569708, -972898, -2749500, -5161399, -6859754, -5492058, -1227509, 2836358, 4717233, 5575034, 6560864, 6217923, 2893958, -2204442, -6379990, -8505392, -9014634, -8246357, -6814624, -6645889, -9409046, -14016587, -17300630, -17242433, -14405159, -10386604, -6277141, -2867439, -981511, -643709, -521870, 821490, 3158445, 4808075, 4730435, 3591078, 2349450, 877634, -850261, -1124720, 1836483]
4674A836483M733632K423241j784888l548054k402728j833252l344291m100107
4666h019964j595009K459043M697112M215954K356637L22448j197497j564821
4658A673903r77710n18977l20716P77913K668125L039701O73986k086122k225796
4649B704307j73801J099758L20890q36584n22538R92940K023625J394337n74720
4640F428214k422722k756226j353129Q11555K360242K213065K84538j855824j970448
4631A739265J03285J710696P65810j350170k110372j607246j423031j106789Q20335
4622b458217L147706L083992Q71337n61197m89115p33968j033944R09885L822942
4613F559421K822547k725995o563682m107493Q73883K121029m69691k524167k352711
$$ y = [1836483, 6570115, 8993356, 7208468, 3660414, 1257686, -575566, -3919857, -8019964, -9614973, -7155930, -2458818, 1757136, 4113773, 4436221, 3238724, 1673903, 696193, 177216, -143500, 634413, 3302538, 6342239, 7016225, 4930103, 2704307, 2530506, 3630264, 3951154, 3114570, 2592032, 3584972, 5608597, 7002934, 6428214, 4005492, 1249266, -103863, 707692, 3067934, 5280999, 5565537, 3709713, 1739265, 1842550, 3553246, 4319056, 2968886, 858514, -748732, -2171763, -3278552, -2458217, 689489, 3773481, 4644818, 4083621, 3594506, 2860538, 1826594, 2736479, 6559421, 9381968, 6655973, 92291, -4015202, -3141319, -1020290, -1489981, -4014148, -6366859]
4604f366859j545527n56434J391722L037233K080856q43369k629648j885513Q7115
4595g230424J917533L162250L265608J974453M29563O5407J053216K887877M885704
4586A2411187N080756J426721m048485n633444j361080L284303K779293o12331
4578A3326920j164432J023028J024419k133828m117858k811036j257843j876657
4570B012713k843394k099518p79227n96733j167479j739899k627486l284715j824614
4561a4950352J743615M325333L694657J561651Q40747J591575J610831m1028j845107
4552a468078j796539L93253K928494L549260J789250o58287k151400k720406k749901
4543b884354j598015Q24221K530711J799309N7616P881J574647K205793P25921
$$ y = [-6366859, -7912386, -8468820, -7077098, -4039865, -1959009, -2802378, -5432026, -7317539, -7230424, -5312891, -2150641, 1114967, 3089420, 3518983, 3584390, 4637606, 7525483, 12411187, 17491943, 18918664, 14870179, 9236735, 7875655, 11159958, 13939251, 13326920, 12162488, 13185516, 14209935, 12076107, 7958249, 5147213, 3889370, 2012713, -830681, -2930199, -3709426, -4306159, -5473638, -7213537, -9841023, -13125738, -14950352, -13206737, -8881404, -5186747, -3625096, -2784349, -1192774, 418057, 377029, -1468078, -3264617, -2871364, 57130, 3606390, 5395640, 4737353, 2585953, -134453, -2884354, -4482369, -3658148, -1127437, 671872, 729488, 737369, 2312016, 4517809, 5243730]
4534E243730j556002l210311l788120k931725p41811J251494J584033P78420j21940
4525c492232j594435l709656l954618n69019L386919L602463J214875J083180
4517d032523L714005M379546J062717k220022j904168K84678J426798J791123
4509D502154K164675R76841k267914m074629j489517K865788M155915J968262
4501H801575n7662P1505R48229J042180M83693l85077j664751k897218l244717
4492C097757k706721j846820p49717M34603O61759o19503j826103q78991J638899
4483b794837K809169J273988p70908n09558J499816J829026j105193m400237m262088
4474f430822j299502L79106n27999n57581K459095M974002K897360j515566k646506
$$ y = [5243730, 3687728, 477417, -3310703, -6242428, -6984239, -5732745, -4148712, -3370292, -3492232, -5086667, -8796323, -12750941, -13319960, -9933041, -6330578, -5115703, -4032523, -318518, 4061028, 5123745, 2903723, 999555, 1284233, 2711031, 4502154, 6666829, 7643670, 5375756, 1301127, -188390, 2677398, 6833313, 8801575, 8743913, 8815418, 9763647, 10805827, 11289520, 10904443, 9239692, 6342474, 3097757, 391036, -1455784, -2205501, -1770898, -1109139, -1728642, -3554745, -4433736, -2794837, 14332, 1288320, 517412, 7854, 1507670, 3336696, 2231503, -2168734, -6430822, -7730324, -7351218, -7879217, -8436798, -5977703, -1003701, 1893659, 378093, -2268413]
4465b268413J11085K125560J211347J12050P14940J156548K49869j70268N94035
4456C836753K79888j550373j524800J662635L795163J342087k713544l481658
4448A646151j325235J14092K65891J064713K055777J221060l68955L27480K823005
4439G823979L209559J19738l246013l722308j721503M40302J214860L70192j069852
4430C418954j327474L7233J131843N34176k60606M52916J123367n32188k936131
4421A642090k597883R7121J409737M33130J10135J404774J267497j752563m166116
4412b152078k570570J240403L150595K275417Q00664J83265K64557P29757R56996
4403D879006k91653k659419l123116M5608L464305K300633k577091m969362j787159
$$ y = [-2268413, -2157328, -31768, 1179579, 1291629, 2006569, 3163117, 3412986, 3242718, 3836753, 4116641, 2566268, 1041468, 2704103, 6499266, 7841353, 5127809, 1646151, 320916, 435008, 700899, 1765612, 3821389, 5042449, 4673494, 5000974, 7823979, 11033538, 11153276, 7907263, 4184955, 2463452, 2903754, 4118614, 4488806, 3418954, 2091480, 2128713, 3260556, 3794732, 3534126, 3987042, 5110409, 4578221, 1642090, -955793, -858672, 551065, 984195, 1094330, 2499104, 3766601, 2014038, -2152078, -4722648, -3482245, -331650, 1943767, 2744431, 2927696, 3192253, 3922010, 4879006, 4587353, 1927934, -1195182, -1149574, 2314731, 4615364, 2038273, -2931089, -4718248]
4394d718248K548858K418566j163009k465732N86244L871651L249410j42383k354016
4385A831341j891706l39768O60789P15917q6108j027489n37762J697412L115856
4376D138482J359192j504832j013999L154802O026251L849870j221549m613943
4368A0174274m837026l532938k318313j844660k324178k948052k151790L4037
4360i748646J627086J953839K736442M180369L231031j257185m740519k644602
4352d662185K432021M090205J380522o87225M19891J532286J46813j375676n57147
4343B719505O31088n96559k741663k362710K99047J735863N54324q34673k39105
4334h34883J154764Q06011j373545k638427p90304K847008M498162K070731k413369
$$ y = [-4718248, -2169390, 249176, -913833, -3379565, -2793321, 1078330, 4327740, 4185357, 1831341, -60365, -400133, 260656, 976573, 890465, -137024, -674786, 1022626, 4138482, 5497674, 3992842, 2978843, 6133645, 12159896, 16009766, 14788217, 10174274, 5337248, 1804310, -514003, -2358663, -4682841, -7630893, -9782683, -9748646, -8121560, -6167721, -3431279, 749090, 3980121, 2722936, -2017583, -4662185, -2230164, 1860041, 3240563, 2553338, 2973229, 4505515, 4652328, 3276652, 2719505, 3350593, 2754034, 12371, -2350339, -2051292, -315429, 238895, -595778, -834883, 319881, 1125892, -247653, -2886080, -3676384, -829376, 3668786, 5739517, 3326148]
4325C326148n036144m083066j175952J114073J610374O99156n62812j195705r13912
4316f217840k27196L96148J147109K195232K999045L009569K418931J472285p8836
4307G114447j903212k584920j510982j73689l5486k73691L96646Q83497o11699
4298A300911k805851k439832N77138K275054O7519l423060l735616j90596L596671
4289d777662M070112J279137j689068k054316q9838J367669K18570k470166l696395
4280g841957j663226K701243O553042P023092L586314o43323j493430J286977
4272I508732L400386J767013j342148k174934j110190j073352k186723k090158
4264D698626o60719j31594p15450l57906Q42975K43855k429169l900420k519509
$$ y = [3326148, -1709996, -5793062, -6969014, -5854941, -4244567, -3545411, -4108223, -5303928, -6217840, -6445036, -6048888, -4901779, -2706547, 292498, 3302067, 5720998, 7193283, 7114447, 5211235, 2626315, 1115333, 941644, 906158, 632467, 1029113, 1912610, 1300911, -1504940, -3944772, -3367634, -1092580, -1025061, -4448121, -8183737, -8374333, -4777662, -707550, 571587, -1117481, -3171797, -3261635, -1893966, -1675396, -4145562, -7841957, -9505183, -6803940, -250898, 6772194, 10358508, 9715185, 8221755, 9508732, 12909118, 14676131, 13333983, 11159049, 10048859, 8975507, 6788784, 4698626, 4037907, 3906313, 3190863, 2832957, 3675932, 3919787, 1490618, -2409802, -4929311]
4255d929311p98889r67583j555855o46529O86478Q46194R44215K599961M420102
4246E98783L677491N19628j988671j667514N71163K047227R58267j812897l278686
4237c75209j687683R16858J190785p40228j601933k37583P30536l95534j451253
4228c651244l18477J173754J62134k481495l407186j652647O66090J969894K743270
4219d795907L266666K302449p21569l595008l195980L38124K825196Q96369l191579
4210e871239m101266q08913K032507J457658O64499K888384N014714K589184j929103
4201A936425k509201O34444J778291l68775j100416J307419K690050O03656k455694
4192B516199n021427q044012q695829k254691O784090O542906l376858o401267
$$ y = [-4929311, -5728200, -6695783, -8251638, -8898167, -8211689, -7365495, -6421280, -3821319, 598783, 4276274, 4795902, 2807231, 1139717, 1710880, 3758107, 4716374, 2903477, -375209, -2062892, -1146034, 44751, -695477, -2297410, -2534993, -1804457, -2199991, -3651244, -3969721, -2795967, -2633833, -5115328, -8522514, -10175161, -9509071, -7539177, -4795907, -1529241, 773208, 51639, -3543369, -6739349, -6401225, -3576029, -2679660, -5871239, -9972505, -10781418, -8748911, -7291253, -6626754, -3738370, 1276344, 3865528, 1936425, -572776, 61668, 1839959, 1471184, 370768, 1678187, 4368237, 4971893, 2516199, -2505228, -10549240, -19245069, -21499760, -14715670, -8172764, -11549622, -17950889]
4184a7950889P918486K5259294K4003200M836655j1409983j2231850n156133j163283
4176A4105497p56370j88795J92753m74190J06887K401064K685033m72801l250439
4167A4348639l240773l033430m043755l158230P06752K958956P98526j349764
4159C986921R48788M424910L340258j425363m415090l935915k647948j777203
4151a500642l18940R80951M3266k209430k357055J97807K097636J049082j091748
4142c109073j502869l37690K24044l63254k03417J947251M168292L529636N23063
4133D875983j000536N73072J792428m73854l401346k246508J626333K337164r80176
4124C102560k418011J189974M907812L282329j540527l716737k249684q27816
$$ y = [-17950889, -10032403, 15226891, 39230091, 44066746, 32656763, 20424913, 15268780, 14105497, 13349127, 13160332, 13353085, 12878895, 12985782, 15386846, 18071879, 17599078, 14348639, 11107866, 8074436, 4030681, 872451, 1579203, 4538159, 5336685, 3986921, 4935709, 9360619, 12700877, 11275514, 6860424, 2924509, 276561, -1500642, -1819582, -838631, -795365, -3004795, -5361850, -5164043, -3066407, -2017325, -3109073, -4611942, -4949632, -4725588, -5088842, -5292259, -3345008, 823284, 4352920, 4875983, 3875447, 4448519, 6240947, 5767093, 2365747, 119239, 1745572, 4082736, 3102560, 684549, 1874523, 6782335, 10064664, 8524137, 4807400, 2557716, 1729900]
4116A729900j226277j559604l80873J311310K196786K108972J388069N95488N50269
4107F714040J292990J676187R92224q4559r77034j986930k740518j991457j53377
4098B741566L84662j001868j708341r4261J564306Q00821q95825p03643P79498
4089A866915P49200j113014k347765j505186L50675J524447J222071j27122p55110
4080a34889R31934L502399L190722r15347m755424m515860j553731L55440J54533
4071c740223r58868k473971l612355j980234K793547O256865M388366k02141k050584
4062a579598j066622j462595l593189l293267K64964K482060R21932p33042R07319
4053g152038L464144L189718R52367N340O57656J013930R58271J562147J786625
$$ y = [1729900, 503623, -1055981, -1436854, -125544, 2071242, 4180214, 5568283, 6163771, 6714040, 8007030, 9683217, 10675441, 10590882, 9613848, 7626918, 4886400, 2894943, 2741566, 3126228, 2124360, 416019, 321758, 1886064, 2686885, 1791060, 1087417, 1866915, 2616115, 1503101, -844664, -2349850, -1999175, -474728, 747343, 620221, -134889, 797045, 4299444, 7490166, 6574819, 1819395, -2696465, -4250196, -3894756, -3740223, -4699091, -7173062, -10785417, -12765651, -9972104, -3715239, 673127, 470986, -1579598, -2646220, -4108815, -7702004, -10995271, -10730307, -8248247, -7326315, -8059357, -7152038, -3687894, -498176, 454191, 459531, 1117187, 2131117, 3089388, 4651535, 6438160]
4044F438160m26983m021453n112381k077810K063722L403383J644748l32108m24675
4035A154603N83824P88107k27660j319012j612391j184483j32435J483606K490006
4026B024165J207805j848518l620407k278183J93894Q80496m5811k38940J078728
4017b646771K559156L081838K503153Q32862j226756j821821k83696J074158j7873
4008D054250k088821k192926p71739o60509j894819j622751O47296J864860L78171
3999b286988j755754k560177k569036k108398L6585L268361M164116J467320j083782
3990c427753J5577K696845K732319L91115l68744J602258L033981J466625j304216
3981F838007k277263j344561n80006p29295l56555J528561L517007L466261J464529
$$ y = [6438160, 6011177, 1989724, -3122657, -5200467, -3136745, 266638, 1911386, 1579278, 1154603, 1738427, 2526534, 2298874, 979862, -632529, -1817012, -1949447, -465841, 2024165, 3231970, 1383452, -2236955, -4515138, -4321244, -3440748, -3486559, -3725499, -2646771, -87615, 2994223, 5497376, 6330238, 5103482, 3281661, 2997965, 4072123, 4054250, 1965429, -227497, -999236, -1659745, -3554564, -5177315, -4530019, -2665159, -2286988, -4042742, -6602919, -9171955, -11280353, -11243768, -7975407, -3811291, -2343971, -3427753, -3412176, -715331, 2016988, 2408103, 2039359, 3641617, 6675598, 8142223, 6838007, 4560744, 3216183, 2636177, 1906882, 1550327, 3078888, 6595895, 10062156, 11526685]
3972A1526685k89669o38339p98017j752998k185777p17021J342800J761315P42289
3963H991268l2827o64024k232641l449576j811656J762117L205715J050662j557832
3954E261206j713482l10581O23473R47425J065442N04706l76294K9278J613829
3945G645002J964388L68435o85838J00725L68184j506883l014790j705838L74984
3936C908369J94874j033099l34600J406797Q53036k011690l877126l232696j524347
3927e650482K85228K356737L452051J813347j171882j943799N7606J730454J454103
3918B383363J173942K082833J867723j400697n271502n625420k130377J429976
3910e490159J970614M51195M800J719848L315990K364148q7158p46625J103598
$$ y = [11526685, 11237016, 10598677, 9800660, 8047662, 5861885, 5144864, 6487664, 8248979, 8991268, 8958441, 8294417, 6061776, 2612200, 800544, 2562661, 5768376, 6819038, 5261206, 3547724, 3237143, 3860616, 4808041, 5873483, 6378189, 6001895, 6031173, 7645002, 9609390, 9977825, 9291987, 9392712, 9760896, 8254013, 5239223, 3533385, 3908369, 4103243, 3070144, 2735544, 4142341, 4995377, 2983687, -893439, -4126135, -5650482, -5365254, -3008517, 443534, 2256881, 1084999, -858800, -801194, 929260, 2383363, 3557305, 5640138, 7507861, 6107164, 835662, -4789758, -6920135, -5490159, -3519545, -3068350, -3063550, -1343702, 1972288, 4336436, 4249278, 3502653, 4606251]
3901D606251K384591Q66323j480476j859548j079475j612863k932236k442612
3893c550045k84017O10058o45451j519341k75167J474258J513581n1707j651116
3884d378947k146663j171467P17676J805887Q04101j156438j745745m43474J479322
3875f235748L308492M779665M392980J068332k798988l509034j401932k44222
3867f40455r50381l44319K682089M551380K850220L76799J88691N24061j475111
3858G762974m255082m537234l088532l000554l746353k001265K056420M201939
3850f607687K608163N23551J054923K848084K955709J235972l99810j177293j565028
3841A476584j472305o60965k65683j514918k909534j159899L896711P397491M906323
$$ y = [4606251, 6990842, 7857165, 6376689, 4517141, 3437666, 1824803, -1107433, -3550045, -3834062, -3224004, -3869455, -5388796, -5663963, -4189705, -2676124, -2727831, -4378947, -6525610, -7697077, -6979401, -5173514, -4369413, -5525851, -7271596, -7715070, -6235748, -2927256, 1852409, 6245389, 7313721, 4514733, 1005699, -396233, -640455, -1590836, -1935155, 746934, 5298314, 8148534, 8525333, 8714024, 9238085, 7762974, 3507892, -1029342, -4117874, -7118428, -10864781, -12866046, -10809626, -6607687, -3999524, -3475973, -2421050, 427034, 3382743, 4618715, 4218905, 3041612, 1476584, 4279, -656686, -922369, -2437287, -5346821, -6506720, -2610009, 4787482, 9693805]
3832I693805j126359l509662M82025N346242M911518O37938j408464J23570P57846
3823A5908459j731083l764011k428313m99196j527788l747036l162754j34025
3815a085747J659988J258254R43412J517809J422465M98452M98027J343335P24087
3806H780082j593092k631128q77528J027353J89853k441336l909604l231517j554159
3797f241076J23065J429969J923271J620670J443486J806830J686107L52643j031490
3788C113475j093399n92731j221764k544799k180776O80758L659859L937888J580890
3779E339401q66480j538645r11076l56949k19515n8579j4197n99209j314392j052341
3769a591982k52409q48404k992511l692917p27380L456928M398682J528501j464330
$$ y = [9693805, 8567446, 5057784, 5539809, 10886051, 15797569, 16435507, 15027043, 15150613, 15908459, 14177376, 10413365, 7985052, 7485856, 5958068, 2211032, -951722, -1085747, 574241, 1832495, 2775907, 4293716, 5716181, 6214633, 6712660, 8055995, 8780082, 7186990, 4555862, 3678334, 4705687, 4895540, 2454204, -1455400, -4686917, -6241076, -6118011, -4688042, -2764771, -1144101, 299385, 2106215, 3792322, 4144965, 3113475, 2020076, 1427345, 205581, -2339218, -4519994, -3839236, -179377, 3758511, 5339401, 4472921, 2934276, 2023200, 1666251, 1446736, 1388157, 1373960, 774751, -539641, -1591982, -1844391, -2692795, -5685306, -9378223, -10105603, -6648675, -2249993, -721492, -2185822]
3760b185822k089451j674792j752610j117136J488278M199226M205534J824441
3752B897668k2845J98377J216177J298224L37804n09067k30994R70192J539337
3743G694873J30599k243156k870345j007748P04430k7390j655211j261769P47346
3734B11629J294819n12672k203108j891364n83477K90779J087861K398403L390735
3725C483605L212036K386642J405524m39312l165355m594491k906707K13208J263738
3716H58888m77015k116118j192836J172284J966052R7530k361596k551196m4141
3707d648148K543318K504607L93550o58293P43815K210562J054330j611607k347117
3698A85017k96639J747878J387796m17823j221207k90669J088022J450165L86751
$$ y = [-2185822, -4275273, -5950065, -7702675, -8819811, -7331533, -3132307, 1073227, 2897668, 2874823, 3073200, 4289377, 5587601, 5925405, 5416338, 5185344, 6155536, 7694873, 7825472, 5582316, 2711971, 1704223, 2408653, 2381263, 726052, -535717, 211629, 1506448, 993776, -1209332, -3100696, -3684173, -3393394, -2305533, 92870, 3483605, 6695641, 9082283, 10487807, 10048495, 6883140, 2288649, -618058, -404850, 858888, 381873, -1734245, -2927081, -1754797, 211255, 308785, -2052811, -4604007, -4648148, -2104830, 399777, 793327, 135034, 878849, 3089411, 4143741, 2532134, 185017, -111622, 1636256, 3024052, 2606229, 1385022, 1094353, 2182375, 3632540, 4019291]
3689D019291j351828k373614j857976n64345K8678l48127n78051J28116J471374
3680a426482K903613L768245K758772p03785m320941m635925j749810L06388p38120
3671c838045k206418j118952R42296R52645L7597J551663M750932N208613J702936
3662G983267j887216k610806k080084k302726j963145L28571K419608J798914
3654A686383R8323O00221K610310K245835j450248m806004m568441j748274O62174
3645d669721J514532J624656J671105J562990J187283O15624j25737p81697o73805
3636A925230N78108K239037K879259J816101k8546j015500o56711j62333n73971
3627G000674q68541P30414L463493L869201J09149m844785o151570k780164J456820
$$ y = [4019291, 2667463, 293849, -1564127, -2128472, -2099794, -2447921, -3025972, -2897856, -1426482, 1477131, 5245376, 8004148, 7300363, 2979422, -1656503, -3406313, -3099925, -3838045, -6044463, -7163415, -6221119, -5268474, -5230877, -3679214, 1071718, 6280331, 7983267, 6096051, 3485245, 1405161, -897565, -2860710, -2532139, -112531, 1686383, 1784706, 2384927, 4995237, 7241072, 5790824, 984820, -3583621, -5331895, -4669721, -3155189, -1530533, 140572, 1703562, 2890845, 3506469, 3380732, 2599035, 1925230, 2503338, 4742375, 7621634, 9437735, 9409189, 8393689, 7736978, 7574645, 7000674, 6132133, 6862547, 10326040, 14195241, 14304390, 9459605, 3308035, 527871, 1984691]
3618A984691K616165Q32294p89958l79736P22369J34099k209108l657895k043613
3609b790692J491467L800025L384648J365643q92581l049244m353946l475482
3601d520162j081641j92782j878618k736661M73184N247175N959701J591940k771002
3592I1134k714202L93873K282280J267505p74434j368925M0813J773606J567876
3583B559526o69639k065339k34773K945310L393269N94552j634997q33694Q62769
3574D916984P59958j53023M15647J692271J016999j669267l456233k425221K43758
3565A341873K251216K620688J944243J269411R07209N654k173743m432196m450110
3556g15755k002744L40681P23309L11863P22511J258820P48771J00809L92663
$$ y = [1984691, 4600856, 5433150, 4643192, 4263456, 4985825, 5119924, 2910816, -747079, -2790692, -1299225, 2500800, 5885448, 7251091, 6358510, 3309266, -1044680, -4520162, -5601803, -5794585, -7673203, -10409864, -9936680, -4689505, 1270196, 2862136, 91134, -2623068, -2229195, 53085, 1320590, 546156, -822769, -781956, 991650, 2559526, 1889887, -175452, -410225, 2535085, 5928354, 6522906, 4887909, 4054215, 4916984, 5676942, 5523919, 5939566, 7631837, 8648836, 6979569, 3523336, 1098115, 1341873, 3593089, 6213777, 8158020, 9427431, 10334640, 10340294, 8166551, 3734355, -715755, -2718499, -2377818, -1654509, -1342646, -620135, 638685, 1387456, 1488265, 1880928]
3547A880928J96954j973287l925641k312531J667112L129051M11068k720025k779243
3538f425614r20777M8602r0618R1937P77761J169275J151153R46088M11803n9044
3528b899434N11915J707668J594075r8750q81877O40081K156483J264950n18121
3519C476990m03408Q54693M89773j070920p40939J584786K187212o67681l839085
3510A871421l950435j795140p3660N57084Q08498M71501m44289j04455K572052
3501h7423M979629L708120l04349k838974k464488j916622k728760k336113J271414
3492b717566N059435M432997k73797m098360l867480j357424K84283N37347P23586
3483a276979J268058J524666J329786J080636N91403p83599k733487l605275j918715
$$ y = [1880928, 2077882, 104595, -3821046, -6133577, -4466465, -1337414, -926346, -3646371, -6425614, -7346391, -7297789, -7388407, -7296470, -6518709, -5349434, -4198281, -3252193, -2840390, -2899434, -2387519, -679851, 914224, 815474, -66403, 573678, 2730161, 3995111, 3476990, 3073582, 3928275, 4418048, 3347128, 2606189, 4190975, 6378187, 5710506, 1871421, -2079014, -3874154, -3947814, -3390730, -2582232, -2110731, -2555020, -2659475, -87423, 4892206, 8600326, 8295977, 5457003, 2992515, 1075893, -1652867, -3988980, -2717566, 2341869, 6774866, 6501069, 2402709, -1464771, -2822195, -2537912, -2000565, -1276979, -8921, 1515745, 2845531, 3926167, 4517570, 3733971, 1000484, -2604791, -4523506]
3474d523506J881643N329587N789682K841345j100000l011319k244856p79252
3466D183324n06510j253139j880122k122546k270907j966970q43583P5648o56574
3457g241379k411142k641548k63893K495624K789316Q28902m70082P18763K948196
3448c247243L484076J728539n9056M60344K617397L144800J66774l848867m493059
3439d6295r42465K562789J901458j654537l337573j372457J046954P64851r46467
3430b023742p45934J832918M214981M731001M145568L223636J345055j498647
3422A5224836l403384k830463r36079r1883q86665j976738k264331j853319j296280
3413c14306j124976j675856k284880j440941Q72669K045147J38710k554503k112450
$$ y = [-4523506, -2641863, 2687724, 8477406, 11318751, 10218751, 7207432, 4962576, 4183324, 3676814, 2423675, 543553, -1578993, -3849900, -5816870, -6660453, -6584805, -7241379, -9652521, -12294069, -12557962, -10062338, -7273022, -6444120, -6914202, -6195439, -3247243, 236833, 1965372, 1906316, 2366660, 4984057, 8128857, 8295631, 4446764, -46295, -988760, 1574029, 3475487, 1820950, -1516623, -2889080, -1842126, -1077275, -2023742, -2769676, -936758, 3278223, 8009224, 12154792, 15378428, 16723483, 15224836, 11821452, 8990989, 8054910, 7963027, 7076362, 5099624, 2835293, 981974, -314306, -1439282, -3115138, -5400018, -6840959, -5968290, -3923143, -3784433, -6338936, -8451386]
3404h451386J109086K583384L13197k236602j729350L0085k47028j433648Q0009
3395i982253L873382N349370K305627k102881l891503k635328j70590K215844
3387e038332L590325K713433k84166k984241l215067j450403N67004K118190K923091
3378a060166J980984p51371k775020j812920N00463N66122j675804k409999R1636
3369g346075K483940J427388j048805n57625K669408L735207L15885l697213l586529
3360e604419j39665K085077J232042k65339k19629L48648k67809j416011j274493
3351e521598K61996J557778J482021M47229m16383k68857Q43559J793068J347629
3342A526442j98117j229608j103415r91399j733626k381782k023079j454284j512605
$$ y = [-8451386, -7342300, -4758916, -4445719, -6682321, -8411671, -8381586, -8628614, -10062262, -9982253, -6108871, -759501, 1546126, -556755, -4448258, -7083586, -7254176, -5038332, -1448007, 1265426, 981260, -2002981, -5218048, -6668451, -6101447, -3983257, -1060166, 920818, 169447, -2605573, -4418493, -3918030, -3351908, -5027712, -7437711, -7346075, -4862135, -3434747, -4483552, -5041177, -2371769, 1363438, 1679323, -2017890, -5604419, -5744084, -3659007, -2426965, -2692304, -2911933, -2563285, -2831094, -4247105, -5521598, -5259602, -3701824, -2219803, -1772574, -2188957, -2457814, -1614255, 178813, 1526442, 1328325, 98717, -1004698, -1996097, -3729723, -6111505, -8134584, -9588868, -11101473]
3333a1101473j356394l00425L11540n40399r98153P96910K698006J305440k028090
3324a1213038k417329J110378M011966L167521Q38815j67699p04394j788713j195950
3315h358443K454467N516506L785539j041063l806324l133985j778543j079575
3307g441421P6277J285086N43473j484132j569464R59080L300240M108797M947422
3298D725358N670806L235120k510248o375394m622010n47418O47846n02823J26026
3289a52737K634077L015008K37177j758738k29218K363017K416222J97441j447370
3280G274879j308845n11501k24337o00449j366207k021771j866004q42309J24619
3271a341925M29428O57758J202315R77112r47553l064801k804859k91554J349428
$$ y = [-11101473, -12457867, -12758292, -12446752, -12987151, -13985304, -13188394, -10490388, -9184948, -11213038, -13630367, -12519989, -8508023, -5340502, -4501687, -4669386, -5373780, -7162493, -8358443, -5903976, -387470, 3398069, 2357006, -1449318, -4583303, -6361846, -7441421, -7365144, -6080058, -5536585, -7020717, -8590181, -7631101, -4330861, -222064, 4725358, 10396164, 13631284, 11121036, 4745642, 123632, -423786, 224060, -278763, -152737, 2481340, 5496348, 5733525, 3974787, 3745569, 6108586, 8524808, 8722249, 7274879, 5966034, 5454533, 5230196, 4629747, 3263540, 1241769, -624235, -1466544, -1341925, -912497, -254739, 947576, 1924688, 977135, -2087666, -4892525, -5184079, -3834651]
3262c834651K97152j206528k4217L206952M693850K400348j714580m537862m902375
3253e621911l251076k50463K848247L976358K253063m52465j529829o99044L34344
3244b392776O61811Q47801J131600Q60510j08353j061625j711383k352128k663788
3235f788331k006580r74984p12898n11605J479481M510192N048075J881166j345961
3226E78555j069231J109790J380434j39577k18973J378985J177484j875785l839262
3217a517580j552282K273028K732023n47602l546549l643173k077401p96184J65800
3208h509920J370603K340121K456899J994646J236067p3674j416478j209631P05686
3199a105681J755507p1305k662992k241056R41546K533681M29679k107760j561312
$$ y = [-3834651, -3537499, -4744027, -4768244, -1561292, 3132558, 5532906, 3818326, -719536, -5621911, -8872987, -9123450, -6275203, -2298845, -45782, -498247, -2028076, -2727120, -2392776, -1730965, -883164, 248436, 1108946, 1000593, -61032, -1772415, -4124543, -6788331, -8794911, -9769895, -10482793, -10994398, -9514917, -5004725, 43350, 1924516, 578555, -490676, 619114, 1999548, 1859971, 1640998, 3019983, 4197467, 2321682, -1517580, -3069862, -796834, 1935189, 1387587, -2158962, -5802135, -7879536, -8675720, -8509920, -7139317, -4799196, -2342297, -347651, 888416, 814742, -601736, -1811367, -1105681, 649826, 578521, -2084471, -4325527, -3383981, -850300, -420621, -2528381, -4089693]
3190d089693N93268Q51379l25477L47538K708587K747798o97469l307391j641803
3181b813263J505739J468878j162293j878845M94145K224061O39965k195864l206451
3172d923928k604732k273416j994688j22779K765668L676345J281104j684092
3164e880518j488003J868210M481230L347059P9886j276815M94894K432172J562450
3155E620565j358783l417970l382256k227974q48657N66242J253050L66643r91963
3146d421103n74930J433795J932739o55434l549687l250024m67332J125500L18475
3137h108001k72776J403200L601793L321238O05113j357807j18717L157168M919526
3128G150737K973368j158701l732626k766923j29280Q88229m46486j900628j670117
$$ y = [-4089693, -3496425, -2645046, -2970523, -2622985, 85602, 2833400, 2135931, -1171460, -2813263, -1307524, 161354, -1000939, -2879784, -2385639, -161578, 478387, -1717477, -4923928, -7528660, -9802076, -11796764, -11919543, -9153875, -5477530, -4196426, -5880518, -7368521, -5500311, -1019081, 2327978, 2407864, 1131049, 1625943, 4058115, 5620565, 4261782, 843812, -2538444, -4766418, -5615075, -5048833, -3795783, -3429140, -4421103, -4996033, -3562238, -1629499, -2284933, -5834620, -9084644, -9551976, -8426476, -8108001, -8380777, -6977577, -3375784, -54546, 550567, -807240, -925957, 2231211, 7150737, 10124105, 8965404, 5232778, 2465855, 2336575, 3224804, 2778318, 877690, -792427]
3119g92427n23229N0346K11742R14668J787329J662693P20714K03834L3913j249827
3109C019756l599400m521717k389291Q29225J951272P51190k65531J91141P55772
3100c277583K43953k85224M85125J658720J292390p34409k549388k682343j312494
3091g161253P28862K798433M000753L235552O07659j863961j970631K17609K215713
3082B808736J685656j137318l767379m025111j993133M97571J836901J755844
3074b338233Q70310j46365p99251p86319j90022N81849J237797J699144J676836
3065A805746P04813j044529k451583k475097j246258K07146R77462O76903n84898
3056c430295j912028j809441K60631K576953K543778k35486l129210l284136o57322
$$ y = [-792427, -1315656, -1265310, -1053568, -138900, 1648429, 3311122, 4031836, 4235670, 4269583, 3019756, -579644, -5101361, -7490652, -6661427, -4710155, -3958965, -4224496, -4033355, -3277583, -3033630, -3318854, -2833729, -1175009, 117381, -617028, -3166416, -5848759, -7161253, -6432391, -3633958, 366795, 3602347, 4210006, 2346045, 375414, 593023, 2808736, 4494392, 3357074, -410305, -4435416, -6428549, -5930978, -4094077, -2338233, -1467923, -1614288, -2413539, -3199858, -3389880, -2808031, -1570234, 128910, 1805746, 2510559, 1466030, -985553, -3460650, -4706908, -4499762, -3522300, -2845397, -3430295, -5342323, -7151764, -6891133, -4314180, -1770402, -2005888, -5135098, -8419234, -9076556]
3047i076556K283575L262312J891684o71233k567494j997056J276860M687024
3039i10884M648697P80690k846583k370959Q32969K085854M229j884804r20157
3030e80948O33987m11751k897839l457921k068656j310125r64110J837772O506835
3021b712756P930845L691965j692367k792634l62167J107696M19664J00916J153971
3012F845133J651784N33498p34334q24504j65046N75628J275155J270430k91968
3003A0135776k606585l698595l044493j842714p30466N34218J150426k17353k470385
2994b790171k415421P47440L662559L000791m86313l446571l775825j724248J200375
2985f027384L051119K523303M89717o47031L2861R61578P55685O3870k34308o60739
$$ y = [-9076556, -6792981, -3530669, -1638985, -2310218, -4877712, -6874768, -5597908, -910884, 3737813, 4518503, 1671920, -699039, 133930, 2219784, 2224013, 339209, -580948, 53039, -358712, -3256551, -6714472, -8783128, -10093253, -11057363, -9219591, -2712756, 5218089, 8910054, 7217687, 4425053, 4062886, 5170582, 5590246, 5691162, 6845133, 8496917, 9030415, 8296081, 7471577, 7306531, 7882159, 9157314, 10427744, 10135776, 7529191, 3830596, 786103, -1056611, -1787077, -1252859, -102433, -319786, -2790171, -5205592, -4458152, -795593, 2205198, 1718885, -1727686, -5503511, -7227759, -6027384, -2976265, -452962, 36755, -610276, -577415, 384163, 1139848, 1203718, 969410, 308671]
2975C08671j555853j764917o20675M53810K04763j29012J132502K956406K738994
2966C724689r6313l503959n164474l914785N7907M567661O075161L263639p35203
2957D274323j921405n32043k0797j418306j874007N42495L480309L418186L20217
2948F268972k702973l522371k986943k718831k332709n7173L974180O532951M813343
2939G268446M39011k171740j475312k17373m26250k53606J982545L703537J727602
2930A0576860j982767k666448n1212J364065m10766j983626m59934K050743K304831
2921H741746R01373L19379N21136p8686r23024j63634J501235J237257j513708
2912A0543074l960902m032667l031148k990873l381279k233169N78760L108582
$$ y = [308671, -1247182, -3012099, -3632774, -3178964, -2974201, -3103213, -1970711, 985695, 3724689, 3628376, 124417, -5040057, -8954842, -8896935, -4329274, 1745887, 5009526, 4274323, 2352918, 1820875, 1800078, 381772, -1492235, -949740, 2530569, 5948755, 6268972, 3565999, 43628, -2943315, -5662146, -7994855, -8052028, -4077848, 2455103, 7268446, 7707457, 5535717, 4060405, 3843032, 3416782, 3163176, 5145721, 8849258, 10576860, 8594093, 5927645, 5876433, 7240498, 6829732, 4846106, 4386172, 6436915, 8741746, 9643119, 9962498, 10483634, 10404948, 9481924, 9318290, 10819525, 12056782, 10543074, 6582172, 2549505, -481643, -3472516, -6853795, -9086964, -8508204, -5399622]
2904e399622M102938M242056M256148L338115N94067k727508l978732k232560
2896B194902M63268J423863J08806j954772l244662l398436k714817j433830K87960
2887h267718K011618K878397K247622Q30890N31114K078992L387336J969120j291179
2878F376192l113929k711039k617506l585794k336434K858586P535141O129189
2870H534406o4642m450668l909040j609994j021469j554368j302115k91524P47496
2861d921918J914699K772992J943697m04010j908800j247402J07354N19678K88609
2852i35101q0112j164202k615575k316763N09269L391209L727584K027711L52249
2843B896269n63966q52302j40137J330643J901134P60653n30622m90729N9043
$$ y = [-5399622, -1296684, 2945372, 7201520, 10539635, 11133702, 8406194, 4427462, 2194902, 2658170, 4082033, 4190839, 2236067, -1008595, -4407031, -7121848, -8555678, -8267718, -6256100, -3377703, -1130081, -299191, 231923, 2310915, 5698251, 7667371, 6376192, 3262263, 551224, -2066282, -5652076, -7988510, -5129924, 2405217, 8534406, 8469764, 4019096, 110056, -1499938, -2521407, -4075775, -5377890, -5669414, -4921918, -3007219, -234227, 1709470, 1305460, -603340, -1850742, -1743388, -1223710, -935101, -1015213, -2179415, -4794990, -7111753, -6602484, -3211275, 516309, 2544020, 2896269, 2332303, 1480001, 1339864, 2670507, 4571641, 5332294, 4801672, 4310943, 4369986]
2834D369986q8774l88566k01619m34390j400678j359394L53014J157424q27856
2825A179147l009493j991541R53121J949246M87821p13697n50979l1145R72799
2816g54721K902067L260317o88504o063096o642747j801709K235387J585379l23716
2807f291343N12677K318046J798780L52280J117730K811573J753577j487554k526988
2798C58778L6911K705623K581559J056713P05870J380612J185590m57474k461942
2789G092240l839196m355372l777637j656937J787846N050975O163546M373826
2781A0839291Q31603k572225m677761n095534l654897r16365J377710J900860
2773a967318J510373J737872J842375k44947l795016n001288k157603J476506
$$ y = [4369986, 4281212, 3892646, 3691027, 3256637, 1855959, 496565, 849579, 2007003, 1179147, -1830346, -3821887, -2868766, -919520, -431699, -1145396, -1696375, -1727520, -754721, 2147346, 5407663, 4719159, -1343937, -7986684, -9788393, -7553006, -5967627, -6291343, -5778666, -3460620, -1661840, -1309560, -191830, 2619743, 4373320, 2885766, 358778, 395689, 3101312, 5682871, 6739584, 7445454, 8826066, 10011656, 9554182, 7092240, 3253044, -1102328, -4879965, -6536902, -4749056, 301919, 6465465, 10839291, 11670894, 9098669, 4420908, -674626, -4329523, -5245888, -3868178, -1967318, -456945, 1280927, 3123302, 2878355, -916661, -5917949, -8075552, -6599046]
2765f599046K007906O51j164924l06130J013972J810044K408429K207518j40021
2756A238399l732301n239200k883865J180761L535619L145549J425146l1465o07649
2747a969006l69633K45362O66639O62818L57254l11875j499282k640204k591048
2738g448975j106054M72534O21997n96666j592435q20729J813596M670669N421042
2729A434979L106341n40552k575867k063787r92031j372070k459258k112202k00490
2720g774937J181821J001561Q69887K354169M195364L852686J122212j554645
2712E248118k317069j715160r21463J92677K044971L546161K921197J62290k534506
2703F627216l056114j490587K07171L24156r22219j755722j045181J47848L4933
$$ y = [-6599046, -4591140, -4590489, -5755413, -6061543, -5047571, -3237527, -829098, 1378420, 1238399, -2493902, -7733102, -10616967, -9436206, -5900587, -2755038, -1329892, -1361357, -1969006, -2338639, -2093277, -1426638, -763820, -406566, -718441, -2217723, -4857927, -7448975, -8555029, -8082495, -7460498, -8057164, -9649599, -10470328, -8656732, -3986063, 1434979, 4541320, 4000768, 1424901, -638886, -1630917, -3002987, -5462245, -7574447, -7774937, -6593116, -5591555, -4721668, -2367499, 1827865, 5680551, 6802763, 5248118, 2931049, 1215889, 294426, 487103, 2532074, 6078235, 8999432, 9161722, 6627216, 3571102, 2080515, 2287686, 2611842, 1689623, -66099, -1111280, -963432, -928499]
2694i28499j030293p05215J667630L315665J632120j777152k950892r50811J138930
2685e88517Q38885n66657n89081O91817J125902k02268j822322j948583o43329
2676c704153M49995K47802l20976M25402K192288K497274J38601k475295k349718
2667b898780k80852L75486j068412j744852l7544K023350K547858K757128L840581
2658E513963L645127j42636n179910o524582l098202J118707K513427J569116
2650e84990N19061o7715q98489j858346j947499p48563R53396J766099P45070
2641b121976j529347k902359j586059J593267L711199K830116r7601k597281l157457
2632e857498k017344k60289J152604J647739R44502q57142k874683l470450j592698
$$ y = [-928499, -1958792, -2664007, -996377, 2319288, 3951408, 2174256, -776636, -1727447, -588517, 250368, -316289, -905370, -213553, 912349, 710081, -1112241, -3060824, -3704153, -3254158, -3006356, -3327332, -2901930, -709642, 1787632, 1926233, -549062, -2898780, -3179632, -2804146, -3872558, -5617410, -5654954, -3631604, -1083746, 1673382, 5513963, 9159090, 9016454, 3836544, -2688038, -5786240, -4667533, -2154106, -584990, -65929, -133644, -1032133, -2890479, -4837978, -5586541, -4633145, -2867046, -2121976, -3651323, -6553682, -8139741, -6546474, -2835275, -5159, -102760, -2700041, -5857498, -7874842, -8135131, -6982527, -5334788, -4390286, -5247428, -8122111, -11592561, -13185259]
2623a3185259J594597L358420K390303L43611m80994m0330J79900n6830L55018
2614e541564J373798J372142k35335j748865j559882k96352O21780J290944K553948
2605b169386L747491L226748J150052j32859Q14401K444532K321629K39119k069574
2596I572153l550553m403549m289834k127795J566928M005825L257642Q36959
2588D867776l89341Q1933M90801j35004j032134j471555j517471j137959m28925
2579f71879n40865k286023l940914k872615M83344K898253K963073K495776K691450
2570A219600K260847P32115p24M80671o01736m099041n596858j379866M868481
2561b116511O214305J921986k169135k217593m51026j91859j284231j859304j224116
$$ y = [-13185259, -11590662, -8232242, -5841939, -5498328, -5979322, -6019652, -5839752, -5896582, -5541564, -4167766, -2795624, -3030959, -4779824, -6339706, -6636058, -6014278, -4723334, -2169386, 1578105, 4804853, 5954905, 5822046, 6636447, 9080979, 11402608, 11641727, 9572153, 6021600, 1618051, -2671783, -4799578, -3232650, 773175, 4030817, 4867776, 4478435, 4560368, 5051169, 4916165, 3884031, 2412476, 895005, -242954, -671879, -1212744, -3498767, -7439681, -10312296, -9828952, -6930699, -3967626, -1471850, 1219600, 3480447, 4212562, 4211838, 4692509, 4090773, -8268, -5605126, -6984992, -2116511, 4097794, 6019780, 3850645, 1633052, 1182026, 990167, -294064, -2153368, -3377484]
2552c377484M05871K360476K822429L97675k948547l466025q75229J110275M57125
2543c113434m82752N33903J996382J791152Q31234O75586J89531k056783m025295
2534c660476k607370J120922K675263L08134k658002k420406O61575L177000K982763
2525d20597J144345P5767P06470J745390J486541j70640j860115k462847j985893
2516a741579j120491q15473j777007l150508k365007J782220O272559O627584
2508C712298K792772m77535l647J883204J445209j021110k341257j325125K45443
2499D910252O81317R1453o77473r78163l85000Q34080J466639O56715q79068j810426
2489C910326j819872j437166r68675n42381n68885j225828j966221k130989j427821
$$ y = [-3377484, -2971613, -611137, 2211292, 2608967, -339580, -3805605, -4680834, -3570559, -3113434, -3596186, -3062283, -1065901, 725251, 1556485, 2232071, 2421602, 364819, -3660476, -6267846, -5146924, -2471661, -2163527, -4821529, -7241935, -6580360, -3403360, -420597, 723748, 799515, 1505985, 3251375, 4737916, 4567276, 2707161, 244314, -1741579, -2862070, -3677543, -5454550, -8605058, -10970065, -9187845, -2915286, 3712298, 6505070, 6027535, 6023888, 7907092, 9352301, 8331191, 5989934, 4664809, 4910252, 5591569, 5683022, 5005549, 4027386, 3642386, 4476466, 5943105, 6599820, 5720752, 3910326, 2090454, 653288, -315387, -857768, -1426653, -2652481, -4618702, -6749691, -8177512]
2480h177512M21123L289889N489596M607715M91760l876108n399112l647940j83017
2471f983606L164005M604171L032215l69010k801987l117602k615129j987767
2463g074710k12349K337051K964108R63988l76461J094599K425791L35978k871866
2454d13871k644378N78615K362104J419102P37211J776531K412283J335806K06552
2445G769955K53257L59807j99534k76053O25404J068766J41249j100509j514860
2436G127482j175157m03847L90498k1753k130218l709681k364477L25466P51296
2427a210391q31646n83438K349273M194418K751839O35357L60955N29874o19756
2418G576485j863905j984134k357864l545147k967666N24210L220310J705295
$$ y = [-8177512, -7756389, -4466500, 1023096, 5630811, 6122571, 2246463, -3152649, -6800589, -6983606, -3819601, 784570, 3816785, 3447775, 645788, -2471814, -5086943, -7074710, -7287059, -4950008, -1985900, -1021912, -1398373, -303774, 2122017, 2457995, -413871, -3058249, -2479634, -117530, 1301572, 2038783, 3815314, 6227597, 7563403, 7769955, 8023212, 8383019, 8183485, 7907432, 8532836, 9601602, 9742851, 8642342, 7127482, 5952325, 5548478, 5938976, 5917223, 3787005, 77324, -2287153, -1961687, -1210391, -2042037, -2625475, -276202, 3918216, 6670055, 7305412, 7666367, 8196241, 7576485, 5712580, 3728446, 1370582, -2174565, -5142231, -4618021, -1397711, 307584]
2410C07584j502821j801310M71206J464706L43927m91496m97472j338917k539877
2401e584470j499477J754033L897371L096173J022073m47751j240509j229307
2393b31864L04958K410784K639780N49839j540208k122334k171523k403227j744653
2384d308448J23011J370518Q60689J10818O31938J337862N75424r71317j536055
2375a805560j141121j046138j209622n14325Q01191J015745m59925j915148j475825
2366g750728N13301J979427J611719K27013l97526M20493J810178K695046K791548
2357C900471K099705M36627j775377l118610k653816j231087l13407j09971k8182
2348b793647k40120j216553k166685j708913O199J436489J792016J475493O88407
$$ y = [307584, -1195237, -2996547, -2525341, -1060635, -716708, -1208204, -1705676, -3044593, -5584470, -7083947, -5329914, -1432543, 1663630, 2685703, 2237952, 997443, -231864, 73094, 2483878, 5123658, 5673497, 4133289, 2010955, -160568, -2563795, -4308448, -4185437, -2814919, -1954230, -1843412, -1211474, 126388, 701812, -269505, -1805560, -2946681, -3992819, -5202441, -5716766, -4915575, -3899830, -4359755, -6274903, -7750728, -7237427, -5258000, -3646281, -3419268, -3816794, -3396301, -1586123, 1108923, 3900471, 6000176, 6436803, 4661426, 1542816, -1111000, -2342087, -2655494, -2765465, -2793647, -3033767, -4250320, -6417005, -8125918, -8119719, -6683230, -4891214, -3415721, -2727314]
2339b727314n15800j037948J63323J787146J511563j86403m19218J239595J585571
2330A400515r43353l123598j696147J433213K074842J3136j263921j77713J231064
2321a051962J138160J89390o16978j496559k444876k508666j443271k73736N36064
2312g972434J700718L225194L766371K759514J452545R09310O90429M33714Q17013
2303G782374J716782J437302n20316j868007r31053R8901j777933n147956n456318
2294d666224j511171K593029L015235Q48820l19415N99039J669911J204515l85544
2285C048195j634553j593962m44158P37937R91209N13312J99479J55683k88696
2276A684446r95202r47735k13411k06312j147224j234432K53778J076142o21353
$$ y = [-2727314, -3243114, -4281062, -4117739, -2330593, -819030, -1005433, -1424651, -185056, 1400515, 457162, -2666436, -4362583, -2929370, -854528, -841392, -2105313, -2283026, -1051962, 86198, 275588, -341390, -1837949, -4282825, -6791491, -8234762, -8508498, -7972434, -6271716, -3046522, 719849, 3479363, 4931908, 5841218, 6531647, 6965361, 7782374, 9499156, 10936458, 10416142, 8548135, 7617082, 7715983, 5938050, 790094, -4666224, -6177395, -3584366, -569131, 279689, -39726, 559313, 2229224, 3433739, 3048195, 1413642, -180320, -624478, 113459, 1104668, 1617980, 1817459, 1973142, 1684446, 689244, -258491, -471902, -678214, -1825438, -3059870, -2806092, -1729950, -2351303]
2267b351303k825156k317810L12063J514183K70310n47651J190587L827616M613936
2258C686775L158563R65383o93806j356400j259540j389736k273071k516083n11733
2249b189648K212348K066305j314863l805881k425947N95086J613868Q16426P58817
2240a673489J759119K166395J938986K425498L126235K041554p06585k596848
$$ y = [-2351303, -5176459, -7494269, -7182206, -5668023, -5397713, -5945364, -4754777, -927161, 3686775, 6845338, 7810721, 7116915, 5760515, 4500975, 3111239, 838168, -1677915, -2189648, 22700, 2089005, 774142, -3031739, -5457686, -4862600, -3248732, -2432306, -1673489, 85630, 2252025, 4191011, 6616509, 9742744, 11784298, 11077713, 8480865]
$$ [...]
##END NTUPLES=NMR SPECTRUM
##END=
