##TITLE=31Pdec_DE-156_TFA_CCl4p
 CCl4,64 sc
 10.6.2026
##JCAMPDX= 6.0         $$ Bruker NMR JCAMP-DX V2.0
##DATA TYPE= NMR SPECTRUM
##DATA CLASS= NTUPLES
##ORIGIN= UXNMR, Bruker Analytische Messtechnik GmbH
##OWNER= root
$$ XWIN-NMR		Version 3.5
$$ Wed Jun 10 14:11:01 2026 Russian Standard Time (UT+4h)  she@DPX200
##.OBSERVE FREQUENCY= 81.013821
##.OBSERVE NUCLEUS= ^31P
##.ACQUISITION MODE= SIMULTANEOUS
##.ACQUISITION SCHEME= undefined
##.AVERAGES= 64
##.DIGITISER RES= 17
##SPECTROMETER/DATA SYSTEM= spect
##.PULSE SEQUENCE= zgpg30
##.SOLVENT NAME= CDCl3
##.SHIFT REFERENCE= (INTERNAL, CDCl3, 0, 197.392)
##AUDIT TRAIL= $$ (NUMBER, WHEN, WHO, WHERE, WHAT)
$$ ##TITLE= Audit trail, XWIN-NMR		Version 3.5
$$ ##JCAMPDX= 5.01
$$ ##ORIGIN= Bruker BioSpin GmbH
$$ ##OWNER= she
$$ F:/spectra/data/she/nmr/P31/2/pdata/1/auditp.txt
$$ ##AUDIT TRAIL=  $$ (NUMBER, WHEN, WHO, WHERE, WHAT)
(   1,<2026-06-10 14:08:34.07 +0400>,<she>,<DPX200>,
      <created by zg, POWCHK disabled, PULCHK disabled
       configuration hash MD5:
       00 E9 B6 7A A2 85 ED C7 34 08 36 98 17 FE 4E 26
       data hash MD5: 32K
       FB DD 6A 44 63 8B 2F 00 CD 68 8D 9B 5B B8 2C 24>)
(   2,<2026-06-10 14:08:36.40 +0400>,<she>,<DPX200>,
      <Start of raw data processing
       efp BC_mod = 2 LB = 1.5 FT_mod = 6 PKNL = 1 PHC0 = 1613.308 PHC1 = 51.50064 SI = 64K 
       data hash MD5: 64K
       70 FB 1F 2F 15 B3 4E 7D 8B D9 84 72 34 62 FB 90>)
(   3,<2026-06-10 14:09:06.32 +0400>,<she>,<DPX200>,
      <pk PHC0 = 206.6357 PHC1 = -414.2 
       data hash MD5: 64K
       9E 2B 3D 47 8F 07 EE 72 48 2C 1A 1E B8 74 43 F2>)
$$ ##END=
$$ 
$$ hash MD5
$$ 6C A2 AD F1 A2 94 11 A2 67 38 88 C1 61 94 A2 AF
##$RELAX= 
##$RELAX= 
##$RELAX= 
##$RELAX= 
##$RELAX= 
##$RELAX= 
##$RELAX= 
##$RELAX= 
$$ Bruker specific parameters
$$ --------------------------
##$DU= <F:/spectra>
##$EXPNO= 2
##$NAME= <P31>
##$PROCNO= 1
##$TYPE= <nmr>
##$USER= <she>
##$AMP= (0..31)
100 100 100 100 100 100 100 100 100 100 100 100 100 100 100 100 100 100 
100 100 100 100 100 100 100 100 100 100 100 100 100 100 
##$AQSEQ= 0
##$AQ_mod= 1
##$AUNM= <au_zg>
##$AUTOPOS= <>
##$BF1= 81.014009
##$BF2= 200.13
##$BF3= 200.13
##$BF4= 200.13
##$BF5= 200.13
##$BF6= 200.13
##$BF7= 200.13
##$BF8= 200.13
##$BYTORDA= 1
##$CFDGTYP= 0
##$CFRGTYP= 5
##$CHEMSTR= <none>
##$CNST= (0..31)
1 1 145 1 1 1 1 1 1 1 1 1 1 1 1 1 1 1 1 1 1 1 1 1 1 1 1 1 1 1 1 1 
##$CPDPRG= <waltz16>
##$CPDPRG1= <>
##$CPDPRG2= <waltz16>
##$CPDPRG3= <>
##$CPDPRG4= <mlev>
##$CPDPRG5= <mlev>
##$CPDPRG6= <mlev>
##$CPDPRG7= <mlev>
##$CPDPRG8= <mlev>
##$CPDPRGB= <>
##$CPDPRGT= <>
##$D= (0..31)
0 1 0 0 0 0 0 0 0 0.06 0 0.03 2e-05 3e-06 0 0 0.0002 0 0 0 0 0 0 0 0 0 
0 0 0 0 0 0 
##$DATE= 1781086113
##$DBL= (0..7)
120 120 120 11 120 120 24 19 
##$DBP= (0..7)
150 150 150 150 150 150 150 150 
##$DBP07= 0
##$DBPNAM0= <>
##$DBPNAM1= <>
##$DBPNAM2= <>
##$DBPNAM3= <>
##$DBPNAM4= <>
##$DBPNAM5= <>
##$DBPNAM6= <>
##$DBPNAM7= <>
##$DBPOAL= (0..7)
0.5 0.5 0.5 0.5 0.5 0.5 0.5 0.5 
##$DBPOFFS= (0..7)
$$ [...]
##$SUBNAM2= <"">
##$SUBNAM3= <"">
##$SUBNAM4= <"">
##$SUBNAM5= <"">
##$SUBNAM6= <"">
##$SUBNAM7= <"">
##$SUBNAM8= <"">
##$SUBNAM9= <"">
##$SW= 400.765351723535
##$SWIBOX= (0..15)
0 1 3 0 0 0 0 0 0 0 0 0 0 0 0 0 
##$SW_h= 32467.5324675325
##$TD= 32768
##$TD0= 1
##$TE= 0
##$TE2= 300
##$TE3= 300
##$TEG= 300
##$TL= (0..7)
0 120 53 12 22 120 120 120 
##$TP= (0..7)
150 150 150 150 150 150 150 150 
##$TP07= 0
##$TPNAME0= <>
##$TPNAME1= <>
##$TPNAME2= <>
##$TPNAME3= <>
##$TPNAME4= <>
##$TPNAME5= <>
##$TPNAME6= <>
##$TPNAME7= <>
##$TPOAL= (0..7)
0.5 0.5 0.5 0.5 0.5 0.5 0.5 0.5 
##$TPOFFS= (0..7)
0 0 0 0 0 0 0 0 
##$TUNHIN= 0
##$TUNHOUT= 0
##$TUNXOUT= 0
##$USERA1= <user>
##$USERA2= <user>
##$USERA3= <user>
##$USERA4= <user>
##$USERA5= <user>
##$V9= 5
##$VALIST= <valist>
##$VCLIST= <CCCCCCCCCCCCCCC>
##$VD= 0
##$VDLIST= <DDDDDDDDDDDDDDD>
##$VPLIST= <PPPPPPPPPPPPPPP>
##$VTLIST= <TTTTTTTTTTTTTTT>
##$WBST= 1024
##$WBSW= 4
##$XGAIN= (0..3)
0 0 0 0 
##$XL= 0
##$YL= 0
##$YMAX_a= 3840
##$YMIN_a= -3550
##$ZGOPTNS= <>
##$ZL1= 120
##$ZL2= 120
##$ZL3= 120
##$ZL4= 120
##$ABSF1= 0
##$ABSF2= 0
##$ABSG= 0
##$ABSL= 0
##$ALPHA= 0
##$AQORDER= 0
##$ASSFAC= 0
##$ASSFACI= 0
##$ASSFACX= 0
##$ASSWID= 0
##$AUNMP= <proc_1d>
##$AZFE= 0.1
##$AZFW= 0.5
##$BCFW= 0
##$BC_mod= 2
##$BYTORDP= 0
##$COROFFS= 0
##$CY= -3
##$DATMOD= 1
##$DC= 0
##$DFILT= <>
##$DTYPP= 0
##$F1P= 0
##$F2P= 0
##$FCOR= 1
##$FTSIZE= 65536
##$FT_mod= 6
##$GAMMA= 0
##$GB= 0
##$INTBC= 1
##$INTSCL= 9.790993e-09
##$ISEN= 30
##$LB= 1.5
##$LEV0= 0
##$LPBIN= 0
##$MAXI= 10000
##$MC2= 0
##$MEAN= 0
##$ME_mod= 0
##$MI= 50
##$NCOEF= 0
##$NC_proc= -8
##$NLEV= 6
##$NOISF1= 182.463
##$NOISF2= 159.3651
##$NSP= 0
##$NTH_PI= 0
##$NZP= 0
##$OFFSET= 197.3918
##$PC= 4
##$PHC0= 1819.944
##$PHC1= -362.6994
##$PH_mod= 1
##$PKNL= yes
##$PPARMOD= 0
##$PSCAL= 0
##$PSIGN= 0
##$REVERSE= no
##$SF= 81.014063255964
##$SI= 65536
##$SIGF1= 159.3651
##$SIGF2= -187.1042
##$SINO= 113.3802
##$SIOLD= 16384
##$SREGLST= <1H.CDCl3>
##$SSB= 0
##$STSI= 65536
##$STSR= 0
##$SW_p= 32467.5324675325
##$SYMM= 0
##$S_DEV= 0
##$TDeff= 32768
##$TDoff= 0
##$TI= <>
##$TILT= no
##$TM1= 0
##$TM2= 0
##$TOPLEV= 0
##$USERP1= <user>
##$USERP2= <user>
##$USERP3= <user>
##$USERP4= <user>
##$USERP5= <user>
##$WDW= 1
##$XDIM= 65536
##$YMAX_p= 82496300
##$YMIN_p= -353911643
$$ End of Bruker specific parameters
$$ ---------------------------------
##NTUPLES= NMR SPECTRUM
##VAR_NAME=  FREQUENCY,     SPECTRUM/REAL,   SPECTRUM/IMAG
##SYMBOL=    X,             R,               I
##VAR_TYPE=  INDEPENDENT,   DEPENDENT,       DEPENDENT
##VAR_FORM=  AFFN,          ASDF,            ASDF
##VAR_DIM=   65536,         65536,           65536
##UNITS=     HZ,            ARBITRARY UNITS, ARBITRARY UNITS
##FACTOR=    0.49542278885378, 1,            1
##FIRST=     15991.5117654749, 0,            0
##LAST=      -16476.0207020576, 0,           0
##MIN=       -16476.0207020576, -353911643,  0
##MAX=       15991.5117654749, 82496300,     0
$$ Real data points
##PAGE= N=1
##DATA TABLE= (X++(R..R)), XYDATA
$$ [...]
7500E284133k566619n277309l809951J30690L292206L769060J986107l12026j479492
$$ 5284133 2717514 -2559795 -6369746 -6239056 -2946850 822210 2808317 2496291 1016799
7491A016799q44918R02740K002493R84907j700231l688457k904508J37784K584512
$$ 1016799 171881 1074621 3077114 4062021 2361790 -1326667 -4231175 -4093391 -1508879
7482a508879K035767j001966l634713l493769q92137J902871L051902K413405
$$ -1508879 526888 -475078 -4109791 -7603560 -8495697 -6592826 -3540924 -1127519
7474a127519Q75055p11892j779786j939385j115674M04446K150145L421477L315356
$$ -1127519 -252464 -964356 -2744142 -4683527 -5799201 -5394755 -3244610 176867 3492223
7465C492223J602613m40934j145377o35899o69016j775623k138254n06824J302016
$$ 3492223 5094836 4653902 3508525 2872626 2203610 427987 -1710267 -2217091 -915075
7456i15075Q31292j050717j155743J131875K613536Q14423k465814l724763k349401
$$ -915075 -83783 -1134500 -2290243 -1158368 1455168 2269591 -196223 -3920986 -6270387
7447f270387p09982m20988n12642N10185K304172L117910J925441m53123k177631
$$ -6270387 -6980369 -7401357 -7913999 -7403814 -5099642 -1981732 -56291 -509414 -2687045
7438b687045k098863p53754K74257M1417q16989r69120l086J190327J597752J186081
$$ -2687045 -4785908 -5539662 -5265405 -5223988 -6040977 -7010097 -7013183 -5822856 -4225104 -3039023
7428c039023N75971k6396r70056k146257k477257j039686J520990L402042L540800
$$ -3039023 -2463052 -2489448 -3459504 -5605761 -8083018 -9122704 -7601714 -4199672 -658872
7419f58872K482233J253250J89673o78327q80006l6118J187841J513287M69754
$$ -658872 1823361 3076611 3266284 2587957 1707951 1671833 2859674 4372961 4842715
7410D842715j129087k119087k019048j237950o37146q21584j568204k000972j442385
$$ 4842715 3713628 1594541 -424507 -1662457 -2299603 -3121187 -4689391 -6690363 -8132748
7401h132748O9887K019498L647309L984122K505639R3437j426176j132931K36103
$$ -8132748 -8062861 -6043363 -2396054 1588068 4093707 4187144 2760968 1628037 1864140
7392A864140J535644K186018J710278j39373k084393j879963N75864K346343J300933
$$ 1864140 3399784 5585802 7296080 7156707 5072314 3192351 3768215 6114558 7415491
7383G415491p88563j126257k94308q90463k774184l123179j183027M77206J93079
$$ 7415491 6626928 5500671 5206363 4315900 1541716 -1581463 -2764490 -2287284 -2094205
7374b094205m51271K02009J138034Q41494l6721j34822K37642R7666k27308K5088
$$ -2094205 -2545476 -2343467 -1205433 -363939 -400660 -535482 -297840 -200174 -427482 -402394
7364d02394L31983j91539j106793j506107j564497j589005o07860K050768M554236
$$ -402394 -70411 -261950 -1368743 -2874850 -4439347 -6028352 -6636212 -4585444 -31208
7355c1208M247009J324477j336912k109789k238761l044483l607389k469328k12870
$$ -31208 4215801 5540278 4203366 2093577 -145184 -3189667 -6797056 -9266384 -9479254
7346i479254J176526R13345J36686K26277J320374K510745K827728J948651M42458
$$ -9479254 -8302728 -7389383 -7252697 -7026420 -5706046 -3195301 -367573 1581078 2023536
7337B023536n99233o14433k89897o53545j353896p91346J384141K933429J665386
$$ 2023536 1424303 809870 519973 -133572 -1487468 -2278814 -894673 2038756 3704142
7328C704142j090890j676239R24958L438990K712364k11322k149009k217640j863301
$$ 3704142 2613252 937013 1861971 5300961 8013325 7802003 5652994 3435354 1572053
7319A572053j598441n29704J109910J629478M77736r24554j321526p59958M94549
$$ 1572053 -26388 -556092 553818 2183296 2661032 1736478 414952 -345006 149543
7310A49543K092163K522392L12780l184928m588261k776708o6503J574761K750098
$$ 149543 2241706 4764098 5076878 1891950 -2696311 -5473019 -5539522 -3964761 -1214663
7301a214663L918745L417391K83298l206754m115995k399628n8781J566884J897458
$$ -1214663 2704082 6121473 6404771 3198017 -917978 -3317606 -3376387 -1809503 87955
7292H7955M36441j868259k343677N1848K699561K893629J621440J161949Q85990
$$ 87955 524396 -1343863 -3687540 -3635692 -936131 1957498 3578938 4740887 5626877
7283E626877j069602l365319k821392J43530J509937l52627k359282j588192O35980
$$ 5626877 4557275 1191956 -1629436 -1485906 24031 -328596 -2687878 -4276070 -3640090
7274c640090J291271j8097j238523j000383O2194M85302m57011j945993k196894
$$ -3640090 -2348819 -2366916 -3605439 -4605822 -4543628 -4058326 -4515337 -6461330 -8658224
7265h658224n19760J450514J709370P02297N93345J880098K664577J602221k79412
$$ -8658224 -9177984 -7727470 -6018100 -5315803 -4722458 -2842360 -177783 1424438 1145026
7256A145026j328157j213429m09298P87302J855851J901066Q24950k58015n32849
$$ 1145026 -183131 -1396560 -1805858 -1018556 837295 2738361 3563311 3305296 2772447
7247B772447o08834j420453k645534k935402j486306R59185K625358K379485J048990
$$ 2772447 2163613 743160 -1902374 -4837776 -6324082 -5364897 -2739539 -360054 688936
7238F88936N02497J094940J078552n97103k186283j441102R61606K290817J545043
$$ 688936 1191433 2286373 3364925 2767822 581539 -859563 102043 2392860 3937903
7229C937903K72519j93124j73902j76266j0471J95509j45330p60355o17202L06419
$$ 3937903 4210422 4017298 3843396 3667130 3656659 3852168 3706838 2946483 2329281 2635700
7219B635700Q41885M48328k99613j113842k133506k558084j190242J203293K146704
$$ 2635700 3477585 3925913 3626300 2512458 378952 -2179132 -3369374 -2166081 -19377
7210a9377Q66307m40775K43614J975670K360121N97615j999711l598510l230000
$$ -19377 846930 406155 649769 2625439 4985560 5583175 3583464 -15046 -3245046
7201c245046j421576J27204K70626k02382R8025Q81399P87503j40446n93054l62854
$$ -3245046 -4666622 -4539418 -4268792 -4471174 -4373149 -3491750 -2704247 -2844693 -3437747 -3800601
7191c800601l18830j92809R65921K140155J282752p15567n94962J719131K123601
$$ -3800601 -4119431 -4312240 -3346319 -1206164 76588 -638979 -1233941 485190 2608791
7182B608791j055617l470130j120544K940446K684501k001190n245949l626323
$$ 2608791 1553174 -1916956 -3037500 -97054 2587447 586257 -4659692 -8286015
7174h286015k53478M75856j353249k517723j452287N48913J965308K788806L347449
$$ -8286015 -8539493 -8063637 -9416886 -11934609 -13386896 -12837983 -10872675 -8083869 -4736420
7165d736420K899189P63052j553354j278541J690120L674292K008317p12485k47652
$$ -4736420 -1837231 -1074179 -2627533 -3906074 -2215954 1458338 3466655 2754170 2506518
7156B506518K524769K658704r46565l510127j903099M86321m80990l040610k802978
$$ 2506518 5031287 7689991 6743426 3233299 1330200 1816521 1335531 -1705079 -4508057
7147d508057J23507J882341J099261j13819n70885j211857k054405j759425n12012
$$ -4508057 -4384550 -2502209 -1402948 -1516767 -2087652 -3299509 -5353914 -7113339 -7625351
7138g625351r065k17394P22630K869825L837653K619933J225619J296619J550322
$$ -7625351 -7634416 -7851810 -7129180 -4259355 -421702 2198231 3423850 4720469 6270791
7129F270791J26487k345721l638950k812894r59408L45815N55962L93258P78278
$$ 6270791 6397278 4051557 412607 -2400287 -3359695 -3013880 -2457918 -2064660 -1286382
7120a286382J377194P90217j242138k777004j976537L19713J659650R05573j192513
$$ -1286382 90812 881029 -361109 -3138113 -5114650 -4794937 -3135287 -2229714 -3422227
7111c422227l404978m445120l001518P08933M119338M877856L522382J931073
$$ -3422227 -6827205 -11272325 -14273843 -13564910 -9445572 -4567716 -1045334 885739
7103H85739L47888j817866l518795l271813k002947j701421j884554o04385J517840
$$ 885739 1233627 -584239 -4103034 -7374847 -9377794 -11079215 -12963769 -13568154 -12050314
7094a2050314J864619M25589J03280J897628L387748K873431J556477N35048q88689
$$ -12050314 -10185695 -9760106 -9656826 -7759198 -4371450 -1498019 58458 593506 -295183
7085b95183k518596k305828J65319K356113K722000K836998L642440K989677m28328
$$ -295183 -2813779 -5119607 -4954288 -2598175 123825 2960823 6603263 9592940 9164612
7076I164612l836699m267486l051314k978950l318528j627581J135339J629564
$$ 9164612 5327913 1060427 -1990887 -4969837 -8288365 -9915946 -8780607 -7151043
7068g151043l93400j691856o68737P16475O64213n2115k08902J00619P63019K240874
$$ -7151043 -7544443 -9236299 -9905036 -9188561 -8524348 -8576463 -8785365 -8684746 -7921727 -5680853
7058e680853L836701L631748J369197o14107o08639K43057L96594O05965K080039
$$ -5680853 -1844152 1787596 3156793 2542686 1934047 2177104 2573698 3179663 5259702
7049E259702L483063K487359k80250j632953m30808P94532j88519k010850k102765
$$ 5259702 8742765 11230124 10949874 9316921 8886113 9680645 9492126 7481276 5378511
7040E378511o67931J081q20843j767810k071165k174164j617667Q38848M196366
$$ 5378511 4710580 4711661 3890818 2123008 51843 -2122321 -3739988 -2901140 1295226
7031A295226N116535K338358j212926k440832j814469j097739k9221J809546K250110
$$ 1295226 6411761 8750119 7537193 5096361 3281892 2184153 2154932 3964478 6214588
7022F214588m67185l582954k981319M40646K012531M91016p67286q7200K14200
$$ 6214588 5747403 2164449 -816870 -376224 1636307 2127323 1360037 1272837 1487037
7013A487037r35260r32292J348040K593221L91417k399403k206161l45342j49452
$$ 1487037 551777 -380515 967525 3560746 3952163 1552760 -653401 -998743 -1148195
7004a148195j225355q52113Q26968J327890L89902K3044P04236J179020J487096
$$ -1148195 -2373550 -3225663 -2398695 -1070805 -680903 -657859 46377 1225397 2712493
6995B712493K597232L412658J820448j242187k383301q82699J92144j155078l043854
$$ 2712493 5309725 8722383 10542831 9300644 6917343 6034644 6226788 5071710 2027856
6986B027856l002285j280561N63127J936849K445953J060558j914840l680331
$$ 2027856 -974429 -2254990 -1691863 244986 2690939 3751497 1836657 -1843674
6978a843674k028187J260891K271706L8402k134377r72237K534201M351667K375766
$$ -1843674 -3871861 -2610970 -339264 -300862 -2435239 -3407476 -873275 3478392 5854158
6969E854158j137186k546132j161783N61090N97360n34802j352148j366459p59791
$$ 5854158 4716972 2170840 1009057 1570147 2167507 1632705 280557 -1085902 -1845693
6960a845693L83104J495104J416768l3578j379974j324219k66632P47126J319640
$$ -1845693 -1462589 32515 1449283 1415705 35731 -1288488 -1555120 -807994 511646
6951E11646J180483k9499j486202j515506l64124m84330k452958l061608O7701
$$ 511646 1692129 1662630 176428 -1339078 -1703202 -2187532 -4640490 -7702098 -7634397
6942g634397M118069M437710Q59488k423804k362265L42072L153848L578660L54086
$$ -7634397 -3516328 921382 1780870 -642934 -3005199 -2663127 490721 4069381 4423467
6933D423467m379656n589908j364235L198625K166384k630580m171959n90272
$$ 4423467 43811 -5546097 -6910332 -3711707 -1545323 -4175903 -8347862 -8938134
6925h938134K900064K794199J800326K638958L167413R88873j781577k253109
$$ -8938134 -6038070 -3243871 -1443545 1195413 4362826 5351699 3570122 1317013
6917A317013j652923k501625l679809k305351J345953M302306M859189L260194
$$ 1317013 -335910 -2837535 -6517344 -8822695 -7476742 -3174436 1684753 4944947
6909D944947J14965l045172l459919n09255K190375J259450j356274j286260J453662
$$ 4944947 5059912 2014740 -1445179 -1954434 235941 1495391 139117 -1147143 306519
6900C06519K554385P5729k881348k918124o25854J101897Q49922m52023j107264
$$ 306519 2860904 2936633 55285 -2862839 -3488693 -2386796 -1536874 -1988897 -3096161
6891c096161k92212J157394J573447P10252M13573J909859L527701K899733M88086
$$ -3096161 -3388373 -2230979 -657532 52720 466293 2376152 5903853 8803586 9291672
6882I291672j252405j517720j508589j568060p54096N22171K14288k056438l659964
$$ 9291672 8039267 6521547 5012958 3444898 2690802 3212973 3427261 1370823 -2289141
6873b289141k224178J275757L820240L614695J228885j453046k589402j549064
$$ -2289141 -4513319 -3237562 582678 4197373 5426258 3973212 1383810 -165254
6865a65254M78140J499279P17171q87255j884939j596092j53149J582314K137962
$$ -165254 312886 1812165 2529336 1642081 -242858 -1838950 -1992099 -409785 1728177
6856A728177N84611k079069l495684k294235M78948K285193J299588j786723l899826
$$ 1728177 2312788 233719 -3261965 -5556200 -5077252 -2792059 -1492471 -3279194 -7179020
6847g179020k478987J239381L196704J664982l85442L17514K614700L219380K043252
$$ -7179020 -9658007 -8418626 -5221922 -3556940 -3942382 -3624868 -1010168 2209212 4252464
6838D252464J616046K065479Q94663j946540l017636q17677J462613P10147j659043
$$ 4252464 5868510 7933989 8828652 6882112 3864476 3046799 4509412 5219559 3560516
6829C560516k454138j431396o22145p92723j163822j367398j425380q21694N29084
$$ 3560516 1106378 -325018 -947163 -1739886 -2903708 -4271106 -5696486 -6518180 -5989096
6820e989096J470401J318428R82108R23100K3291j602258j180612K371255M993891
$$ -5989096 -4518695 -3200267 -2218159 -1295059 -1271768 -2874026 -4054638 -1683383 3310508
6811C310508K413675k903992m325483k51795L892463L539751M16457j502635j551931
$$ 3310508 5724183 2820191 -1505292 -1757087 2135376 5675127 6091584 4588949 3037018
6802C037018j445544j712840j727526j419474q42331L73604J536271P96360j748122
$$ 3037018 1591474 -121366 -1848892 -3268366 -4110697 -3737093 -2200822 -1404462 -3152584
6793c152584l004557j083225J536943J620257Q2970J69888K042191K694785Q44990
$$ -3152584 -6157141 -7240366 -5703423 -4083166 -4000196 -3830308 -1788117 906668 1751658
6784A751658j442155k227754j847208j062917K47011J708006K043319J031325
$$ 1751658 309503 -1918251 -3765459 -4828376 -4581365 -2873359 -830040 201285
6776B01285L5486j50285j56940j32571R15269K906570L860823K581546M48306
$$ 201285 236771 86486 -70454 -203025 712244 3618814 7479637 10061183 10509489
6767A0509489p65326j215023j771386k146163j819379j334133j014499O6148J973197
$$ 10509489 9744163 8529140 6757754 4611591 2792212 1458079 443580 509728 2482925
6758B482925K470877K23838j996570o03834K912049L138450j562455o031311m836252
$$ 2482925 4953802 5177640 3181070 2577236 5489285 8627735 7065280 1033969 -3802283
6749c802283P78039M881865M175854P24288j881009k465123k035013j634307j525504
$$ -3802283 -3024244 1857621 6033475 6757763 4876754 2411631 376618 -1257689 -2783193
6740b783193j547439j346924o38953K37624M37410k22997o96403m8691R92331
$$ -2783193 -4330632 -5677556 -6316509 -6078885 -5641475 -5864472 -6560875 -6609566 -5617235
6731e617235R11852j79803l88038J083846K259744R38868k012389l609934k476887
$$ -5617235 -4705383 -4885186 -5273224 -4189378 -1929634 -990766 -3003155 -6613089 -9089976
6722i089976K03664L040944N373908N791496K668501k588361n480696l618066
$$ -9089976 -8886312 -5845368 -471460 5320036 7988537 5400176 -80520 -3698586
6714c698586M1653J322123K96031o9729Q52559R07493o16744j787408j447490
$$ -3698586 -3656933 -2334810 -2038779 -2108508 -1255949 -348456 -965200 -2752608 -4200098
6705d200098q87292j269957j835121j644289j030559l13846J027676K799938L381191
$$ -4200098 -5087390 -6357347 -8192468 -9836757 -10867316 -11181162 -10153486 -7353548 -3972357
6696c972357J803707o92548k215292k291550j620746q39370k85825q5050R3215
$$ -3972357 -2168650 -2861198 -5076490 -7368040 -8988786 -9828156 -10113981 -10199031 -10105816
6687a0105816N84161R22656N23490J2372M09021J148615Q07588k11307J2430J632011
$$ -10105816 -9521655 -8598999 -8075509 -8063137 -7654116 -6505501 -5697913 -5909220 -5896790 -4264779
6677d264779K583562K084079J856606K705819K649930K59693k581440l390177
$$ -4264779 -1681217 402862 2259468 4965287 7615217 7874910 5293470 1903293
6669A903293k517600j679912r64240K33730Q82624l36751k319955k672248r55873
$$ 1903293 -614307 -2294219 -3258459 -3024729 -2142105 -2478856 -4798811 -7471059 -8426932
6660h426932J250674K827781L647940L353743J707332j92383p79953J36990J532263
$$ -8426932 -7176258 -4348477 -700537 2653206 4360538 4168155 3388202 3525192 5057455
6651E057455K393303J854499m83448l116158l287360o80954J515503J087570p4543
$$ 5057455 7450758 9305257 8821809 5705651 2418291 1737337 3252840 4340410 4265867
6642D265867K48704N12411j345926l100294j309513K431607L378755R67000r38740
$$ 4265867 4514571 5026982 3681056 580762 -728751 1702856 5081611 6048611 5109871
6633E109871q51672j204007k592102k242831K40952J181512p07449j398765J645253
$$ 5109871 4258199 3054192 462090 -1780741 -1539789 -358277 -1065726 -2464491 -819238
6624h19238M520635K897739q81730j479445J382947L365795K322289J21183j407769
$$ -819238 3701397 6599136 5717406 4237961 5620908 8986703 11308992 11430175 10022406
6615A0022406k203863k041771n68886P26356k35530k765391l998761k852030q65723
$$ 10022406 7818543 5776772 5207886 5934242 5698712 2933321 -1065440 -3917470 -4783193
6606d783193P28854K075169K804715J918257O6940n78864M91063J250997K72121
$$ -4783193 -4054339 -1979170 825545 2743802 2810742 2231878 2722941 3973938 4246059
6597D246059j214751j352633j46166J078338J490256J205282Q01306Q36459J066262
$$ 4246059 3031308 1678675 1532509 2610847 4101103 5306385 6107691 6944150 8010412
6588H010412J98525k380793m800339m323594j016172J972983K320103R63089q9431
$$ 8010412 8208937 5828144 1027805 -3295789 -4311961 -2338978 -18875 944214 854783
6579H54783m97660r03777j182909j046769j137319j687029j132620J684076M504081
$$ 854783 357123 -546654 -1729563 -2776332 -3913651 -5600680 -6733300 -5049224 -545143
6570e45143L577408r59404m296741k947968P23154K175802J115036J004355K795050
$$ -545143 3032265 2072861 -2223880 -5171848 -4448694 -2272892 -1157856 -153501 2641549
6561B641549L091721k33728m104049m444852j793665M31021J383533K681733L850287
$$ 2641549 5733270 5499542 1395493 -3049359 -4843024 -4412003 -3028470 -346737 3503550
6552C503550K342988j459967l524681j881283O23497J172703J029044K186398
$$ 3503550 5846538 4386571 861890 -1019393 -395896 776807 1805851 3992249
6544C992249L238995J949167n72768j899276k523221m209664n701888m350684
$$ 3992249 7231244 9180411 8607643 6708367 4185146 -24518 -5726406 -10077090
6536a0077090j116770M93184J35994O51222K168407J267938k565654m591447j627766
$$ -10077090 -11193860 -10700676 -10564682 -9913460 -7745053 -6477115 -9042769 -13634216 -15261982
6527a5261982K812100L571467R18732j076976p92868K91113J519848L426103M794408
$$ -15261982 -12449882 -8878415 -7959683 -9036659 -9829527 -9538414 -8018566 -4592463 201945
6518B01945L406858L8095j762606o71594O49209p0300j325015n97822J559003
$$ 201945 3608803 3646898 1884292 1212698 1861907 1791607 466592 -131230 1427773
6509A427773K395379Q81868j225238j967593j321112n21810j84400L28839J668222
$$ 1427773 3823152 4705020 3479782 1512189 191077 -330733 -515133 -186294 1481928
6500A481928K956920K333593l56003k412867j478532O63058l8339l809005n791484
$$ 1481928 4438848 6772441 6416438 4003571 2525039 3188097 3149758 -659247 -6450731
6491f450731k686326K009492K566785q32489k583048o1381K845094K041961q63674
$$ -6450731 -9137057 -7127565 -4560780 -5393269 -7976317 -8037698 -5192604 -3150643 -4014317
6482d014317j781398m05881L39760n27844j295180j328362j745220k106055l06364
$$ -4014317 -5795715 -6201596 -5861836 -6389680 -7684860 -9013222 -10758442 -12864497 -13170861
6473a3170861L061080L922924N34881k978403j970416K010077L543676J302551
$$ -13170861 -10109781 -6186857 -5651976 -8630379 -10600795 -8590718 -5047042 -3744491
6465c744491m37204J285994L534778J935848k744324n396776l208324J103788
$$ -3744491 -4181695 -2895701 639077 2574925 -169399 -5566175 -8774499 -7670711
6457g670711L174661K136977M93091p9761o72070k441817l872227k601243O85671
$$ -7670711 -4496050 -2359073 -1865982 -1945743 -2617813 -5059630 -8931857 -11533100 -10847429
6448a0847429K466200R97624j255329j075536J143421K313926J096543o59882
$$ -10847429 -8381229 -7383605 -8638934 -9714470 -8571049 -6257123 -5160580 -5820462
6440e820462r26040n4603M03977J66647L40642J458519K385798J627702n35131
$$ -5820462 -6746502 -6801105 -6397128 -6230481 -5889839 -4431320 -2045522 -417820 -952951
6431i52951j886386p60088J713306K795448J536393j97542m15874N92480J312697
$$ -952951 -2839337 -3599425 -1886119 909329 2445722 2248180 1832306 2424786 3737483
6422C737483J209344O91179j72316j447987k330717j729769J44061J700425J545438
$$ 3737483 4946827 5638006 5465690 4017703 1686986 -42783 101278 1801703 3347141
6413C347141k54807k196237k444710o06984J466893J658443L71705k36999J16194
$$ 3347141 3092334 896097 -1548613 -2155597 -688704 969739 1341444 1104445 1220639
6404A220639n35317k401077k630469P9864K578512J789154m81043p15113O59201
$$ 1220639 685322 -1715755 -4346224 -4266360 -1687848 101306 -379737 -1094850 -435649
6395d35649R06239L38123J140600K046160k81527m633925n717967k204418J119410
$$ -435649 470590 808713 1949313 3995473 3713946 -919979 -6637946 -8842364 -7722954
6386g722954R37353j36370Q24431J983562P42407j315836j361203j8408N52745
$$ -7722954 -6785601 -6921971 -6097540 -4113978 -3371571 -4687407 -6048610 -6067018 -5514273
6377e514273N28661Q66912N25917j175541j933210O8900K411919K058091M24679
$$ -5514273 -4985612 -4118700 -3592783 -4768324 -6701534 -6632634 -4220715 -2162624 -1737945
6368a737945O09571J695269O58711j600307j396987J251327K456598Q31415q14253
$$ -1737945 -1128374 566895 1225606 -374701 -1771688 -520361 1936237 2767652 1953399
6359A953399o09754J28003N58270J808180L612160L529557R73923j566085k590351
$$ 1953399 1343645 1471648 2029918 3838098 7450258 10979815 11953738 10387653 7797302
6350G797302l248811l713633j927854K074003M431790K674443m41273j018367
$$ 7797302 4548491 834858 -1092996 981007 5412797 8087240 7645967 6627600
6342F627600O59811J572796N22296j341566k770316k950532j422482O88040J148165
$$ 6627600 7287411 8860207 9382503 8040937 5270621 2320089 897607 1585647 2733812
6333B733812j10623m48814J137992J984576L15173j236163K01849K784305K962890
$$ 2733812 2623189 2174375 3312367 5296943 5612116 4375953 4577802 7362107 10324997
6324A0324997J263441P82124J405721J58238l185952n296829m442816k574669
$$ 10324997 11588438 12370562 13776283 13934521 10748569 5451740 1008924 -1565745
6316a565745j561307p94976M65038J353624J168669N09592k20158j321734k297175
$$ -1565745 -3127052 -3922028 -3456990 -2103366 -934697 -425105 -645263 -1966997 -4264172
6307d264172k069172j082164q04555q72183N06245K851692L290363J109357p86076
$$ -4264172 -6333344 -7415508 -8220063 -9092246 -8586001 -5734309 -2443946 -1334589 -2120665
6298b120665m61699J50437j049104k676563k428415p80092O43912K153774M318715
$$ -2120665 -2582364 -2431927 -3481031 -6157594 -8586009 -9366101 -8722189 -6568415 -2249700
6289b249700N120171K469855j502869k486154o3943J836077R23809m96466K59304
$$ -2249700 2870471 5340326 3837457 1351303 1287360 3123437 4047246 3550780 3810084
6280C810084K036658J860187n76438k503676j634056J155537K721904R49038k731231
$$ 3810084 5846742 7706929 7130491 4626815 2992759 4148296 6870200 7819238 5088007
6271E088007m549566k739011K06767Q92135m28422q67090K55929O91436m00427
$$ 5088007 538441 -2200570 -1993803 -1101668 -1530090 -2397180 -2141251 -1449815 -1850242
6262a850242q57387M25541J168440l19010j797209p94068Q24102j04861k101615
$$ -1850242 -2707629 -2282088 -1113648 -1432658 -3229867 -4023935 -3199833 -3304694 -5406309
6253e406309q89978L192136M738493J446016k079579j334734J367568J094110
$$ -5406309 -6296287 -3104151 1634342 3080358 1000779 -333955 1033613 2127723
6245B127723j759627k584868k75038J349788J75052r80790M29899K259932J341592
$$ 2127723 368096 -2216772 -2491810 -1142022 -966970 -1947760 -1517861 742071 2083663
6236B083663j248685k039429o32085K30390n53184j018841J70158J619073J840011
$$ 2083663 834978 -1204451 -1836536 -1606146 -2159330 -3178171 -3008013 -1388940 451071
6227D51071J585183K077544K698480K088148L78822j165504j862257j656583l95641
$$ 451071 2036254 4113798 6812278 8900426 9279248 8113744 6251487 4594904 4199263
6218D199263J407086J871115k93737l386228m188217k076513J19039j440j319639
$$ 4199263 5606349 7477464 7183727 3797499 -390718 -2467231 -2348192 -2349632 -3669271
6209c669271j171946Q05953K448147K265384J235499R62093J261740O62510j090257
$$ -3669271 -4841217 -4035264 -1587117 678267 1913766 2875859 4137599 4800109 3709852
6200C709852k308428j717301o37239j470261m056444n117876k273514K549330
$$ 3709852 1401424 -315877 -953116 -2423377 -6479821 -11597697 -13871211 -11321881
6192a1321881N201554M225365K003812J138123J558429J790555J376906Q30758
$$ -11321881 -6120327 -1894962 108850 1246973 2805402 4595957 5972863 6803621
6184F803621K67402n70491j380368j427710m37164J170447K524846K471702L70732
$$ 6803621 7071023 6500532 5120164 3692454 3255290 4425737 6950583 9422285 9793017
6175I793017k621388m029629k782187o19175K32281j78780m04292j96575l47661
$$ 9793017 7171629 3142000 359813 -259362 -27081 -205861 -610153 -806728 -1154389
6166a154389o27800j51570M03453n87258k554407k800402o28114J135798L18676
$$ -1154389 -1782189 -1933759 -1530306 -2117564 -4671971 -7472373 -8100487 -6964689 -6646013
6157f646013j209098n54418J644415K491859J494601P68366R59638L49936j376884
$$ -6646013 -7855111 -8409529 -6765114 -4273255 -2778654 -2010288 -1050650 -700714 -2077598
6148b077598j781361K76794K015427O77533j838850j426549J979673L927218J656578
$$ -2077598 -3858959 -3582165 -1566738 -889205 -2728055 -4154604 -2174931 1752287 3408865
6139C408865k146678l244963j317875N14115L67416n43189n08502L00804P22169
$$ 3408865 1262187 -1982776 -3300651 -2786536 -2419120 -2962309 -3470811 -3170007 -2447838
6130b447838M90070K47059K86028J54510n41272j396385j458001k86232J280917
$$ -2447838 -1957768 -1710709 -1424681 -1270171 -1811443 -3207828 -4665829 -4952061 -3671144
6121c671144J856604J264034R06540J648684K025652k4061l797590n864341l999361
$$ -3671144 -1814540 -550506 356034 2004718 4030370 4006309 208719 -5655622 -9654983
6112i654983K59558L678346M681907L751652J758895o40005k558022l159506k307482
$$ -9654983 -9395425 -5717079 -1035172 2716480 4475375 3835370 1277348 -1882158 -4189640
6103d189640l60884K123492M005548L916480J884598l72260j652752k524009l365745
$$ -4189640 -4550524 -2427032 1578516 5494996 7379594 7007334 5354582 2830573 -535172
6094e35172k951896p68413J038648N61424m93072N95562K713049K376880m34038
$$ -535172 -3487068 -4255481 -3216833 -2655409 -3148481 -2552919 160130 2537010 2102972
6085B102972k056474j046790J5261l44715n2827J878755K681198P22540r21720
$$ 2102972 46498 -1000292 -985031 -1329746 -1382573 496182 3177380 3899920 2978200
6076B978200M82564K232483O98635j929298q96943K750676L101084j308730m880033
$$ 2978200 3460764 5693247 6391882 4462584 3565641 6316317 9417401 8108671 3228638
6067C228638l138729J335780L499430K457233O73808m39510r84511n18180J329617
$$ 3228638 89909 1425689 4925119 7382352 8056160 7616650 6632139 6113959 7443576
6058G443576K921295J825899j974898n635221o366325m060971j112088k0992r85234
$$ 7443576 10364871 12190770 10215872 4580651 -1785674 -5846645 -6958733 -6979725 -7964959
6049g964959j884200j023041P35516J578937J571054J960770K309558J009870
$$ -7964959 -9849159 -10872200 -10136684 -8557747 -6986693 -5025923 -2716365 -1706495
6041a706495j232257j485077Q73237K641159J446006p44968r18631M86215J025343
$$ -1706495 -2938752 -4423829 -3550592 -909433 536573 -208395 -1127026 -640811 384532
6032C84532M12453K09831M37007l29382j736069j559592O58309K400352J616722
$$ 384532 796985 1006816 1443823 1114441 -621628 -2181220 -1522911 877441 2494163
6023B494163m97393j397796n43816N37928Q35206R82400J619277J822183L02742
$$ 2494163 1996770 598974 55158 593086 1428292 2410692 4029969 5852152 6154894
6014F154894k085451k564205n9110K632137K066286j095064k832520j281272J071575
$$ 6154894 4069443 1505238 1446128 4078265 6144551 5049487 2216967 935695 2007270
6005B007270J465904N24433K33129N15055L6236j116117j868040k228971k736892
$$ 2007270 3473174 3997607 4230736 4745791 4782027 3665910 1797870 -431101 -3167993
5996c167993k626171p63104J969221L218319K063057r2066j384325j168372k42411
$$ -3167993 -5794164 -6557268 -4588047 -1369728 693329 601263 -783062 -1951434 -2193845
5987b193845k36155j954644l690044k735733N26791K340960R39112o02824O00610
$$ -2193845 -2430000 -4384644 -8074688 -10810421 -10283630 -7942670 -7003558 -7606382 -7005772
5978g005772K403504J611079j0992J124761L236072J450039l251397m310710K7456
$$ -7005772 -4602268 -2991189 -3002181 -1877420 1358652 2808691 -442706 -4753416 -4725960
5969d725960L531453J844750j046624l59743J413995k61421l218991k008767K457216
$$ -4725960 -1194507 650243 -396381 -756124 657871 396450 -2822541 -4831308 -2374092
5960b374092L823807K94621k822279j462313J857201K883082J387422k22361p54899
$$ -2374092 1449715 1744336 -1077943 -2540256 -683055 2200027 3587449 3365088 2610189
5951B610189l83913O44774J408337K52672k888011n526447n380239k929133k42859
$$ 2610189 2226276 2871050 4279387 4532059 1644048 -3882399 -9262638 -12191771 -12434630
5942a2434630J460493K164460K202455J984999J693640Q51698p63816j894544
$$ -12434630 -10974137 -8809677 -6607222 -4622223 -2928583 -2076885 -2840701 -4735245
5934d735245j199394J88259j44916j846631j881960L21646J141264j628950m485265
$$ -4735245 -5934639 -5746380 -5891296 -7737927 -9619887 -9298241 -8156977 -9785927 -14271192
5925a4271192k877460J944508M653294L341074J242494J125570K019403K351787
$$ -14271192 -17148652 -15204144 -10550850 -7209776 -5967282 -4841712 -2822309 -470522
5917d70522K582497L008960K118254n99625k723368k351790j382037k364234l757132
$$ -470522 2111975 5120935 7239189 6639564 3916196 1564406 182369 -2181865 -5938997
5908e938997k014665K251868M252118J855226j259623j070057J246953J868417
$$ -5938997 -7953662 -5701794 -1449676 405550 -854073 -1924130 -677177 1191240
5900A191240K01431j057510o84745l78688j347110k362223k047215q34114L82694
$$ 1191240 1392671 335161 -349584 -728272 -2075382 -4437605 -6484820 -7318934 -6936240
5891f936240J619129K658346K304130K84248j493588j257016R2523M55247k66023
$$ -6936240 -5317111 -2658765 -354635 -70387 -1563975 -2820991 -2728468 -2273221 -2539244
5882b539244k90501J132106K745660L174492K255096M89672j375958k194072j306912
$$ -2539244 -2829745 -1697639 1048021 4222513 6477609 6967281 5591323 3397251 2090339
5873B090339K13219N42397n45525j620777j824741j482398m73254J808607M252623
$$ 2090339 2303558 2845955 2300430 679653 -1145088 -2627486 -3100740 -1292133 2960490
5864B960490M161190R69089k185172k382680o84162J10142j54012L97153J631809
$$ 2960490 7121680 8090769 5905597 3522917 2838755 2948897 2794885 3192038 4823847
5855D823847J269671j065146k694976j834080k24032k91453j522612j547030K34607
$$ 4823847 6093518 5028372 2333396 499316 275284 -16169 -1538781 -3085811 -2851204
5846b851204J951712J876632L81714p51434k46488J355286J973869Q1336l158068
$$ -2851204 -899492 977140 1358854 607420 360932 1716218 3690087 3771423 613355
5837F13355m667113k959484N2521J561274J176621N55661O05303O84372K63845
$$ 613355 -4053758 -7013242 -6960721 -5399447 -4222826 -3667165 -3061862 -2377490 -2113645
5828b113645k21878k97531j3980M47452O96791p0350j862947k815212j149130
$$ -2113645 -2335523 -2633054 -2647034 -2199582 -1502791 -1573141 -3436088 -6251300 -7400430
5819g400430J809969K784260J185311J49140J744119L621251K552406o52874k517632
$$ -7400430 -5590461 -2806201 -1620890 -1471750 272369 3893620 6446026 5793152 3275520
5810C275520k009389j296779j809120k505514k351548j815653j178609J95190
$$ 3275520 1266131 -30648 -1839768 -4345282 -6696830 -8512483 -9691092 -9495902
5802i495902J871629J945574Q9207j023311P30359L412910L289416q2473l092071
$$ -9495902 -7624273 -5678699 -5589492 -6612803 -5882444 -2469534 819882 737409 -2354662
5793b354662k470826R88399L481420K303141j304954l427014j893194J080487
$$ -2354662 -4825488 -3837089 -355669 1947472 642518 -2784496 -4677690 -3597203
5785c597203J888734N66845L13903J795652J474983k458758n935627m278937P76536
$$ -3597203 -1708469 -1141624 -827721 967931 2442914 -15844 -5951471 -10230408 -9453872
5776i453872L581869K637694J449860J848703J630512k60580j139022P27547K878064
$$ -9453872 -5872003 -3234309 -1784449 64254 1694766 1434186 295164 1022711 3900775
5767C900775K651228J045054J067r45809k379020k443547p9030J811928L28982
$$ 3900775 6552003 7597057 7598124 6652315 4273295 1829748 1750718 3562646 3891628
5758C891628k425139k497407m94098j98661j923666k323246o29173J05533j259939
$$ 3891628 1466489 -1030918 -1525016 -1723677 -3647343 -5970589 -6599762 -6494229 -7754168
5749g754168j907631k53497J338323J033678M80335Q43374N6792k712288l657655
$$ -7754168 -9661799 -9915296 -8576973 -7543295 -7062960 -6219586 -6162794 -8875082 -12532737
5740a2532737L45755N768169O486083K210797j780557k454099j765839j506098
$$ -12532737 -12186982 -6418813 67270 2278067 497510 -1956589 -3722428 -5228526
5732e228526k47435K911095N360950M314081Q95101j420700j201687p8560j72972
$$ -5228526 -5475961 -2564866 2796084 7110165 8005266 6584566 5382879 5304319 5131347
5723E131347j945106m170615n085244l838089j355991N25820R27315M06819k62874
$$ 5131347 3186241 -984374 -6069618 -9907707 -11263698 -10737878 -9810563 -9403744 -9666618
5714i666618p99134q37746J18239J710716K655728K194197R26582r5133l93852
$$ -9666618 -10465752 -11303498 -11185259 -9474543 -6818815 -4624618 -3698036 -3793169 -4187021
5705d187021l6391N78796P52798J85857k81747L59678J545536J604125J25356
$$ -4187021 -4223412 -3644616 -2891818 -2705961 -2987708 -2628030 -1082494 521631 646987
5696F46987j512855k262842k499147k486165j467138P38440K691336L037251K071001
$$ 646987 -865868 -3128710 -5627857 -8114022 -9581160 -8842720 -6151384 -3114133 -1043132
5687a043132O26092j180980k865636k770897j64965K909783L792062K513775J172375
$$ -1043132 -417040 -1598020 -4463656 -7234553 -7399518 -4489735 -697673 1816102 2988477
5678B988477O71499J15693q82033j415446r99229l20280L9419K30345L42467L04239
$$ 2988477 3659976 3775669 2893636 1478190 478961 158681 198100 428445 770912 1075151
5668A075151N34001J297916J659604P82598l9374J042093K800021J765168k394464
$$ 1075151 1609152 2907068 4566672 5349270 5309896 6351989 9152010 10917178 8522714
5659H522714n280438l482108N26803J811510l38904k086168o99518K270523L622461
$$ 8522714 3242276 -239832 286971 2098481 1759577 -326591 -1026109 1244414 4866875
5650D866875K175009n75822k003460m97680K654572L890667J386085k169919k851591
$$ 4866875 7041884 6466062 4462602 3964922 6619494 10510161 11896246 9726327 6874736
5641F874736r33080k12683j975614l219847k054139j110252k879427m682093k263554
$$ 6874736 5941656 5728973 3753359 533512 -1520627 -2630879 -5510306 -10192399 -12455953
5632a2455953L119258N581950K666895j416192j823745Q42479K503625J407585
$$ -12455953 -9336695 -3754745 -1087850 -2504042 -4327787 -3485308 -981683 425902
5624D25902m86091q70326L43615J633833J568540j23602k255041l017105j754453
$$ 425902 -60189 -930515 -586900 1046933 2615473 2491871 236830 -2780275 -4534728
5615d534728K78902J337631R02393l96969j790138k575453k031515p1960K377492
$$ -4534728 -4255826 -2918195 -2015802 -2412771 -4202909 -6778362 -8809877 -8881837 -6504345
5606f504345M307869N383898N213195K921607j281788m884149n089954k046055
$$ -6504345 -2196476 3187422 8400617 11322224 10040436 5156287 66333 -1979722
5598a979722J158893J737644l98735l092012l732747j163950K823221M386558
$$ -1979722 -820829 916815 518080 -2573932 -6306679 -7470629 -4647408 -260850
5590b60850J646407k631509m239129k917643k005354k805282k644241L23080L666091
$$ -260850 1385557 -1245952 -5485081 -8402724 -10408078 -13213360 -15857601 -15534521 -11868430
5581a1868430M334489L179937K886582L249622J977627o86526j763993j61108
$$ -11868430 -7533941 -4354004 -1467422 1782200 3759827 3073301 1309308 1148200
5573A148200J663816J477373N6500r36246j465480j900255j256146J191983L672976
$$ 1148200 2812016 4289389 4345889 3409643 1944163 43908 -1212238 -20255 3652721
5564C652721L534526Q42928j471197j292976K70253O69223r30867k980703l469790
$$ 3652721 7187247 8030175 6558978 5266002 5536255 6205478 5274611 2293908 -1175882
5555a175882j859494O39359K135411J475817q17226k795756k656152m28044K038485
$$ -1175882 -3035376 -2396017 -260606 1215211 397985 -2397771 -5053923 -5481967 -3443482
5546c443482K963134K222626Q18332n83917j705764j702372L23690L433500M847107
$$ -3443482 -480348 1742278 2560610 1976693 270929 -1431443 -1107753 2325747 7172854
5537G172854K902529p26054k851441k414682j304698j703641l525630m679216
$$ 7172854 10075383 9349329 6497888 4083206 2778508 1074867 -2450763 -7129979
5529g129979l414144k41585K467948K941966J768208N92810l85769k069942l755140
$$ -7129979 -10544123 -10785708 -8317760 -5375794 -3607586 -3014776 -3400545 -5470487 -9225627
5520i225627l155157r3409K225839J463713m29635m22908Q78200Q52489k45086
$$ -9225627 -12380784 -12474193 -10248354 -8784641 -9214276 -9637184 -8758984 -7906495 -8151581
5511h151581J08230J756366J759540l27304j297178K71001J467028R4147j449458
$$ -8151581 -8043351 -6286985 -4527445 -4854749 -6151927 -5880926 -4413898 -4319751 -5769209
5502e769209l11517J878352J833664J11958j85116J177999J556187L01806l16221
$$ -5769209 -6080726 -4202374 -2368710 -2256752 -2441868 -1263869 292318 594124 277903
5493B77903O32791J166038l440j321835j133482j02279M25872M03156J76200m59971
$$ 277903 910694 2076732 2073292 751457 -382025 -484304 -58432 344724 520924 60953
5483F0953j059502l33596J407622J622118p81392k968931j824109J293186K313778
$$ 60953 -998549 -1332145 75477 1697595 916203 -2052728 -3876837 -2583651 -269873
5474b69873L47599j306598k75169J794497K341443J426378L65258r64433k955393
$$ -269873 77726 -1228872 -1504041 290456 2631899 4058277 4423535 3459102 503709
5465E03709l908990j937539J216729J537887j443190l293374q12336L156786L707162
$$ 503709 -3405281 -5342820 -4126091 -2588204 -4031394 -7324768 -8137104 -4980318 -1273156
5456a273156P87798j254530l03528J092674M58064r59486r55353M1674M93337
$$ -1273156 -485358 -1739888 -2043416 -950742 -492678 -1452164 -2407517 -2365843 -1872506
5447a872506P34033J645483J838268n85937l975025m187509k75942L777003M223662
$$ -1872506 -1138473 507010 2345278 1759341 -2215684 -6403193 -6679135 -2902132 1321530
5438A321530K065569O91298R00933O38355j160509k867952k620198p88736Q06883
$$ 1321530 3387099 4078397 4979330 5617685 4457176 1589224 -1030974 -1819710 -1012827
5429a012827J237293J112897J178121J102837J07368j545063k467318j875964
$$ -1012827 224466 1337363 2515484 3618321 3725689 2180626 -286692 -2162656
5421b162656o89344j77586j66087K43355O71883l6557j316346j131282M58314
$$ -2162656 -2852000 -3029586 -3195673 -2952318 -2280435 -2316992 -3633338 -4764620 -4306306
5412d306306M31460k581387m970102k475930L289603O284873M054129O16188K13297
$$ -4306306 -3874846 -6456233 -11426335 -13902265 -10612662 -4327789 -273660 342528 555825
5403E55825J728622J689204k6662q13240m3959L66785m35356j293228j725743
$$ 555825 2284447 3973651 3946989 3133749 3089790 3456575 3021219 1727991 2248
5394B248k596170l614031k940546k37870K237879K692392J932627J461648J470163
$$ 2248 -2593922 -6207953 -9148499 -9386369 -7148490 -4456098 -2523471 -1061823 408340
5385D08340J780438K645540L330892K105994q03365k510855j581821n26151j825210
$$ 408340 2188778 4834318 8165210 10271204 9467839 6956984 5375163 4849012 3023802
5376C023802l735336l072392l42617J369101J342220J388558J909631J600132
$$ 3023802 -711534 -3783926 -4126543 -2757442 -1415222 -26664 1882967 3483099
5368C483099P37787R29757J581873N40154j466232j226661J283250K051193n11903
$$ 3483099 4220886 5150643 6732516 7272670 5806438 4579777 5863027 7914220 7402317
5359G402317k565348q03784K362482K723233L06835j832608k385011j939240m22831
$$ 7402317 4836969 4033185 6395667 9118900 9425735 7593127 5208116 3268876 2846045
5350B846045K086707L477267J903704j087454k680684k789402k907587k439898
$$ 2846045 4932752 8410019 10313723 9226269 6545585 3756183 848596 -1591302
5342a591302Q5737L054715L120313M64949j197593l30900N01852n58073j565814
$$ -1591302 -1505565 1549150 4669463 5134412 3936819 3605919 4107771 3549698 1983884
5333A983884l06463K005435K847546K131030J442694Q77440r65607m148118o428331
$$ 1983884 1677421 3682856 6530402 8661432 10104126 10981566 10015959 5867841 -560490
5324e60490n613990k132373J159289J758724Q4574j155760m12902P84416K86490
$$ -560490 -6174480 -8306853 -7147564 -5388840 -5304266 -6460026 -6872928 -6088512 -5802022
5315e802022j254627j170545J305676L840172M119172K571709J239120J108910
$$ -5802022 -7056649 -8227194 -6921518 -3081346 1037826 3609535 4848655 5957565
5307E957565J467965J265481L63387m44807m32609L2452k38977j700649l282735
$$ 5957565 7425530 8691011 9054398 8609591 8176982 8209434 7970457 6269808 2987073
5298B987073l640324k706161j492558q26435o89662l13505J138127L122360L263752
$$ 2987073 -653251 -3359412 -4851970 -5678405 -6368067 -6681572 -5543445 -2421085 842667
5289H42667J06639l792789m181897j053792J031370o9231p12328K147941N177548
$$ 842667 949306 -2843483 -7025380 -8079172 -7047802 -7117033 -7829361 -5681420 -503872
5280e03872L696052n23683j954771m4188O97686j201257k068394R8427K297128
$$ -503872 3192180 2668497 713726 669538 1367224 165967 -1902427 -1804000 493128
5271D93128J805658R5869o51245q90312j378525j087409L62946J334668J102395
$$ 493128 2298786 2394655 1743410 853098 -525427 -1612836 -1249890 84778 1187173
5262A187173R95559J026245r25089m531571n594023k038725K209573K615130K20033
$$ 1187173 2182732 3208977 2283888 -2247683 -7841706 -9880431 -7670858 -5055728 -4835695
5253d835695r55703P4511J443537K185413K135849L00225k848873l549053M61771
$$ -4835695 -5791398 -5716887 -4273350 -2087937 47912 348137 -2500736 -6049789 -5588018
5244e588018M956543L791924k277435o202456m231489k44660O38945j357858k603172
$$ -5588018 -631475 3160449 883014 -5319442 -9550931 -9795591 -9156646 -10514504 -13117676
5235a3117676j523141M85460J980554K970770L948505M894752N282552M540835
$$ -13117676 -14640817 -14155357 -12174803 -9204033 -5255528 -360776 4921776 9462611
5227I462611K655278M38284j113052j736847j878869j908932j793261j496094
$$ 9462611 12117889 12556173 11443121 9706274 7827405 5918473 4125212 2629118
5219B629118j356075j822665k577722k096833Q31508M614359N459901K023831
$$ 2629118 1273043 -549622 -3127344 -5224177 -4392669 221690 5681591 7705422
5211G705422k108426k961395j669151k020946l705730k756085J194857L488915
$$ 7705422 5596996 2635601 966450 -1054496 -4760226 -7516311 -6321454 -2832539
5203b832539J862232M9044J207400K620810Q22586k124026k135375J50059R88651
$$ -2832539 -970307 -921263 286137 2906947 3729533 1605507 -529868 -379809 608842
5194F08842k34473j068365p94101p55565r52088l21039M41683m4769r52977q14376
$$ 608842 374369 -693996 -1488097 -2243662 -3195750 -3516789 -3075106 -3119875 -4072852 -4887228
5184d887228o02324j670498k269764k38046K381889K002479m60281j073445N46528
$$ -4887228 -5489552 -7160050 -9429814 -9667860 -7285971 -5283492 -5743773 -6817218 -6270690
5175f270690J385693J093415K115758L739696K224107j964424l203623O53873
$$ -6270690 -4884997 -3791582 -1675824 2063872 4287979 2323555 -880068 -226195
5167b26195M229217K421051k349796m432225k856925r60277o07091o95572j43281
$$ -226195 4003022 6424073 4074277 -357948 -3214873 -4175150 -4782241 -5477813 -5621094
5158e621094P88900J622804K049881J699828P75746J19638j42578q51075k101460
$$ -5621094 -4832194 -3209390 -1159509 540319 1316065 1435703 1293125 442050 -1659410
5149a659410k731804k111030r24611K71785J607069K638549K399848J128628J16204
$$ -1659410 -4391214 -6502244 -7426855 -7155070 -5548001 -2909452 -509604 619024 735228
5140G35228m38219j466197k777309k956035j741223l55443N85937J249080J009290
$$ 735228 297009 -1169188 -3946497 -6902532 -8643755 -8999198 -8413261 -7164181 -6154891
5131f154891n19651j336792N91091L038557J738105k722133m801188j991736J775748
$$ -6154891 -6674542 -8011334 -7420243 -4381686 -2643581 -5365714 -10166902 -12158638 -10382890
5122a0382890K622715J889635J983499J556402j157085l626415k280449J505834
$$ -10382890 -7760175 -5870540 -3887041 -2330639 -3487724 -7114139 -9394588 -7888754
5114g888754K999129P10900k265974l076317k080920r38662k37380L75071J096323
$$ -7888754 -4889625 -4178725 -6444699 -9521016 -11601936 -12540598 -12777978 -12402907 -11306584
5105a1306584J487854Q15523p96191j778216q99475O08820N63185o96476p74913
$$ -11306584 -9818730 -9003207 -9799398 -11577614 -12477089 -11868269 -11305084 -12001560 -12776473
5096a2776473P56122J737810J309228J160455J961263J938864M14723o28498k33158
$$ -12776473 -12020351 -10282541 -8973313 -7812858 -5851595 -3912731 -3498008 -4126506 -4359664
5087d359664l39086j943243k749905j069904J086939J439486R90661J432154J874994
$$ -4359664 -4698750 -6641993 -9391898 -10461802 -9374863 -7935377 -6944716 -5512562 -3637568
5078c637568J057630Q4633L5368m15934j959972k137416O73207L525124L015690
$$ -3637568 -2579938 -2495305 -2459937 -2875871 -4835843 -6973259 -6300052 -2774928 240762
5069B40762O48859j2980P07178l656j917522k418157j563082j744177k811196
$$ 240762 889621 876641 1583819 1580163 -337359 -2755516 -4318598 -6062775 -8873971
5060h873971k093452O88586K717713K656016K183267K449086K417028J432868
$$ -8873971 -10967423 -10278837 -7561124 -4905108 -2721841 -272755 2144273 3577141
5052C577141M11478k40223j196104k144428j749033k96038J12590j159658k017534
$$ 3577141 3988619 3748396 2552292 407864 -1341169 -1637207 -1524617 -2684275 -4701809
5043d701809p03959J565943K203154N23865j478845j457852M41552J451104l02852
$$ -4701809 -5405768 -3839825 -1636671 -1112806 -2591651 -4049503 -3607951 -2156847 -2459699
5034b459699k660884j854241J847363L859390J778578j107737j005352Q04181
$$ -2459699 -5120583 -6974824 -5127461 -1268071 510507 -597230 -1602582 -798401
5026g98401P23344j315524k495941j941120j105057l80856J019285K341859J900364
$$ -798401 -75057 -1390581 -3886522 -5827642 -6932699 -7313555 -6294270 -3952411 -2052047
5017b052047L11094P1488J715229K961392K035369j98126j759599j790356j086176
$$ -2052047 -1740953 -1669465 45764 3007156 5042525 4844399 3084800 1294444 208268
5008B08268j057442j798862j329344J645950M461868K992371k078739n316682
$$ 208268 -849174 -2648036 -3977380 -2331430 2130438 5122809 3044070 -2272612
5000b272612m192328k252180k371747j847781J915540N450477M178365q0334k042192
$$ -2272612 -6464940 -8717120 -11088867 -12936648 -11021108 -5570631 -1392266 -1472600 -3514792
4991c514792q76653J99173J16807K92427L88096r44335k306525j478775J70964
$$ -3514792 -4391445 -4192272 -4075465 -3783038 -3394942 -4339277 -6645802 -8124577 -7953613
4982g953613l8825r85562R7262K028249J702748J83442Q54596K614677J235578
$$ -7953613 -7992438 -8978000 -8880738 -6852489 -5149741 -4966299 -4111703 -1497026 -261448
4973b61448k823527m251169j041403K793172L475447J580721p10731k104475j609699
$$ -261448 -3084975 -7336144 -8377547 -5584375 -2108928 -528207 -1238938 -3343413 -4953112
4964d953112O15462K044210R31833n70800k03193m9500k352284l914017j075209
$$ -4953112 -4337650 -2293440 -1361607 -1932407 -2135600 -2185100 -4537384 -8451401 -9526610
4955i526610K466765N08790m881763n901933j420540J970445J317712O81453K097808
$$ -9526610 -7059845 -6551055 -11432818 -17334751 -18755291 -16784846 -15467134 -14785681 -12687873
4946a2687873K067056p58836k428125q34639J035160J222634J510976K294559
$$ -12687873 -10620817 -11379653 -13807778 -14642417 -13607257 -12384623 -10873647 -8579088
4938h579088J450141k51092N06435K730138J919802j396615j875930R37808J756263
$$ -8579088 -7128947 -7380039 -6873604 -4143466 -2223664 -3620279 -5496209 -4558401 -2802138
4929b802138l67081m28311K260769K157397j538735k318449J643359L316393p87871
$$ -2802138 -3169219 -3597530 -1336761 820636 -718099 -3036548 -1393189 1923204 1135333
4920A135333m197532j942666J154662j67050k692935j633682J215313K248760
$$ 1135333 -3062199 -5004865 -3850203 -4017253 -6710188 -8343870 -7128557 -4879797
4912d879797K096756J880421K43111j997578j633643k87453l055954p690228n884466
$$ -4879797 -2783041 -902620 -659509 -2657087 -4290730 -4578183 -7634137 -15324365 -21208831
4903b1208831J855340N001872M02089k719608N8024J005510l626184n696413j197306
$$ -21208831 -19353491 -14351619 -13949530 -16669138 -16611114 -15605604 -19231788 -24928201 -26125507
4894b6125507J636876j098154q71849N241548O219712k193533p328582k558634
$$ -26125507 -24488631 -25586785 -26458634 -21217086 -14997374 -17190907 -24519489 -27078123
4886b7078123L2329n956184p087641K498920M791786r477309j8989785r029372
$$ -27078123 -27045794 -33001978 -40089619 -37590699 -32798913 -42276222 -61266007 -70295379
4878g0295379j251211j3412555k1959679r083904j2816120o6031696j09444572
$$ -70295379 -71546590 -84959145 -106918824 -116002728 -128818848 -194850544 -304295116
4871c04295116m9616527R3145150J81447145J34238065K7577583k1734437m961721
$$ -304295116 -353911643 -260766493 -79319348 54918717 82496300 60761863 55800142
4864E5800142P616709r039658j8040856l680782N106271n601560j2611868k784076
$$ 55800142 63416851 54377193 36336337 32655555 37761826 32160266 19548398 16764322
4856A6764322N502931Q8008m969453J36585L600667k019744m951643J973956P311298
$$ 16764322 22267253 22355261 17385808 17522393 21123060 19103316 14151673 16125629 23436927
4847B3436927K873758k157643k02095J540055k438506m740873p60791J542434
$$ 23436927 26310685 24153042 23950947 25491002 23052496 18311623 17550832 19093266
4839A9093266k339312l964061J491121M887073j63805n217131k690530N36341
$$ 19093266 16753954 12789893 14281014 19168087 19004282 13787151 11096621 11632962
4831A1632962k888764o314884j614714N062900L659743k678367m112093m96504
$$ 11632962 8744198 2429314 814600 5877500 9537243 6858876 2746783 2250279
4823B250279J387231J084791K782970M874750K661770j702671k300665j2194n92353
$$ 2250279 3637510 4722301 7505271 12380021 15041791 13339120 11038455 11026261 10433908
4814A0433908m150854n292473k517958L10696J084753J233442J130339k12266
$$ 10433908 6283054 990581 -1527377 -1216681 -131928 1101514 2231853 2019587
4806B019587j455998k52127K340632L242480K232000J438826J258606N98414k23517
$$ 2019587 563589 311462 2652094 5894574 8126574 9565400 10824006 11422420 11198903
4797A1198903l99949r06716k592118l834068l196682k214166k364733j823585
$$ 11198903 10798954 9892238 7300120 3466052 269370 -1944796 -4309529 -6133114
4789f133114J191592M318940M221753J797292L32712K44366m70210j917115k184254
$$ -6133114 -4941522 -622582 3599171 5396463 5729175 5973541 5503331 3586216 1401962
4780A401962p98869O51670Q37933k37122j428185o59354K938628O244835M791317
$$ 1401962 603093 1254763 2092696 1855574 427389 -231965 2706663 8951498 13742815
4771A3742815m93720l318946q54885K171282J148466j708925k435179k145643
$$ 13742815 13249095 9930149 9075264 11246546 12395012 10686087 8250908 6105265
4763F105265l485725m548060k496193J52203n33186k323329j74981M683663O294931
$$ 6105265 2619540 -1928520 -4424713 -4272510 -4805696 -7129025 -7304006 -2620343 3674588
4754C674588L740498J979799K753824K037466j921395m822940l270259P3376J376963
$$ 3674588 7415086 9394885 12148709 14186175 12264780 7441840 4171581 4244957 5621920
4745E621920J111636J382920J570705J02769k055582k781629j902453o57216L24933
$$ 5621920 6733556 8116476 9687181 9789950 7734368 4952739 3050286 2393070 2718003
4736B718003P70007K27366o45432q9006J947373K911991J229034j140611j689091
$$ 2718003 3488010 3715376 3069944 2980938 4928311 7840302 9069336 7928725 6239634
4727F239634j187400k088697m191792m540513j556966K845739N664980N747369
$$ 6239634 5052234 2963537 -1228255 -5768768 -7325734 -4479995 1184985 6932354
4719F932354L815180J004768j521865k421585j291048m3749j460945n262613p049346
$$ 6932354 10747534 11752302 10230437 7808852 6517804 6474055 5013110 -249503 -7298849
4710g298849l293575L239914N856279K199101k731122l287371j29757K058796
$$ -7298849 -10592424 -7352510 -1496231 702870 -2028252 -5315623 -5445380 -3386584
4702c386584J593999R53530J750244K269013P35135j687347k492625r18322J573032
$$ -3386584 -1792585 -839055 911189 3180202 3915337 2227990 -264635 -1182957 390075
4693C90075L016900K577912J006087l46391j115407j914792k497684j470714J057160
$$ 390075 3406975 5984887 6990974 6644583 5529176 3614384 1116700 -354014 703146
4684G03146K326625M24389k546265l250973j809413p35122k54185J517691L905434
$$ 703146 3029771 3454160 907895 -2343078 -4152491 -4887613 -5141798 -3624107 281327
4675B81327L462108m20318l552248k631596L33059J783305J991236L427391N589541
$$ 281327 3743435 3323117 -229131 -2860727 -2527668 -744363 1246873 4674264 10263805
4666A0263805N156162R94110l914963n950975m363370j142527J040146P42114
$$ 10263805 15419967 16414077 12499114 6548139 2184769 1042242 2082388 2824502
4658B824502r74440j298195R17566K951566J366702k857031m874873k278930J737374
$$ 2824502 1850062 551867 1469433 4420999 5787701 2930670 -1944203 -4223133 -2485759
4649b485759K982902J677205Q87217J339550J071130l22425o99759N91267J011941
$$ -2485759 497143 2174348 3061565 4401115 5472245 5149820 4450061 5041328 6053269
4640F053269r25430k409056j78496M034831N240670J896949k241588l275706j350934
$$ 6053269 5127839 2718783 2540287 6575118 11815788 13712737 11471149 8195443 6844509
4631F844509J053086K361577K099433J00056k721512m380445m149308l424485
$$ 6844509 7897595 10259172 12358605 12458661 9737149 5356704 1207396 -2217089
4623b217089k951146j176251K588198N352838L861657l28681k619414j848573
$$ -2217089 -5168235 -6344486 -3756288 1596550 5458207 5129526 2510112 661539
4615F61539j257484k433534k355584J289551N165708M332399l59361k932412m42786
$$ 661539 -595945 -3029479 -5385063 -4095512 1070196 5402595 5043234 2110822 1668036
4606A668036L164980K835130q09216l026602j715646N14050Q86344N9149L3789
$$ 1668036 4833016 7668146 6858930 3832328 2116682 2630732 3517076 3576225 3610014
4597C610014Q02811J044660P36554Q79384J341502J135995N21315O53416J180867
$$ 3610014 4412825 5457485 6194039 7073423 8414925 9550920 10072235 10725651 11906518
4588A1906518M84239j354182k229009j437302r70659k078450k953801j829124
$$ 11906518 12390757 11036575 8807566 7370264 6399605 4321155 1367354 -461770
4580d61770k99070r32556k944963l147433o29229K243954L405243L103611K126007
$$ -461770 -760840 -1693396 -4638359 -7785792 -8415021 -6171067 -2765824 337787 2463794
4571B463794N23184j130549j404872j08663R60465N64306j13226N10591J766956
$$ 2463794 2986978 1856429 451557 342894 1303359 1867665 1754439 2265030 4031986
4562D031986J798802N87723P3655J180070K305425J483058r68497k906518k978161
$$ 4031986 5830788 6418511 6492166 7672236 9977661 11460719 10492222 7585704 4607543
4553D607543j764527m53368M75176Q86293M95178l58724m47438M72283L73657
$$ 4607543 2843016 2389648 2864824 3751117 4246295 3887571 3440133 3912416 4286073
4544D286073k417620n626671m702614J073348O561697O511828J578160l255389
$$ 4286073 1868453 -3758218 -8460832 -7387484 -825787 5686041 7264201 4008812
4536D008812m736199l551828j564420L79022J838342K319721K141655K331458
$$ 4008812 -727387 -4279215 -5843635 -5464613 -3626271 -1306550 835105 3166563
4528C166563L073618L185568J468442j923711n247418n953314k777262J999486
$$ 3166563 6240181 9425749 10894191 8970480 3723062 -2230252 -5007514 -3008028
4520c008028L803528R73541k665282k668596M3104J268316M56192J030783L511428
$$ -3008028 795500 1769041 -896241 -3564837 -3521733 -2253417 -1797225 -766442 2744986
4511B744986L513318r95852n012204l147809K124820L784207L06176k763520j354792
$$ 2744986 6258304 5262452 250248 -2897561 -772741 3011466 3317642 554122 -800670
4502h00670J944189K876255J597769R38798J317139P80924j071593k339089j878541
$$ -800670 1143519 4019774 5617543 6556341 7873480 8654404 7582811 5243722 3365181
4493C365181o84007J20330O71996J125073O69494j205390l500321m651145m010632
$$ 3365181 2681174 2801504 3473500 4598573 5268067 4062677 562356 -4088789 -8099421
4484h099421j851450J170511L777051M268372K236542l46383r55078O49077K305751
$$ -8099421 -9950871 -8780360 -5003309 -734937 1501605 1155222 200144 849221 3154972
4475C154972K060137L0961k152562k868763j612642M33400J079287n31756k398109
$$ 3154972 5215109 5246070 3093508 224745 -1387897 -954497 124790 -406966 -2805075
4466b805075j820038Q73894K398033Q41238j697811j897861N71619K962313K885709
$$ -2805075 -4625113 -3751219 -1353186 -511948 -2209759 -4107620 -3536001 -573688 2312021
4457B312021O02735j785997k404181r50748J250027K442437J934683L66990j246512
$$ 2312021 2914756 1128759 -1275422 -2226170 -976143 1466294 3400977 3767967 2521455
4448B521455k092715j472563N94545K553943K556363R54848K0803N49378O16994
$$ 2521455 428740 -1043823 -449278 2104665 4661028 5615876 5636679 6186057 6803051
4439F803051j115367k874107k545900j347372j992785l958443l610210N56164
$$ 6803051 5687684 2813577 267677 -1079695 -3072480 -7030923 -10641133 -10084969
4431a0084969N373997O825457M617864J643457R9049l73128j151085k552176l556013
$$ -10084969 -4710972 2114485 6732349 8375806 8474855 8101727 6950642 4398466 842453
4422H42453l059336j125160R45201J749470J017821k69771r34750p17159l33071
$$ 842453 -2216883 -3342043 -2396842 -647372 370449 100678 -834072 -1551231 -1884302
4413a884302m24197o79261m09206J95722L31186K59948J300852L329650L960766
$$ -1884302 -2308499 -2987760 -3396966 -3201244 -2870058 -2610110 -1309258 2020392 5981158
4404E981158J834643q67467j498028j078532k241809m101432l190167N78227L211713
$$ 5981158 7815801 6948334 5450306 4371774 2129965 -1971467 -5161634 -4583407 -1371694
4395a371694K651280J132802K68057j566553m726522n817385k891235R18066K380325
$$ -1371694 1279586 2412388 2680445 1113892 -3612630 -9430015 -12321250 -11403184 -9022859
4386i022859K808619L931762L463581k29049k985473m78665M002920M006365n8140
$$ -9022859 -6214240 -2282478 1181103 952054 -2033419 -2512084 1490836 5497201 5439061
4377E439061k338482j413564j126423k164227r65585K193551K193004j740455
$$ 5439061 3100579 1687015 560592 -1603635 -2569220 -375669 1817335 76880
4369G6880l570445l20679K832017J391300j228857l33433K058250J697061j30247
$$ 76880 -3493565 -3814244 -982227 409073 -819784 -1153217 905033 2602094 2471847
4360B471847M15341K489881K557468J042401R11047J490253k34551l232099l313441
$$ 2471847 2887188 5377069 7934537 8976938 9887985 11378238 11143687 7911588 4598147
4351D598147k88813J284695p95306l371932l284280j615845q94374j274508j406901
$$ 4598147 4309334 5594029 4798723 1426791 -1857489 -3473334 -4367708 -5642216 -7049117
4342g049117q95225k28818L49172P99488J018743J127518J341380J537982J494897
$$ -7049117 -7944342 -8173160 -7823988 -7024500 -6005757 -4878239 -3536859 -1998877 -503980
4333e03980J103746j8593j945444k968335p50175L793698O112618L570787q06802
$$ -503980 599766 581173 -1364271 -4332606 -5082781 -1289083 4823535 8394322 7587520
4324G587520k599986j809796j395503k058954k171949j434950p62213L39023K331500
$$ 7587520 4987534 3177738 1782235 -276719 -2448668 -3883618 -4645831 -4306808 -1975308
4315a975308K750941o82890m785036l971018J194607M038575J640530q91110J390031
$$ -1975308 775633 92743 -4692293 -8663311 -7468704 -3430129 -1789599 -2680709 -1290678
4306a290678N739082O205894K084427k298219l976435l582181k510096j396218
$$ -1290678 4448404 10654298 12738725 10440506 6464071 2881890 371794 -1024424
4298a024424r21234j358201j518923j55614J957144K931833K143658L45623j616239
$$ -1024424 -1945658 -3303859 -4822782 -4978396 -3021252 -89419 2054239 2399862 783623
4289G83623k781017k004893L44586J786961P03404j194164j352532j38489K63054
$$ 783623 -1997394 -4002287 -3657701 -1870740 -1167336 -2361500 -3714032 -3852521 -3589467
4280c589467l45891l43755K74997k32621j876982k355996p61750Q07686N32957
$$ -3589467 -3935358 -4279113 -4004116 -4236737 -6113719 -8469715 -9231465 -8423779 -7890822
4271g890822n12256m45770O36023J487153J766569J745824J279306M97526L01795
$$ -7890822 -8403078 -8848848 -8212825 -6725672 -4959103 -3213279 -1933973 -1436447 -1134652
4262a134652Q20256P35482l61004n46633J445043L300855J943090j606310l298994
$$ -1134652 -314396 421086 60082 -486551 958492 4259347 6202437 4596127 1297133
4253A297133j852377k25900p12901j780586j275897O0622N07825O03425J694922
$$ 1297133 -555244 -781144 -1494045 -3274631 -4550528 -4489906 -3982081 -3378656 -1683734
4244a683734K559796N95474l663159n988412l516760J328495L451964J011247
$$ -1683734 876062 1471536 -2191623 -8180035 -11696795 -10368300 -6916336 -5905089
4236e905089k654961l272746o30564J911412K354596K240311L048600L028818
$$ -5905089 -8560050 -11832796 -12463360 -10551948 -8197352 -5957041 -2908441 120377
4228A20377K76978k833022k153472J772989L919371K038765m29809j38016J548882
$$ 120377 397355 -2435667 -4589139 -2816150 1103221 3141986 2712177 2574161 4123043
4219D123043J929039J268242R30741L60140j119959k237319k248318k650689l810439
$$ 4123043 6052082 7320324 8251065 8611205 7491246 5253927 3005609 354920 -3455519
4210c455519l232122j65226J852200O15299o55477R42366K518301P54419j687661
$$ -3455519 -6687641 -6852867 -5000667 -4385368 -5040845 -4098479 -1580178 -825759 -2513420
4201b513420j129396J44431j270523k531964o996K327575p00230m753814k541396
$$ -2513420 -3642816 -3498385 -4768908 -7300872 -7307868 -4980293 -5680523 -10434337 -12975733
4192a2975733K521357J653293l199416k948429R14108j135627o807502m416880
$$ -12975733 -10454376 -8801083 -12000499 -14948928 -14034820 -15170447 -21977949 -26394829
4184b6394829K408717m262823k2697602k3598372P157875L9869044L8398896J0095604
$$ -26394829 -23986112 -28248935 -50946537 -74544909 -67387034 -27517990 10880906 20976510
4176B0976510q311343l884251L098090j090829n337206o2996N132655J097495
$$ 20976510 12665167 8780916 11879006 10788177 5450971 5387975 10520630 11618125
4168A1618125m328785j869362L000690J722398k233321j772725O74090l26327
$$ 11618125 7289340 5419978 8420668 10143066 7909745 6137020 6811110 6484783
4160F484783k076987K63755L574377K396148j221108k200390j325953j716458
$$ 6484783 4407796 4671551 8245928 10642076 9420968 7220578 5894625 4178167
4152D178167j818783L97247J574330j050780l012235K25698M470138L328378r67717
$$ 4178167 2359384 2756631 4330961 3280181 267946 493644 4963782 8292160 7324443
4143G324443j742850R13130J721244q054o72297j72045j199173k514674r14596
$$ 7324443 5581593 6494723 8215967 8207913 7535616 7363571 6164398 3649724 2735128
4134B735128J497714k7913l806966l287289K212998N890105L583147j100977l230689
$$ 2735128 4232842 4204929 397963 -2889326 -676328 5213777 8796924 7695947 4465258
4125D465258k469495r81819p3221l03561j339775j177745J280207L413302K271054
$$ 4465258 1995763 1013944 940723 637162 -702613 -1880358 -600151 2813151 5084205
4116E084205l25031m02221J540425J543795p77617j601593M41849K089272Q72188
$$ 5084205 4759174 4356953 5897378 7441173 6663556 5061963 5503812 7593084 8465272
4107H465272j607842k883295k503639r88395R47031J813445Q37008k70399K38094
$$ 8465272 6857430 3974135 1470496 482101 1429132 3242577 4079585 3809186 4047280
4098D047280J081125N31290K01465K056905L621850J471235j996032j441623K405545
$$ 4047280 5128405 5659695 5861160 7918065 11539915 13011150 11015118 9573495 11979040
4089A1979040L267739p82657m613146m494378k796212k186134j376967M17349
$$ 11979040 15246779 14464122 9850976 5356598 2560386 374252 -1002715 -585366
4081e85366M79082k234683l663466n50227L875630M292080P60844k030148j312027
$$ -585366 -106284 -2340967 -6004433 -6554660 -2679030 1613050 2373894 343746 -968281
4072i68281J222336K508434J435795m80379p61742J032136K212271N08936k134450
$$ -968281 254055 2762489 4198284 3717905 2956163 3988299 6200570 6709506 4575056
4063D575056k142055J12638J117183K06894J36516J417955J224534r78509k037751
$$ 4575056 2433001 2545639 3662822 3869716 4006232 5424187 6648721 5670212 3632461
4054C632461j109549j540303m140245m186222R87531O370144O050116J720294
$$ 3632461 2522912 982609 -3157636 -7343858 -6356327 13817 6063933 7784227
4046G784227p18409m7730J89706j368061k209033o93584J763254L267482L131065
$$ 7784227 7065818 7018088 7207794 5839733 3630700 2937116 4700370 7967852 11098917
4037A1098917J304344j346220k839360k318677j419671j474047j189252M77066
$$ 11098917 12403261 11057041 8217681 5899004 4479333 3005286 1816034 2293100
4029B293100J391238m78772k794636j873343J211727J877334r12756l090115j645814
$$ 2293100 3684338 3205566 410930 -1462413 -250686 1626648 713892 -2376223 -4022037
4020d022037J377421K479362J413161M30521N95720P61011k73942j795874j823011
$$ -4022037 -2644616 -165254 1247907 1678428 2274148 3035159 2761217 965343 -857668
4011h57668K11292J989803Q13994k454624l982519k178253J29637K20552m63713
$$ -857668 -646376 1343427 2157421 -297203 -4279722 -6457975 -6328338 -6107786 -6571499
4002f571499O56735K495914K020820m69005j507632K79881K398879K380081P17395
$$ -6571499 -5914764 -3418850 -1398030 -1867035 -3374667 -3094786 -695907 1684174 2401569
3993B401569p26385j019468k28121R69448J234850k40775k169146k337839n50774
$$ 2401569 1675184 655716 427595 1397043 2631893 2391118 221972 -2115867 -2666641
3984b666641J194450J628304J560589J904017K061182J106938o19769j924819
$$ -2666641 -1472191 156113 1716702 3620719 5681901 6788839 6169070 4244251
3976D244251k067750j204930n3650O76032Q49152P39060Q8546j781997m192172
$$ 4244251 2176501 971571 917921 1593953 2443105 3182165 3270711 1488714 -2703458
3967b703458m612792j547857K757435M318350K030074j286231k498535j322736
$$ -2703458 -7316250 -8864107 -6106672 -1788322 241752 -1044479 -3543014 -4865750
3959d865750L88777J147768J024669J135120K341951M086516M629169K966275
$$ -4865750 -4476973 -3329205 -2304536 -1169416 1172535 5259051 9888220 12854495
3951A2854495J87786j718819k010785j421262p99318n00173p39631j474628k008171
$$ 12854495 13042281 11323462 9312677 7891415 7092097 6591924 5852293 4377665 2369494
3942B369494j506341J19129K197056L714766L495548R83317k438717m021985k643037
$$ 2369494 863153 982282 3179338 6894104 10389652 11372969 8934252 4912267 2269230
3933B269230l18702M09927l08515l79923J050208K650787K744354R10260j825802
$$ 2269230 1950528 2360455 2051940 1672017 2722225 5373012 8117366 9027626 7201824
3924G201824l495383k623425j07564J309331M48047p43480l04339P64251N79171
$$ 7201824 3706441 1083016 975452 2284783 2732830 1989350 1685011 2449262 3028433
3915C028433k83311k41591j78542k042059m473018l588019J223149N636979N904366
$$ 3028433 2745122 2503531 2324989 282930 -4190088 -7778107 -6554958 -917979 4986387
3906D986387L266097J160744M28323l74668j483503j520657l17871J86934j329760
$$ 4986387 8252484 9413228 9841551 9466883 7983380 6462723 6144852 6331786 5002026
3897E002026l282905k830969M18915L467145L293505M81182j661908j322899N3406
$$ 5002026 1719121 -1111848 -692933 2774212 6067717 6548899 4886991 3564092 3617498
3888C617498M65919j05534q67839k012023l596898m132215k463222j34046L87603
$$ 3617498 4083417 3977883 3110044 1098021 -2498877 -6631092 -9094314 -9228360 -8840757
3879h840757o72996p40297J356347L963588M919553L594975P52990k018266k945301
$$ -8840757 -9513753 -10254050 -8897703 -4934115 -14562 3580413 4333403 2315137 -630164
3870f30164j694252o2076L07914J02463O22582J173208N36228j92899O41585J524447
$$ -630164 -2324416 -2386492 -2078578 -1976115 -1353533 -180325 355903 163004 804589 2329036
3860B329036m53413m199413n035721j297491L235424M722723L513584J534425
$$ 2329036 1875623 -2323790 -7359511 -8657002 -5421578 -698855 2814729 4349154
3852D349154q49576l119494l161414m81852J788084J139508l25995O32224K897696
$$ 4349154 3499578 380084 -2781330 -3263182 -1475098 -335590 -661585 -29361 2868335
3843B868335K649928o61271l728490m372505l600352k500821m47768K568373M503451
$$ 2868335 5518263 4856992 1128502 -3244003 -6844355 -9345176 -9792944 -7224571 -2721120
3834b721120L737032J352792m03657p93504n31810R80J051119K158461J842240
$$ -2721120 1015912 2368704 1965047 1171543 639733 640713 1691832 3850293 5692533
3825E692533n87246l358187l565926p32457J955749J244089j991326l931819k920690
$$ 5692533 5105287 1747100 -1818826 -2551283 -595534 648555 -1342771 -5274590 -8195280
3816h195280r79377J56574J546881L951455N028381K573738j188326k033874J94552
$$ -8195280 -9174657 -9018083 -7471202 -3519747 1508634 4082372 2894046 860172 1054724
3807A054724J472818j83209j842049m12386K551510L171727Q11545j250559m15926
$$ 1054724 2527542 2344333 502284 89898 2641408 5813135 6624680 5374121 4958195
3798D958195K055991L011221J236600j538415k896774k160807o61052k54466j713711
$$ 4958195 7014186 10025407 11262007 9723592 6826818 4666011 4004959 3750493 2036782
3789B036782l959072m573334j862377K819967N527501L793641j50202j837566
$$ 2036782 -1922290 -6495624 -8358001 -5538034 -10533 3783108 3632906 1795340
3781A795340j39235J635111O20313j922317l046293k145210o71899M95579J192868
$$ 1795340 1656105 3291216 3911529 1989212 -1057081 -3202291 -3874190 -3378611 -2185743
3772b185743P30240j066906k431563j698995p7822J84626k90488R21306L319072
$$ -2185743 -1455503 -2522409 -4953972 -6652967 -6730789 -6546163 -6836651 -5915345 -2596273
3763b596273L510990P03845j550048p23408R79692O37252p17399n38983N35311
$$ -2596273 914717 1618562 68514 -654894 324798 962050 244651 -294332 240979
3754B40979J94832q25228L64668L534832M851771K293310j698493l965241m201122
$$ 240979 435811 -389417 -24749 3510083 8361854 10655164 8956671 4991430 790308
3745G90308l561116k353539q35451j86217p39568q08186Q27069K520535J857608
$$ 790308 -2770808 -5124347 -5959798 -6146015 -6885583 -7693769 -6866700 -4346165 -2488557
3736b488557o63392k021602n18017K304766L603400K072979j088424l362936l226453
$$ -2488557 -3151949 -5173551 -5691568 -3386802 216598 2289577 1201153 -2161783 -5388236
3727e388236j560156k51493M49079J754596L440344L394662J096959q54387n05502
$$ -5388236 -6948392 -7199885 -6750806 -4996210 -1555866 1838796 2935755 2081368 1575866
3718A575866L82030n93921k349099k230451m57744O97501R64843J666579K140541
$$ 1575866 1957896 1363975 -985124 -3215575 -3673319 -2975818 -2010975 -344396 1796145
3709A796145O25222j616255j369876J050368J767898m25335k237814j586793o58153
$$ 1796145 2421367 805112 -564764 485604 2253502 1828167 -409647 -1996440 -2654593
3700b654593j352515k056524j399944r65079j326423K90740M642407O847212K925408
$$ -2654593 -4007108 -6063632 -7463576 -8428655 -9755078 -9464338 -4821931 2025281 4950689
3691D950689l231034m733277j302720J471172J001695Q6075P63910J359384N55670
$$ 4950689 1719655 -3013622 -4316342 -2845170 -1843475 -1757400 -993490 365894 921564
3682I21564j56480M63516J341314J305730O48511k89642j644121k746480k607178
$$ 921564 765084 1228600 2569914 3875644 4524155 4234513 2590392 -156088 -2763266
3673b763266j689095j015974j24219J553036K357947P84247q96169N47303L530867
$$ -2763266 -4452361 -5468335 -5592554 -4039518 -1681571 -897324 -1793493 -1246190 2284677
3664B284677L314869n98522l550383k797525o99413K32892P27347J627784J858508
$$ 2284677 5599546 5001024 1450641 -1346884 -2046297 -1813405 -1086058 541726 2400234
3655B400234J346916J836270L072049K425153l1390q03430O84050L23461l276813
$$ 2400234 3747150 5583420 8655469 11080622 11049232 10245802 10929852 11253313 7976500
3646G976500n223460k202928J417513N72596k058624q59772L009699L737027O76451
$$ 7976500 2753040 550112 1967625 2540221 481597 -378175 2631524 6368551 7045002
3637G045002j107385L89739J527291n5151j889300j713366j084972j760736k385778
$$ 7045002 5937617 6327356 7854647 7799496 5910196 4196830 3111858 1351122 -1034656
3628a034656j209186P41886J386102M82785q26439j736663j849364r85837J82089
$$ -1034656 -2243842 -1501956 -115854 366931 -459508 -2196171 -4045535 -5031372 -4849283
3619d849283O05261M28196O79132J194939O48722r24178j543221r4193J883709
$$ -4849283 -4244022 -3815826 -3136694 -1941755 -1293033 -2217211 -3760432 -3854625 -1970916
3610a970916K334386J433659R75408J651914K189248J327568j87778m65959O81150
$$ -1970916 363470 1797129 2772537 4424451 6613699 7941267 7753489 7287530 7968680
3601G968680J017359q89815k912461k079979N42817Q58162j964893l828348j963283
$$ 7968680 8986039 8096224 5183763 3103784 3646601 4504763 2539870 -1288478 -3251761
3592c251761P54921N46493j296250r21265J674044K883854J204077j108581j843897
$$ -3251761 -2496840 -1950347 -3246597 -4167862 -2493818 390036 1594113 485532 -1358365
3583a358365j095797J91599J156678P28364r63763j324782J709062N763351O222791
$$ -1358365 -2454162 -2262563 -1105885 -377521 -1341284 -2666066 -957004 4806347 11029138
3574A1029138K378747j698300k816226k155483k187317k802629k140532K39057
$$ 11029138 13407885 11709585 8893359 6737876 4550559 1747930 -392602 -153545
3566a53545K439364K139465q44399l785065l616510p04278J434372R04813l39360
$$ -153545 2285819 4425284 3580885 -204180 -3820690 -4524968 -3090596 -2185783 -2525143
3557b525143m05038n87027k039310k447663J93375L139906K824191J047873J918031
$$ -2525143 -2930181 -3517208 -5556518 -8004181 -7810806 -4670900 -1846709 -798836 1119195
3548A119195M187396K877411j879123m254662j940145M63665o37481k417162j208192
$$ 1119195 5306591 8184002 6304879 2050217 110072 573737 -63744 -2480906 -3689098
3539c689098J549795K668228K503841K945819L137005J141998k049610l548273
$$ -3689098 -2139303 528925 3032766 5978585 9115590 10257588 8207978 4659705
3531D659705k412934j21834J626386J919777Q36911j64767L15425J218168M01372
$$ 4659705 2246771 2124937 3751323 5671100 6508011 6343244 6658669 7876837 8278209
3522H278209j257284n70470K269458K876849n69055m011455l742883j883724k025637
$$ 8278209 7020925 6450455 8719913 11596762 11027707 7016252 3273369 1389645 -635992
3513f35992l039239j731404R60463J348585p97085j985401n22422J516927J826267
$$ -635992 -3675231 -5406635 -4446172 -3097587 -3894672 -5880073 -6402495 -4885568 -3059301
3504c059301L45695j770050l178845k581290j14836J898356J563030P3052j69589
$$ -3059301 -2713606 -4483656 -7662501 -10243791 -10358627 -8460271 -6897241 -6824189 -6993778
3495f993778R01500J571951J460745J539872J648647N88034j341373k077437m00476
$$ -6993778 -6092278 -4520327 -3059582 -1519710 128937 716971 -624402 -2701839 -3102315
3486c102315K559779M468346L657608M46447k697337l307723j876610j204333
$$ -3102315 -542536 3925810 7583418 8029865 5332528 2024805 148195 -1056138
3478a056138k189595k487324n33149J725517K094963J644847K419360L747184
$$ -1056138 -3245733 -5733057 -6266206 -4540689 -2445726 -800879 1618481 5365665
3470E365665L620029K055460M03010j069824k265820j765455P79954K506051Q79517
$$ 5365665 8985694 11041154 11444164 10374340 8108520 6343065 7123019 9629070 10508587
3461A0508587k093283k623097p80377K57129m77081j053018o72928n25942p83346
$$ 10508587 8415304 5792207 5011830 5268959 4791878 3738860 3065932 2539990 1756644
3452A756644l49567L61358j99080j480969j288283L64659J079287L3852r74440
$$ 1756644 1407077 1768435 1569355 88386 -1199897 -835238 244049 277901 -696539
3443f96539p35171J33157J344491L204476M395534K777744r19893l232734k541766
$$ -696539 -1431710 -1298553 45938 3250414 7645948 10423692 9503799 6271065 3729299
3434C729299p57383J17616K00645r0318j033693j930513j320389K33727L76806
$$ 3729299 2971916 3089532 3290177 3199859 2166166 235653 -1084736 -851009 -474203
3425d74203j189939k015268r78049L2687k44488k42446J311371K884404K708636
$$ -474203 -1664142 -3679410 -4657459 -4624772 -4869260 -5111706 -3800335 -915931 1792705
3416A792705J520299Q45379N97487J20295k95333n56461j551791l215383l661029
$$ 1792705 3313004 4158383 4755870 4876165 4580832 4024371 2472580 -742803 -4403832
3407d403832j880660L98631J131452O24419L08839M50901N98737Q02542Q88843
$$ -4403832 -6284492 -5885861 -4754409 -4129990 -3821151 -3370250 -2771513 -1968971 -1080128
3398a080128p2909k102076l367666k319666K52415K320604K731858J584527j11708
$$ -1080128 -1153037 -3255113 -6622779 -8942445 -8690030 -6369426 -3637568 -2053041 -2164749
3389b164749o13856J011187L003382K614511K48758o83593R72425K022888n0286
$$ -2164749 -2778605 -1767418 1235964 3850475 4099233 3415640 4388065 6410953 6360667
3380F360667k866706k721900k64078O10432j514048l914261l651639r96651J286664
$$ 6360667 3493961 772061 507983 1118415 -395633 -4309894 -7961533 -8958184 -7671520
3371g671520R27540j498016k798827n89039L335469M673402K103989j116628j935585
$$ -7671520 -6743980 -8241996 -11040823 -11629862 -8294393 -3620991 -1517002 -2633630 -4569215
3362d569215j221003j026370q21043R51764L518071M812564M596080L967692K876697
$$ -4569215 -5790218 -6816588 -7637631 -6685867 -3167796 1644768 6240848 10208540 13085237
3353A3085237O66387j772246k867473k803415k920548l278783k858454j604562
$$ 13085237 13751624 11979378 9111905 6308490 3387942 109159 -2749295 -4353857
3345d353857l64503N96381J299027J137091K4810n90449K37608J092067M38545
$$ -4353857 -4718360 -4121979 -2822952 -1685861 -1661051 -2251500 -2013892 -921825 -483280
3336d83280o19930k67522P23906N11785j99201N97213K163161J928916J87839
$$ -483280 -1103210 -1370732 -646826 -135041 -334242 262971 2426132 4355048 4542887
3327D542887m7831J683293K093066n46115l430591l448107j514522n36343j235237
$$ 4542887 4495056 6178349 8271415 7725300 4294709 846602 -667920 -1204263 -2439500
3318b439500k194616k449381j951853n98564J359559K711267K587301J733212
$$ -2439500 -4634116 -7083497 -9035350 -9633914 -8274355 -5563088 -2975787 -1242575
3310a242575J285627R99087o5574j645267k353954j536629j10795N56390J57668
$$ -1242575 43052 1042139 976565 -668702 -3022656 -4559285 -4670080 -4113690 -3956022
3301c956022k62187M96369K212811L210999K339561N01689n66028n06833k36589
$$ -3956022 -4218209 -3721840 -1509029 1701970 4041531 4543220 3977192 3470359 3233770
3292C233770j44619J03223K46545l30674j004254m10944J129760J630823N32266
$$ 3233770 3089151 3192374 3438919 3108245 2103991 1693047 2822807 4453630 4985896
3283D985896j77400R78196K569697K409043O53591r28552j694095k235459k427221
$$ 4985896 4808496 5786692 8356389 10765432 11419023 10490471 8796376 6560917 4133696
3274D133696j395061N63390J764641J266173p3342j099848j739235k196203j877943
$$ 4133696 2738635 3302025 5066666 6332839 6259497 5159649 3420414 1224211 -653732
3265f53732l07642J422864J519366n3395j262723p95065K9233o42613k059038
$$ -653732 -961374 461490 1980856 1927461 664738 -130327 -101094 -743707 -2802745
3256b802745j706641Q41803L003383K729491J060517P0215N8943K94411Q78734
$$ -2802745 -4509386 -3667583 -664200 2065291 3125808 3196023 3254966 3549377 4428111
3247D428111J883949J976680K48519j578564j366768k66876j234711m033906m984685
$$ 4428111 6312060 8288740 8537259 6958695 5591927 5325051 4090340 56434 -4928251
3238d928251k335009J182767K375364J458805L70029l21099q63021o98381M42423
$$ -4928251 -7263260 -6080493 -3705129 -2246324 -1876295 -2197394 -3060415 -3758796 -3316373
3229c316373J249970N96363n91898q71215l21671N96499K461255M938631N207767
$$ -3316373 -2066403 -1470040 -2061938 -2933153 -3254824 -2658325 -197070 4741561 9949328
3220I949328J413939l434753m492100j580933R14344P81024O08640K450199L805809
$$ 9949328 11363267 7928514 3436414 1855481 2769825 3550849 4159489 6609688 10415497
3211A0415497J677105k183704l532378j706720q2023r00182k693260l184143k163371
$$ 10415497 12092602 9908898 6376520 4669800 4587777 3687595 994335 -2189808 -4353179
3202d353179n97647J104086K716125L455107K854075J612796O95775K10872j69299
$$ -4353179 -4950826 -3846740 -1130615 2324492 5178567 6791363 7487138 7698010 7528711
3193G528711l90768l12313j49956L0865N63640J228446Q86630r34333k772578
$$ 7528711 7137943 6825630 6675674 6706539 7270179 8498625 9385255 8450922 5678344
3184E678344k761097j062057L79258K86709q39069j872270k157324j504153k32486
$$ 5678344 2917247 1855190 2234448 2521157 1682088 -190182 -2347506 -3851659 -4084145
3175d084145O92280N58045m2154J343O27688P94637J35483q05134j660106k092723
$$ -4084145 -3391865 -2833820 -2875974 -2874631 -2246943 -1452306 -1316823 -2121957 -3782063 -5874786
3165e874786j088471J541482L376878J900095j144180j314201J763719L125730
$$ -5874786 -6963257 -5421775 -2044897 -144802 -1288982 -2603183 -839464 2286266
3157B286266K0270l264017j650324K909450M506716K058910j91151o2123J28693
$$ 2286266 2306536 -957481 -2607805 301645 4808361 6867271 6676120 6613997 6742690
3148F742690j088394j784537r87779r89645k951033m043056j805607J662516K816978
$$ 6742690 5654296 3869759 2881980 1892335 -1058698 -5101754 -6907361 -5244845 -2427867
3139b427867J611648N13118N61818J115410J739567J765932k00351l614232m827022
$$ -2427867 -816219 -303101 258717 1374127 3113694 4879626 4679275 1065043 -3761979
3130c761979j840127J649646R09120k539503k983608O25165L134648J408690j101174
$$ -3761979 -5602106 -3952460 -3043340 -5582843 -8566451 -7941286 -4806638 -3397948 -4499122
3121d499122l65072K075999K434923Q58101K14647P49362J49586j858500k811401
$$ -4499122 -4864194 -2788195 -353272 504829 719476 1468838 1618424 -240076 -3051477
3112c051477j493113M88790J474168J488354Q85107k00155n73299J241514M100059
$$ -3051477 -4544590 -4055800 -2581632 -1093278 -208171 -408326 -981625 259889 4359948
3103D359948M578488J426876k462638l822501k693413r90752L81922J147158M90690
$$ 4359948 8938436 10365312 7902674 4080173 1386760 396008 777930 1925088 2415778
3094B415778j366857k113488l49293J825742J837990P12635R87179J979299J072555
$$ 2415778 1048921 -1064567 -1413860 411882 2249872 2962507 3949686 5928985 7001540
3085G001540j092172j299988K73651k04092l274799m105980m9886M275679L364852
$$ 7001540 5909368 4609380 4883031 4678939 1404140 -2701840 -2751726 1523953 4888805
3076D888805j146992l264618j096760K018376L356334L174264J883261o70371
$$ 4888805 3741813 477195 -619565 1398811 4755145 7929409 9812670 9142299
3068I142299k852704k114785R65954K694133J117951j831051l625678l841706
$$ 9142299 6289595 4174810 5140764 7834897 8952848 7121797 3496119 -345587
3060c45587k955763j221964L35466L13382p08232m65171J466900K740936J770662
$$ -345587 -3301350 -4523314 -4187848 -3874466 -4582698 -5047869 -3580969 -840033 930629
3051I30629o7559q51783o49951n09669p50451j232845j657941j032548J248611
$$ 930629 863070 11287 -638664 -1148333 -1898784 -3131629 -4789570 -5822118 -4573507
3042d573507L458729L044407M48959j330696j459871k169614m038352m288278
$$ -4573507 -1114778 1929629 2378588 1047892 -411979 -2581593 -6619945 -10908223
3034a0908223j643498R63795J101673O22721J672835K455606P91313j268640q98573
$$ -10908223 -12551721 -11587926 -10486253 -9863532 -8190697 -5735091 -4943778 -6212418 -7110991
3025g110991L5597j874954m756091l474162K042158O092171N376212K800272J856103
$$ -7110991 -7075394 -8950348 -13706439 -17180601 -15138443 -9046272 -3670060 -869788 986315
3016I86315J837454P20597r27772j381575n57991N43976J236886Q12582j015344
$$ 986315 2823769 3544366 2616594 1235019 677028 1221004 2457890 3270472 2255128
3007B255128k513325j349755J533987K474119O60959k68445J861982L750587J484707
$$ 2255128 -258197 -1607952 -73965 2400154 3061113 2792668 4654650 8405237 9889944
2998I889944l326940n802341m351356j510608N54955J870316K511310J979554
$$ 9889944 6563004 760663 -3590693 -5101301 -4546346 -2676030 -164720 1814834
2990A814834Q98008O73591J187932J055176K73076K85558J120031Q59336j286991
$$ 1814834 2712842 3386433 4574365 5629541 5902617 6188175 7308206 8167542 6880551
2981F880551l497117l944215l099606k209999r97027J482340M433891N429807
$$ 6880551 3383434 -560781 -3660387 -5870386 -6867413 -5385073 -951182 4478625
2973D478625L169770o19216k549404j018438J838171K352972j60112k250787q74183
$$ 4478625 7648395 7029179 4479775 3461337 5299508 7652480 7492368 5241581 4367398
2964D367398K125970K352508q27030l284786k135487L06322M73578j030935q56123
$$ 4367398 6493368 8845876 8018846 4734060 2598573 2904895 3378473 2347538 1491415
2955A491415J573644L124949J461153k137889m914792n515161m153292j741761
$$ 1491415 3065059 6190008 7651161 5513272 598480 -4916681 -9069973 -10811734
2947a0811734L28018R52733O05384P47431J636990K147248K043244K516939L698843
$$ -10811734 -10483716 -9530983 -8925599 -8178168 -6541178 -4393930 -2350686 166253 3865096
2938C865096L715252J573818r00437j734515j674602k236975k431388k54091L285078
$$ 3865096 7580348 9154166 8253729 6519214 4844612 2607637 176249 -77842 3207236
2929C207236M633572K388604r80586k598511k220126j196829m26920k36506o75903
$$ 3207236 7840808 10229412 9248826 6650315 4430189 3233360 2806440 2569934 1894031
2920A894031j017113k59572J143973J355635l24035k180967k087103J17149K658441
$$ 1894031 876918 617346 1761319 3116954 2792919 611952 -1475151 -1358002 1300439
2911A300439L352711J068875l026571n656194m449489r32041J191607P96588K43530
$$ 1300439 4653150 5722025 2695454 -2960740 -7410229 -8342270 -7150663 -6354075 -6110545
2902f110545J259110K513163K259518R28560k49258j038009j311921n61194M44721
$$ -6110545 -4851435 -2338272 -78754 849806 600548 -437461 -1749382 -2310576 -1865855
2893a865855p1188j574110j046556J997759L609049J307443j328863J88810M158009
$$ -1865855 -1937043 -3511153 -4557709 -2559950 1049099 2356542 1027679 1216489 5374498
2884E374498N309609K731302J57686p13421j848142l654083l446196o01895J271448
$$ 5374498 10684107 13415409 13573095 12859674 11011532 7357449 3911253 3309358 4580806
2875D580806m47146l462243m138298k270308r6872J191324J816468J992010J977917
$$ 4580806 4133660 671417 -3466881 -5737189 -5834061 -4642737 -2826269 -834259 1143658
2866A143658K277799K520952J517289o27658k077398j875679j234355j223790
$$ 1143658 3421457 5942409 7459698 6832040 4754642 2878963 1644608 420818
2858D20818j046367J83184J664819K176788J608188K67128j612608k746268j305927
$$ 420818 -625549 -442365 1222454 3399242 5007430 5274558 3661950 915682 -390245
2849c90245K028666L564527J006481l150361m457292j609956K723143M972286
$$ -390245 1638421 5202948 6209429 3059068 -1398224 -3008180 -285037 4687249
2841D687249L340322j126915m760693m041602L76985L832883L166240L18730j117164
$$ 4687249 8027571 6900656 2139963 -1901639 -1524654 2308229 5474469 5793199 4676035
2832D676035q13112p99665j412994j140817K97142J474070J582655R80531k79914
$$ 4676035 3862923 3063258 1650264 509447 806589 2280659 3863314 4843845 4563931
2823D563931k291118l859933l383575j260546L73023M22686j99274l40625K21959
$$ 4563931 2272813 -1587120 -4970695 -6231241 -5858218 -5435532 -5634806 -5975431 -5753472
2814e753472J370825K854844L735988K942828O57981j671002k641731j679242
$$ -5753472 -4382647 -1527803 2208185 5151013 5808994 4137992 1496261 -182981
2806a82981P34553K717031J970291j400765l991194k811704P97005K866118J815463
$$ -182981 551572 3268603 5238894 3838129 -153065 -2964769 -2167764 698354 2513817
2797B513817l37447j367657j070927p5014J189439J814017P98686j146638j948322
$$ 2513817 2176370 808713 -262214 -337228 852211 2666228 3464914 2318276 369954
2788C69954j016963l6588j32458o8576J471567L328428L297922J303150n78494
$$ 369954 -647009 -683597 -816055 -884631 586936 3915364 7213286 8516436 7937942
2779G937942j072564j136619j991410k956583k428274n98927L67624m67301r32227
$$ 7937942 6865378 5728759 3737349 780766 -1647508 -2246435 -1878811 -2346112 -3278339
2770c278339J171536L977846L261143j416987n181892m047538j71046J512189
$$ -3278339 -2106803 1871043 5132186 3715199 -1466693 -5514231 -5685277 -4173088
2762d173088Q7899r69408N19151K515043K030726q53261l179441k385710R88991
$$ -4173088 -4085189 -5054597 -4535446 -2020403 10323 -842938 -4022379 -6408089 -5419098
2753e419098L611807K895306L37108j78125K202663M061008L050973J243817P32955
$$ -5419098 -1807291 1088015 1425123 1246998 3449661 7510669 10561642 11805459 12538414
2744A2538414n04252m298306o990300m073853J683430L136522o96263l615387
$$ 12538414 12034162 7735856 745556 -3328297 -1644867 1491655 795392 -2819995
2736b819995k337042n96100j166723q90358K480328M722159J736199l001296l411668
$$ -2819995 -5157037 -5753137 -6919860 -7810218 -5329890 -607731 1128468 -1872828 -5284496
2727e284496J00639K369200J860976J428783K066483J716088J8867q74127n10486
$$ -5284496 -5183857 -2814657 -953681 475102 2541585 4257673 4276540 3402413 2891927
2718B891927p45172j826871j977107j225713j602541k926478k449818L28610K366976
$$ 2891927 2146755 319884 -1657223 -2882936 -4485477 -7411955 -9861773 -9533163 -7166187
2709g166187J912118J009406J586543K414713J899964Q67978M18476l22740k028998
$$ -7166187 -5254069 -4244663 -2658120 -243407 1656557 2524535 2943011 2620271 591273
2700E91273l099766k153607o09644m04850q95021m34587N90406R17016J182070
$$ 591273 -2508493 -4662100 -5271744 -5676594 -6571615 -7006202 -6415796 -5498780 -4316710
2691d316710K620898L929024K620774o21373k049875Q981K667309K322816q69318
$$ -4316710 -1695812 2233212 4853986 4232613 2182738 2191719 4859028 7181844 6312526
2682F312526l742475m052748k231098P4859J784270K709734L039164K853659J939716
$$ 6312526 2570051 -1482697 -3713795 -3638936 -1854666 855068 3894232 6747891 8687607
2673H687607Q5621k237091l671462k992549n85319J483562J444245j91178j279486
$$ 8687607 8773228 6536137 2864675 -127874 -713193 770369 2214614 2023436 743950
2664G43950p82341P6573q7338o63939k33574Q79844J006535j12629q77830m63056
$$ 743950 -38391 38182 -49156 -713095 -946669 -66825 939710 827081 -50749 -513805
2654e13805j8036m91399j024385o43697l758p7373m65975n15229p91231j635101
$$ -513805 -531841 -1023240 -2047625 -2691322 -2695080 -2772453 -3238428 -3753657 -4544888 -6179989
2644f179989j490480R76005L843515L716210N00861k179186j795696K98785J698947
$$ -6179989 -7670469 -6694464 -2850949 865261 1366122 -813064 -2608760 -2309975 -611028
2635f11028K119980K301957J829481Q6372j856822k268855r99293Q02646K415633
$$ -611028 1508952 3810909 5640390 5726762 3869940 1601085 601792 1404438 3820071
2626C820071L468152L051022Q54599j376673j614898m80402j89017p14118K32965
$$ 3820071 7288223 10339245 11193844 9817171 8202273 7721871 7532854 6818736 7051701
2617G051701K748417L283782m38977n392148o760628m055152q23122R23940K589366
$$ 7051701 9800118 13083900 12644923 7252775 492147 -3563005 -4386127 -3462187 -872821
2608h72821M929748N566528K575729j615683k570941N81080M064090L997456M41375
$$ -872821 4056927 9623455 12199184 10583501 8012560 8593640 12657730 16655186 17096561
2599A7096561l377581m620787l101057q72164j91037j514106l173063l235410
$$ 17096561 13718980 9098193 5997136 5124972 4933935 3419829 246766 -2988644
2591b988644j652293j15499J54694k31777R4636J496469L067605L680260K854206
$$ -2988644 -4640937 -4756436 -4601742 -4833519 -4738883 -3242414 -174809 3505451 6359657
2582F359657R65923q99879j567794q03087L18503M83851m57215j531218j968480
$$ 6359657 7325580 6425701 4857907 4054820 4373323 4857174 4399959 2868741 900261
2573I00261j925337j754549j177385K43699K024469K840052J985283L85991l20868
$$ 900261 -1025076 -2779625 -3957010 -3713311 -1688842 1151210 3136493 3522484 3201616
2564C201616L37228J185881R79931K0299k96132O24719J723472J512980k54838
$$ 3201616 3538844 4724725 5704656 5724955 5428823 6053542 7777014 9289994 9035156
2555I035156k411055l567938l190631j680342J97022J854877L006535L416168
$$ 9035156 6624101 3056163 -134468 -1814810 -1617788 237089 3243624 6659792
2547F659792K797414J238015m36228j263944j206969j032248r69324l22430J020386
$$ 6659792 9457206 10695221 10258993 8995049 7788080 6755832 5786508 5464078 6484464
2538F484464J635307L21836j743739k202493q32767R4815o77161j418591l15959
$$ 6484464 8119771 8441607 6697868 4495375 3662608 3757423 3080262 1661671 1345712
2529A345712J243694N39936k029935k995705p16557K158623K399657M89397o45862
$$ 1345712 2589406 3129342 1099407 -1896298 -2612855 -454232 1945425 2434822 1788960
2520A788960L3094Q87670P25916L46189N18262N33978j31504m22664M42362R92556
$$ 1788960 1822054 2709724 3435640 3781829 4300091 4834069 4702565 4279901 4722263 5714819
2510E714819n23827k773571k415911R97880L504386J579864l015610n189934k665294
$$ 5714819 5190992 2417421 1510 999390 4503776 6083640 3068030 -2121904 -4787198
2501d787198J741509L946770K925362P14662l97004K67876J749703K256110N39780
$$ -4787198 -3045689 901081 3826443 4541105 4144101 4411977 6161680 8417790 8957570
2492H957570k624104m635769l471701K42727L909665N271178L715092J75605l249966
$$ 8957570 6333466 1697697 -1774004 -1531277 2378388 7649566 11364658 11540263 8290297
2483H290297m166525j800201J732116L085592J091403k007362k997333j026344
$$ 8290297 4123772 2323571 4055687 7141279 8232682 6225320 3227987 2201643
2475B201643J656189K080578l36054l066478l228301j036829M36553o51724k408379
$$ 2201643 3857832 5938410 5602356 2535878 -692423 -1729252 -1292699 -1944423 -4352802
2466d352802j942666N96487K563692K658304K000177J550753Q66851j17807l61758
$$ -4352802 -6295468 -5698981 -3135289 -476985 1523192 3073945 3940796 3822989 3461231
2457C461231K73462K82544r66892j718719l34266K055730K989785J787062j79804
$$ 3461231 3734693 4017237 3050345 1331626 997360 3053090 6042875 7829937 7650133
2448G650133j471464j577584p41771M4764l24461j477106j637795k32286J014275
$$ 7650133 6178669 4601085 3859314 3904078 3579617 2102511 464716 232430 1246705
2439A246705Q15636M45502J319202K132371Q28768j810383l189303k643044j474167
$$ 1246705 2062341 2507843 3827045 5959416 6788184 4977801 1788498 -854546 -2328713
2430b328713j9685K279732M274047L861837J544795P0749J12177m40364k149871
$$ -2328713 -2348398 -68666 4205381 8067218 9612013 9682762 9794939 9354575 7204704
2421G204704k559990n82431J010035k01950k319752k127735k9120R41441k22144
$$ 7204704 4644714 4062283 5072318 4870368 2550616 422881 393761 1335202 1113058
2412A113058j590714j452207q7197J311414J733529O79184j203862k229108j515968
$$ 1113058 -477656 -1929863 -2017060 -705646 1027883 1707067 503205 -1725903 -3241871
2403c241871m2677J016194J760504K254104J434631q67050k397701j291119Q06594
$$ -3241871 -3284548 -2268354 -507850 1746254 3180885 2313835 -83866 -1374985 -568391
2394e68391R66285o23019j299127l73307J69922n73278j077419m21661J59806
$$ -568391 397894 -225125 -1524252 -1897559 -1727637 -2300915 -3378334 -3799995 -3640189
2385c640189j57033j14584J337474L007286L144158J712475j39672j502486j666208
$$ -3640189 -3797222 -3911806 -2574332 432954 3577112 5289587 5149915 3647429 1981221
2376A981221k28819J695768J986255M43659m58641P79628K061521P66331k042917
$$ 1981221 1752402 3448170 5434425 5878084 5419443 6199071 8260592 9026923 6984006
2367F984006l124652j963210j232723k289015l072140j547736J020423J884487
$$ 6984006 3859354 1896144 663421 -1625594 -4697734 -6245470 -5225047 -3340560
2359c340560N40985j032449j218897l89661J71265p3320m72240M2243J645783
$$ -3340560 -2799575 -3832024 -5050921 -5440582 -5269317 -5342637 -5814877 -5772634 -4126851
2350d126851K968484K403744M22213m44451J147881L137573K627534J4412j508445
$$ -4126851 -1158367 1245377 1667590 1223139 2371020 5508593 8136127 8150539 6642094
2341F642094n76426N27621m48375k334335k491597p31481O90370L07909j096013
$$ 6642094 6065668 6593289 6144914 3810579 1318982 587501 1277871 1585780 489767
2332D89767j954397j424561K37111J604122J011202j109846j778142Q05740M064402
$$ 489767 -1464630 -2889191 -2652080 -1047958 -36756 -1146602 -2924744 -2119004 1945398
2323A945398M058677R77778j433625j618986j659464k476977j808542J177251
$$ 1945398 6004075 6981853 5548228 3929242 2269778 -207199 -2015741 -838490
2315h38490L161558J500979j406425k020510j234120j992252l414272k111055
$$ -838490 2323068 3824047 2417622 397112 -837008 -2829260 -6243532 -8354587
2307h354587J474165L000484R08526j345893r55546L72047J22124q91479o14143
$$ -8354587 -6880422 -3879938 -2971412 -4317305 -5272851 -4900804 -4778680 -5670159 -6284302
2298f284302N93844J109092J092385J720572K484782J797711j57558j379260q80926
$$ -6284302 -5690458 -4581366 -3488981 -1768409 716373 2514084 2356526 977266 96340
2289I6340J25647J51160p36556j416383j204221l39610O24698J425048J928670
$$ 96340 221987 373147 -363409 -1779792 -2984013 -3323623 -2698925 -1273877 654793
2280F54793J642504J00464j879092k211384L5441K756533K866861J79695k362877
$$ 654793 2297297 2397761 518669 -1692715 -1657274 1099259 3966120 4145815 1782938
2271A782938k556297j305702m88834j78127P18901K218091L157897K890403J962349
$$ 1782938 -773359 -2079061 -2567895 -2746022 -2027121 190970 3348867 6239270 8201619
2262H201619J277900J246547J547428J363735K23356j191576j686424j205959
$$ 8201619 9479519 10726066 12273494 13637229 13860585 12669009 10982585 9776626
2254I776626j030603j984077l309471l775706l053025j526764L17659J715015
$$ 9776626 8746023 6761946 3452475 -323231 -3376256 -4903020 -4585361 -2870346
2246b870346J758580N22096o51570o84464O6762P39629J182713J455976J035031
$$ -2870346 -1111766 -589670 -1241240 -1925704 -1858942 -1119313 63400 1519376 2554407
$$ [...]
##END NTUPLES=NMR SPECTRUM
##END=
