##TITLE=31Pdec_DE-155oil_d6_TFA
 DMSOd6+CCl4,64 sc
 3.6.2026
##JCAMPDX= 6.0         $$ Bruker NMR JCAMP-DX V2.0
##DATA TYPE= NMR SPECTRUM
##DATA CLASS= NTUPLES
##ORIGIN= UXNMR, Bruker Analytische Messtechnik GmbH
##OWNER= root
$$ XWIN-NMR		Version 3.5
$$ Wed Jun  3 15:10:22 2026 Russian Standard Time (UT+4h)  she@DPX200
##.OBSERVE FREQUENCY= 81.013821
##.OBSERVE NUCLEUS= ^31P
##.ACQUISITION MODE= SIMULTANEOUS
##.ACQUISITION SCHEME= undefined
##.AVERAGES= 64
##.DIGITISER RES= 17
##SPECTROMETER/DATA SYSTEM= spect
##.PULSE SEQUENCE= zgpg30
##.SOLVENT NAME= CDCl3
##.SHIFT REFERENCE= (INTERNAL, CDCl3, 0, 197.392)
##AUDIT TRAIL= $$ (NUMBER, WHEN, WHO, WHERE, WHAT)
$$ ##TITLE= Audit trail, XWIN-NMR		Version 3.5
$$ ##JCAMPDX= 5.01
$$ ##ORIGIN= Bruker BioSpin GmbH
$$ ##OWNER= she
$$ F:/spectra/data/she/nmr/P31/2/pdata/1/auditp.txt
$$ ##AUDIT TRAIL=  $$ (NUMBER, WHEN, WHO, WHERE, WHAT)
(   1,<2026-06-03 15:09:27.81 +0400>,<she>,<DPX200>,
      <continue with go, POWCHK disabled, PULCHK disabled
       configuration hash MD5:
       00 E9 B6 7A A2 85 ED C7 34 08 36 98 17 FE 4E 26
       data hash MD5: 32K
       21 45 D0 98 CF FB 6D EB 0F E3 98 CE 4B 47 78 C8>)
(   2,<2026-06-03 15:09:29.87 +0400>,<she>,<DPX200>,
      <Start of raw data processing
       efp BC_mod = 2 LB = 1.5 FT_mod = 6 PKNL = 1 PHC0 = 1343.506 PHC1 = -221.8995 SI = 64K 
       data hash MD5: 64K
       08 E8 DC 64 5D FD 74 60 FC CF A6 AF C7 C9 43 5F>)
(   3,<2026-06-03 15:09:44.34 +0400>,<she>,<DPX200>,
      <pk PHC0 = 2.865496 PHC1 = 0 
       data hash MD5: 64K
       7D 1A A3 62 3D 01 2E 65 9E BA 4E 8A 5E 8B B4 0E>)
$$ ##END=
$$ 
$$ hash MD5
$$ 75 BB 47 A2 ED 46 08 CA B6 FF E6 AB A3 08 10 37
##$RELAX= 
##$RELAX= 
##$RELAX= 
##$RELAX= 
##$RELAX= 
##$RELAX= 
##$RELAX= 
##$RELAX= 
$$ Bruker specific parameters
$$ --------------------------
##$DU= <F:/spectra>
##$EXPNO= 2
##$NAME= <P31>
##$PROCNO= 1
##$TYPE= <nmr>
##$USER= <she>
##$AMP= (0..31)
100 100 100 100 100 100 100 100 100 100 100 100 100 100 100 100 100 100 
100 100 100 100 100 100 100 100 100 100 100 100 100 100 
##$AQSEQ= 0
##$AQ_mod= 1
##$AUNM= <au_zg>
##$AUTOPOS= <>
##$BF1= 81.014009
##$BF2= 200.13
##$BF3= 200.13
##$BF4= 200.13
##$BF5= 200.13
##$BF6= 200.13
##$BF7= 200.13
##$BF8= 200.13
##$BYTORDA= 1
##$CFDGTYP= 0
##$CFRGTYP= 5
##$CHEMSTR= <none>
##$CNST= (0..31)
1 1 145 1 1 1 1 1 1 1 1 1 1 1 1 1 1 1 1 1 1 1 1 1 1 1 1 1 1 1 1 1 
##$CPDPRG= <waltz16>
##$CPDPRG1= <>
##$CPDPRG2= <waltz16>
##$CPDPRG3= <>
##$CPDPRG4= <mlev>
##$CPDPRG5= <mlev>
##$CPDPRG6= <mlev>
##$CPDPRG7= <mlev>
##$CPDPRG8= <mlev>
##$CPDPRGB= <>
##$CPDPRGT= <>
##$D= (0..31)
0 1 0 0 0 0 0 0 0 0.06 0 0.03 2e-05 3e-06 0 0 0.0002 0 0 0 0 0 0 0 0 0 
0 0 0 0 0 0 
##$DATE= 1780484613
##$DBL= (0..7)
120 120 120 11 120 120 24 19 
##$DBP= (0..7)
150 150 150 150 150 150 150 150 
##$DBP07= 0
##$DBPNAM0= <>
##$DBPNAM1= <>
##$DBPNAM2= <>
##$DBPNAM3= <>
##$DBPNAM4= <>
##$DBPNAM5= <>
##$DBPNAM6= <>
##$DBPNAM7= <>
##$DBPOAL= (0..7)
0.5 0.5 0.5 0.5 0.5 0.5 0.5 0.5 
$$ [...]
##$SUBNAM2= <"">
##$SUBNAM3= <"">
##$SUBNAM4= <"">
##$SUBNAM5= <"">
##$SUBNAM6= <"">
##$SUBNAM7= <"">
##$SUBNAM8= <"">
##$SUBNAM9= <"">
##$SW= 400.765351723535
##$SWIBOX= (0..15)
0 1 3 0 0 0 0 0 0 0 0 0 0 0 0 0 
##$SW_h= 32467.5324675325
##$TD= 32768
##$TD0= 1
##$TE= 0
##$TE2= 300
##$TE3= 300
##$TEG= 300
##$TL= (0..7)
0 120 53 12 22 120 120 120 
##$TP= (0..7)
150 150 150 150 150 150 150 150 
##$TP07= 0
##$TPNAME0= <>
##$TPNAME1= <>
##$TPNAME2= <>
##$TPNAME3= <>
##$TPNAME4= <>
##$TPNAME5= <>
##$TPNAME6= <>
##$TPNAME7= <>
##$TPOAL= (0..7)
0.5 0.5 0.5 0.5 0.5 0.5 0.5 0.5 
##$TPOFFS= (0..7)
0 0 0 0 0 0 0 0 
##$TUNHIN= 0
##$TUNHOUT= 0
##$TUNXOUT= 0
##$USERA1= <user>
##$USERA2= <user>
##$USERA3= <user>
##$USERA4= <user>
##$USERA5= <user>
##$V9= 5
##$VALIST= <valist>
##$VCLIST= <CCCCCCCCCCCCCCC>
##$VD= 0
##$VDLIST= <DDDDDDDDDDDDDDD>
##$VPLIST= <PPPPPPPPPPPPPPP>
##$VTLIST= <TTTTTTTTTTTTTTT>
##$WBST= 1024
##$WBSW= 4
##$XGAIN= (0..3)
0 0 0 0 
##$XL= 0
##$YL= 0
##$YMAX_a= 3421
##$YMIN_a= -3969
##$ZGOPTNS= <>
##$ZL1= 120
##$ZL2= 120
##$ZL3= 120
##$ZL4= 120
##$ABSF1= 0
##$ABSF2= 0
##$ABSG= 0
##$ABSL= 0
##$ALPHA= 0
##$AQORDER= 0
##$ASSFAC= 0
##$ASSFACI= 0
##$ASSFACX= 0
##$ASSWID= 0
##$AUNMP= <proc_1d>
##$AZFE= 0.1
##$AZFW= 0.5
##$BCFW= 0
##$BC_mod= 2
##$BYTORDP= 0
##$COROFFS= 0
##$CY= -3
##$DATMOD= 1
##$DC= 0
##$DFILT= <>
##$DTYPP= 0
##$F1P= 0
##$F2P= 0
##$FCOR= 1
##$FTSIZE= 65536
##$FT_mod= 6
##$GAMMA= 0
##$GB= 0
##$INTBC= 1
##$INTSCL= 9.790993e-09
##$ISEN= 30
##$LB= 1.5
##$LEV0= 0
##$LPBIN= 0
##$MAXI= 10000
##$MC2= 0
##$MEAN= 0
##$ME_mod= 0
##$MI= 50
##$NCOEF= 0
##$NC_proc= -8
##$NLEV= 6
##$NOISF1= 182.463
##$NOISF2= 159.3651
##$NSP= 0
##$NTH_PI= 0
##$NZP= 0
##$OFFSET= 197.3918
##$PC= 4
##$PHC0= 1346.371
##$PHC1= -221.8995
##$PH_mod= 1
##$PKNL= yes
##$PPARMOD= 0
##$PSCAL= 0
##$PSIGN= 0
##$REVERSE= no
##$SF= 81.014063255964
##$SI= 65536
##$SIGF1= 159.3651
##$SIGF2= -187.1042
##$SINO= 113.3802
##$SIOLD= 16384
##$SREGLST= <1H.CDCl3>
##$SSB= 0
##$STSI= 65536
##$STSR= 0
##$SW_p= 32467.5324675325
##$SYMM= 0
##$S_DEV= 0
##$TDeff= 32768
##$TDoff= 0
##$TI= <>
##$TILT= no
##$TM1= 0
##$TM2= 0
##$TOPLEV= 0
##$USERP1= <user>
##$USERP2= <user>
##$USERP3= <user>
##$USERP4= <user>
##$USERP5= <user>
##$WDW= 1
##$XDIM= 65536
##$YMAX_p= 277899566
##$YMIN_p= -188164409
$$ End of Bruker specific parameters
$$ ---------------------------------
##NTUPLES= NMR SPECTRUM
##VAR_NAME=  FREQUENCY,     SPECTRUM/REAL,   SPECTRUM/IMAG
##SYMBOL=    X,             R,               I
##VAR_TYPE=  INDEPENDENT,   DEPENDENT,       DEPENDENT
##VAR_FORM=  AFFN,          ASDF,            ASDF
##VAR_DIM=   65536,         65536,           65536
##UNITS=     HZ,            ARBITRARY UNITS, ARBITRARY UNITS
##FACTOR=    0.49542278885378, 1,            1
##FIRST=     15991.5117654749, 0,            0
##LAST=      -16476.0207020576, 0,           0
##MIN=       -16476.0207020576, -188164409,  0
##MAX=       15991.5117654749, 277899566,    0
$$ Real data points
##PAGE= N=1
##DATA TABLE= (X++(R..R)), XYDATA
$$ [...]
##PAGE= N=2
##DATA TABLE= (X++(I..I)), XYDATA
7485i940583k179675j561760L366K397726M070389L846001K590344J860952J596411
7476B683171O91273p47883j613800j886923k405453k679808j269713J360719K681674
7467c186743J479668o03800j572047j170336M9171J557725K063929L47535k120634
7458c155532k008413J001660K872212P62210k655477l097834p68439O56126k44175
7449f637662j340924q83262M84288J765032K868054L256047J739822j369773l649617
7440c767995l260450j247782k11522j181222k511363j921130O01593K450675J550210
7431i498986p41308j378631r492P35540k24195n71282J142071K442676R89186
7422g114421q49680O86059M344845N113868J620106j879500j650178R61664K430519
$$ plain form
7485 -9940583 -12120258 -13682018 -13678652 -11280926 -7210537 -3364536 -774192 1086760 2683171
7476 2683171 3374444 2626561 1012761 -874162 -3279615 -5959423 -7229136 -5868417 -3186743
7467 -3186743 -1707075 -2310875 -3882922 -5053258 -5004087 -3446362 -1382433 -1034898 -3155532
7458 -3155532 -5163945 -4162285 -1290073 -527863 -3183340 -6281174 -7049613 -6393487 -6637662
7449 -6637662 -7978586 -8861848 -8377560 -6612528 -3744474 -488427 1251395 -118378 -3767995
7440 -3767995 -7028445 -8276227 -8487749 -9668971 -12180334 -14101464 -13499871 -11049196 -9498986
7431 -9498986 -10240294 -11618925 -11628417 -10892877 -11117072 -11688354 -10546283 -8103607 -7114421
7422 -7114421 -7964101 -7278042 -2933197 2180671 3800777 1921277 271099 1232763 3663282
7413C663282J583877l28815j824978j972601p89181M2544j295304l553886k953631
7404g428693J606214N959109N380511N12393l582840l521657o69525J674995K144536
7395B075043J611352R06738k68672j908049k374867j12806L353805M225407J426033
7386H933984j205051P8974L369266L666303J20994l026710k861839j234590p08172
7377G133159q71439p31915j430195l696719n111927l156775N75335K324098J318553
7368c647825Q5322K71150J042362J473832J794659J885190Q59725j111320k310038
7359C43057j623334l0739O22671m79680k601720l936344k701221J043569M545863
7350d817878M611800J224491k057072j959468R27353L155364K605185P08624J15418
$$ plain form
7413 3663282 5247159 4918344 3093366 1120765 331584 374128 -921176 -4475062 -7428693
7404 -7428693 -5822479 136630 5517141 6029534 2446694 -1074963 -1744488 -69493 2075043
7395 2075043 3686395 4593133 4324461 2416412 41545 -71261 3282544 7507951 8933984
7386 8933984 7728933 7807907 11177173 14843476 14964470 11937760 9075921 7841331 7133159
7377 7133159 6261720 5529805 4099610 402891 -4709036 -7865811 -7290476 -4966378 -3647825
7368 -3647825 -3562503 -3291353 -2248991 -775159 1019500 2904690 3764415 2653095 343057
7359 343057 -1280277 -1311016 -688345 -1168025 -3769745 -7706089 -10407310 -9363741 -4817878
7350 -4817878 -206078 1018413 -1038659 -2998127 -2070774 1084590 3689775 4398399 4513817
7341D513817Q93645M47841k351934m593911k774823J940768M547391K648343n99193
7332D671944j226391L65448J035432k55705j876042k642303k834347k583363j606127
7323f951454l55517M88491J251718K115115J629381j024738l025162o09167M965021
7314a516312P741084M579256q39217l301075k443996j413794j557163j614020
7306c65237q93175r0933O95041K085791L483209L283263J343739o41334j544229
7297G356135j839578j940465j362464j85658L87453j26470n33979J75654J352771
7288C283399K073020K508995K552852O67431l688051p481607o695168j559353
7280h338482L214290L982770J799526k48397j010023j076820n56069Q20246K343588
$$ plain form
7341 4513817 5407462 5855303 3503369 -1090542 -3865365 -1924597 2622794 5271137 4671944
7332 4671944 3445553 3811001 4846433 4590728 2714686 72383 -2761964 -5345327 -6951454
7323 -6951454 -7306971 -6818480 -5566762 -3451647 -1822266 -2847004 -5872166 -6481333 -1516312
7314 -1516312 6224772 10804028 9964811 6663736 4219740 2805946 1248783 -365237
7306 -365237 -1258412 -1349345 -654304 1431487 4914696 8197959 9541698 8900364 7356135
7297 7356135 5516557 3576092 2213628 2027970 2415423 2288953 1754974 1930628 3283399
7288 3283399 5356419 7865414 10418266 11085697 7397646 -83961 -6779129 -8338482
7280 -8338482 -5124192 -1141422 658104 409707 -600316 -1677136 -2233205 -1412959 930629
7271I30629K964530K724827K182982J253594K1854m41095J25978j44303k365944
7262G253052l899935j491919L110951M502766J096270k576627k451309j71802
7254E371447N32366n00845r79407o45463j112111k357211k631033j511169m49551
7245d282977l90014q60758j173299q20699P26678K911719L646973J915065j81943
7236A490745k02887Q57101K72924j766389k381543n98607J496890K352010K518087
7227D038331K184117L69172k481204m057274l516217k574425k204716j132354
7219i374570R99590J982208N25683j283120j227475k42564n8401J02270J654439
7210f921940L471522L712479L264831L986884M654821K439092j857578l842205
$$ plain form
7271 930629 3895159 6619986 8802968 10056562 10078416 9637321 9763299 9618996 7253052
7262 7253052 3353117 1861198 4972149 9474915 10571185 7994558 5543249 5371447
7254 5371447 5903813 5402968 4423561 3778098 2665987 308776 -2322257 -3833426 -4282977
7245 -4282977 -4672991 -5533749 -6707048 -7527747 -6801069 -3889350 -242377 1672688 1490745
7236 1490745 1287858 2144959 2417883 651494 -1730049 -2328656 -831766 1520244 4038331
7227 4038331 6222448 6591620 4110416 53142 -3463075 -6037500 -8242216 -9374570
7219 -9374570 -8374980 -6392772 -5867089 -7150209 -8377684 -8620248 -8678649 -8576379 -6921940
7210 -6921940 -3450418 262061 3526892 7513776 12168597 14607689 12750111 8907906
7202H907906j575094J607859J694547r91122l041410k594978r42620j89588p09567
7193B165933j085024j60229J155784P40997j777764l924774l289132p00606R64260
7184e910555N99348j79510K64357J547591K117431R94532j333255k892894j668947
7175f461902J788747M111691L076808P16338K40528J065866J79552k194728k509713
7166A3187n3270J268589p89890k871721j330214J948997K749069R07362o40680
7157A201429j251333k413485l294068j375761K376604L686604J284788j136992
7149i22214p40890O00969K23051j191512j902461k345641l102858k381387J050112
7140a0712831M500926M567858K211925R77115J314584O67860j331337j981957
$$ plain form
7202 8907906 7332812 8940671 10635218 9644096 6602686 4007708 3065088 2875500 2165933
7193 2165933 1080909 920680 2076464 2817461 1039697 -2885077 -6174209 -6874815 -5910555
7184 -5910555 -5311207 -5490717 -5226360 -3678769 -1561338 -566806 -1900061 -4792955 -6461902
7175 -6461902 -4673155 -561464 2515344 3231682 3472210 4538076 4717628 2522900 13187
7166 13187 -40083 1228506 438616 -2433105 -3763319 -1814322 934747 1842109 1201429
7157 1201429 -49904 -2463389 -5757457 -7133218 -4756614 -1070010 214778 -922214
7149 -922214 -1663104 -1062135 -839084 -2030596 -3933057 -6278698 -9381556 -11762943 -10712831
7140 -10712831 -6211905 -1644047 567878 1544993 2859577 3527437 2196100 214143
7132B14143k44257J479377J269478R2543p66942j499742j812105m18637J961701
7123B75559K359780K91165n41619K048617M402009J953141l708625o681547m449004
7114d050524k5721K849734L071812J103696j808699l147156j139888K243508L245093
7105B341855J597995P00441J992543K732571P67264j830615k039202j64561J511107
7096G609398K255368K603413K169856K89909k074939l230669k989569k431209
7088D201558k149759k091739k159351j604402R12139M920583P063122M629853
7080A3722004n97430m244473m545483l392145k606705j874927q08133m63500j417314
7071f228106k055944n81365J969642K410115n29765l865175l230355J792322O423176
$$ plain form
7132 214143 -30114 1449263 2718741 2811284 2044342 544600 -1267505 -1686142 275559
7123 275559 2635339 2926504 2384885 4433502 8835511 10788652 7080027 398480 -4050524
7114 -4050524 -4076245 -1226511 1845301 2948997 1140298 -2006858 -3146746 -903238 2341855
7105 2341855 3939850 4640291 6632834 9365405 10132669 8302054 6262852 6098291 7609398
7096 7609398 9864766 12468179 14638035 14927944 12853005 9622336 6632767 4201558
7088 4201558 2051799 -39940 -2199291 -3803693 -2891554 2029029 9092151 13722004
7080 13722004 13124574 8880101 4334618 942473 -1664232 -3539159 -4347292 -4810792 -6228106
7071 -6228106 -8284050 -8865415 -6895773 -4485658 -5015423 -8880598 -12110953 -10318631 -3895455
7062c895455N970865J601127j188697K44287K721748K437389J63635j122161j427598
7053E505140k992846n412840n417377j932360J906133K951780J777170Q48335
7045b766865R62192J109293N89752k57655q03059o15851K91543J122944Q12954
7036D45248o34077j913704j912448q95831K3613J01305m38365o05056L18139J524823
7026c986353J240215o56423j731120k83173J650889J002965j376709j653948R68522
7017d825135K673367P31319k453643l168547j632226o11279o34259J93664K337798
7008g388941L820865L226991J377522m26345j909052k941391k791383j251789
7000h283523M66290R33840J82021m52615O1709J440667K590554K769704K134297
$$ plain form
7062 -3895455 2075410 3676537 2487840 2732127 5453875 7891264 8054899 6932738 5505140
7053 5505140 2512294 -2900546 -8317923 -10250283 -8344150 -5392370 -3615200 -2766865
7045 -2766865 -1804673 -695380 -105628 -363283 -1166342 -1782193 -1490650 -367706 445248
7036 445248 -188829 -2102533 -4014981 -4910812 -4887199 -4785894 -5224259 -5829315 -5511176 -3986353
7026 -3986353 -2746138 -3402561 -5133681 -5416854 -3765965 -2763000 -4139709 -5793657 -4825135
7017 -4825135 -2151768 -1420449 -3874092 -7042639 -8674865 -9286144 -9920403 -9726739 -7388941
7008 -7388941 -3568076 -341085 1036437 610092 -1298960 -4240351 -7031734 -8283523
7000 -8283523 -7817233 -6883393 -6701372 -7153987 -7092278 -5651611 -3061057 -291353 1842944
6991A842944J339109Q87282Q45926Q02419L7222j636097k996031k371814j14195
6982a363235J131862j17009j721530r00801J342520J551281p12142j938837L8004
6973b689887K885575L457014K083462J152703J305065J225412N7111j737053l057608
6964D681794k635823j25453K379964J822143j607879l911477k501291M44663J823227
6955C69868K034783K724381K769302M04643k513615k709916r34628q46629k895489
6946a597300l716985j795798N25389J298183J177317N82417j208925k958161j748906
6937i442769J797477K840070n12631l299256n47043N083969O737681K651621k171016
6928C138103k971806l14752K067415J742580q02385l322027l946144k750089j094318
$$ plain form
6991 1842944 3182053 4069335 4915261 5717680 5754902 4118805 1122774 -1249040 -1363235
6982 -1363235 -231373 -348382 -2069912 -2970713 -1628193 -76912 -789054 -2727891 -2689887
6973 -2689887 195688 3652702 5736164 6888867 8193932 9419344 9476455 7739402 4681794
6964 4681794 2045971 1920518 4300482 6122625 4514746 603269 -1898022 -1453359 369868
6955 369868 2404651 5129032 7898334 8302977 5789362 3079446 2144818 1298189 -1597300
6946 -1597300 -5314285 -7110083 -6584694 -5286511 -4109194 -3526777 -4735702 -7693863 -9442769
6937 -9442769 -7645292 -4805222 -5317853 -8617109 -9164152 -4080183 2657498 5309119 3138103
6928 3138103 166297 -148455 1918960 3661540 2859155 -462872 -4409016 -7159105 -8253423
6919h253423N60948K826100N040448M948797J972775j317183k656620k880708
6911B41134l316688k818541k33831K288574K029999L55857P82917L110443L494247
6902E934111M48744l039982m048227k922151j082236J002707K318628R82917k603074
6893c008563m770434k893677J093260L306486K469944K63503j292864j129984
6885e962329P24333K585984K060571p68234k534840r07666J706197J200766k436003
6876d331221n078915l944421n23029K165846K800117J600189p22488k582159j887982
6867a2504063J508700M763950M998500K658407M93113k16224n74456j301311j238660
6858a412044L19048J543679K47199k642153l898656k280132R4189J153413J451913
$$ plain form
6919 -8253423 -7692475 -4866375 174073 5122870 7095645 5778462 3121842 241134
6911 241134 -3075554 -5894095 -6127926 -3839352 -1809353 -1453496 -670579 2439864 5934111
6902 5934111 6382855 3342873 -705354 -3627505 -4709741 -3707034 -1388406 -405489 -3008563
6893 -3008563 -7778997 -10672674 -9579414 -6272928 -3802984 -3539481 -4832345 -5962329
6885 -5962329 -5237996 -2652012 -591441 -1359675 -3894515 -4802181 -3095984 -1895218 -4331221
6876 -4331221 -9410136 -13354557 -13877586 -11711740 -8911623 -7311434 -8033922 -10616081 -12504063
6867 -12504063 -10995363 -6231413 -1232913 1425494 1918607 1702383 1127927 -173384 -1412044
6858 -1412044 -1092996 450683 697882 -1944271 -5842927 -8123059 -8028870 -6875457 -5423544
6849e423544K053098J972734P2769j854522q61601K544410M445969K707458m38568
6840E218203j976946j878300j749311j794771j235316l76888j7947M05563J868522
6831a537191L319930K448673q23314l523084l098394m37282J428680Q27312j143616
6822b538286k293998j738855n21643m2994k18271K16168J533071K237238J264647
6813b102923k6948M52579K301660K899608J130560r51034j080726N6438J14789
6804B794003j300685k137817j038777P39458J355866J032020J217676J743566
6796D405310P14340k355595n045124m894872k557374m78698O45957J917409L070929
6787d577718K059048j245439l385786j359685L107624N456181L749767K95498
$$ plain form
6849 -5423544 -3370446 -1397712 -1324943 -3179465 -4041066 -1496656 2949313 5656771 5218203
6840 5218203 3241257 1362957 -386354 -2181125 -3416441 -3793329 -3811276 -3405713 -1537191
6831 -1537191 1782739 4231412 3408098 -114986 -3213380 -3650662 -2221982 -1394670 -2538286
6822 -2538286 -4832284 -6571139 -7092782 -7135776 -7354047 -7137879 -5604808 -3367570 -2102923
6813 -2102923 -2129871 -1677292 624368 3523976 4654536 3703502 2622776 2679214 2794003
6804 2794003 1493318 -644499 -1683276 -943818 412048 1444068 2661744 4405310
6796 4405310 5119650 2764055 -2281069 -7175941 -9733315 -10212013 -9566056 -7648647 -4577718
6787 -4577718 -2518670 -3764109 -7149895 -8509580 -5401956 54225 3803992 4099490
6779D099490j833125j948100j242787p80375o60065l65683M50741J196806O58475
6770d24623j303439k964164k640275q74407M27851N11449O4042m43112r36046
6761h582724n72598J465396L787613L603913N24489k377173k423176n78760N21114
6752d631906L29701M12501J577641K785523K755606J382626m06348j345087o43166
6743B217091J030954J706391K19212k027394k414754k51690K315387K725718O37986
6734F158901k110737l578475l302459k106152q72858K33983J451044K682571L365209
6725A921027K965581J432708o46801k137181k021415n31360O81899J78443j618451
6716B24450k974142k735018r81432J657960M131734M720417K281982j892973m750855
$$ plain form
6779 4099490 2266365 318265 -924522 -1704897 -2364962 -2730645 -2279904 -1083098 -424623
6770 -424623 -1728062 -4692226 -7332501 -8206908 -7779057 -7267608 -7203566 -7646678 -8582724
6761 -8582724 -9155322 -7689926 -3902313 -298400 226089 -2151084 -4574260 -5153020 -4631906
6752 -4631906 -4302205 -3889704 -2312063 473460 3229066 4611692 4205344 2860257 2217091
6743 2217091 3248045 4954436 5173648 3146254 731500 479810 2795197 5520915 6158901
6734 6158901 4048164 469689 -2832770 -4938922 -5811780 -5577797 -4126753 -1444182 1921027
6725 1921027 4886608 6319316 5672515 3535334 1513919 982559 1664458 1842901 224450
6716 224450 -2749692 -5484710 -6466142 -4808182 -676448 4043969 6325951 4432978 -317877
6707c17877m527190k231976Q0151J347341J533511R62725K84670J92547P19552
6698a956546J486440K474527L440245L056144M94375k434629l097783j904322
6690A558451j418009j445355J044703N814980P652694L688276j572485k590869
6682A2732386q36408j467222m482681n217279k617609o51497r82331l97546K641874
6673a278313M464167K165424j356121j806691M80909K316451K570149J936906
6665I492881K66156k363445l837067k599370m02978N20119R87622K225426K110867
6656F400211j408579m931569l165775K582620N222624J945086k139723k252099
6648B252796l73888l14270j172689j26298J727996J237679j172627k404630j898418
$$ plain form
6707 -317877 -4845067 -7077043 -6996892 -5649551 -4116040 -3153315 -2868645 -2676098 -1956546
6698 -1956546 -470106 2004421 5444666 8500810 8995185 6560556 3462773 1558451
6690 1558451 140442 -1304913 -260210 5554770 13207464 16895740 15323255 12732386
6682 12732386 11895978 10428756 5946075 728796 -1888813 -2540310 -3522641 -3920187 -1278313
6673 -1278313 3185854 5351278 3995157 2188466 2669375 4985826 7555975 9492881
6665 9492881 9759037 7395592 3558525 959155 556177 1076296 2063918 4289344 6400211
6656 6400211 4991632 60063 -3105712 -523092 4699532 6644618 4504895 2252796
6648 2252796 1878908 1564638 391949 265651 1993647 3231326 2058699 -345931 -2244349
6639b244349j501437j153849O14936K409118J252095j571899j263971K653386
6631h05970M618609J493969k475982k669407j163798j982658l403869j233325
6623g622431K870054L316416o4614j591896Q38176K718917J128281n56893P26256
6614A762266K193027N30572j989045j609849L51873K18071j529578j711940m86339
6605b270942o22031j899310j340248J412811L523947L515624K272027P0628l037951
6596A624555m529528j939908K177975K912239N39521j08617J927520K252980o65739
6587D190998k444205m75040J689112J093051M33116K020930K456530j224472m986550
6578B753470l564178J036570L160266K406784K215485K205800o69474m764441
$$ plain form
6639 -2244349 -3745786 -4899635 -4284699 -1875581 -623486 -2195385 -3459356 -805970
6631 -805970 3812639 5306608 2830626 161219 -1002579 -2985237 -6389106 -7622431
6623 -7622431 -4752377 -1435961 -1500575 -3092471 -2254295 464622 1592903 1036010 1762266
6614 1762266 3955293 4485865 2496820 886971 1238844 1456915 -72663 -1784603 -2270942
6605 -2270942 -2892973 -4792283 -6132531 -4719720 -1195773 2319851 4591878 4662506 1624555
6596 1624555 -2904973 -4844881 -2666906 245333 784854 676237 2603757 4856737 4190998
6587 4190998 1746793 1271753 2960865 4053916 4487032 6507962 8964492 7740020 2753470
6578 2753470 -810708 225862 3386128 5792912 8008397 10214197 9544723 4780282
6570D780282n082629j761970n4963j357376j324309J754350L665477J795655l59011
6561B055506N30794K246003J575131l75788j278897j949798l566170m023347j383777
6552f170343J848592K278660J165355J887089L569170K204576k253966m631742
6544a02609j488676L964390N591316J310644m834991o943531l205577K290468
6536c418566M152542J837056m73604k12926L71619j101787k594452j053036J979060
6527e14094K334086k62082j952824r83884O7693p55218j576400m74734P13499
6518c403958o30785l024303k361864J975858N433917L835534j171951m065255
6510c412807k306281Q52896J251277m47478l25529K277915L281755L8864m110180
$$ plain form
6570 4780282 -302347 -2064317 -2119280 -3476656 -4800965 -3046615 618862 2414517 2055506
6561 2055506 2586300 4832303 6407434 6031646 4752749 2802951 -763219 -4786566 -6170343
6552 -6170343 -4321751 -2043091 -877736 1009353 4578523 6783099 4529133 -102609
6544 -102609 -1591285 2373105 7964421 9275065 4440074 -2503457 -5709034 -3418566
6536 -3418566 733976 2571032 2097428 1884502 2256121 1154334 -1440118 -2493154 -514094
6527 -514094 1819992 1557910 -394914 -1378798 -1311105 -2066323 -3642723 -4117457 -3403958
6518 -3403958 -4034743 -7059046 -9420910 -7445052 -2011135 1824399 652448 -3412807
6510 -3412807 -5719088 -4866192 -3614915 -4062393 -4387922 -2110007 1171748 1210612 -2899568
6501b899568m084867O2415L578997L336024O53562j835558l040471k764685j029011
6492h023162J005574J627008J003725J104975K438201L004494J571689k02882
6484C529622m77257p7484o17535j329193k50480K215039L467368K427499Q59458
6475I747037M49696M20572r00635l334581m907728m220383j865692L69158J109208
6466c133348L05314q89170j119069j91404M77093o59449l098550m306083k584795
6457a5199461P13405K934051L549972M125467M947377M159649J319823p46454
6449E803829L3068J154969r10006m557600m692407o70914K076028K03639k153761
6440c713155K66575N339641O242603J306711l884278m588604k449490j238048
$$ plain form
6501 -2899568 -6984435 -6922020 -3343023 -6999 646563 -1188995 -4229466 -6994151 -8023162
6492 -8023162 -7017588 -5390580 -4386855 -3281880 -843679 2160815 3732504 3529622
6484 3529622 3052365 2974881 2357346 1028153 777673 2992712 6460080 8887579 9747037
6475 9747037 10196733 10617305 9716670 6382089 1474361 -2746022 -4611714 -4242556 -3133348
6466 -3133348 -2828034 -3717204 -4836273 -5027677 -4550584 -5210033 -8308583 -12614666 -15199461
6457 -15199461 -14486056 -11552005 -8002033 -3876566 1070811 5230460 6550283 5803829
6449 5803829 5836897 6991866 6081860 1524260 -3168147 -3839061 -1763033 -1559394 -3713155
6440 -3713155 -3446580 1893061 8135664 9442375 5558097 969493 -1479997 -2718045
6432b718045j001937M85907K877254L416603J305200r79045j023519P61096K173280
6423E296794J721872k79997k211073k502894j148078K13018K95604k28823j28761
6414A027662L1798j292288l491570l654804n68795K895615L086416K43002j998827
6405c721791j358511P79170K063616K334852K944605M022317L972426J714658
6397A2751342j604260l608912l044085q41368R35296R39027n15701j968758k151208
6388H91373j071634J3390j50961j458397k549543k402212j343593j29250J231073
6379f969754K731032L057301P90722k804271m054250j144579L161101M551940
6371f80758K074769j567028l929994m973001n223518m002727p25728L202483N241808
$$ plain form
6432 -2718045 -3719982 -3234075 -356821 3059782 4364982 3385937 2362418 3123514 5296794
6423 5296794 7018666 6738669 4527596 2024702 876624 1089642 1385246 1156423 1027662
6414 1027662 1059460 -232828 -3724398 -7379202 -7947997 -5052382 -1965966 -1722964 -3721791
6405 -3721791 -5080302 -4301132 -2237516 97336 3041941 7064258 11036684 12751342
6397 12751342 11147082 7538170 4494085 3652717 4588013 5527040 5011339 3042581 891373
6388 891373 -180261 -166871 -317832 -1776229 -4325772 -6727984 -8071577 -8200827 -6969754
6379 -6969754 -4238722 -1181421 -390699 -3194970 -7249220 -8393799 -5232698 -680758
6371 -680758 1394011 -173017 -4103011 -9076012 -14299530 -18302257 -19027985 -15825502 -10583694
6362a0583694M328182J840957m2464m67777k91247o90937j759266k595063k439874
6353a2701183j196640R72961L646915N580569N266150K730930o2039j309011j102608
6344A826044n30140j23520O083l08766o53614j94206N27826l20700k618579l310188
6334e699760q15824J905027J709526L62734J163338K497955L18051l759104l434879
6325e752936K073957N488174K095417l020863k800657J565611L679232J855758
6317E183693Q7691P48603J884272J497723O8323j385890k339616j953472j67090
6308C624237R28550l26431k117656j809759m82298j099855l077568k924744o4053
6299g349577K256879K119216R20526k30402j961319l656700l142516o47008P16685
$$ plain form
6362 -10583694 -6255512 -4414555 -4457019 -4924796 -5216043 -5906980 -7666246 -10261309 -12701183
6353 -12701183 -13897823 -12924862 -9277947 -3697378 1568772 4299702 4237663 2928652 1826044
6344 1826044 1295904 1172384 1178467 869701 216087 21881 549707 229007 -2389572 -5699760
6334 -5699760 -6515584 -4610557 -2901031 -2538297 -1374959 1122996 1441047 -2318057 -5752936
6325 -5752936 -3678979 1809195 3904612 883749 -1916908 -351297 3327935 5183693
6317 5183693 5271384 6019987 7904259 9401982 9470305 8084415 5744799 3791327 3624237
6308 3624237 4552787 4226356 2108700 298941 -183357 -1283212 -4360780 -7285524 -7349577
6299 -7349577 -5092698 -2973482 -2052956 -2283358 -4244677 -7901377 -11043893 -11690901 -10974216
6290a0974216j30999n26208J094125K364416J170016p26165p96868L01998N16851
6281g707050j18123k22033N11531J610760K799609L171292J498850j216129k020230
6272a691523m11882M15506j279542k557351m72556K932581L707925J799186K03744
6263B646088N3782R1159k23652m38287r50595k107231k567499j476863q20269
6254e793367k294752l418398q64709L401787M035474K45777k908339j921205R23936
6245h593796K176710J960628J900666J727883O14720n65805q34339j038088j919814
6236d571235k038799l7308K461623K808238J255742L56172Q82774J010456j79706
6227A947957r46615J22953J296952m4611l064207l763404l20124L788731L800360
$$ plain form
6290 -10974216 -11105215 -11631423 -10537298 -8172882 -7002866 -7729031 -8525899 -8223901 -7707050
6281 -7707050 -7825173 -8047206 -7535675 -5924915 -3125306 45986 1544836 328707 -1691523
6272 -1691523 -2103405 -1687899 -2967441 -5524792 -5997348 -3064767 643158 2442344 2646088
6263 2646088 2699870 2791029 2567377 2129090 1178495 -928736 -3496235 -4973098 -5793367
6254 -5793367 -8088119 -11506517 -12371226 -8969439 -4933965 -4688188 -7596527 -9517732 -8593796
6245 -8593796 -6417086 -4456458 -2555792 -827909 -213189 -778994 -1613333 -2651421 -4571235
6236 -4571235 -6610034 -6647342 -4185719 -1377481 -121739 234433 1117207 2127663 1947957
6227 1947957 1001342 1124295 2421247 2376636 -687571 -4450975 -4771099 -982368 2817992
6218B817992j73724l325080k443592N17145K054099J715093J117950M63337j080267
6209A662953k548810j873846N93934K010630J053640l26836m0444J242396J472452
6200C246069M7056j882785k929351k416097o23219J241931J975065J623159J118500
6191A400328P20959m886o42200J6460J816351K751048J581463m30256j565603
6182E643664k122002l205302m013749k607605N08114J886307l92669l308637k267851
6173i879730K445326N311647K824737j452033j747267J699179L238136M63293
6165B903288k361429j337059R03073k58356l659844l927302K39223M028045L317886
6156a52475k09112k062715m24507K737109M284113K637553q95076l082849k090398
$$ plain form
6218 2817992 2644268 -680812 -3124404 -2607259 -553160 1161933 2279883 2743220 1662953
6209 1662953 -885857 -2759703 -2165769 -155139 898501 571665 531221 1773617 3246069
6200 3246069 3293125 1410340 -1519011 -3935108 -4558327 -3316396 -1341331 281828 1400328
6191 1400328 2121287 2116401 1474201 1490661 3307012 6058060 7639523 7209267 5643664
6182 5643664 3521662 316360 -3697389 -6304994 -5796880 -3910573 -4303242 -7611879 -9879730
6173 -9879730 -7434404 -2122757 701980 -750053 -2497320 -798141 2439995 2903288
6165 2903288 541859 -795200 107873 -150483 -3810327 -7737629 -7498406 -3470361 -152475
6156 -152475 -361587 -2424302 -2848809 -111700 4172413 6809966 5914890 2832041 741643
6147G41643L73183J446210Q61836M08104N03097q8979j490180k406846k562387
6138b214319k749386k449025k50556L137415N139733M857307L556557J640331
6130A0668057j484566m328633m083838j350445j00857j620382k553307o94357
6122e548328J508137J576191R78830J521582J643658j22186j373780N36466L804043
6113D524613M903619L570357J433040j571671n247361o283618k350275K813054
6105A791758L560496L43879j623232p58078m50718j945868j757155K135474O237370
6096G533926O116182J920224k589364m270111k727897k04101J75256k096078l549542
6087C08495j253074K404533K890796M46765p21437K50485j76481k926097l946398
$$ plain form
6147 741643 1114826 2561036 3422872 3830976 4334073 4245094 2754914 348068 -2214319
6138 -2214319 -4963705 -7412730 -7663286 -4525871 613862 5471169 9027726 10668057
6130 10668057 9183491 4854858 771020 -579425 -680282 -2300664 -4853971 -5548328
6122 -5548328 -4040191 -2464000 -1485170 36412 1680070 1557884 184104 720570 4524613
6113 4524613 9428232 12998589 14431629 12859958 7612597 1328979 -1021296 1791758
6105 1791758 5352254 5696133 4072901 3314823 2864105 918237 -838918 1296556 7533926
6096 7533926 13650108 15570332 12980968 8710857 5982960 5778859 5954115 3858037 308495
6087 308495 -944579 1459954 4350750 4797515 4076078 4326563 4150082 1223985 -2722413
6078b722413j035370K161327K036800M53034P31841J984782J371203q86123k567554
6069A527527l222639l378344k200406N61179K406637J517451L90797K104880M674306
6060D381388L658340m61495k274032P68244M650508M212807o27495n468223o393615
6051B446427l384539J22968Q12980p58337r06993J747838L696825J685995j799400
6042C663764j973574P67569J516537j200882l210940j592749R76425J097497k18653
6033a75006m09397k0321p36525j150882J203869M689753M713396K75503m240359
6024D150031m836855k535659p41831l95230J797R03777R06511n36350j667836
6015d751645o84543J694008L075974K326686N38599p64115j200519j082589n84693
$$ plain form
6078 -2722413 -3757783 -1596456 440344 893378 1625219 3610001 4981204 4095081 1527527
6069 1527527 -1695112 -5073456 -7273862 -6712683 -4306046 -2788595 -2397798 -292918 4381388
6060 4381388 8039728 7578233 5304201 6072445 10722953 14935760 14308265 8840042 2446427
6051 2446427 -938112 -815144 -2164 -760501 -1667494 80344 3777169 5463164 3663764
6042 3663764 1690190 2457759 3974296 2773414 -437526 -2030275 -1053850 43647 -175006
6033 -175006 -584403 -604724 -1341249 -2492131 -1288262 3401491 8114887 8390390 4150031
6024 4150031 -686824 -3222483 -3964314 -4359544 -4357747 -3453970 -2547459 -3083809 -4751645
6015 -4751645 -5436188 -3742180 -666206 1660480 2199079 1434964 234445 -848144 -1432837
6006a432837l3471n9626n95253n45698N43475J297452K45095j932733l365847
5997e879443l658367l799513l702615k025239J142268L494686L409562K009353
5989i009308J235259J282346J237301J089802J555373K472756K709447J542462
5981D115438n47101k163566j857396M23729K432143J496104k017551m596600l900667
5972f615467j492415J07563J087973K759967M011774K617097n78089k218197j391369
5963a711163p32141j782583k483284q81409J436380J799493L33730q19091o48387
5954e488455L78665J702719K393411R63991k251593l983777j999460J091248J263398
5945e929853o21517Q397L916158O216622L559026r59649k696400j884317j656457
$$ plain form
6006 -1432837 -1466308 -1525934 -2121187 -2666885 -2123410 -825958 -580863 -2513596 -5879443
5997 -5879443 -9537810 -13337323 -17039938 -19065177 -17922909 -14428223 -11018661 -9009308
5989 -9009308 -7774049 -6491703 -5254402 -4164600 -2609227 -136471 2572976 4115438
5981 4115438 3568337 1404771 -452625 -28896 2403247 3899351 1881800 -2714800 -6615467
5972 -6615467 -8107882 -8000319 -6912346 -4152379 -140605 2476492 1898403 -319794 -1711163
5963 -1711163 -2443304 -4225887 -6709171 -7590580 -6154200 -4354707 -4020977 -4840068 -5488455
5954 -5488455 -5109790 -3407071 -1013660 -49669 -2301262 -6285039 -8284499 -7193251 -5929853
5945 -5929853 -6551370 -6542973 -2626815 3589807 7148833 6189184 3492784 1608467 -47990
5936d7990k167049j010285J545520K202384J0846j667206j10583K613561K520594
5927C889792r20553m328304m605502j980348R53778K037153J156896l06233j161921
5918e265242j296290r61062j5286J352388J843376L65288k047284l061023j894549
5909a0979684O5397J619387K974677M058873L555222R74885j700779k071565k57760
5900a761347J537312J756406N80561j040369k177915k247335j653125j546618
5892f552430j992146j423860P08961K116944P42527j371128l59402L442263N196917
5883E08646K285712j911515k913166j081571N4960n90098j079602n00435o4463
5874e291532p5326R11009K937016L501535J226897j501275j585995O04668K230254
$$ plain form
5936 -47990 -2215039 -3225324 -1679804 522580 533426 -1133780 -1244363 1369198 3889792
5927 3889792 2969239 -1359065 -5964567 -7944915 -6991137 -4953984 -3797088 -4103321 -5265242
5918 -5265242 -6561532 -7522594 -7537880 -6185492 -4342116 -3976828 -6024112 -9085135 -10979684
5909 -10979684 -10914287 -9294900 -6320223 -2261350 1293872 2268757 567978 -1503587 -1761347
5900 -1761347 -224035 1532371 2112932 1072563 -1105352 -3352687 -5005812 -6552430
5892 -6552430 -8544576 -9968436 -9259475 -7142531 -6400004 -7771132 -8130534 -4688271 508646
5883 508646 2794358 882843 -2030323 -3111894 -3056934 -3647032 -4726634 -5227069 -5291532
5874 -5291532 -5366858 -4455849 -1518833 1982702 3209599 1708324 122329 726997 2957251
5865B957251K014804R26542m78119k590948m436464l691213l06021K233346J280995
5856b089827j022794p12954K093649L328055J088950j591867j471753J83973P1856
5847a22712j785272k274383k07858K011576K160928R22620j40668r48999j780669
5838b165437j794462n20869O82733N71289J23918P46589J641932J286661L54787
5829I27141L77359M75467j091726k623523n44352M102997N465557J247520l276672
5820E059768k994650n84146j582075m963662m876373n09005K529684J447053M09859
5811f063547K894503N511747L592029j119401l176201j395200O39051O76611k06004
5802A353588j295757l436499n803689n331692j032647L754956N176784L179337
$$ plain form
5865 2957251 4972055 5898597 5420478 2829530 -1606934 -5298147 -5604168 -3370822 -2089827
5856 -2089827 -3112621 -3825575 -1731926 1596129 2685079 1093212 -378541 -194568 -122712
5847 -122712 -1907984 -4182367 -4390225 -2378649 -217721 704899 564231 -384768 -2165437
5838 -2165437 -3959899 -4480768 -3798035 -3226746 -3102828 -2356239 -714307 572354 927141
5829 927141 1304500 1779967 688241 -1935282 -2479634 1623363 7088920 8336440 5059768
5820 5059768 2065118 1480972 -101103 -5064765 -9941138 -10450143 -7920459 -6473406 -6063547
5811 -6063547 -3169044 2342703 5934732 4815331 1639130 243930 882981 1559592 1353588
5802 1353588 57831 -3378668 -9182357 -14514049 -15546696 -11791740 -6614956 -3435619
5794c435619O46965l04084J82181Q22464M83773j108324l015111l681749k352469
5785a1761973K81771K808518M030005L426285J439519p62131k310618l070932
5777e919556k709284n40308K591195L760297J398472j750543j733455J114786
5769c788396K747373J348709p04028j399412j931263l372337l915586j961372
5761a2976312O68211J443495J053809J671386K848175K307138k3250j735145j394723
5752f137216J43918J523709J836084M14886k017793k713729J4228L710651M599040
5743A373778K817467J505176J219473m33898l234757l385076k5157K043505n37215
5734A343296l888726k634142J582679K636257o39248l281039k381566q14011j424960
$$ plain form
5794 -3435619 -2788654 -3092738 -2910557 -2088093 -1604320 -2712644 -5727755 -9409504 -11761973
5785 -11761973 -11480202 -8671684 -4641679 -1215394 224125 -538006 -2848624 -5919556
5777 -5919556 -8628840 -9169148 -6577953 -2817656 -1419184 -3169727 -4903182 -3788396
5769 -3788396 -1041023 307686 -396342 -1795754 -3727017 -7099354 -11014940 -12976312
5761 -12976312 -12308101 -10864606 -9810797 -8139411 -5291236 -2984098 -3007348 -4742493 -6137216
5752 -6137216 -5993298 -4469589 -2633505 -2218619 -4236412 -6950141 -6935913 -3225262 1373778
5743 1373778 4191245 5696421 6915894 6481996 3247239 -137837 -162994 1880511 1343296
5734 1343296 -2545430 -5179572 -3596893 -960636 -1599884 -4880923 -7262489 -8076500 -9501460
5725i501460k551524j806722j49790Q88681K447854N146878N783414J792321l169494
5716a119842l347083M05624J714437j275329l030702J34836L762511K285251k035115
5707b505412k632596J329215M175782K403063j095156k282075j142210J4534J58476
5698a576379m03187j295274j808152j054985M80959J111336M47802J22321J339317
5689b636242L320788M659065M546959K543001p76576k888092j670947J083899
5681H181855J505200o96149j983699j067294q47662k698478l530346j318208R56151
5672a498630N04336l39666J234405K807121Q86839k403324k533467k412J371084
5663B6286J477773K825166M088704J826509k212059k918541q07186j283609m336990
$$ plain form
5725 -9501460 -12052984 -13859706 -14009496 -13120815 -10672961 -5526083 257331 2049652 -1119842
5716 -1119842 -4466925 -4061301 -2346864 -3622193 -6652895 -6518059 -2755548 -470297 -2505412
5707 -2505412 -5138008 -3808793 366989 2770052 1674896 -607179 -1749389 -1734855 -1576379
5698 -1576379 -1979566 -3274840 -5082992 -6137977 -5657018 -4545682 -4097880 -3975559 -2636242
5689 -2636242 684546 5343611 9890570 12433571 11656995 8768903 7097956 8181855
5681 8181855 9687055 8990906 7007207 5939913 5092251 2393773 -1136573 -2454781 -1498630
5672 -1498630 -994294 -1333960 -99555 2707566 3594405 1191081 -1342386 -1344798 26286
5663 26286 1504059 4329225 8417929 10244438 8032379 5113838 4306652 3023043 -1313947
5654a313947l642448J902626M721395P23905l439210j044927L990452M019234
5646E917080m59945l373337l169290k620269j731168J322419M157566K673191
5638B716247j375464k258892P70727K972870K222844J005541L03147j648787l772144
5629I36089k246081K149302L422557m28436l746194j835529K372421L917131K966925
5620G508185K159704J196618j127683k844396j630111O15108M91415j372504j728312
5611C268024k92067J90154j221962k416478j677568M46145K539094L404087K326623
5602F566052J62150q41020j27781j73048k567237m769802l706479p05825P69096
5593e393894P74339K029849M290568M268643J344432j178433j450170j494170
$$ plain form
5654 -1313947 -4956395 -3053769 1667626 2391531 -1047679 -2092606 1897846 5917080
5646 5917080 5457135 2083798 -1085492 -3705761 -5436929 -4114510 43056 2716247
5638 2716247 1340783 -918109 -147382 2825488 5048332 6053873 6357020 4708233 936089
5629 936089 -1309992 839310 4261867 3833431 87237 -1748292 624129 4541260 7508185
5620 7508185 9667889 10864507 9736824 6892428 5262317 5877425 6368840 4996336 3268024
5611 3268024 2975957 3166111 1944149 -472329 -2149897 -1703752 835342 4239429 6566052
5602 6566052 6728202 5887182 5759401 5586353 3019116 -1750686 -5457165 -6162990 -5393894
5593 -5393894 -4619555 -2589706 1700862 5969505 7313937 6135504 4685334 3191164
5585C191164k785144l399000j791254k5947m46044j628338o20514K370429M260968
5576h73680L258799O23506j294571j300830n3773N99710l92496j674243j168432
5567b276010M83013M30017j747896k825210j015399P94909l14275k139703p20526
5558i331080K933473M061706J551812o16787J2895Q74753o03527k347948r36265
5549d400968L002956N721555N141399K142717j563333m234731l962247p05835
5541A141513K133053J197964j928653k498076M14766K304573J06865k851491j767109
5532a746595K248111L687542O95805k550312k161670M38967J659777J053235P80197
5523D105057J472320J637580O41294m33290j024132j831878k825933k668205j049137
$$ plain form
5585 3191164 406020 -2992980 -4784234 -4810181 -5256225 -6884563 -7505077 -5134648 -873680
5576 -873680 2385119 3008625 1714054 413224 359451 959161 566665 -1107578 -2276010
5567 -2276010 -1792997 -1362980 -3110876 -5936086 -6951485 -6156576 -6470851 -8610554 -9331080
5558 -9331080 -6397607 -2335901 -784089 -1400876 -1387981 -513228 -1116755 -3464703 -4400968
5549 -4400968 -1398012 4323543 9464942 11607659 10044326 5809595 1847348 1141513
5541 1141513 3274566 4472530 2543877 45801 460567 2765140 2872005 20514 -1746595
5532 -1746595 501516 4189058 4884863 2334551 172881 611848 2271625 3324860 4105057
5523 4105057 5577377 7214957 7856251 7422961 6398829 4566951 1741018 -927187 -1976324
5514a976324K54803j00437r51992n13202Q51679J370505O26525r5603O3731N40461
5504G0146M98512j45933r39297j327783r40363m7750N81040Q25473J464297K450537
5494B488879K060407o59940l486578l196285J23508L119243L571195K481930J421706
5485G924065K95490j179735j993745j394695l01959K52774N96152R64646K70396
5476E433389j924768l709659l157272j167077J30023O38919J510678K066985N65904
5467C87122k148811k905578p48273J559108J675464Q41966J300999K623906K744830
5458E330733J407429L26462L06909K15980q34008j799642j150891O88906J533952
5449F025830L43757j063242m21521J267071N01338l426787o201608l847425J266322
$$ plain form
5514 -1976324 -1721521 -1821958 -2773950 -3287152 -2435473 -1064968 -438443 -534046 -470315 70146
5504 70146 568658 422725 -516572 -1844355 -2784718 -2832468 -2251428 -1425955 38342 2488879
5494 2488879 4549286 3889346 402768 -2793517 -2670009 449234 4020429 6502359 7924065
5485 7924065 8219555 7039820 5046075 3651380 3349421 3602195 4198347 5162993 5433389
5476 5433389 3508621 -201038 -3358310 -4525387 -4395364 -3756445 -2245767 -178782 387122
5467 387122 -1761689 -4667267 -5415540 -3856432 -2180968 -1339002 -38003 2585903 5330733
5458 5330733 6738162 7064624 7371533 7587513 6753505 4953863 3802972 4491878 6025830
5449 6025830 6369587 5306345 4884824 6151895 6653233 3226446 -2975162 -6822587 -5556265
5440e556265L119023L01932k258372p74796K049068J666397j264594k200167K26155
5431d691619K400532J360345j047083j231648R74085K356990Q73784j776164k620372
5422c401150j228749J34646j28980r21579n16492N67731L86212j198639k051579
5413h358579r09517P40612Q28545n48524j593159j128222M91409K097167K563744
5404e816524J549225k5859p65644k98121P15563J863670K903806K637706J02515
5395B866337k752745k340972J366690L728457J563146k244587l044488r62978
5387a821140M78004N60800J728372M163585M629422J772585j282984j508927j88276
5378H531441l45576k060520k728230r63145J669703K523057M87958k895249m572093
$$ plain form
5440 -5556265 -2437242 -2135310 -4393682 -5168478 -3119410 -1453013 -2717607 -4917774 -4691619
5431 -4691619 -2291087 -930742 -1977825 -3209473 -2235388 121602 995386 -780778 -3401150
5422 -3401150 -4629899 -4495253 -4624233 -5545812 -6062304 -5494573 -5108361 -6307000 -8358579
5413 -8358579 -9268096 -8527484 -7698939 -8247463 -9840622 -10968844 -10477435 -8380268 -5816524
5404 -5816524 -4267299 -4293158 -5058802 -5356923 -4641360 -2777690 126116 2763822 2866337
5395 2866337 113592 -2227380 -860690 2867767 4430913 2186326 -858162 -1821140
5387 -1821140 -1343136 -782336 946036 5109621 9739043 11511628 10228644 8719717 8531441
5378 8531441 8185865 6125345 3397115 2433970 4103673 6626730 7114688 4219439 -352654
5369c52654k910503L60195K065537J314136m2672m78139l43817j33354N19603
5360a668J273362P08137j182511k075304m79808J826181K270642J008790P3758
5351C421579J23006J31214k98882m22975j14235l93798j825542l476856l816181
5342f672670k093128J072098L927868M695393L077466N68755j004386r18970M60948
5333C113374K211131L026838J939549m74730k398671k760381k060533j033141
5325A563436J36123R13633N71697m1066R66306L010348K509380k037474o718502
5316H73881o820946l035058K29892J312699K079440K911385J674519j388428k244398
5307d407014J096265M772651M112671J09370k364887j337637O12512R94698N00619
$$ plain form
5369 -352654 -3263157 -2902962 -837425 476711 434039 -44100 -387917 -521271 -1668
5360 -1668 1271694 1979831 797320 -1277984 -1757792 68389 2339031 3347821 3421579
5351 3421579 3544585 3675799 3376917 2953942 2839707 2445909 620367 -2856489 -6672670
5342 -6672670 -8765798 -7693700 -3765832 929561 4007027 4575782 3571396 2652426 3113374
5333 3113374 5324505 8351343 10290892 9816162 7417491 4657110 2596577 1563436
5325 1563436 1699559 2613192 3184889 3143823 4110129 7120477 9629857 7592383 873881
5316 873881 -5947065 -8982123 -8752231 -7439532 -5360092 -2448707 -774188 -2162616 -4407014
5307 -4407014 -3310749 1461902 5574573 5683943 3319056 1981419 2593931 3588629 4089248
5298D089248Q01196J607961J272398p98471l418040m909475m492058k565564j14326
5289h527131J898388K636321J543201q76429k742721k384364l65877J138607J121318
5280f558687N22140j2456j196776k916102l032509l44614K764073L049856Q61255
5271f863820o71872k78961M93949P88752J587266K665763J760634j552735m067402
5262f138426l301151j176909o77005j063200J63020K216945K118888K03798O0853
5253g593187K409671L418772Q13265k250044j954088P51366K532329K813557L014467
5244C956108K724208P03012j472405r98220J240737J480007q92098k220983n23839
5235C996527J409338O34461j691043k889751k599013j613245K93137K630608K908057
$$ plain form
5298 4089248 4890444 6498405 7770803 6972332 3554292 -1355183 -5847241 -8412805 -8527131
5289 -8527131 -6628743 -3992422 -2449221 -3325650 -6068371 -8452735 -8818612 -7680005 -6558687
5280 -6558687 -6036547 -6049003 -7245779 -10161881 -13194390 -13539004 -10774931 -7725075 -6863820
5271 -6863820 -7535692 -7814653 -7320704 -6531952 -4944686 -2278923 -518289 -2071024 -6138426
5262 -6138426 -9439577 -10616486 -11293491 -12356691 -12193671 -9976726 -7857838 -7654040 -7593187
5253 -7593187 -5183516 -1764744 -951479 -3201523 -5155611 -4404245 -1871916 941641 3956108
5244 3956108 6680316 7383328 5910923 4912703 6153440 7633447 6741349 4520366 3996527
5235 3996527 5405865 6040326 4349283 1459532 -1139481 -2752726 -2459589 171019 3079076
5226C079076K88774j778929j87065K651395K430167K1792j57480J986492J884690
5217A0218912j444391k828909Q28658M977552L961769p40838l280361j789095
5209I903297O31488J642340J757475J301736m08482k542133k981778j680470q67435
5200F756038j459709k045226j808831j599163j576114p39870M83537J68665j672090
5191c492763k556911j479732k42560L48520K005580M823536N455077K220339j453281
5182E627805k056277j172045j691635k101707L75991L442898K529666j289347
5174C665349k471725J1600J220035j220684l310962j601825J550841K549312J684707
5165B076648O05902j073650l268175l408808n84251J750091Q82070o52058M18664
$$ plain form
5226 3079076 3367850 1588921 1401856 4053251 6483418 6505210 6347730 8334222 10218912
5217 10218912 8774521 5945612 6774270 11751822 15713591 14972753 11692392 9903297
5209 9903297 10534785 12177125 13934600 15236336 14827854 12285721 9303943 7623473 6756038
5200 6756038 5296329 3251103 1442272 -156891 -1733005 -2472875 -1989338 -1820673 -3492763
5191 -3492763 -6049674 -7529406 -7771966 -7423446 -5417866 -594330 4860747 7081086 5627805
5182 5627805 3571528 2399483 707848 -1393859 -1017868 2425030 4954696 3665349
5174 3665349 1193624 1205224 2425259 1204575 -2106387 -3708212 -2157371 391941 2076648
5165 2076648 2682550 1608900 -1659275 -5068083 -5652334 -3902243 -3020173 -3672231 -3253567
5156c253567K349806J650604o74376j045703O20281J603620J393497J187673O3862
5147C895697l142838n476041l020425K204288M197200J685780q56019j094986
5139a607344j527290l130907k713862Q25318L200895J171529k220585k517982
5131h520228k90520J066726J070176J809986L708956M971929M291588J880662
5123I989275j144359k979865k283814k79441J99105j237040j810653k3496J953102
5114B382814J850680N05276k73849m39532n52640l92121k87355j213714k226978
5105f47419r16524K169047L213375J042083p41304J59163R90728n62330j756694
5096B950125J45149K347352J041479j976581k528933j034073p28066j342550m27501
$$ plain form
5156 -3253567 -903761 746843 72467 -973236 -352955 1250665 2644162 3831835 3895697
5147 3895697 752859 -4723182 -7743607 -5539319 -1342119 343661 -512358 -1607344
5139 -1607344 -3134634 -6265541 -8979403 -8154085 -4953190 -3781661 -6002246 -8520228
5131 -8520228 -8810748 -7744022 -6673846 -4863860 -1154904 3817025 8108613 9989275
5123 9989275 8844916 5865051 3581237 3301796 3500901 2263861 453208 429712 2382814
5114 2382814 4233494 4738770 4464921 4025389 3472749 3080628 2793273 1579559 -647419
5105 -647419 -1563943 605104 3818479 4860562 4119258 4278421 5269149 4706819 2950125
5096 2950125 3095274 5442626 6484105 4507524 1978591 944518 216452 -1126098 -1553599
5087a553599Q74269m75101l054396k498060J014294K715458Q53973j261250j253346
5078d637758k95071R00239L219681N170850L209039k140702n439756l750703l70114
5069d134295J063097J585840L101887L810670J391134k163658k953027p98082
5061I03566R86681N11326r34564j599835j248056l16839R99161K243734K341643
5052C886817N43806k347415m199454l535367j187658P58528J444241J359790L43814
5043b932898k097629m146876k618515J983602M705239K710262o63261j172060
5035d232136M72529J472066K064723L370828L483893R49045q34768J395541M028348
5026A2170069J602182l472620l906940O47498K932394k70021l805536l117776
$$ plain form
5087 -1553599 -679330 -1154431 -4208827 -6706887 -5692593 -2977135 -2123162 -3384412 -4637758
5078 -4637758 -4932829 -4032590 -812909 4357941 7566980 5426278 -13478 -3764181 -4134295
5069 -4134295 -3071198 -1485358 1616529 5427199 6818333 4654675 1701648 903566
5061 903566 1890247 2401573 1467009 -132826 -1380882 -1697721 -698560 1545174 3886817
5052 3886817 4430623 2083208 -2116246 -5651613 -6839271 -6080743 -4636502 -3276712 -2932898
5043 -2932898 -5030527 -9177403 -11795918 -9812316 -5107077 -2396815 -3060076 -4232136
5035 -4232136 -3759607 -2287541 -222818 3148010 6631903 7580948 6746180 8141721 12170069
5026 12170069 13772251 10299631 6392691 7040189 9972583 9702562 5897026 2779250
5018B779250k10039J644509K470065K365687k3159l229176l150639K511J060054
5009C709063j307035j821444K092221N144676K791073j359238k022235n03300
5001F723781o16339j180592Q95771L576232K391709j808258l727856j363393J918558
4992F809613K640270Q62906j191946j596175j41374J301259Q22355p18608r97834
4983G790466k71072p63152j931262p63368K473798L704346J519071q27842j191486
4974I739499r33999l73294J931516L862187R01036n109820o202706n01075M010449
4965G323793K029768j410699j104080n36780l699865o427713m080541n02466o58234
4956i066817j144416K737897O766326M600223o43245j835017p5583j068512l577231
$$ plain form
5018 2779250 2569211 4213720 6683785 9049472 9026313 5797137 2646498 2649009 3709063
5009 3709063 2402028 580584 2672805 7817481 10608554 9249316 7227081 6723781
5001 6723781 6107442 4926850 5822621 9398853 11790562 9982304 6254448 4891055 6809613
4992 6809613 9449883 10312789 9120843 7524668 7383294 8684553 9506908 8788300 7790466
4983 7790466 7519394 6756242 4824980 4061612 6535410 10239756 11758827 10930985 9739499
4974 9739499 8805500 8432206 10363722 14225909 15126945 10017125 3814419 3313344 7323793
4965 7323793 9353561 7942862 6838782 6302002 2602137 -3825576 -7906117 -8408583 -9066817
4956 -9066817 -10211233 -7473336 -707010 3893213 3249968 1414951 1339368 270856 -3306375
4947c306375k369668Q99411Q14530q07939J648183N658717L836587k364435m183064
4938a74053l34096J586411r99853k032853J157369L213855J041832r63140O29658
4929C125130K843240K561894J284489R23223P48341K52427r5219j300914l953188
4920F389423m894078j452929K875027L205362J021693L18939k61515l296743m870737
4911i65558o99718M147244K455520k182363j436529K686721J965834k397430k602784
4902I70937K31063j253814m776550j603591N883578O850366J310281q15225J022934
4893G819979j496115o529410m032344L283073K845370l535404k032612N895006
4885B217543M964810l592435k770009O175622L928262p687991n298645Q981882
$$ plain form
4947 -3306375 -5676043 -4776632 -3962102 -4770041 -3121858 2536859 6373446 4009011 -174053
4938 -174053 -508149 1078262 78409 -1954444 -797075 2416780 3458612 2495472 3125130
4929 3125130 5968370 8530264 9814753 10737976 11486317 11738744 11643525 10342611 6389423
4920 6389423 1495345 42416 2917443 6122805 7144498 7463437 7201922 3905179 -965558
4911 -965558 -1665276 2481968 4937488 2755125 1318596 4005317 5971151 3573721 970937
4902 970937 1202000 -51814 -4828364 -6431955 -548377 6301989 7612270 6797045 7819979
4893 7819979 6323864 -205546 -4237890 -954817 1890553 -1644851 -3677463 2217543
4885 2217543 7182353 3589918 819909 6995531 10923793 3235802 -2062843 6919039
4877F919039N324708j5110083j3734543O964755j8021056j08224155j66764562
4870c02645897r5016740N6573390J39755496R9152306K4188789M227964K1179786
4863e2584906J8465370j352404k791616J0836222J0780945j516864k961091N395845
4855a5728499M394899m205293k931883O194546N860997l335480m830804K814109
4847a1767408N048557o23198j700417M529569O719396J181927k712049o86430
4839a0053Q78616p65445r19521P75604p09702m253679l454739Q02611J495427
4830f160881j282565r19725K621234L101507O74826J415234M707719L969770k99442
4821G827677j088936J498499K71373m841666n798005j007669K062676P78909R94378
$$ plain form
4877 6919039 12243747 -2866336 -16600879 -9636124 -27657180 -135881335 -302645897
4870 -302645897 -397662637 -341089247 -201333751 -102181445 -77992656 -73764692 -52584906
4863 -52584906 -34119536 -35471940 -38263556 -27427334 -16646389 -18163253 -21124344 -15728499
4855 -15728499 -11333600 -15538893 -18470776 -12276230 -6415233 -9750713 -14581517 -11767408
4847 -11767408 -6718851 -7342049 -9042466 -4512897 2206499 3388426 676377 -10053
4839 -10053 868563 103118 -816403 -40799 -750501 -5004180 -8458919 -7656308 -6160881
4830 -6160881 -7443446 -8363171 -5741937 -2640430 -1965604 -550370 4157349 8127119 7827677
4821 7827677 6738741 8237240 8508613 3666947 -2131058 -3138727 -1076051 -297142 697236
4812F97236M238544M071978j120985m008680j414119K28735k364188k591951L590522
4803A327092Q933838O141846p76125m016901l512339l390996l226106o28750K087013
4794B938572J183969j627731j650112J750251N155884N917831L501508j237660
4786A5932512n170561m480182P0543K842965Q09314k525935l227751k454757k629459
4777h33311k656284j118241k99173k355713m536056k916107J319519L704643K915725
4768f774998J363192O83566M19064L84865J008862J678048J381133O32583O19053
4759A395368R74648M02078r81546j770013j437199q07758m88425r4080Q62012
4750a944915K100982K818327K527202J450002j05360k334676m863675n458951
$$ plain form
4812 697236 4935780 9007758 7886773 3878093 2463974 2692709 328521 -2263430 1327092
4803 1327092 10260930 16402776 15626651 11609750 8097411 4706415 1480309 851559 2938572
4794 2938572 4122541 2494810 844698 2594949 7750833 13668664 17170172 15932512
4786 15932512 10761951 6281769 6352312 9195277 10004591 7478656 4250905 1796148 -833311
4777 -833311 -3489595 -4607836 -4907009 -7262722 -11798778 -14714885 -13395366 -9690723 -6774998
4768 -6774998 -5411806 -4728240 -4309176 -3924311 -2915449 -1237401 143732 776315 1395368
4759 1395368 2370016 2772094 1790548 20535 -1416664 -2224422 -2712847 -2806927 -1944915
4750 -1944915 156067 2974394 5501596 6951598 6846238 4511562 -352113 -5811064
4742e811064k110925L040776M872036K041413o67156N63696K681201J030824k684905
4733B955896l264620p55015J2101k060271k760379r3781K626824K552556Q37911
4724E1222r62699k845211l261814M19004O215910P659096K482389l545822m522002
4715A690073j717106K48561K76942K4722j97813p55805n23804J101395K224332
4706B371497J395658K15103L32850L92389j258386l272627l496500k139650k92111
4697e751777K064159M023308K849481j689016n008093l387606N96951K146502
4689d156091J289104J488816L123688L233000J019365r24839r36481o6830O09652
4680D679384J095732O71000j717259m663265m896530j740781J357076J019914
$$ plain form
4742 -5811064 -7921989 -4881213 -9177 2032236 1365080 1928776 4609977 5640801 2955896
4733 2955896 -308724 -1063739 -1051638 -3111909 -5872288 -5966069 -3339245 -786689 51222
4724 51222 -911477 -3756688 -7018502 -6599498 -383588 7275508 9757897 6212075 1690073
4715 1690073 -27033 221528 498470 523192 325379 -430426 -954230 147165 2371497
4706 2371497 3767155 3982258 4315108 4707497 3449111 176484 -3320016 -5459666 -5751777
4697 -5751777 -3687618 335690 3185171 1496155 -3511938 -6899544 -6302593 -4156091
4689 -4156091 -2866987 -1378171 1745517 4978517 5997882 5073043 4136562 4069732 4679384
4680 4679384 5775116 6446116 4728857 65592 -4830938 -6571719 -5214643 -4194729
4672d194729j938223l779541k328776P78772K185474P36492j182885q34096J012407
4663i545105J240216o03313j153531J667354M991621M778374J452060r59737m32290
4654A435649R47373M22271j934254l644773k712122K34656K458498K095786M29971
4645b66945Q8110J184884J208725r17955l003891k863182j275163k56908k22600
4636f324925l75008l51553n7814P47924J551024J197814j99566j118116j024826
4627e955046q73931o95067O05606K257726J732622q28810j930272l99134K34722
4618e851584k079879l422933J48316N368024N688767P27706l372123k525861R37650
4609d381917K761024J705245p40526k575167k365565k55031J627409J336813m32796
$$ plain form
4672 -4194729 -6132952 -9912493 -12241269 -11462497 -9277023 -8540531 -9723416 -10557512 -9545105
4663 -9545105 -8304889 -8908202 -10061733 -8394379 -3402758 1375616 2827676 1867939 1435649
4654 1435649 2383022 2805293 871039 -2773734 -5485856 -5251200 -2792702 -696916 -266945
4645 -266945 -178835 1006049 2214774 1296819 -1707072 -4570254 -5845417 -6102325 -6324925
4636 -6324925 -6699933 -7051486 -7109300 -6361376 -4810352 -3612538 -3812104 -4930220 -5955046
4627 -5955046 -6828977 -7524044 -6918438 -4660712 -2928090 -3756900 -5687172 -6086306 -5851584
4618 -5851584 -7931463 -11354396 -11206080 -5838056 -149289 578417 -2793706 -5319567 -4381917
4609 -4381917 -1620893 84352 -656174 -3231341 -5596906 -5851937 -4224528 -2887715 -3320511
4600c320511j496309j141592l57982M2439j44731r66197j530055p6932L294634
4591e697236N426137L768455r5871k708491l031211k343081j581568j207423j950184
4582i420473l123854k096472J820551N071671M515685K069501J143040R53603
4574I33252j123488l670317k994846L99240K466784K167442K072446K701860J771029
4565D723402n73279j277132m7695j41283k158532k396440O24964L097675K039333
4556C891013r6653l1492J081493M67757j402241k324234k360399k985151l914978
4547g674885l653492j973130K99748K635209M147818L261547M2332k566381j890482
4538g371716J056789K951857K173514J99086l36315J741581M727057N154058J549664
$$ plain form
4600 -3320511 -4816820 -5958412 -6316394 -6273955 -6418686 -7384883 -8914938 -8991870 -5697236
4591 -5697236 -271099 3497356 3401485 692994 -2338217 -4681298 -6262866 -7470289 -9420473
4582 -9420473 -12544327 -14640799 -12820248 -7748577 -3232892 -1163391 -20351 933252
4574 933252 -190236 -3860553 -6855399 -6456159 -3989375 -1821933 250513 2952373 4723402
4565 4723402 4150123 2872991 2825296 2684013 525481 -1870959 -1245995 1851680 3891013
4556 3891013 3794360 3762868 4844361 5312118 3909877 1585643 -774756 -3759907 -7674885
4547 -7674885 -11328377 -13301507 -13001759 -10366550 -6218732 -2957185 -2914853 -5481234 -7371716
4538 -7371716 -6314927 -3363070 -1189556 -990470 -1326785 414796 5141853 10295911 11845575
4529A1845575l214858n102423l923308k657714k314135j063241J222730J725185
4521c482189n43152k487300j557773O24098J506284J384705J444599R51305p02732
4512b862155j635019k19062J863366K314909K045521L087231M310631K807497
4504A1712919j230547m353871m455302k817387j537824j249299j590189j984362
4496g505862j621251j13128J592702K034360J062183P3082M27805K019952L197393
4487A167236K148459r52210l459700l117752j028637m4286o13576o65098N17470
4478f048094J372866J403592J978572K815860J425233k178316l969190j652608
4470d852085J519171J689026n659l12768M25000m11209k542511l118230j304395
$$ plain form
4529 11845575 8630717 3528294 -395014 -3052728 -5366863 -6430104 -5207374 -3482189
4521 -3482189 -4025341 -6512641 -8070414 -7446316 -5940032 -4555327 -3110728 -2159423 -2862155
4512 -2862155 -4497174 -4716236 -2852870 -537961 1507560 4594791 8905422 11712919
4504 11712919 10482372 6128501 1673199 -1144188 -2682012 -3931311 -5521500 -7505862
4496 -7505862 -9127113 -9240241 -7647539 -5613179 -4550996 -4477914 -4050109 -2030157 1167236
4487 1167236 3315695 2363485 -1096215 -4213967 -5242604 -5286890 -5900466 -6565564 -6048094
4478 -6048094 -4675228 -3271636 -1293064 1522796 2948029 769713 -3199477 -4852085
4470 -4852085 -3332914 -1643888 -1649547 -1962315 -1537315 -1948524 -4491035 -7609265 -8913660
4461h913660R38542J953218J423222n58978k661173k001954K214667O157885N702970
4452D254739J898176j208540k470179l391794l595306j386664J765504K181993
4444a952071m16477k568246k535046j851547j204614O66929L215936L699583J717605
4435a227948P6164Q2563J10566k32028P60673K218628M25535m408366o397593
4426h591806k446523K420240K504015j45005L8230K983340M097183K371205J118789
4417D349668J382514N73041j931717l170398j743883l7992J49465J94166J243277
4408A008141J939092J398881J009569J163414l74502m178295o425688l883092
4400h342480Q30074K807441J880065J762260L175011K745506o65975l232749j819487
$$ plain form
4461 -8913660 -7975118 -6021900 -4598678 -5157656 -7818829 -9820783 -7606116 -1448231 4254739
4452 4254739 6152915 4944375 2474196 -917598 -4512904 -5899568 -4134064 -1952071
4444 -1952071 -2368548 -4936794 -7471840 -9323387 -10528001 -9861072 -6645136 -2945553 -1227948
4435 -1227948 -1151784 -1069221 -958655 -1190683 -430010 1788618 2214153 -2194213 -8591806
4426 -8591806 -11038329 -8618089 -6114074 -6259079 -6220849 -3237509 859674 3230879 4349668
4417 4349668 5732182 6305223 4373506 1203108 -540775 -578767 -429302 -235136 1008141
4408 1008141 2947233 4346114 5355683 6519097 6144595 1966300 -4459388 -8342480
4400 -8342480 -7512406 -4704965 -2824900 -1062640 2112371 4857877 4191902 959153 -860334
4391h60334J274459K042821O02594M5782J099041J427690j46566j857690j886621
4382A741176o45884N96164J528365K327539K741698K546044K022649J362998K87136
4373A4507885j402840l498520n563733o673997n470582j905700J438975J765008
4365f803504j56739q77555O34878J499099k60414k236790j360955J127461J657795
4356f776724J14417L0008K810472N085247L297801j272016m068111k845392J42676
4347c481622J408498J33607j832030k828071k875865k398997j020198J419341
4339a1475337L770339M890006N224645N498306M759394K041860o88733l92250
4331A3628230K052858K227461j313085m444971l505488o88051m09695k755684
$$ plain form
4391 -860334 414125 2456946 3059540 3105322 4204363 5632053 5485487 3627797 1741176
4382 1741176 1095292 1691456 3219821 5547360 8289058 10835102 12857751 14220749 14507885
4373 14507885 13105045 9606525 4042792 -2631205 -8101787 -10007487 -8568512 -6803504
4365 -6803504 -6960243 -7837798 -7202920 -5703821 -5964235 -8201025 -9561980 -8434519 -6776724
4356 -6776724 -6662307 -6632299 -3821827 1263420 4561221 3289205 -778906 -3624298 -3481622
4347 -3481622 -2073124 -1939517 -3771547 -6599618 -9475483 -11874480 -12894678 -11475337
4339 -11475337 -7704998 -2814992 2409653 7907959 12667353 14709213 14020480 13628230
4331 13628230 15681088 17908549 16595464 12150493 8645005 7956954 7547259 4791575
4323D791575m024437k305631P90541L036505L300940J195817k220816m140596
4315D23898l001170r31177o90531j460412p36196R36021R72161k75209J62184
4306d600431K552930L741839K383029P78969L86744m48232k520195l339960j219987
4297b285294J230075O03802k298775l679527j789254J356849K623398Q07654k238208
4288e669280k977060J15186M038439M339911R02964j890020j362628K28609P7672
4279b196207q58715m27288N42092j49457j893593j960105K60597K417911K586262
4270a678503J518625J307105K905494M951227M688141Q81109l940304n675963
4262D956931l609217j201487j110870j871065j087054N86764J046080L21890j34676
$$ plain form
4323 4791575 767138 -1538493 -747952 2288553 5589493 6785310 4564494 423898
4315 423898 -2577272 -3508449 -4198980 -5659392 -6395588 -5459567 -4487406 -4762615 -4600431
4306 -4600431 -2047501 1694338 4077367 4856336 5243080 4794848 2274653 -1065307 -2285294
4297 -2285294 -1055219 -451417 -2750192 -6429719 -8218973 -6862124 -4238726 -3431072 -5669280
4288 -5669280 -8646340 -8531154 -4492715 -152804 750160 -1139860 -2502488 -2273879 -2196207
4279 -2196207 -3054922 -3482210 -2940118 -3089575 -4983168 -6943273 -6682676 -4264765 -1678503
4270 -1678503 -159878 1147227 4052721 9003948 13692089 14573198 10632894 4956931
4262 4956931 1347714 146227 -964643 -2835708 -3922762 -3335998 -2289918 -1968028 -2102704
4253b102704l00577j018510j716174j348406p19084j233700k058740j157474J370242
4244a0285127L552942M672598N438647N374863L028611r10530l512051l427071
4236C932882k459316k365072k219334l67951K459292L556352J378465k519006
4228A396312m702983l177068K92191J866947K25411j736128r64104J447383K100961
4219c251078L64776j126862p00422M73417J021484J187181J226362M46419r66962
4210a325685j229973N23430K583655K838433J299963o63581k258568l141182k620130
4201c993638n97770J383613J522372m9410j553710j948847k094673l260142m961521
4192a5553726n106911l126387k498497p625966j6482862j9058570p594116J2009837
$$ plain form
4253 -2102704 -2403281 -3421791 -5137965 -6486371 -7205455 -8439155 -10497895 -11655369 -10285127
4244 -10285127 -6732185 -2059587 3379060 8753923 11782534 10872004 7359953 3932882
4236 3932882 1473566 -891506 -3110840 -3478791 -1019499 2536853 3915318 1396312
4228 1396312 -3306671 -6483739 -6191548 -4324601 -4099190 -5835318 -6799422 -5352039 -3251078
4219 -3251078 -2886302 -4013164 -4713586 -4240169 -3218685 -2031504 -805142 -358723 -1325685
4210 -1325685 -2555658 -2032228 551427 3389860 4689823 4026242 1767674 -1373508 -3993638
4201 -3993638 -4591408 -3207795 -1685423 -1734833 -3288543 -5237390 -7332063 -10592205 -15553726
4192 -15553726 -20660637 -23787024 -26285521 -33911487 -50394349 -69452919 -77047035 -65037198
4184f5037198K4119856K0504123R025155K328209K574659K708169n64530k798508
4176g140065q39459J718932J126042k23209J507790M599855M535502J317084j092160
4167E510312j348193j640623k395601j276774J697267K923117R02862j158683
4159C213684q34148n00028k646078m683314k637707K292562N249703M432322K144004
4150F031000M4721k348884m581655m768600k708759j91068J964392L819157L545616
4141H05920q45579o442887o974889j246204M391821M493401J373332M12301K187545
4132a845239L188251J739229p81863k923293l903660k921628q07413n39956k866244
4123a1661816l536903J046692P250002Q116836K961214k066338k954203k036698
$$ plain form
4184 -65037198 -40917342 -20413219 -11388064 -9059855 -6485196 -3777027 -4341557 -7140065
4176 -7140065 -7979524 -6260592 -5134550 -5357759 -3849969 749886 5285388 6602472 5510312
4167 5510312 4162119 2521496 125895 -1150879 546388 3469505 4372367 3213684
4159 3213684 2379536 1879508 -766570 -5449884 -8087591 -5795029 -545326 3886996 6031000
4150 6031000 6075721 3726837 -854818 -5623418 -8332177 -8523245 -6558853 -2739696 805920
4141 805920 -39659 -6482546 -13457435 -14703639 -10311818 -5818417 -4445085 -4032784 -1845239
4132 -1845239 1343012 3082241 2300378 -622915 -4526575 -7448203 -8255616 -8795572 -11661816
4123 -11661816 -15198719 -14152027 -6902025 1214811 4176025 2109687 -844516 -2881214
4115b881214k160522j969937K76478K360934J281118j694670k738323j011120
4107h537256O26844J05647j266412j123319Q67043L060990L968487L338370J464842
4098B505236j375427m122634m558871j496146K654490L569846J70631l778584
4090f431459m474292k485001n68283P75507K712720M482438L868126J029254j185536
4081b276526j068676K72315J365017K173558K942136L191896K484005R18343j142397
4072H859671k762612k586838p80679K83907q30329k173869j461195N8653j20497
4063a513788j224286q51167J20078j019430l065179j911149K307890M481576K212191
4054d63264r03350j490663q92127j107178j097633o6654J00998j054589l98918
$$ plain form
4115 -2881214 -5041736 -7011673 -6735195 -4374261 -3093143 -4787813 -7526136 -8537256
4107 -8537256 -7910412 -7804765 -9071177 -10194496 -9327453 -6266463 -2297976 1040394 2505236
4098 2505236 1129809 -2992825 -7551696 -9047842 -6393352 -2823506 -2652875 -6431459
4090 -6431459 -10905751 -13390752 -13959035 -13183528 -10470808 -5988370 -2120244 -1090990 -2276526
4081 -2276526 -3345202 -3072887 -1707870 465688 3407824 6599720 9083725 10002068 8859671
4072 8859671 6097059 3510221 2729542 3013449 2183120 9251 -1451944 -1393291 -1513788
4063 -1513788 -2738074 -3589241 -3469163 -4488593 -7553772 -9464921 -7157031 -2675455 -463264
4054 -463264 -1366614 -2857277 -3749404 -4856582 -5954215 -6020869 -5919871 -6974460 -7373378
4045g373378L163029N219542K497993r94902J63645M000058M295358N34022j800778
4036I704589l49455J053949n38988k545908j597715J064585J754953m15535k934828
4027E195647l457299k212972j058034r96104j046945J03350J756028J936869N51739
4018G72279l08851J58377L07188m41290j6554K255536L227410O41093k559655
4009D035533k374539J28789R95077j91251n77145N57158J275004J022699O80719
4000E552044o27689l944605o304656l631705K015776L852249J46190l072857j099091
3991g114344L046003M212595K340257L91178j060896k973738m169622k615716
3983g944283R11086L469726L380596J145881j579445k443789M8155L766293M221890
$$ plain form
4045 -7373378 -4210349 1009193 3507186 2512284 2675929 6675987 10971345 11505367 9704589
4036 9704589 9355134 10409083 9870095 7324187 5726472 6791057 8546010 8130475 5195647
4027 5195647 1738348 -474624 -1532658 -2528762 -3575707 -3472357 -1716329 220540 772279
4018 772279 463428 621805 928993 487703 471149 2726685 5954095 6595188 4035533
4009 4035533 1660994 1789783 2784860 2593609 2016464 2573622 3848626 4871325 5552044
4000 5552044 4924355 979750 -5324906 -8956611 -6940835 -3088586 -2942396 -6015253 -7114344
3991 -7114344 -4068341 144254 2484511 2875689 1814793 -1158945 -5328567 -7944283
3983 -7944283 -7033197 -3563471 -182875 963006 -616439 -3060228 -3012073 754220 4976110
3974D976110N65070k440976q78423K759703L535588R32874j878696l337808l892939
3965C40503k895108K53216K777714J147137l080476m620964k117464J68920n50818
3956h577340j466608N72571L714042M296327K492193J144803Q72014O5155j222992
3947A890165j148504J54235J13524k104151l867527k990152r81902m33330j020281
3938a0387923o28511O83708Q14162m52432p12922R80667K164139R10973o26536
3929g254675O42177L554928L967226R06036j875660j284654J039045J591590k22246
3920A063767k149828k506010j493800J23032J762022K619859K038051M32947j044259
3911H45781j723967j576451n05184J454352L251611L239998J025425j635971k408692
$$ plain form
3974 4976110 5541180 3100204 2221781 4981484 8517072 9449946 7571250 4233442 340503
3965 340503 -2554605 -2301389 476325 1623462 -1457014 -6077978 -8195442 -8026522 -8577340
3956 -8577340 -10043948 -9471377 -5757335 -1461008 1031185 2175988 3048002 3113157 1890165
3947 1890165 741661 895896 1009420 -1094731 -4962258 -7952410 -8934312 -9367642 -10387923
3938 -10387923 -11016434 -10332726 -9518564 -9970996 -10683918 -9703251 -7539112 -6628139 -7254675
3929 -7254675 -6612498 -3057570 909656 1815692 -59968 -1344622 -305577 1286013 1063767
3920 1063767 -1086061 -3592071 -5085871 -4962839 -3200817 -580958 1457093 1890040 845781
3911 845781 -878186 -2454637 -2959821 -1505469 1746142 4986140 6011565 4375594 1966902
3902A966902q47475J120562J483305N66422L15201J108986P88572j972606m689049
3893a59180l749687L13185K929065J491587j300009j550627N81657J975189J452296
3884A983476Q99465J760676K831236K208597q4039k222470k504802o75471J979635
3875F176303L445623K490857j12720k212850k537550k020645k309148l217511
3867b97641k795240m02429J604931Q21183j447330j818283j05047L25256j487151
3858e601751j662881K161523N725003M021406l86714r36458K361997K999439q84886
3849G796678l105459Q7183L500670J779521j704231j188176J338026J67264l299832
3840E371644k617605J944157K825395k346697o158230k715762L393345M272917
$$ plain form
3902 1966902 1119427 2239989 3723294 4289716 4604917 5713903 6502475 4529869 -159180
3893 -159180 -3908867 -3595682 -666617 824970 -475039 -2025666 -1444009 531180 1983476
3884 1983476 2882941 4643617 7474853 9683450 9599411 7376941 4872139 4196668 6176303
3875 6176303 9621926 12112783 12000063 9787213 7249663 5229018 2919870 -297641
3867 -297641 -3092881 -3495310 -1890379 -1069196 -2516526 -4334809 -4439856 -4114600 -5601751
3858 -5601751 -7264632 -5103109 621894 4643300 4256586 3320128 5682125 8681564 7796678
3849 7796678 4691219 4778402 8279072 10058593 8354362 7166186 8504212 8671476 5371644
3840 5371644 2754039 4698196 7523591 5176894 -981336 -3697098 -303753 3969164
3832C969164j93344l773133l163900n99531J121618J554838J064451K1614m17877
3823d16100O16502J920897J615685M3237p71949k95479m3232q99824j757707j313701
3813a301671J29092J257233J360162Q68061N78549N67056K5069j484155k896290
3804h96894k700090j083597J91638K58506P9458N06466J008832J080832J287780
3795b67069J877467J930293J123768P48831J459056J572931m81371l322492m318223
3786C23191l125260j412106l3331J128007J383761J90252n82842J357720M245638
3777C475030L412544j740771n417149k639841L781817O789512M071148j20358
3769A1611932j729217j579482k123335k838207j545586J395645L192305K570163
$$ plain form
3832 3969164 3775820 2687 -3161213 -3760744 -2639126 -1084288 -19837 1777 -416100
3823 -416100 200402 2121299 3736984 3780221 3008272 2712793 2669561 1769737 12030 -1301671
3813 -1301671 -1172579 84654 1444816 2312877 2891426 3458482 3483551 1999396 -896894
3804 -896894 -3596984 -4680581 -4488943 -4230437 -4150979 -3644513 -2635681 -1554849 -267069
3795 -267069 1610398 3540691 4664459 5413290 6872346 8445277 7963906 4641414 323191
3786 323191 -2802069 -4214175 -4247506 -3119499 -1735738 -1545486 -2128328 -770608 3475030
3777 3475030 6887574 5146803 -270346 -2910187 871630 7661142 11732290 11611932
3769 11611932 9882715 8303233 6179898 3341691 1796105 3191750 6384055 8954218
3761H954218J023001k33705k005762m513917n265117k031228K990800M822855
3753C741145J887550j830769j971613O97457J774535p86307m292507n015313k581502
3744h377324J90156R54272K06049o4497P94379J461510P53033p00721j579565
3735f362708j799420k068973k069122p73090J409127K613743K105962J146240
3727e798241O51720o2680j174807j115737Q18758K498238J857504K33846J72670
3718a918729J166511P95637n75151j7897K681867L797634J227124j996949k086957
3709C073090R6793Q13100r85136k772020k472500p06876R88361J969920K081488
3700B086220J147903m07802j504722j573134j168633j084225j310698j111911
$$ plain form
3761 8954218 9977219 9743514 7737752 3223835 -2041282 -4072510 -1081710 3741145
3753 3741145 5628695 3797926 1826313 2523770 4298305 3511998 -780509 -5795822 -8377324
3744 -8377324 -8187168 -7232896 -7026847 -7091344 -6296965 -4835455 -4082422 -4783143 -6362708
3735 -6362708 -8162128 -10231101 -12300223 -13073313 -11664186 -9050443 -6944481 -5798241
3727 -5798241 -5146521 -5209201 -6384008 -7499745 -6680987 -4182749 -2325245 -2091399 -1918729
3718 -1918729 -752218 43419 -531732 -549629 2132238 5929872 7156996 5160047 3073090
3709 3073090 3169883 3982983 2997847 225827 -2246673 -2953549 -1965188 4732 2086220
3700 2086220 3234123 2826321 1321599 -251535 -1420168 -2504393 -3815091 -4927002
3692d927002O6493J750311K520554J434714n37836j333367l86099O57317M43205
3683c11710j48325K86680J210468R95156n66585k275918l350242l423714j547193
3674i131383K317459N137012L208606k530205o413979m737428j59464K411469
3666i897913K124179J750392K443094K280301J12377k031800j656097P35755K369077
3657a770635J808171O12704J126662L243814M272068K434952l80785q33170J167293
3648A1681074K051558l92382l787954m598186k927904j575010j642714j941884
3640c133402k053583k760016l262176j239777L140857N974311M135608p50980
3632E0842m454866m800488k776726m31866P19861K59603o75199l33129J152199
$$ plain form
3692 -4927002 -4860509 -3110198 -589644 845070 307234 -1026133 -1412232 -754915 -311710
3683 -311710 -460035 -173355 1037113 2032269 1465684 -810234 -4160476 -7584190 -9131383
3674 -9131383 -6813924 -1676912 1531694 -998511 -7412490 -12149918 -12309382 -9897913
3666 -9897913 -7773734 -6023342 -3580248 -1299947 -1187570 -3219370 -4875467 -4139712 -1770635
3657 -1770635 37536 650240 1776902 5020716 9292784 11727736 11346951 10513781 11681074
3648 11681074 13732632 13340250 9552296 4954110 2026206 451196 -1191518 -3133402
3640 -3133402 -5186985 -7947001 -11209177 -12448954 -9308097 -3333786 801822 50842
3632 50842 -4404024 -9204512 -11981238 -12413104 -11693243 -11433640 -12108839 -12441968 -11289769
3623a1289769J458236m17639j902321j48324L566733N248415L552164J229682
3615A297177J002026K240909K537324Q96892j604638l289145l192134j608734
3607a720323R8647O71864J82996k70544r554O13781Q97899N29392j81333l74674
3597D38151O02174K061532K352520J000548n40767j116640j481064k350214k451103
3588a484863o31842J450414J474542L08696N35122J698878P94312k271603l727037
3579a853381j650357J132260J684842R44046O91905k2726k202213l473440j263113
3570f012177K429727L415485J361963m17182n36506q25730j955019j810476O33718
3561c716197L071018L031349R20893j384457k830112k833322p89636K415643M006919
$$ plain form
3623 -11289769 -9831533 -10249172 -12151493 -12299817 -8733084 -3484669 67495 1297177
3615 1297177 2299203 4540112 7077436 7974328 6369690 3080545 -111589 -1720323
3607 -1720323 -1621676 -949812 -766816 -1037360 -1046914 -433133 464766 994158 812825 438151
3597 438151 1040325 3101857 5454377 6454925 5914158 4797518 3316454 966240 -1484863
3588 -1484863 -2116705 -666291 808251 1116947 1652069 3350947 4145259 1873656 -1853381
3579 -1853381 -3503738 -2371478 -686636 257410 949315 926589 -1275624 -4749064 -6012177
3570 -6012177 -3582450 -166965 1194998 777816 241310 -584420 -2539439 -4349915 -3716197
3561 -3716197 -645179 2386170 3307063 1922606 -907506 -3740828 -4530464 -2114821 1892098
3552A892098K184781j502458l920167l713064j935098j55969R48389J485188J613150
3543c103150J018067o63034k543429k503705J51859K812959K365328n02895k236157
3534e204157j577564p99399j206998q76282J444664L446292K890904J455065J751423
3525A323948K621648J127146k087072l448551k065432p21368r50339r58655M60437
3516d698238J483271N40904q94086j020275p76607j635860k274809m88895K674535
3507g090060L911477K618447J812851L426574N338989M578472J550651q81557
3499A5265844j459011j566600k473031l543620l753846l394066l183018k739205
3491f846553j302493N50337J360449Q65872K37389J06772j40103o50368l46540
$$ plain form
3552 1892098 4076879 2574421 -1345746 -5058810 -6993908 -7149877 -6201488 -4716300 -3103150
3543 -3103150 -2085083 -2748117 -5291546 -7795251 -7643392 -4830433 -2465105 -2968000 -5204157
3534 -5204157 -6781721 -7581120 -8788118 -9664400 -8219736 -4773444 -1882540 -427475 1323948
3525 1323948 3945596 5072742 2985670 -462881 -2528313 -3249681 -4200020 -5158675 -4698238
3516 -4698238 -3214967 -2674063 -3568149 -4588424 -5365031 -7000891 -9275700 -9764595 -7090060
3507 -7090060 -3178583 -560136 1252715 4679289 10018278 14596750 16147401 15265844
3499 15265844 13806833 12240233 9767202 6223582 2469736 -924330 -4107348 -6846553
3491 -6846553 -8149046 -7598709 -6238260 -5372388 -5134999 -5028227 -5168330 -5818698 -6165238
3482f165238J089014J980475R31891q36872j218235l29528K37128N63820K086448
3473a661097M122445L778719M33124k401211j610218J156164J985301J90288j306085
3464D687430m75899J507465K640120K545319J835396O83418r52563k641666l804098
3455F024922m104470l154147p31172K097185L020469Q40134k470141l252863k10092
3446a940175L727946M426424J309614j917516j800601O60271J656454j74017k149852
3437C798548j596530N35766J404073J46504j635462k343683j698128k29366R88715
3428f29563O32352j343478k997259k682029j299644n99954k12738J292741L141190
3419d698382L058256J098514k62226r0462J06890q4166Q56845K605550K259620
$$ plain form
3482 -6165238 -5076224 -3095749 -2163858 -3000730 -4218965 -4548493 -4311365 -3747545 -1661097
3473 -1661097 2461348 6240067 6673191 4271980 2661762 3817926 5803227 5993515 4687430
3464 4687430 4211531 5718996 8359116 10904435 12739831 13423249 12470686 9829020 6024922
3455 6024922 1920452 -1233695 -1964867 132318 3152787 3992921 1522780 -1730083 -1940175
3446 -1940175 1787771 6214195 7523809 5606293 3805692 4465963 6122417 5948400 3798548
3437 3798548 2202018 2737784 4141857 4288361 2652899 309216 -1388912 -1618278 -629563
3428 -629563 2789 -1340689 -4337948 -7019977 -8319621 -8919575 -9132313 -7839572 -4698382
3419 -4698382 -1640126 -541612 -803838 -894300 -787410 -871576 -14731 2590819 4850439
3410D850439o39999k194501q9116K159718O04800k658251k991979p21555K00705
3401a479739m94217N71385L249813K998190j344612m624024k939300O50900J466525
3392a945079K57751P03217K761250L222760J411365j62580m34943j069734k756873
3383A987134l695093k752414j372103j027929r53047N9837J197651P57912j036275
3374f834327k051335j101993M72483O81036l81432o53615J016548L151681L498662
3365b202292J833457j28795j008578n91322J031591L200885L772006R43660l433064
3356C417548m909743k005447J638525K230360N94262j55729N03051Q03790L51796
3347B468413L40928Q38380P56576K26039M35838J325909J747678J563678J313773
$$ plain form
3410 4850439 4210440 2015939 1926823 4086541 4691341 2033090 -958889 -1680444 -1479739
3401 -1479739 -1973956 -1402571 1847242 4845432 3500820 -1123204 -4062504 -3411604 -1945079
3392 -1945079 -1687328 -984111 1777139 4999899 6411264 6248684 5813741 4744007 1987134
3383 1987134 -1707959 -4460373 -5832476 -6860405 -7813452 -7753615 -6555964 -5798052 -6834327
3374 -6834327 -8885662 -9987655 -9515172 -8834136 -9215568 -9869183 -8852635 -5700954 -2202292
3365 -2202292 -368835 -497630 -1506208 -2097530 -1065939 2134946 5906952 6850612 3417548
3356 3417548 -1492195 -3497642 -1859117 371243 965505 809776 1312827 2116617 2468413
3347 2468413 2809341 3647721 4404297 4630336 5066174 6392083 8139761 9703439 11017212
3338A1017212M15643j706163l376952k580082n78980k54373j255108q18030O16396
3329A479563n50342m346821n653268j761443L086740L941693J847656N15504Q2402
3320a358316j106221j539102J101751M424247L865871N4866j870330l39775P19936
3311C952927j048242k727813j453526J113019K168503J865965J352091L2535k269185
3302B986274l261594j435553Q98826Q83601n81637r26517m58786j314899l105593
3293f315878l241894j142121J091836K030527K155556J964295J496962J459255
3285e01462K154887J771479j262544m634547m350468n48255K637256L265195L381105
3276A912646L783418J921424k708035n706390l799435L9394J414634J123810K353315
$$ plain form
3338 11017212 11432855 9726692 6349740 3769658 3190678 2936305 1681197 863167 1479563
3329 1479563 929221 -3417600 -9070868 -10832311 -7745571 -3803878 -1956222 -1440718 -1358316
3320 -1358316 -2464537 -4003639 -2901888 1522359 5388230 5443096 3572766 3232991 3952927
3311 3952927 2904685 176872 -1276654 -163635 2004868 3870833 5222924 5255459 2986274
3302 2986274 -275320 -1710873 -812047 71554 -510083 -1436600 -1895386 -3210285 -6315878
3293 -6315878 -9557772 -10699893 -9608057 -7577530 -5421974 -3457679 -1960717 -501462
3285 -501462 1653425 3424904 2162360 -2472187 -6822655 -7370910 -4733654 -1468459 1912646
3276 1912646 5696064 7617488 4909453 -796937 -4596372 -4556978 -3142344 -2018534 334781
3267C34781M071381K770850p20553j954664j6373J603313J540279K181647L552201
3258A3362862J616597m433936q543026n748905J02112J497526k378081n457375
3250i982226l753026L80304K974803L119657J880691M653j600172j399346R48353
3241g426309L508381M063608K470496L20370j025201j431253j501803j580522
3233b602233j191769L44201K509476L395395J677482j538049l617180l030261
3225d052938o41251J263511Q63550j613996l691979k830003N62379L221083K844908
3216d074736P02126m90324J4358J020463J595294J515095L87009j803902l680515
3207d815132l583783j469790J338842L607185M403583L081209N06363r01866k6701
$$ plain form
3267 334781 4406162 7177012 6456459 4501795 4485422 6088735 7629014 9810661 13362862
3258 13362862 14979459 10545523 2002497 -3746408 -3644296 -2146770 -4524851 -9982226
3250 -9982226 -13735252 -13354948 -10380145 -7260488 -5379797 -5375144 -6975316 -8374662 -7426309
3241 -7426309 -3917928 145680 2616176 2936546 1911345 480092 -1021711 -2602233
3233 -2602233 -3794002 -3449801 -940325 2455070 4132552 2594503 -1022677 -4052938
3225 -4052938 -4694189 -3430678 -2567128 -4181124 -7873103 -10703106 -10140727 -6919644 -4074736
3216 -4074736 -3372610 -3862934 -3848576 -2828113 -1232819 282276 669285 -1134617 -4815132
3207 -4815132 -8398915 -9868705 -8529863 -4922678 -519095 2562114 3068477 2166611 2139910
3198B139910J225725P17806q59534j601408j324273n96313J194294L908752M802464
3189I607423K134619j226789j824413j259891k862377m573199j646666M170095
3181B518802N583707R77614k799502j414903N16608j918618n515339m709141n10428
3172g271200K336040L057552L670013L452684Q45083j709724j016668Q01964l56595
3163C809149k938382k044913J658540K349503j442679m447628l020216R7244J232860
3154d746522P78829N42843N04944L66493P10619J059585K38875m54320J462610
3145D63956M399523L618335j132107m205959k585622l97369j634275l674701k547709
3136g695928m2287k4247j109218Q11223M699657N253040J203072k785749l010095
$$ plain form
3198 2139910 3365635 4083441 3223907 1622499 298226 -298087 896207 4804959 9607423
3189 9607423 11742042 10515253 8690840 7430949 4568572 -4627 -1651293 2518802
3181 2518802 8102509 9080123 6280621 4865718 5382326 3463708 -2051631 -6760772 -7271200
3172 -7271200 -4935160 -1877608 1792405 5245089 6090172 4380448 3363780 4165744 3809149
3163 3809149 870767 -1174146 484394 2833897 1391218 -3056410 -6076626 -5979382 -4746522
3154 -4746522 -3967693 -3424850 -2919906 -2553413 -1842794 -783209 -544334 -998654 463956
3145 463956 4863479 8481814 7349707 3143748 558126 160757 -1473518 -5148219 -7695928
3136 -7695928 -7738215 -7762462 -8871680 -8060457 -3360800 1892240 3095312 309563 -2700532
3127b700532q57966Q39667J441762J114096o16592l010642l434433n71072L300393
3118d495319M856990L477393J232750J4586j95655n31766j479494k119776j302292
3109e42583M58673J109897l53022k360835k771658j489728P4757J176413J770001
3100b928085J213481r09386k809187j602461K807264O592260N965472J501170
3092I830528k596287l289959j770536j298438k703263l393471j291354J811284
3084d701496K596857R86436l9187O53614O83894j503517l553997k582724N31658
3075f928462K663884K664677J637096L28158j150158j897053j061967M35648J203949
3066b104228J677688K899771L898811K918191O50670n46177l35085m79851j411321
$$ plain form
3127 -2700532 -3558498 -2718831 -1277069 -162973 -779565 -3790207 -7224640 -7795712 -4495319
3118 -4495319 361671 3839064 5071814 5086400 4890745 4358979 2879485 759709 -542583
3109 -542583 -83910 1025987 672965 -1687870 -4459528 -5949256 -5874499 -4698086 -2928085
3100 -2928085 -1714604 -2623990 -5433177 -7035638 -4228374 2363886 8329358 9830528
3092 9830528 7234241 3944282 2173746 875308 -1827955 -5221426 -6512780 -4701496
3084 -4701496 -2104639 -1118203 -1157390 -503776 180118 -1323399 -4877396 -7460120 -6928462
3075 -6928462 -4264578 -1599901 37195 365353 -784805 -2681858 -3743825 -3308177 -2104228
3066 -2104228 -426540 2473231 6372042 9290233 9940903 9394726 9059641 8579790 7168469
3057G168469j673039r29266n39457p27422j65104R82455O77043j272548k108795
3048A412336k59138K107443K425266J249581M75374J65419o16149j443068j279938
3039D237126m99883j57360r3357N00208J350838J470289O56116n40833j619565
3030E303579j983718j070932M13385P45916k17217l60372J238712K050460l36902
3021E782911l805522l887034M2974L677885L347070K46852j889214j538442l66402
3012A611078k65223q23455k10540J782337K623412J41555l676085m164288n4544
3003c035753M183766L877766J38580k201097j302959J24277l86585j851455k058213
2994b511673n97310J297153K309444J758452K7595j407081j510333j012529q05444
$$ plain form
3057 7168469 5495430 4566164 4026707 3299285 3134181 4116636 4793679 3521131 1412336
3048 1412336 1153198 3260641 5685907 6935488 7410862 7576281 6960132 5517064 4237126
3039 4237126 3737243 3579883 3486526 3986734 5337572 6807861 7463977 6923144 5303579
3030 5303579 3319861 2248929 2662314 3408230 3191013 2830641 4069353 6119813 5782911
3021 5782911 1977389 -1909645 -1866671 1811214 5158284 5405136 3515922 1977480 1611078
3012 1611078 1345855 522400 311860 2094197 4717609 4859164 1183079 -2981209 -3035753
3003 -3035753 1148013 5025779 5164359 2963262 1660303 1784580 1397995 -453460 -2511673
2994 -2511673 -3108983 -1811830 497614 2256066 2283661 876580 -633753 -1646282 -2451726
2985b451726J60196K945704N153454K847003l351592p485009n334647L80462L865875
2976c270280L075931M92678j059301r47633j71726j97997j519388k292371q3364
2967e973451L875410M800685Q84699l144259k315941J249748J766376j174000
2959c0733k466356j77645J503782m30355k908564k209334k9903j87819k201066
2950i137993k482686l52452J304980Q91167o8339j83444j59884o59182o96058
2941a1543891N32949J903075J893498J039188J509415M120693O517955N229546
2933A1202428R254m722113m392240j05690K305951j58982l672521l120614O98992
2924a955535K626021N98394k182757k530017j104566O4919Q49641K003835L020695
$$ plain form
2985 -2451726 -2291530 654174 5807628 8654631 5303039 -2181970 -7516617 -7136155 -3270280
2976 -3270280 -194349 298329 -760972 -1708605 -1880331 -2078328 -3597716 -5890087 -5973451
2967 -5973451 -2098041 2702644 3587343 443084 -1872857 -623109 1143267 -30733
2959 -30733 -2497089 -2674734 -1170952 -1601307 -4509871 -6719205 -6749108 -6936927 -9137993
2950 -9137993 -11620679 -11973131 -10668151 -9776984 -9845323 -10028767 -10188651 -10847833 -11543891
2941 -11543891 -11010942 -9107867 -7214369 -6175181 -4665766 -545073 5972882 11202428
2933 11202428 11211682 6489569 2097329 1991639 4297590 4138608 466087 -2654527 -1955535
2924 -1955535 670486 1268880 -913877 -3443894 -4548460 -4483541 -3633900 -1630065 1390630
2915A390630K992692K270986J519565J70996k368488m632376m183717r82209J886082
2906a935839J669090o84494j724667K2042K062134J353481j277993k101705K08861
2897b409090K710381K650487J250506R33196R99365p91229l667425m495201k622230
2888e441240n79302K29501J091156K608682L171720K000990O84730K95200j90104
2879C871333j142263q85509J104496K331225P63797k105745l707254l630810k507013
2870e907743k31762K382072K793191L61371j532095L0003L019190L547381J354399
2861E816007j066722k717755l791366l135187j99992K138679J156935q24222j1074
2852b634697J856974O2428m112332l956996J870706O062391L227590k244652l136568
$$ plain form
2915 1390630 4383322 6654308 8173873 8344869 5976381 1344005 -2839712 -3821921 -1935839
2906 -1935839 -266749 -951243 -2675910 -2653868 -591734 761747 -516246 -2617951 -2409090
2897 -2409090 301291 2951778 4202284 5135480 6134845 5343616 1676191 -2819010 -5441240
2888 -5441240 -6020542 -5791041 -4699885 -2091203 1080517 3081507 3766237 4061437 3871333
2879 3871333 2729070 1843561 2948057 5279282 6043079 3937334 230080 -3400730 -5907743
2870 -5907743 -6139505 -3757433 -964242 -602871 -2134966 -2104963 914227 4461608 5816007
2861 5816007 4749285 2031530 -1759836 -4895023 -5095015 -2956336 -1799401 -2623623 -2634697
2852 -2634697 -777723 -715295 -4827627 -8784623 -6913917 -851526 2376064 131412 -3005156
2843c005156N36992L321916K714777O17539j345144k917481k819277K2245L176665
2834C03076K848898m55945k198710m49819J293120m93556l987663m444164n54221
2825h138984L961556M933128K222523q86270j761275q81613l79818j209605k462008
2816d602366k877576k019498j41991K065400L518394L424107K147439Q25825J81844
2807B521578K07350N62510N77968m32554j922002k146044p14056J76418j096100
2798b264932k583449j537542J027332J810333M66463m13789j98678p30765j672690
2789f097717k23690L231377M188771J020505j875652r53785J080973O61527k50802
2780G81507J703166M274804K877472j180743k187769Q16910K638778M21129k238747
$$ plain form
2843 -3005156 -2468164 853752 3568529 4186068 2840924 -76557 -2895834 -2873589 303076
2834 303076 3151974 2696029 497319 47500 1340620 847064 -3140599 -7584763 -8138984
2825 -8138984 -4177428 755700 2978223 2091953 330678 -550935 -930753 -2140358 -4602366
2816 -4602366 -7479942 -9499440 -9641431 -7576031 -4057637 -633530 1513909 2339734 2521578
2807 2521578 2728928 3291438 3869406 3436852 1514850 -631194 -1345250 -1168832 -2264932
2798 -2264932 -4848381 -6385923 -5358591 -3548258 -3081795 -3495584 -3694262 -4425027 -6097717
2789 -6097717 -6321407 -3090030 1098741 2119246 243594 -710191 370782 1032309 781507
2780 781507 2484673 6759477 9636949 8456206 6268437 7085347 9724125 10145254 7906507
2771G906507j686212Q1211q67561m217037o154560m580077r96963J923717K782528
2762e808447J841890K46830j054212j866757k135047j329688O58727K477274K403759
2753d565671L97407j871526k809728k005986j93742J075485O41031m83268J74040
2744i641958K917218M730654L455173J127187O52686J042387o20711l681469m382974
2735d401807j689466J199657J741529R84819N97680J67631r28486j513421l71490
2726d213354J624345K708689K402857J405896L23960o10898j295021j729621j718819
2717a101966p50021R97608J990225Q85162j627277l618716l959291k593510k7793
2708i805579K089034J575853j082257k027814Q26197L922259K787982j139735
$$ plain form
2771 7906507 6220295 6301506 5433945 1216908 -4937652 -9517729 -10514692 -8590975 -5808447
2762 -5808447 -3966557 -3719727 -4773939 -6640696 -8775743 -10105431 -9446704 -6969430 -4565671
2753 -4565671 -4168264 -6039790 -8849518 -10855504 -11049246 -9973761 -9332730 -9815998 -9641958
2744 -9641958 -6724740 -1994086 1461087 2588274 3240960 4283347 3662636 -18833 -4401807
2735 -4401807 -6091273 -4891616 -3150087 -2165268 -1567588 -1399957 -2328443 -3841864 -4213354
2726 -4213354 -2589009 119680 2522537 3928433 4252393 3641495 2346474 616853 -1101966
2717 -1101966 -1851987 -854379 1135846 2021008 393731 -3224985 -7184276 -9777786 -9805579
2708 -9805579 -7716545 -6140692 -7222949 -9250763 -8424566 -4502307 -1714325 -2854060
2700b854060k710058q30630Q96085P96094R63260J989976J335600j531951l356576
2691e302260k459979j331009j686443j467447O21189J987019Q01932j96122J740774
2682g292346M385465M058353J388870m19685q11011j336040j681514l83124J459634
2673f31398J020668j863861m143085l510454q14489J457834J706798N59275L67256
2664e851456K365811M194924K456545j888479l915191j687723R51440O19203n75448
2655c330374O03300K796325K766105R73017Q6643J39485m75475j028987K9439
2646B559478J023816q74918m377591n274479k485061J048430L060140L667082
2638a653103K822237J43420k660308k957215j083842J67659p5273j47450N62323
$$ plain form
2700 -2854060 -5564118 -6394748 -5498663 -4702569 -3739309 -1749333 -413733 -1945684 -5302260
2691 -5302260 -7762239 -9093248 -10779691 -12247138 -11625949 -9638930 -8836998 -9033120 -7292346
2682 -7292346 -2906881 1151472 2540342 2120657 1309646 -26394 -1707908 -2091032 -631398
2673 -631398 389270 -1474591 -5617676 -9128130 -9942619 -8484785 -6777987 -6218712 -5851456
2664 -5851456 -3485645 709279 3165824 1277345 -2637846 -4325569 -3374129 -2754926 -3330374
2655 -3330374 -2727074 69251 2835356 3808373 3895016 4034501 3559026 2530039 2559478
2646 2559478 3583294 2708376 -1669215 -6943694 -9428755 -8380325 -5320185 -1653103
2638 -1653103 1169134 1312554 -1347754 -4304969 -5388811 -5221152 -5296425 -5443875 -4881552
2629d881552Q45279N61908R74715K033846K422405K280220K753230L018230J159501
2620A1167782k033297l654086l164459k705932k695043r23878L089948O301251
2612E382286N919328K414219j931564n029474n311656k738590J87091P69093n60596
2603h99863j347078o06161J221392M016010O345595M459322k337457p546112m849303
2594a543655J931304L477083j141805l651272m26794K164043o25469l965520k329264
2585f111349J352305J849695O65844J773854L294016J079516k815116k888272
2577a799507N78089K163354K30718j297890J113J912393K040079P88817p33054
2568C884112k065627k280732o52352J463682K035563J240505O08084K92147l47968
$$ plain form
2629 -4881552 -4036273 -3474365 -2499650 -465804 1956601 4236821 6990051 10008281 11167782
2620 11167782 9134485 5480399 2315940 -389992 -3085035 -4008913 -918965 5382286
2612 5382286 11301614 13715833 11784269 6754795 1443139 -1295451 -1108360 -339267 -899863
2603 -899863 -2246941 -2853102 -1631710 2384300 8729895 13189217 10851760 3305648 -1543655
2594 -1543655 387649 3864732 2722927 -928345 -1355139 808904 183435 -3782085 -6111349
2585 -6111349 -4759044 -2909349 -2243505 -469651 2824365 3903881 1088765 -1799507
2577 -1799507 -1221418 941936 1172654 -125236 -124123 1788270 3828349 4617166 3884112
2568 3884112 1818485 -462247 -1114599 349083 2384646 3625151 4233235 4525382 4177414
2559D177414q01020n99774q03633j691999j208422J279184K421620m5588k540707
2550A87075p58137L003481L305462L84528q99521K11156k97312l080349l766767
2541a710384q43215J412013K47986j236105r7505J376577K18253j900047j752782
2532d285209K90029J756716K065237J824232N22995j975584l586288k526746j58542
2523f073160J083512J074806J173775J586542J667289J475019J197661L71788
2515C557232q39705j218152o73463p81229j620488o66176K863967N128273K413637
2506H163896k936869n011767k085573J574544J798358o90326k506448k216870
2498c911055j067659l08073L92603J589262K235989N96447k730402m264524j748196
$$ plain form
2559 4177414 3376394 2776620 1972987 280988 -927434 351750 2773370 2727782 187075
2550 187075 -571062 2432419 5737881 6122409 5222888 5434044 5136732 2056383 -1710384
2541 -1710384 -2553599 -1141586 -893600 -2129705 -2227210 -850633 -632380 -2532427 -4285209
2532 -4285209 -3995180 -2238464 -173227 1651005 2174000 198416 -3387872 -5914618 -6073160
2523 -6073160 -4989648 -3914842 -2741067 -1154525 512764 1987783 3185444 3557232
2515 3557232 2717527 1499375 825912 44683 -1575805 -2241981 621986 5750259 8163896
2506 8163896 5227027 215260 -1870313 -295769 1502589 812263 -1694185 -3911055
2498 -3911055 -4978714 -5286787 -4894184 -3304922 -1068933 -472486 -3202888 -7467412 -9215608
2489i215608K252052L279772J116126n8370J940799M131951L190592M13120o51278
2480F399156O09275J776482J159570q13659k998472m160313l065219k011K464339
2471A369148K060216n32233k991548m165240l934128j854351J657304L986728
2463d404104K965312K21701q07862K37472O20491p68762j790872p63242J090183
2454c399683K048220K308576K519186J945738m2251k039981k088319m23769Q40700
2445A668417M87879o21338j031733k96907J004809K041769K250013J603615O79698
2436G786222K06592L23872M56319J23055l38535k77112J31218m1928r69273j484437
2426E915993q05509r5333r92229k926747l454830j409576J701960L721312L819741
$$ plain form
2489 -9215608 -6963556 -3683784 -2567658 -2626028 -685229 3446722 6637314 7050434 6399156
2480 6399156 7008431 8784913 9944483 9130824 6132352 1972039 -1093180 -1095191 1369148
2471 1369148 3429364 2897131 -94417 -4259657 -8193785 -10048136 -8390832 -4404104
2463 -4404104 -1438792 -1217091 -2024953 -1787481 -1166990 -1935752 -3726624 -4489866 -3399683
2454 -3399683 -1351463 957113 3476299 5422037 5379786 3339805 1251486 827717 1668417
2445 1668417 2156296 1534958 503225 206318 1211127 3252896 5502909 7106524 7786222
2436 7786222 7992814 8316686 8773005 8896060 8557525 8280413 8411631 8369703 7400430 5915993
2426 5915993 5110484 5015151 4022922 1096175 -2358655 -3768231 -2066271 1655041 5474782
2417E474782K124454r17542l934284m856001k920793L86322L007732L924685K933004
2408E222359N75735j225287o85683P97689k80982l949067n282597j164149M279585
2399a712397M777004N38183k595515j640872O48640J447858J473909J596299L75961
2390D909070k509571m004076j939206J112275J543352K37465P56570L236235M047288
2381G389402J568805j362863j857713q37584o68963j133295k17065K144557L656668
2372H681949K981952J313850N8519j160932l009814m459733m009680k034527j59536
2363a797952J124082K312072K834088J557126o17880j325681m38194l33249j497273
2354A817139j187590J616738L419270J466352j285234n97548K056686J952105
$$ plain form
2417 5474782 7599236 6681694 2747410 -2108591 -5029384 -4643062 -1635330 2289355 5222359
2408 5222359 5798094 4572807 3887124 4684813 4403831 454764 -4827833 -5991982 -1712397
2399 -1712397 3064607 3602790 1007275 -633597 15043 1462901 2936810 4533109 4909070
2390 4909070 2399499 -1604577 -3543783 -2431508 -888156 -650691 105879 3342114 7389402
2381 7389402 8958207 7595344 5737631 4900047 4231084 3097789 2880724 5025281 8681949
2372 8681949 11663901 12977751 13036270 11875338 8865524 4405791 396111 -1638416 -1797952
2363 -1797952 -673870 1638202 4472290 6029416 5411536 4085855 3647661 3314412 1817139
2354 1817139 629549 2246287 5665557 7131909 5846675 5249127 7305813 9257918
2346I257918r15592k079490o22222p70768m087828o013325l122351J183621K056001
2337e114036K23929o67681m59167j301753k304245o24270K937198M325581K316618
2328f67826k8230m49473q6236j30749L23865J578020J763411r823j562220q61625
2318a30886P64857Q80067k84118p07922r9768l4489j020403j673253r42445N44189
2308b704171J598899J589632K89942k039933m091360m233183k284185L56198K562533
2299h955628M238040M881304L187095o12689l493916k769023L00714K226995K131162
2290A134054K086383K534608R59147l185646n668851k916424K068639L362801
2282C74711N95272p91243K075986N422326M620807J74129m229447o332147n545580
$$ plain form
2346 9257918 8342326 6262836 5640614 4869846 782018 -5231307 -8353658 -7170037 -5114036
2337 -5114036 -4890107 -5557788 -6016955 -7318708 -9622953 -10247223 -7310025 -2984444 -667826
2328 -667826 -696056 -1145529 -1231765 -1362514 -1038649 539371 2302782 2292959 730739 -130886
2318 -130886 633971 1514038 1229920 521998 422230 387741 -632662 -2305915 -3248360 -2704171
2308 -2704171 -1105272 484360 774302 -1265631 -5356991 -9590174 -11874359 -11518161 -8955628
2299 -8955628 -4717588 163716 3350811 2738122 -755794 -3524817 -3224103 -997108 1134054
2290 1134054 3220437 5755045 6714192 3528546 -2140305 -5056729 -2988090 374711
2282 374711 969983 178740 2254726 7677052 12297859 12471988 8242541 1910394 -3635186
2273c635186j682202L472503N816372L540505J98330q2908J501382J059916j332340
2264H856372k292665j486297k047714m308975m325873k84169M131498N061018
2256C303195L378850J747718K12681k161275l993975l387523j317528k18184m52019
$$ plain form
2273 -3635186 -5317388 -1844885 3971487 7511992 7710322 7627414 9128796 10188712 8856372
2264 8856372 6563707 5077410 3029696 -1279279 -5605152 -5889321 -1757823 3303195
2256 3303195 6682045 8429763 8642444 6481169 2487194 -900329 -2217857 -2436041 -2888060
$$ [...]
##END NTUPLES=NMR SPECTRUM
##END=
