##TITLE=31Pdec_DE-155_rm_3h
 ,24 sc
 1.6.2026
##JCAMPDX= 6.0         $$ Bruker NMR JCAMP-DX V2.0
##DATA TYPE= NMR SPECTRUM
##DATA CLASS= NTUPLES
##ORIGIN= UXNMR, Bruker Analytische Messtechnik GmbH
##OWNER= root
$$ XWIN-NMR		Version 3.5
$$ Mon Jun  1 15:39:52 2026 Russian Standard Time (UT+4h)  she@DPX200
##.OBSERVE FREQUENCY= 81.013821
##.OBSERVE NUCLEUS= ^31P
##.ACQUISITION MODE= SIMULTANEOUS
##.ACQUISITION SCHEME= undefined
##.AVERAGES= 24
##.DIGITISER RES= 17
##SPECTROMETER/DATA SYSTEM= spect
##.PULSE SEQUENCE= zgpg30
##.SOLVENT NAME= DMSO
##.SHIFT REFERENCE= (INTERNAL, DMSO, 0, 197.392)
##AUDIT TRAIL= $$ (NUMBER, WHEN, WHO, WHERE, WHAT)
$$ ##TITLE= Audit trail, XWIN-NMR		Version 3.5
$$ ##JCAMPDX= 5.01
$$ ##ORIGIN= Bruker BioSpin GmbH
$$ ##OWNER= she
$$ F:/spectra/data/she/nmr/P31/2/pdata/1/auditp.txt
$$ ##AUDIT TRAIL=  $$ (NUMBER, WHEN, WHO, WHERE, WHAT)
(   1,<2026-06-01 15:38:18.82 +0400>,<she>,<DPX200>,
      <created by zg, POWCHK disabled, PULCHK disabled
       configuration hash MD5:
       00 E9 B6 7A A2 85 ED C7 34 08 36 98 17 FE 4E 26
       data hash MD5: 32K
       7B 0D 0C 78 48 AF 30 D0 08 1F 5F AB BA BA AF D7>)
(   2,<2026-06-01 15:38:31.35 +0400>,<she>,<DPX200>,
      <Start of raw data processing
       efp BC_mod = 2 LB = 1.5 FT_mod = 6 PKNL = 1 PHC0 = 1514.118 PHC1 = -221.8995 SI = 64K 
       data hash MD5: 64K
       3B E6 E6 52 74 D3 5E CE 3A EA EF 0A A0 80 7E AC>)
(   3,<2026-06-01 15:38:57.29 +0400>,<she>,<DPX200>,
      <pk PHC0 = -169.2116 PHC1 = 0 
       data hash MD5: 64K
       13 0D F2 5A FF B8 D5 8A 0A 65 6E 94 E5 D9 C1 53>)
(   4,<2026-06-01 15:39:14.46 +0400>,<she>,<DPX200>,
      <pk PHC0 = -1.39994 PHC1 = 0 
       data hash MD5: 64K
       11 97 BC 21 62 D0 F7 8F EA 8F AF 46 9E BA EC 66>)
$$ ##END=
$$ 
$$ hash MD5
$$ 4C F6 A0 34 F3 A3 91 42 3C 5A FC C1 0A D5 DB 16
##$RELAX= 
##$RELAX= 
##$RELAX= 
##$RELAX= 
##$RELAX= 
##$RELAX= 
##$RELAX= 
##$RELAX= 
$$ Bruker specific parameters
$$ --------------------------
##$DU= <F:/spectra>
##$EXPNO= 2
##$NAME= <P31>
##$PROCNO= 1
##$TYPE= <nmr>
##$USER= <she>
##$AMP= (0..31)
100 100 100 100 100 100 100 100 100 100 100 100 100 100 100 100 100 100 
100 100 100 100 100 100 100 100 100 100 100 100 100 100 
##$AQSEQ= 0
##$AQ_mod= 1
##$AUNM= <au_zg>
##$AUTOPOS= <>
##$BF1= 81.014009
##$BF2= 200.13
##$BF3= 200.13
##$BF4= 200.13
##$BF5= 200.13
##$BF6= 200.13
##$BF7= 200.13
##$BF8= 200.13
##$BYTORDA= 1
##$CFDGTYP= 0
##$CFRGTYP= 5
##$CHEMSTR= <none>
##$CNST= (0..31)
1 1 145 1 1 1 1 1 1 1 1 1 1 1 1 1 1 1 1 1 1 1 1 1 1 1 1 1 1 1 1 1 
##$CPDPRG= <waltz16>
##$CPDPRG1= <>
##$CPDPRG2= <waltz16>
##$CPDPRG3= <>
##$CPDPRG4= <mlev>
##$CPDPRG5= <mlev>
##$CPDPRG6= <mlev>
##$CPDPRG7= <mlev>
##$CPDPRG8= <mlev>
##$CPDPRGB= <>
##$CPDPRGT= <>
##$D= (0..31)
0 1 0 0 0 0 0 0 0 0.06 0 0.03 2e-05 3e-06 0 0 0.0002 0 0 0 0 0 0 0 0 0 
0 0 0 0 0 0 
##$DATE= 1780313898
##$DBL= (0..7)
120 120 120 11 120 120 24 19 
##$DBP= (0..7)
150 150 150 150 150 150 150 150 
##$DBP07= 0
##$DBPNAM0= <>
##$DBPNAM1= <>
$$ [...]
##$SUBNAM3= <"">
##$SUBNAM4= <"">
##$SUBNAM5= <"">
##$SUBNAM6= <"">
##$SUBNAM7= <"">
##$SUBNAM8= <"">
##$SUBNAM9= <"">
##$SW= 400.765351723535
##$SWIBOX= (0..15)
0 1 3 0 0 0 0 0 0 0 0 0 0 0 0 0 
##$SW_h= 32467.5324675325
##$TD= 32768
##$TD0= 1
##$TE= 0
##$TE2= 300
##$TE3= 300
##$TEG= 300
##$TL= (0..7)
0 120 53 12 22 120 120 120 
##$TP= (0..7)
150 150 150 150 150 150 150 150 
##$TP07= 0
##$TPNAME0= <>
##$TPNAME1= <>
##$TPNAME2= <>
##$TPNAME3= <>
##$TPNAME4= <>
##$TPNAME5= <>
##$TPNAME6= <>
##$TPNAME7= <>
##$TPOAL= (0..7)
0.5 0.5 0.5 0.5 0.5 0.5 0.5 0.5 
##$TPOFFS= (0..7)
0 0 0 0 0 0 0 0 
##$TUNHIN= 0
##$TUNHOUT= 0
##$TUNXOUT= 0
##$USERA1= <user>
##$USERA2= <user>
##$USERA3= <user>
##$USERA4= <user>
##$USERA5= <user>
##$V9= 5
##$VALIST= <valist>
##$VCLIST= <CCCCCCCCCCCCCCC>
##$VD= 0
##$VDLIST= <DDDDDDDDDDDDDDD>
##$VPLIST= <PPPPPPPPPPPPPPP>
##$VTLIST= <TTTTTTTTTTTTTTT>
##$WBST= 1024
##$WBSW= 4
##$XGAIN= (0..3)
0 0 0 0 
##$XL= 0
##$YL= 0
##$YMAX_a= 15613
##$YMIN_a= -12388
##$ZGOPTNS= <>
##$ZL1= 120
##$ZL2= 120
##$ZL3= 120
##$ZL4= 120
##$ABSF1= 0
##$ABSF2= 0
##$ABSG= 0
##$ABSL= 0
##$ALPHA= 0
##$AQORDER= 0
##$ASSFAC= 0
##$ASSFACI= 0
##$ASSFACX= 0
##$ASSWID= 0
##$AUNMP= <proc_1d>
##$AZFE= 0.1
##$AZFW= 0.5
##$BCFW= 0
##$BC_mod= 2
##$BYTORDP= 0
##$COROFFS= 0
##$CY= -3
##$DATMOD= 1
##$DC= 0
##$DFILT= <>
##$DTYPP= 0
##$F1P= 0
##$F2P= 0
##$FCOR= 1
##$FTSIZE= 65536
##$FT_mod= 6
##$GAMMA= 0
##$GB= 0
##$INTBC= 1
##$INTSCL= 9.790993e-09
##$ISEN= 30
##$LB= 1.5
##$LEV0= 0
##$LPBIN= 0
##$MAXI= 10000
##$MC2= 0
##$MEAN= 0
##$ME_mod= 0
##$MI= 50
##$NCOEF= 0
##$NC_proc= -9
##$NLEV= 6
##$NOISF1= 182.463
##$NOISF2= 159.3651
##$NSP= 0
##$NTH_PI= 0
##$NZP= 0
##$OFFSET= 197.3918
##$PC= 4
##$PHC0= 1343.506
##$PHC1= -221.8995
##$PH_mod= 1
##$PKNL= yes
##$PPARMOD= 0
##$PSCAL= 0
##$PSIGN= 0
##$REVERSE= no
##$SF= 81.014063255964
##$SI= 65536
##$SIGF1= 159.3651
##$SIGF2= -187.1042
##$SINO= 113.3802
##$SIOLD= 16384
##$SREGLST= <1H.CDCl3>
##$SSB= 0
##$STSI= 65536
##$STSR= 0
##$SW_p= 32467.5324675325
##$SYMM= 0
##$S_DEV= 0
##$TDeff= 32768
##$TDoff= 0
##$TI= <>
##$TILT= no
##$TM1= 0
##$TM2= 0
##$TOPLEV= 0
##$USERP1= <user>
##$USERP2= <user>
##$USERP3= <user>
##$USERP4= <user>
##$USERP5= <user>
##$WDW= 1
##$XDIM= 65536
##$YMAX_p= 338121585
##$YMIN_p= -84273761
$$ End of Bruker specific parameters
$$ ---------------------------------
##NTUPLES= NMR SPECTRUM
##VAR_NAME=  FREQUENCY,     SPECTRUM/REAL,   SPECTRUM/IMAG
##SYMBOL=    X,             R,               I
##VAR_TYPE=  INDEPENDENT,   DEPENDENT,       DEPENDENT
##VAR_FORM=  AFFN,          ASDF,            ASDF
##VAR_DIM=   65536,         65536,           65536
##UNITS=     HZ,            ARBITRARY UNITS, ARBITRARY UNITS
##FACTOR=    0.49542278885378, 1,            1
##FIRST=     15991.5117654749, 0,            0
##LAST=      -16476.0207020576, 0,           0
##MIN=       -16476.0207020576, -84273761,   0
##MAX=       15991.5117654749, 338121585,    0
$$ Real data points
##PAGE= N=1
##DATA TABLE= (X++(R..R)), XYDATA
$$ [...]
$$ plain form
46099 -322830 2516035 2943819 -346484 -6603153 -12323595 -13891871 -11163590 -7671189
46091 -7671189 -7057485 -9911708 -14026485 -16618675 -15982605 -12284216 -7652709 -4644645
46083 -4644645 -3779482 -3270937 -1735574 -111527 -125960 -2028178 -4812849 -7445183 -8704608
46074 -8704608 -7256106 -3567117 -567707 -496009 -2028264 -2420168 -1392163 -616290 -396019
46065 -396019 331215 1296200 1259744 884973 2057158 4112641 4059563 1274403 -1338403
46056 -1338403 -2069994 -3007069 -6112309 -9719201 -11343492 -11579922 -12482605 -13780599 -13450046
46047 -13450046 -11076486 -8327265 -6662364 -6282858 -6642202 -6572837 -4774293 -1466727 1379471
46038 1379471 2422080 2188601 1136529 -1346748 -4586277 -5784109 -3803526 -1588491
$$ packed form
46099c22830K838865M27784l290303o256669n720442j568276K728281L492401
46091g671189O13704k854223m114777k592190O36070L698389M631507L008064
46083d644645Q65163N08545J535363J624047j4433j902218k784671k632334j259425
46074h704608J448502L688989K999410P1698j532255l91904J028005P75873K20271
46065c96019P27234R64985l6456l74771J172185K055483n3078k785160k612806
46056a338403p31591r37075l105240l606892j624291k36430r02683j297994L30553
46047a3450046K373560K749221J664901L79506l59344O9365J798544L307566K846198
46038A379471J042609k33479j052072k483277l239529j197832J980583K215035
$$ plain form
46030 -1588491 -2256499 -4863481 -6774228 -7840822 -8737365 -7552448 -2658535 2682823
46022 2682823 3889705 2481017 4211062 9631358 12698774 10317309 7072075 7409283
46014 7409283 8752235 6950753 4169656 5730101 11612352 16595617 17677543 16364220
46006 16364220 14052087 10052560 4909962 1466978 1029031 1411305 257055 -2037911
45998 -2037911 -3923897 -4941751 -4882737 -2691332 1838615 6425963 8253210 7147047
45990 7147047 5339126 4130550 2131442 -2544562 -8959751 -13219837 -12126056 -6577254
45982 -6577254 -694994 2215540 2015215 443655 -852874 -754397 841863 1932326 -231933
45973 -231933 -5158224 -8381480 -6657018 -1877452 2688151 7615655 14612508 20240116
$$ packed form
46030a588491o68008k606982j910747j066594q96543J184917M893913N341358
46022B682823J206882j408688J730045N420296L067416k381465l245234L37208
46014G409283J342952j801482k781097J560445N882251M983265J081926j313323
46006A6364220k312133l999527n142598l442984m37947L82274j154250k294966
45998b037911j885986j017854N9014K191405M529947M587348J827247j106163
45990G147047j807921j208576j999108m676004o415189m260086J093781N548802
45982f577254N882260K910534k00325j571560j296529R8477J596260J090463k164259
45973b31933m926291l223256J724462M779566M565603M927504O996853N627608
$$ plain form
45965 20240116 18205281 8710027 -15893 -1919136 -113474 -361387 -1986035 -306183
45957 -306183 4623743 7565701 5863253 2537707 997090 1010744 1303291 2443110 5084693
45948 5084693 7958664 9629269 10363980 10666976 9852624 7796098 6366694 7140312 8932858
45939 8932858 9452234 8366701 7000656 5998283 5135497 4577834 4369471 3368736 724245
45930 724245 -2163265 -3345883 -3548209 -5142023 -7972905 -9144798 -7689082 -6463291
45922 -6463291 -7720426 -9368150 -8201765 -5181674 -4476116 -7787529 -12449520 -15430066
45914 -15430066 -16720251 -17739851 -18308654 -16819795 -12549430 -6408025 248825 6370092
45906 6370092 10766200 12083233 10060104 6527159 4221689 4057944 4028689 1660786 -2580606
$$ packed form
45965B0240116k034835r495254q725920j903243J805662k47913j624648J679852
45957c06183M929926K941958j702448l325546j540617J3654K92547J139819K641583
45948E084693K873971J670605P34711L02996q14352k056526j429404P73618J792546
45939H932858N19376j085533j366045j002373q62786n57663k08363j000735k644491
45930G24245k887510j182618k02326j593814k830882j171893J455716J225791
45922f463291j257135j647724J166385L020091P05558l311413m661991k980546
45914a5430066j290185j019600n68803J488859M270365O141405O656850O121267
45906F370092M396108J317033k023129l532945k305470j63745k9255k367903m241392
$$ plain form
45897 -2580606 -5479564 -4986308 -2708019 -1676278 -2803788 -4784808 -6408046 -7186479
45889 -7186479 -6461041 -4155787 -2293776 -3336163 -6499909 -8009900 -5981163 -3030036
45881 -3030036 -2879838 -6264075 -11332132 -15784370 -16856688 -11887597 -2114013 5859245
45873 5859245 6320814 1722938 -50200 4178946 9340101 9647745 5703980 1870426
45865 1870426 -79233 -1311267 -1944589 -472018 3140847 6625904 8002304 7117986
45857 7117986 4521421 535264 -4236877 -8748297 -12059437 -13253666 -11298453 -6306624
45849 -6306624 -620904 2754929 2708242 38065 -4210981 -8722864 -11108125 -9806513
45841 -9806513 -6869035 -6202289 -8443336 -10141158 -8932951 -6721733 -6020627 -5840263 -3888616
$$ packed form
45897b580606k898958M93256K278289J031741j127510j981020j623238p78433
45889g186479P25438K305254J862011j042387l163746j509991K028737K951127
45881c030036J50198l384237n068057m452238j072318M969091R773584P973258
45873E859245M61569m597876j773138M229146N161155L07644l943765l833554
45865A870426j949659j232034o33322J472571L612865L485057J376400q84318
45857G117986k596565l986157m772141m511420l311140j194229J955213M991829
45849f306624N685720L375833m6687k670177m249046m511883k385261J301612
45841i806513K937478O66746k241047j697822J208207K211218P01106J80364J951647
$$ plain form
45832 -3888616 -946006 146896 -1061644 -2342919 -2702340 -3541661 -5509185 -7034340
45824 -7034340 -7075414 -6967568 -8060803 -9398924 -9530744 -9272504 -10605057 -13391571 -15149542
45815 -15149542 -14293401 -12202286 -11498626 -13086218 -15548437 -17143368 -17649059 -17860160 -17728527
45806 -17728527 -16157710 -13129253 -10722873 -10409151 -10056891 -6038023 1326210 6894219
45798 6894219 6659068 2632167 -57187 644163 2718126 4112885 4851728 5169794 4305237
45789 4305237 2049018 -351327 -1682873 -1753436 -433286 2537661 6015596 7539724
45781 7539724 6241961 4266093 3869717 4244128 2758688 -1430078 -6550123 -10495669
45773 -10495669 -12511873 -12863068 -12122588 -10888474 -9482844 -8042161 -7157530 -7504483 -8169320
$$ packed form
45832c888616K942610J092902j208540j281275l59421q39321j967524j525155
45824g034340m1074J07846j093235j338121j31820K58240j332553k786514j757971
45815a5149542Q56141K091115P03660j587592k462219j594931n05691k11101J31633
45806a7728527J570817L028457K406380L13722L52260M018868P364233N568009
45798F894219k35151m026901k689354P01350K073963J394759P38843L18066q64557
45789D305237k256219k400345j331546p0563J320150K970947L477935J524128
45781G539724j297763j975868l96376L74411j485440m188766n120045l945546
45773a0495669k016204l51195P40480J234114J405630J440683Q84631l46953o64837
$$ plain form
45764 -8169320 -6668486 -2097116 2717474 3980307 1242969 -2809074 -6233373 -9226496
45756 -9226496 -11838805 -12976519 -12558797 -12559346 -14538537 -17412418 -18749834 -17283036 -13344479
45747 -13344479 -7950384 -2461253 1637722 3521124 3245523 1113424 -2237347 -5156512
45739 -5156512 -6068174 -5814085 -7215787 -11287484 -15405790 -16505583 -14750626 -12581556
45731 -12581556 -11295754 -10310899 -9137621 -8355791 -8638504 -9739499 -10307632 -8456493 -3508426
45722 -3508426 2349891 5540858 4992704 3010853 1524201 -163501 -2317718 -2329693 1580326
45713 1580326 6261551 7050491 4200972 1945140 1706810 700275 -2244121 -4044023
45705 -4044023 -2401680 288445 685767 -521394 -139366 2748928 5938546 6934322 4830368
$$ packed form
45764h169320J500834M571370M814590J262833k737338m052043l424299k993123
45756i226496k612309j137714M17722n49j979191k873881j337416J466798L938557
45747a3344479N394095N489131M098975J883402k75601k132099l350771k919165
45739e156512r11662K54089j401702m071697m118306j099793J754957K169070
45731a2581556J285802R84855J173278P81830k82713j100995n68133J851139M948067
45722c508426N858317L190967n48154j981851j486652j687702k154217j1975L910019
45713A580326M681225P88940k849519k255832k38330j006535k944396j799902
45705d044023J642343K690125L97322j207161L82028K888294L189618R95776k103954
$$ plain form
45696 4830368 427768 -4080295 -6725275 -8289659 -11702270 -17532304 -21850310 -20526200
45688 -20526200 -14326235 -7772122 -4051134 -3001460 -3085682 -3116174 -2431099 -1170269 -228811
45679 -228811 87297 578673 1403270 1289763 -76747 -653431 906569 2521454 1671495
45670 1671495 -378637 -664864 155386 -1487041 -5958430 -8938777 -7144805 -2188344
45662 -2188344 2786901 7169411 11248530 12981965 9631722 2063150 -4962694 -7105268
45654 -7105268 -4018643 1152964 4782821 5246244 3305530 739321 -1068109 -1427061
45646 -1427061 -415659 523477 -875565 -5101708 -9549259 -11517187 -11846142 -13349990
45638 -13349990 -15985761 -16319754 -12238676 -5587871 763043 6014686 10339955 13000630
$$ packed form
45696D830368m402600m508063k644980j564384l412611n830034m318006J324110
45688b0526200O199965O554113L720988J049674q4222l0492O85075J260830R41458
45679b28811L16108M91376Q24597j13507j366510n76684J560000J614885q49959
45670A671495k050132k86227Q20250j642427m471389k980347J793972M956461
45662b188344M975245M382510M079119J733435l350243p568572p025844k142574
45654g105268L086625N171607L629857M63423j940714k566209j807430l58952
45646a427061J011402R39136j399042m226143m447551j967928l28955j503848
45638a3349990k635771l33993M081078O650805O350914N251643M325269K660675
$$ plain form
45630 13000630 13345373 12089729 10056379 7075703 3510327 1270391 1616266 3189550
45622 3189550 3763169 2762812 707319 -2275945 -5533577 -6902911 -4922453 -1268916
45614 -1268916 995371 983348 7745 -1158016 -2894518 -4885876 -5580651 -3643439 1133962
45605 1133962 7785100 13788007 15756374 12411820 6281043 752121 -3632239 -7912194
45597 -7912194 -11023059 -10677463 -7805966 -6565309 -8710465 -10774700 -8751431 -3726667
45589 -3726667 -705615 -2513531 -6518864 -7606811 -3775806 1603562 3493471 1028682
45581 1028682 -1737070 -1604868 -521564 -1782214 -3979991 -2812795 1597831 3906676
45573 3906676 1263871 -2502498 -2817936 -739168 3825 -546022 500897 2746286 1859952
$$ packed form
45630A3000630L44743j255644k033350k980676l565376k239936L45875J573284
45622C189550N73619j000357k055493k983264l257632j369334J980458L653537
45614a268916K264287j2023r75603j165761j736502j991358o94775J937212M777401
45605A133962O651138O002907J968367l344554o130777n528922m384360m279955
45597g912194l110865L45596K871497J240657k145156k064235K023269N024764
45589c726667L021052j807916m005333j087947L831005N379368J889909k464789
45581A028682k765752J32202J083304j260650k197777J167196M410626K308845
45573C906676k642805l766369l15438K078768P42993n49847J046919K245389q86334
$$ plain form
45564 1859952 -4178090 -11368563 -13688816 -9205894 -1337043 4805555 6619469 5289064
45556 5289064 3446796 1782758 -1208792 -5793267 -8935627 -7391325 -2081325 2456395
45548 2456395 2826321 -332487 -3764575 -4438723 -1481907 2912639 4658578 1617346
45540 1617346 -3688245 -6774479 -6448911 -5452141 -5886312 -6465887 -5201857 -2616545 -657336
45531 -657336 218668 1154330 2672970 3685119 2668164 -669605 -4608428 -6233379 -3905766
45522 -3905766 746715 4138494 4252699 1967464 -983117 -3673716 -5320217 -5153358
45514 -5153358 -4176959 -5084326 -8604913 -11446689 -9951805 -4637440 1120447 5854863
45506 5854863 10643881 15393487 17679835 16107745 12332897 8629859 5536352 3141726
$$ packed form
45564A859952o038042p190473k320253M482922P868851O142598J813914j330405
45556E289064j842268j664038k991550m584475l142360J544302N310000M537720
45548B456395L69926l158808l432088o74148K956816M394546J745939l041232
45540A617346n305591l086234L25568R96770m34171n79575J264030K585312J959209
45531f57336Q76004R35662J518640J012149j016955l337769l938823j624951K327613
45522c905766M652481L391779J14205k285235k950581k690599j646501J66859
45514e153358R76399r07367l520587k841776J494884N314365N757887M734416
45506E854863M789018M749606K286348j572090l774848l703038l093507k394626
$$ plain form
45498 3141726 2632080 4639720 7394418 8484991 7703378 6448641 5047535 2666696
45490 2666696 -321176 -1905533 -861766 1807010 4309548 5639122 5156573 2108628
45482 2108628 -3007708 -7255544 -7082473 -1880103 4914753 8763149 7965590 4638046
45474 4638046 2168710 2105428 3413679 4151943 3364429 1546941 -92495 -682780 -537072
45465 -537072 -1146043 -3637902 -6770803 -7245637 -3118308 3332912 7378345 6843242 4415344
45456 4415344 4307437 7257496 9722362 7847911 1397017 -6410737 -12131494 -14493988
45448 -14493988 -14116416 -12206116 -10189277 -9647441 -11121373 -12889056 -12247971 -8678418
45440 -8678418 -4849563 -3750405 -5534652 -7898020 -8717172 -7381195 -4494481 -1759492
$$ packed form
45498C141726n09646K007640K754698J090573p81613j254737j401106k380839
45490B666696k987872j584357J043767K668776K502538J329574m82549l047945
45482B108628n116336m247836J73071N202370O794856L848396p97559l327544
45474D638046k469336o3282J308251P38264p87514j817488j639436n90285J45708
45465e37072o08971k491859l132901m74834M127329O451220M045433n35103k427898
45456D415344j07907K950059K464866j874451o450894p807754n720757k362494
45448a4493988L77572J910300K016839N41836j473932j767683O41085L569553
45440h678418L828855J099158j784247k363368q19152J335977K886714K734989
$$ plain form
45432 -1759492 -1512745 -4514538 -8226281 -8996398 -6213926 -2784943 -1310394 -1574999 -2301852
45423 -2301852 -3330300 -4739136 -5382362 -4108010 -1848876 -1121871 -3497152 -8016902
45415 -8016902 -11636960 -11175157 -6087531 209563 3191249 2084994 401055 985767
45407 985767 2674865 3154740 2712918 2821664 3023424 2256673 1938155 4360538 8621661
45398 8621661 11436145 11779650 11383761 10506704 6943684 426798 -5189629 -5970212 -2001892
45389 -2001892 3808011 8830316 11339071 10430388 7243724 4732176 4733906 6513714 8823931
45380 8823931 11243398 12608490 10991404 7036164 4609482 5827252 7939673 7807762
45372 7807762 6933862 8625413 12275465 14599129 15335962 17359745 21441747 25142372
$$ packed form
45432a759492K46747l001793l711743p70117K782472L428983J474549k64605p26853
45423b301852j028448j408836o43226J274352K259134P27005k375281m519750
45415h016902l620058M61803N087626O297094K981686j106255j683939N84712
45407I85767J689098M79875m41822J08746K01760p66751l18518K422383M261123
45398H621661K814484L43505l95889q77057l563020o516886n616427p80583L968320
45389b001892N809903N022305K508755r08683l186664k511548J730J779808K310217
45380H823931K419467J365092j617086l955240k426682J217770K112421j31911
45372G807762q73900J691551L650052K323664P36833K023783M082002L700625
$$ plain form
45364 25142372 27341923 30053786 34928754 41418798 49265532 59192423 69750843 77025833
45356 77025833 79503978 80173066 81603802 82049131 79320821 75700178 75025001 76515815
45348 76515815 75782196 71602807 67582344 66280352 65298498 61045083 53866887 47254189
45340 47254189 43531231 42465907 43056843 44319627 44639446 42805090 40309446 40559575
45332 40559575 44490032 48496809 48519067 45154664 42482844 42232236 41920378 39496359 36954385
45323 36954385 37147554 38861849 37914283 32636617 25801485 21060422 19612402 20694915
45315 20694915 23234521 25995530 27467293 26714258 23923183 19996015 16299328 14459144
45307 14459144 15060077 16649025 17461864 17980211 19995240 23163355 24737273 23290321
$$ packed form
45364B5142372K199551K711863M874968O490044P846734R926891J0558420P274990
45356G7025833K478145O69088J430736M45329k728310l620643o75177J490814
45348G6515815p33619m179389m020463j301992r81854m253415p178196o612698
45340D7254189l722958j065324N90936J262784L19819j834356k495644K50129
45332D0559575L930457M006777K2258l364403k671820k50608l11858k424019k541974
45323C6954385J93169J714295r47566n277666o835132m741063j448020J082513
45315B0694915K539606K761009J471763p53035k791075l927168l696687j840184
45307A4459144O00933J588948Q12839N18347K015029L168115J573918j446952
$$ plain form
45299 23290321 20506549 18319364 16415204 13932405 11644462 10596504 9993424 8348384
45291 8348384 5783575 3528424 1973247 842133 611073 2120673 5072921 8076375
45283 8076375 9794159 9256109 6025409 1375666 -1497876 -91755 4568299 8538518
45275 8538518 8314599 3556182 -2453077 -4845697 -1389548 4627022 7623290 6607079
45267 6607079 6190674 9325746 12512308 11385520 7928527 7352590 9628339 9794518 6543966
45258 6543966 4666334 7367870 11412751 12839566 13152501 15647378 18439483 16164900
45250 16164900 8149635 706402 149331 5989928 12388929 14830254 13745735 11901739
45242 11901739 9883301 5644028 -1475953 -8065954 -9657476 -5856025 -728528 1912741
$$ packed form
45299B3290321k783772k187185j904160k482799k287943j047958o03080j645040
45291H348384k564809k255151j555177j131114k31060J509600K952248L003454
45283H076375J717784n38050l230700m649743k873542J406121M660054L970219
45275H538518k23919m758417o009259k392620L456149O016570K996268j016211
45267F607079m16405L135072L186562j126788l456993n75937K275749J66179l250552
45258F543966j877632K701536M044881J426815L12935K494877K792105k274583
45250A6164900q015265p443233n57071N840597O399001K441325j084519j843996
45242A1901739k018438m239273p119981o590001j591522L801451N127497K641269
$$ plain form
45234 1912741 2081892 2397950 4727226 8132076 9010491 3917968 -5854376 -13293206 -12177411
45225 -12177411 -4556583 1436943 1508139 -896050 -1593895 -1917973 -4982460 -9572158 -12071670
45216 -12071670 -12208399 -12462327 -12999692 -11549615 -8083981 -5727667 -6511290 -9186961 -11546492
45207 -11546492 -12138808 -9608488 -3489271 3712993 8227025 9786295 11908668 16219530
45199 16219530 19380739 17695676 12498525 8398450 7449840 7620617 6644314 5074716
45191 5074716 4917393 6609730 8372441 8338246 6674339 5092965 4297142 2779400 -1077786
45182 -1077786 -6306785 -9903706 -9912608 -6993659 -3187194 -292601 709165 51201 -726403
45173 -726403 -135069 1661340 3458811 4866170 6158863 6573666 4687684 876329 -2388573
$$ packed form
45234A912741J69151L16058K329276L404850Q78415n092523r772344p438830J115795
45225a2177411P620828N993526P1196k404189o97845l24078l064487m589698k499512
45216a2071670j36729k53928n37365J450077L465634K356314p83623k675671k359531
45207a1546492n92316K530320O119217P202264M514032J559270K122373M310862
45199A6219530L161209j685063n197151m100075r48610J70777r76303j569598
45191E074716j57323J692337J762711l4195j663907j581374p95823j517742l857186
45182a077786n228999l596921q902K918949L806465K894593J001766o57964p77604
45173g26403N91334J796409J797471J407359J292693M14803j885982l811355l264902
$$ plain form
45164 -2388573 -3428901 -3098905 -2903793 -2764573 -1604839 839882 3615771 5252867 4571983
45155 4571983 1821227 -709134 -443357 2643187 5981057 7314884 6345927 3665480
45147 3665480 229563 -1727276 122659 4768857 7853806 6799796 4026150 3226106
45139 3226106 4420268 5129336 4791358 4957409 5990718 6902881 8491343 13266844 20980016
45130 20980016 26833344 26398816 21225397 17437553 18732802 22395537 23057568 19251037
45122 19251037 14405649 11305949 8022022 1421141 -6820750 -11064332 -8693764 -3069654
45114 -3069654 1410309 3945428 5273665 4341033 297655 -4298021 -5904080 -4627411
45106 -4627411 -3247622 -2459008 -465501 3047891 5999586 7195848 7374014 6630906 4181670
$$ packed form
45164b388573j040328L29996J95112J39220J159734K444721K775889J637096o80884
45155D571983k750756k530361K65777L086544L337870J333827r68957k680447
45147C665480l435917j956839J849935M646198L084949j054010k773646q00044
45139C226106J194162P09068l37978J66051J033309R12163J588462M775501P713172
45130B0980016N853328m34528n173419l787844J295249L662735O62031l806531
45122A9251037m845388l099700l283927o600881q241891m243582K370568N624110
45114c069654M479963K535119J328237r32632m043378m595676j606059J276669
45106d627411J379789P88614J993507L513392K951695J196262J78166p43108k449236
$$ plain form
45097 4181670 1545133 2420920 7414964 11683002 10409806 4921845 882136 1428051
45089 1428051 4418686 6152000 5768061 5428255 7151927 10200831 11734120 9989817
45081 9989817 6174824 2531273 -650342 -4537355 -8695440 -10680894 -9168247 -5588127
45073 -5588127 -1868009 1658446 5003698 6922172 6228710 3739903 1379077 -60280
45065 -60280 -987517 -1367844 -370081 2295198 5569627 7804583 8024110 6495442 4283243
45056 4283243 2321655 1102532 1173210 2985605 5634664 6914105 6008082 5207609 7153438
45047 7153438 11085762 13977885 14848846 15351211 16285105 16592416 16233222 16785526 17998265
45038 17998265 16840157 11771260 5365144 837313 -1487754 -2237337 -399446 4213826
$$ packed form
45097D181670k636537Q75787M994044M268038j273196n487961m039709N45915
45089A428051K990635J733314l83939l39806J723672L048904J533289j744303
45081I989817l814993l643551l181615l887013m158085j985454J512647L580120
45073e588127L720118L526455L345252J918474o93462k488807k360826j439357
45065f0280r27237l80327R97763K665279L274429K234956K19527j528668k212199
45056D283243j961588j219123P0678J812395K649059J279441r06023q00473J945829
45047G153438L932324K892123Q70961N02365R33894L07311l59194N52304J212739
45038A7998265j158108n068897o406116m527831k325067p49583J837891M613272
$$ plain form
45030 4213826 7953114 6454186 220851 -5658986 -7105868 -4393341 -602801 1280016
45022 1280016 379436 -1232467 -551940 2112679 2612361 -1295002 -5750105 -5491510 -1188983
45013 -1188983 1788421 1257367 656602 3041721 6425425 6716224 2799831 -2809449 -6735512
45004 -6735512 -7256002 -5508163 -4667253 -6529951 -8940434 -8389134 -4964566 -2367452 -2840468
44995 -2840468 -4644754 -5150811 -3862611 -1386738 2113996 5886779 7927710 7103631
44987 7103631 4844063 3559024 4381438 7210584 11577046 16348957 19677331 20423025
44979 20423025 19149761 17172565 15244254 13440015 11623209 9921696 9256709 10715319
44971 10715319 13318967 13584815 9459254 3919503 1915054 3941254 5682592 4317528
$$ packed form
45030D213826L739288j498928o233335n879837j446882K712527L790540J882817
45022A280016r00580j611903O80527K664619M99682l907363m455103K58595M302527
45013a188983K977404n31054o00765K385119L383704K90799l916393n609280l926063
45004f735512n20490J747839Q40910j862698k410483N51300L424568K597114m73016
44995b840468j804286n06057J288200K475873L500734L772783K040931q24079
44987G103631k259568j285039Q22414K829146M366462M771911L328374P45694
44979B0423025j273264j977196j928311j804239j816806j701513o64987J458610
44971A0715319K603648K65848m125561n539751k004449K026200J741338j365064
$$ plain form
44963 4317528 1861777 1201583 2027726 2578518 2843247 3754769 4837753 4626155 2442999
44954 2442999 -1268774 -5052163 -6252316 -2820195 3514306 7786396 6803714 2028449
44946 2028449 -3200672 -6975374 -8354192 -6409748 -1653500 3651576 8125316 12084568
44938 12084568 14706013 13647228 9431613 6624639 7605752 8399296 4504700 -1887624
44930 -1887624 -5064383 -4275871 -4035553 -6602387 -8984783 -7920733 -3950047 269561
44922 269561 2632195 2047599 -901555 -3261427 -2243362 1180471 3542667 3587600 2949764
44913 2949764 2357957 675781 -1707274 -2168894 -83939 1270213 -879257 -4695955
44905 -4695955 -6231679 -4596206 -2577104 -2803355 -4968010 -6822559 -6949387 -6193769 -6366995
$$ packed form
44963D317528k455751o60194Q26143N50792K64729R11522J082984k11598k183156
44954B442999l711773l783389j200153L432121O334501M272090r82682m775265
44946B028449n229121l774702j378818J944444M756248N305076M473740L959252
44938A2084568K621445j058785m215615k806974R81113P93544l894596o392324
44930a887624l176759P88512K40318k566834k382396J064050L970686M219608
44922B69561K362634n84596k949154k359872J018065L423833K362196M4933o37836
44913B949764n91807j682176k383055m61620K084955J354152k149470l816698
44905d695955j535724J635473K019102k26251k164655j854549j26828P55618j73226
$$ plain form
44896 -6366995 -7764970 -8798101 -8341083 -7077564 -5648757 -3249783 174159 2061003
44888 2061003 232947 -3223269 -3917019 -572706 4089361 7416073 8989104 9045704 7772452
44879 7772452 6393010 6216646 6297331 4582352 1557328 75876 1235359 2954691 2953763
44870 2953763 823230 -2745725 -6224181 -7172933 -4969205 -3105474 -5190337 -9183943
44862 -9183943 -9999601 -7690960 -7770312 -12427624 -16822949 -15984965 -10342570 -2329988 6997504
44853 6997504 14998051 16881270 12694096 10130997 15074674 22992855 25178991 20485671
44845 20485671 15080756 12901352 12534077 12341712 12539398 12170347 9437509 5774698 5119896
44836 5119896 8272027 11676085 12409717 10924400 8453718 5378513 3086962 4130089
$$ packed form
44896f366995j397975j033131M57018J263519J428807K398974L423942J886844
44888B061003j828056l456216o93750L344313M662067L326712J573031N6600j273252
44879G772452j379442j76364Q0685j714979l025024j481452J159483J719332r28
44870B953763k130533l568955l478456r48752K203728J863731k084863l993606
44862i183943q15658K308641p9352m657312m395325Q37984N642395Q012582R327492
44853F997504Q000547J883219m187174k563099M943677P918181K186136m693320
44845B0485671n404915k179404l67275j92365J97686l69051k732838l662811o54802
44836E119896L152131L404058P33632j485317k470682l075205k291551J043127
$$ plain form
44828 4130089 8950673 14436037 16675059 14032081 7928096 2193688 670587 3383530
44820 3383530 6281224 6847734 7703403 11308356 13712032 8903194 -1688544 -9755292
44812 -9755292 -10388798 -6508198 -2459091 1221177 5046566 7824508 9144332 10448220
44804 10448220 11390917 9166944 3737094 -365127 -130996 1792385 1858846 810059 995398
44795 995398 2015865 2544964 3446151 5495538 6772496 5983954 5821603 9208714 14491540
44786 14491540 18095868 19596092 20175251 18611481 13646583 8393019 7061487 8461370
44778 8461370 8049421 5533180 4620683 5464072 3817643 -1153102 -4611185 -4023204 -3493648
44769 -3493648 -6524056 -9625285 -7991355 -3685441 -2568730 -5273283 -6901759 -4999805
$$ packed form
44828D130089M820584N485364K239022k642978o103985n734408j523101K712943
44820C383530K897694N66510Q55669L604953K403676m808838j0591738q066748
44812i755292o33506L880600M049107L680268L825389K777942J319824J303888
44804A0448220R42697k223973n429850m102221K34131J923381O6461j048787J85339
44795I95398J020467N29099R01187K049387J276958p88542j62351L387111N282826
44786A4491540L604328J500224N79159j563770m964898n253564j331532J399883
44778H461370m11949k516241r12497Q43389j646429m970745l458083N87981N29556
44769c493648l030408l101229J633930M305914J116711k704553j628476J901954
$$ plain form
44761 -4999805 -2429689 -1597098 -557928 3009622 7254429 8344550 5709325 2854924
44753 2854924 3357560 7308121 11495749 12366140 8967928 3354127 -1921688 -6237817
44745 -6237817 -10154591 -13010709 -13180888 -10993290 -9280835 -9641534 -9599287 -5424836 2707918
44736 2707918 10147895 12525645 9951630 6328093 5358273 7279777 8824768 6588435
44728 6588435 1170388 -2587961 -731260 4946258 8836168 7999740 4591117 1823898
44720 1823898 365199 -183530 950179 4222207 7892282 9908806 10327830 9910813 8075310
44711 8075310 4766269 2578901 3601674 5305155 3508218 -998132 -3109309 -1157677
44703 -1157677 519970 -1471000 -4083527 -2170909 4363980 10706368 12720126 10010986
$$ packed form
44761d999805K570116Q32591J039170L567550M244807J090121k635225k854401
44753B854924N02636L950561M187628Q70391l398212n613801n275815m316129
44745f237817l916774k856118j70179K187598J712455l60699M2247M174451Q132754
44736B707918P439977K377750k574015l623537r69820J921504J544991k236333
44728F588435n418047l758349J856701N677518L889910q36428l408623k767219
44720A823898j458699n48729J133709L272028L670075K016524M19024m17017j835503
44711H075310l309041k187368J022773J703481j796937m506350k111177J951632
44703a157677J677647j990970k612527J912618O534889O342388K013758k709140
$$ plain form
44695 10010986 4950244 997424 863926 4238382 8011530 9944641 10773181 11641921
44687 11641921 11700132 10152896 8539946 8483188 8889164 7937596 6234528 5329005 4784250
44678 4784250 3773720 3952265 7087036 11040348 12214978 11396860 12782935 17120245
44670 17120245 20407844 20420196 20009264 21793641 23316067 20379972 12765990 4028189
44662 4028189 -2601456 -5867374 -5653610 -2850738 619668 3073898 3786357 2193313
44654 2193313 -1791482 -6078491 -7461166 -5613565 -3620799 -3162464 -2118492 896866
44646 896866 2887212 917686 -2255958 -1444155 3292556 6771456 6265717 4433873 4006596
44637 4006596 3993207 3031626 2665351 4355644 5864391 3943636 -733896 -4412285 -5423291
$$ packed form
44695A0010986n060742l952820j33498L374456L773148J933111Q28540Q68740
44687A1641921N8211j547236j612950n6758M05976r51568j703068r05523n44755
44678D784250j010530J78545L134771L953312J174630q18118J386075M337310
44670A7120245L287599J2352m10932J784377J522426k936095p613982q737801
44662D028189o629645l265918K13764K802872L470406K454230P12459j593044
44654B193313l984795m287009j382675J847601J992766M58335J043972L015358
44646H96866J990346j969526l173644Q11803M736711L478900n05739j831844m27277
44637D006596j3389r61581l66275J690293J508747j920755m677532l678389j011006
$$ plain form
44628 -5423291 -5627014 -6574974 -7031349 -5539342 -3410391 -3066443 -4150661 -3571225 -55960
44619 -55960 3149583 1940153 -2977537 -6320850 -4636219 -374796 1775592 796858 -592710
44610 -592710 -492168 459863 1634626 3655482 6433743 8602506 9929301 11802476 14026639
44601 14026639 13772932 9668829 4457358 1084447 -1452222 -4996390 -7121646 -3877530
44593 -3877530 2935450 6368632 3341192 -1420236 -2437623 -361572 1194471 2201405
44585 2201405 5380194 10591285 14187848 13644824 9830427 4964708 888979 -1073191
44577 -1073191 -1067331 -1115537 -2261941 -2262419 947399 4544522 3548685 -1998243 -6948707 -8609855
44567 -8609855 -9666221 -12172711 -13623658 -11796576 -9075579 -8179145 -7227785 -3434913
$$ packed form
44628e423291k03723r47960m56375J492007K128951L43948j084218N79436L515265
44619e5960L205543j209430m917690l343313J684631M261423K150388r78734j389568
44610e92710J00542R52031J174763K020856K778261K168763J326795J873175K224163
44601A4026639k53707m104103n211471l372911k536669l544168k125256L244116
44593c877530O812980L433182l027440m761428j017387K076051J556043J006934
44585B201405L178789N211091L596563n43024l814397m865719m075729j962170
44577a073191N860m8206j146404m78L209818L597123r95837n546928m950464j661148
44567h609855j056366k506490j450947J827082K720997Q96434R51360L792872
$$ plain form
44559 -3434913 1245515 3132247 3416191 6346693 11760497 14895599 13898927 12419364
44551 12419364 13544072 15634363 16025676 15095683 14342498 13264069 10518305 6315001
44543 6315001 1882815 -1955589 -4619574 -5904759 -7010758 -9324562 -11446535 -9941338
44535 -9941338 -4172910 2117566 5411810 6206880 6916669 8587365 11168588 14180664
44527 14180664 15258309 11176581 2968599 -2891739 -1708315 3374430 5979875 4999597
44519 4999597 4443338 6335549 8283835 7854925 5493930 2866206 1315303 1776246 3380011
44510 3380011 2895707 -1171313 -5025110 -4252585 -1005408 -1108671 -4119765 -2798198 5716823
44501 5716823 14715865 17454331 16037654 15833802 16050081 12491464 6525843 3877966
$$ packed form
44559c434913M680428J886732K83944K930502N413804L135102r96672j479563
44551A2419364J124708K090291L91313r29993p53185j078429k745764m203304
44543F315001m432186l838404k663985j285185j105999k313804k121973J505197
44535i941338N768428O290476L294244P95070P09789J670696K581223L012076
44527A4180664J077645m081728q207982n860338J183424N082745K605445r80278
44519D999597n56259J892211J948286m28910k360995k627724j550903M60943J603765
44510C380011m84304m067020l853797P72525L247177j03263l011094J321567Q515021
44501E716823Q999042K738466j416677k03852K16279l558617n965621k647877
$$ plain form
44493 3877966 5445924 6353297 4645863 4238906 7202971 9119096 5678084 -487789
44485 -487789 -3597290 -2307069 426377 2777822 5186524 7326903 8003341 7855204 8807558
44476 8807558 10712268 11438729 10390545 8951349 7175003 3437230 -1500033 -3459657
44468 -3459657 -150033 4955684 6681066 4463346 2019965 1971500 3685073 5869868
44460 5869868 8247826 10213892 10351731 8327259 5722201 4258693 4369131 5729733
44452 5729733 7657025 8645691 7289506 4374245 2423918 2327572 2073934 -13918 -2353623
44443 -2353623 -2039292 1236312 4755869 5881588 4545234 3010878 3778993 7091791
44435 7091791 10115284 9673157 6296357 4103265 5837015 9662729 12012514 11744659
$$ packed form
44493C877966J567958R07373j707434m06957K964065J916125l441012o165873
44485d87789l109501J290221K733446K351445K408702K140379O76438j48137R52354
44476H807558J904710P26461j048184j439196j776346l737773m937263j959624
44468c459657L309624N105717J725382k217720k443381m8465J713573K184795
44460E869868K377958J966066J37839k024472k605058j463508J10438J360602
44452E729733J927292R88666j356185k915261j950327r6346k53638k087852k339705
44443b353623L14331L275604L519557J125719j336354j534356P68115L312798
44435G091791L023493m42127l376800k193092J733750L825714K349785k67855
$$ plain form
44427 11744659 9866981 7137593 4411518 3894672 7078081 11980756 15046538 15450973
44419 15450973 15227034 15687531 16301940 16627006 16458903 14320951 8973292 2575551 -919404
44410 -919404 -1001004 -912493 -2075861 -1918789 1427732 6097563 10172658 14542232 19130200
44401 19130200 19931368 14248379 6775041 5649335 12760454 21734876 25598502 23134174
44393 23134174 17364493 11117796 5610534 1406761 -904532 -721179 1934754 5389674
44385 5389674 6910942 5625868 4005655 5017031 8825146 13907748 19859335 26527694
44377 26527694 31721798 33248034 32794770 34216038 37793469 39873486 38973430 38502038
44369 38502038 41707554 47028747 50466202 50002468 45866147 39291884 33472205 32957301
$$ packed form
44427A1744659j877678k729388k726075n16846L183409M902675L065782M04435
44419A5450973k23939M60497O14409L25066j68103k137952n347659o397741l494955
44410i19404q1600Q8511j163368J57072L346521M669831M075095M369574M587968
44401A9130200Q01168n682989p473338j125706P111119Q974422L863626k464328
44393B3134174n769681o246697n507262m203773k311293J83353K655933L454920
44385E389674J521268j285074j620213J011376L808115N082602N951587O668359
44377B6527694N194104J526236m53264J421268L577431K080017r00056m71392
44369C8502038L205516N321193L437455m63734m136321o574263n819679n14904
$$ plain form
44361 32957301 38651148 45119344 46391542 43385445 42030885 44660449 47339942 46442105
44353 46442105 44055281 44662436 48797150 52548268 52407227 48520947 43415818 39291664
44345 39291664 37027752 36616567 37452923 38257462 37485807 34367036 29480321 24098936 19247506
44336 19247506 15753395 14594019 16016722 18381313 19243501 18039243 16529158 16119572
44328 16119572 16178860 15874007 16108404 18040168 20703066 21915193 21122898 19825429 19506916
44319 19506916 20475742 22249208 23602620 22840442 19946920 18137217 20931870 27296094
44311 27296094 31868829 30936566 26409437 22836172 22143366 22714599 22273013 19831862 15481850
44302 15481850 10133513 5616100 3716809 4593674 6634842 8019514 8086954 7362819 6848610
$$ packed form
44361C2957301N693847O468196J272198l006097j354560K629564K679493q97837
44353D6442105k386824O07155M134714L751118j41041l886280n105129m124154
44345C9291664k263912m11185Q36356Q04539p71655l118771m886715n381385m851430
44336A9247506l494111j159376J422703K364591Q62188j204258j510085m09586
44328A6119572N9288l04853K34397J931764K662898J212127p92295j297469l18513
44319A9506916R68826J773466J353412p62178k893522j809703K794653O364224
44311B7296094M572735r32263m527129l573265o92806N71233m41586k441151m350012
44302A5481850n348337m517413j899291Q76865K041168J384672O7440p24135n14209
$$ plain form
44293 6848610 7300293 8568679 9295319 7655439 3079774 -2542609 -5908664 -5220607 -1895582
44284 -1895582 1374678 3956176 7155630 10585358 11041920 6894597 1798645 1014482
44276 1014482 4515474 6883775 4505612 -135210 -2567479 -1994075 -772672 -207003
44268 -207003 598030 2530217 5295574 8216581 10681985 12031561 12163315 11900809 11796490
44259 11796490 11192995 9488384 7489776 6216486 5203352 3586659 2191709 2650491
44251 2650491 4703416 6246053 6090211 4883375 3088020 41646 -4076260 -6955143
44243 -6955143 -6348651 -3006438 -203217 -245388 -2056382 -2513985 -41319 3475999 4691232
44234 4691232 2543166 -636461 -1796855 -122354 2891350 5304560 6217537 6355443
$$ packed form
44293F848610M51683J268386P26640j639880m575665n622383l366055O88057L325025
44284a895582L270260K581498L199454L429728M56562m147323n095952p84163
44276A014482L500992K368301k378163m640822k432269N73404J221403N65669
44268b07003Q05033J932187K765357K921007K465404J349576J31754k62506j04319
44259A1796490o03495j704611j998608j273290j013134j616693j394950M58782
44251B650491K052925J542637j55842j206836j795355l046374m117906k878883
44243f955143O06492L342213K803221m2171j810994m57603K472666L517318J215233
44234D691232k148066l179627j160394J674501L013704K413210R12977J37906
$$ plain form
44226 6355443 7573919 10600351 12952875 10963598 4755703 -967545 -2673306 -2286096
44218 -2286096 -3394714 -5337187 -4490335 -275430 3894208 5568505 5859554 6772452 8762589
44209 8762589 11245741 13007561 12218651 8873800 6845689 9904516 15711296 18010294
44201 18010294 15416254 13254656 15074955 17399251 15929291 12453678 11443064 13204052
44193 13204052 14906875 15784068 16589370 15902721 12160006 8456800 10096694 16849133
44185 16849133 21921730 19713864 11387171 2025847 -4494252 -6694006 -4602561 197985
44177 197985 4897465 7108159 5901283 1650305 -3929577 -8239922 -10032786 -10714713
44169 -10714713 -11838494 -12326192 -10392061 -7137013 -5324800 -5205058 -4668752 -3236611
$$ packed form
44226F355443J218476L026432K352524j989277o207895n723248j705761L87210
44218b286096j108618j942473Q46852M214905M169638J674297K91049R12898J990137
44209H762589K483152J761820p88910l344851k028111L058827N806780K298998
44201A8010294k594040k161598J820299K324296j469960l475613j010614J760988
44193A3204052J702823Q77193Q05302o86649l742715l703206J639894O752439
44185A6849133N072597k207866q326693r361324o520099k199754K091445M800546
44177A97985M699480K210694j206876m250978n579882m310345j792864o81927
44169a0714713j123781m87698J934131L255048J812213J19742N36306J432141
$$ plain form
44161 -3236611 -2581801 -3082866 -3310543 -3267785 -4513472 -6267280 -5079699 145967 5999230
44152 5999230 8996099 9231399 8134298 5777753 2455745 52664 -479450 -600489 -1121596
44143 -1121596 -392016 2054153 2901247 -637426 -6099610 -8941816 -8890060 -9377911 -11468779
44134 -11468779 -12217739 -9458150 -5110823 -2673491 -3306755 -5222320 -5782265 -3796996
44126 -3796996 -457907 2039316 3068305 3896942 5090428 5352723 4115753 3310978 4547952
44117 4547952 6082178 4986758 1332508 -2063582 -3196120 -2047965 687805 3527239
44109 3527239 3791855 289102 -3905712 -4197701 13057 5226458 9099910 12562507
44101 12562507 16065956 17165400 13893426 8396779 4871017 4660310 5068548 2853191
$$ packed form
44161c236611O54810n01065k27677M2758j245687j753808J187581N225666N853263
44152E999230K996869K35300j097101k356545l322008k403081n32114j21039n21107
44143a121596P29580K446169Q47094l538673n462184k842206N1756m87851k090868
44134a1468779p48960K759589M347327K437332o33264j915565n59945J985269
44126c796996L339089K497223J028989Q28637J193486K62295j236970q04775J236974
44117D547952J534226j095420l654250l396090j132538J148155K735770K839434
44109C527239K64616l502753m194814k91989M210758N213401L873452L462597
44101A2562507L503449J099444l271974n496647l525762k10707M08238k215357
$$ plain form
44093 2853191 -2075643 -6532775 -7302403 -4280981 713 3753817 7391761 11080666
44085 11080666 12906893 11405171 8425726 7036240 7459936 7573282 6696932 6111141 6138934
44076 6138934 5563684 4003996 2267566 386445 -1958316 -3178422 -1236193 2252172
44068 2252172 2888507 -407358 -3367194 -1934537 2947188 7601354 9936177 9845881 7964592
44059 7964592 5960211 5768210 6705681 5620432 1697412 -1347485 33371 4669540
44051 4669540 9024253 11702306 13079306 12734999 10289555 7186786 4950678 3210188
44043 3210188 1761813 2317830 5229578 6925751 4529801 1084242 1716874 5973109
44035 5973109 8816074 8447963 7761870 7892251 6078030 1584014 -1418732 335632 4411132
$$ packed form
44093B853191m928834m457132p69628L021422M281694L753104L637944L688905
44085A1080666J826227j501722k979445j389486M23696J13346q76350n85791K7793
44076F138934n75250j559688j736430j881121k344761j220106J942229L488365
44068B252172O36335l295865k959836J432657M881725M654166K334823r0296j881289
44059G964592k004381j92001R37471j085249l923020l044897J380856M636169
44051D669540M354713K678053J377000l44307k445444l102769k236108j740490
44043C210188j448375N56017K911748J696173k395950l445559O32632M256235
44035E973109K842965l68111o86093J30381j814221m494016l002746J754364M075500
$$ plain form
44026 4411132 6484217 5699239 3527756 516206 -2522265 -2726070 1567774 7326390
44018 7326390 10056054 9470134 8646529 8449608 6584902 2408411 -882631 -284004 3111720
44009 3111720 5824403 6175937 5304518 4756543 4443399 3148912 467758 -2255313 -3258248
44000 -3258248 -2547342 -2034248 -3101443 -4736528 -4776876 -2490191 783237 3043889 2914144
43991 2914144 83361 -4351963 -7982899 -8456760 -5272488 -297617 3319696 3085455
43983 3085455 -876112 -5425276 -7130875 -6090311 -5837527 -8497844 -11485155 -10764894
43975 -10764894 -6377825 -2430494 -1770833 -2874645 -2521541 180513 3249650 4137566
43967 4137566 1919934 -1967390 -4800152 -5145361 -4402329 -4739210 -5670873 -4390764 145503
$$ packed form
44026D411132K073085p84978k171483l011550l038471k03805M293844N758616
44018G326390K729664n85920q23605j96921j864706m176491l291042N98627L395724
44009C111720K712683L51534q71419n47975l13144j294487k681154k723071j002935
44000c258248P10906N13094j067195j635085m0348K286685L273428K260652j29745
43991B914144k830783m435324l630936m73861L184272M974871L617313k34241
43983C085455l961567m549164j705599J040564K52784k660317k987311P20261
43975a0764894M387069L947331O59661j103812L53104K702054L069137Q87916
43967D137566k217632l887324k832762l45209P43032l36881r31663J280109M536267
$$ plain form
43958 145503 5398223 8546950 9934147 11642853 13859877 14635657 12892203 9918865
43950 9918865 7689693 6958609 7375413 8570146 10571256 13393151 16338112 17765151
43942 17765151 16166636 11944414 7473124 4618748 2763338 327582 -2239040 -2535943
43934 -2535943 488949 4727230 7272374 7820311 8710221 11732263 15712390 17652436
43926 17652436 15976490 12054214 8206779 4839657 753132 -3669551 -5418263 -2476078
43918 -2476078 2653093 5216321 3824603 1544838 951473 619588 -1777047 -4885483
43910 -4885483 -5009750 -1503613 1955669 2109901 -95095 -1638106 -1393031 -62860 2443092
43901 2443092 6775615 11396298 12933149 10481240 7361807 6856592 7994788 7864961
$$ packed form
43958A45503N252720L148727J387197J708706K217024P75780j743454k973338
43950I918865k229172p31084M16804J194733K001110K821895K944961J427039
43942A7765151j598515m222222m471290k854376j855410k435756k566622k96903
43934b535943L024892M238281K545144N47937Q89910L022042L980127J940046
43926A7652436j675946l922276l847435l367122m086525m422683j748712K942185
43918b476078N129171K563228j391718k279765n93365l31885k396635l108436
43910d885483j24267L506137L459282J54232k204996j543011K45075J330171K505952
43901B443092M332523M620683J536851k451909l119433n05215J138196j29827
$$ plain form
43893 7864961 6533470 6323895 6827443 4819320 242441 -1762761 2470792 9428244
43885 9428244 12925273 12393327 12616499 16012264 19437263 19248250 15870405 11940187 8768932
43876 8768932 6355117 4760067 3722933 2334117 350937 -1389256 -2538171 -3530856
43868 -3530856 -3668309 -1109601 4005105 8511932 9831388 8826326 7644296 6665827
43860 6665827 5236363 3477665 1593830 -582199 -1475385 2208100 10460762 17232491
43852 17232491 16418132 9296155 2425540 -701445 -1831098 -2496731 -1351258 1953932
43844 1953932 4444571 3686693 1379767 1015151 3605208 7268586 9820930 10719004 11378772
43835 11378772 13970896 18838964 23194356 23760384 20414504 15681814 11467206 8501056
$$ packed form
43893G864961j331491k09575N03548k008123m576879k005202M233553O957452
43885I428244L497029n31946K23172L395765L424999j89013l377845l930218l171255
43876H768932k413815j595050j037134j388816j983180j740193j148915r92685
43868c530856j37453K558708N114706M506827J319456j005062j182030r78469
43860F665827j429464j758698j883835k176029q93186L683485Q252662O771729
43852A7232491q14359p121977o870615l126985j129653o65633J145473L305190
43844A953932K490639p57878k306926l64616K590057L663378K552344Q98074O59768
43835A1378772K592124M868068M355392N66028l345880m732690m214608k966150
$$ plain form
43827 8501056 7865821 9621274 10343784 6126941 -1302180 -5287182 -2177554 4950099
43819 4950099 11438200 15743906 17357919 14683662 8247577 2510098 880074 1470808
43811 1470808 914742 -358561 -153212 831961 580928 204635 2473012 6812690 9705664
43802 9705664 9662655 8409792 7521936 7022308 6899469 6946279 5521378 1544087 -2689780
43793 -2689780 -3853904 -2439332 -1909917 -3041013 -2661583 1239630 6301421 8899585
43785 8899585 8175448 5969399 4602261 5480890 8347491 11299018 12491017 11652533 9197810
43776 9197810 5273649 1302016 519213 4199386 8865147 10374916 9287370 8652782
43768 8652782 8298127 6020140 3098113 2754374 3356584 -295271 -7644445 -10988419 -6328368
$$ packed form
43827H501056o35235J755453P22510m216843p429121l985002L109628P127653
43819D950099O488101M305706J614013k674257o436085n737479j630024N90734
43811A470808n56066j273303K05349R85173k51033l76293K268377M339678K892974
43802I705664m3009j252863q87856m99628j22839M6810j424901l977291m233867
43793b689780j164124J414572N29415j131096L79430L901213N061791K598164
43785H899585p24137k206049j367138Q78629K866601K951527J191999q38484k454723
43776I197810l924161l971633p82803L680173M665761J509769j087546o34588
43768H652782l54655k277987k922027l43739O02210l651855p349174l343974M660051
$$ plain form
43759 -6328368 250141 1046209 -3197042 -6205251 -5232627 -2280403 854602 3631629
43751 3631629 4484271 2081663 -1810447 -4142296 -4335848 -3415647 -1102896 2775543 5550221
43742 5550221 4419580 1218117 789498 4866083 10675215 15049363 16647619 14712073
43734 14712073 9419178 3663793 1055328 1557889 1933700 712860 -294992 320729
43726 320729 1720000 3374955 6180920 9702732 11246757 9373513 6015232 3567988
43718 3567988 2115404 1138939 1612047 4083403 6451064 6391112 5239636 6884002 12637771
43709 12637771 19113946 21773460 19404644 14485350 9986870 6859034 4692040 3821605
43701 3821605 5512424 9915671 15172611 19471355 22875804 25709005 26255674 22573568
$$ packed form
43759f328368O578509P96068m243251l008209R72624K952224L135005K777027
43751C631629Q52642k402608l892110k331849j93552R20201K312751L878439K774678
43742E550221j130641l201463m28619M076585N809132M374148J598256j935546
43734A4712073n292895n755385k608465N02561L75811j220840j007852O15721
43726C20729J399271J654955K805965L521812J544025j873244l358281k447244
43718C567988j452584r76465M73108K471356K367661n9952j151476J644366N753769
43709A2637771O476175K659514k368816m919294m498480l127836k166994q70435
43701C821605J690819M403247N256940M298744L404449K833201N46669l682106
$$ plain form
43693 22573568 16549138 13384315 15749805 20380309 22121369 19884244 16550202 13982866
43685 13982866 10947926 6470326 2742592 2755574 6135621 9496711 10878537 11825084
43677 11825084 14439191 18365007 22138051 25782271 29735815 32308067 31210754 27503224
43669 27503224 24946424 24854634 24643348 22623762 21079956 22589904 26025353 28636183
43661 28636183 29747409 29795361 28123394 25024692 23948807 27788810 34135166 37904157
43653 37904157 37703887 35922509 33749748 30693124 28379778 29580592 33058467 34676705
43645 34676705 34677553 38224696 46586705 53581688 54505602 53499693 57044409 64080693 68505368
43636 68505368 68987225 69954356 73719603 77860259 81004299 85451959 92008039 96845574
$$ packed form
43693B2573568o024430l164823K365490M630504J741060k237125l334042k567336
43685A3982866l034940m477600l727734J2982L380047L361090J381826R46547
43677A1825084K614107L925816L773044L644220L953544K572252j097313l707530
43669B7503224k556800r1790k11286k019586j543806J509948L435449K610830
43661B8636183J111226M7952j671967l098702j075885L840003O346356L768991
43653C7904157k00270j781378k172761l056624k313346J200814L477875J618238
43645C4676705Q48L547143Q362009O994983R23914j005909L544716P036284M424675
43636F8505368M81857R67131L765247M140656L144040M447660O556080M837535
$$ plain form
43628 96845574 96437190 92471906 89129246 87998439 88516059 91243812 97158970 104601120
43620 104601120 110376976 114119873 118712341 125649177 132595377 137110726 140762494 147153852
43612 147153852 156734642 166029639 172091695 175516275 178392911 181355789 184051584 186951409
43604 186951409 190915809 195960400 202163181 210834461 222782439 236255719 249056076
43597 249056076 262121498 277933352 295236311 308933688 316637947 322023490 329202922
43590 329202922 336351769 338121585 332782623 323409768 312520712 299219439 282523487
43583 282523487 264561662 248507767 234738414 220775183 204546361 186499727 168738278
43576 168738278 153279228 141533459 134429830 131612462 130392636 127105447 120820015 114637653
$$ packed form
43628I6845574m08384l965284l342660j130807N17620K727753N915158P442150
43620A04601120N775856L742897M592468O936836O946200M515349L651768O391358
43612A47153852R580790R294997O062056L424580K876636K962878K695795K899825
43604A86951409L964400N044591O202781Q671280J1947978J3473280J2800357
43597B49056076J3065422J5811854J7302959J3697377P704259N385543P179432
43590C29202922P148847J769816n338962r372855j0889056j3301273j6695952
43583B82523487j7961825j6053895j3769353j3963231j6228822j8046634j7761449
43576A68738278j5459050j1745769p103629k817368j219826l287189o285432o182362
$$ plain form
43568 114637653 111446977 109218658 103301999 93403250 84802344 81211940 79747839 75608244
43560 75608244 69023225 64038753 62223582 61559561 60606083 59522469 57128622 51486297
43552 51486297 44374168 40862581 42437859 44269658 41874291 37096650 34145058 32700823
43544 32700823 29557977 25457089 24957788 29092577 32857571 31875477 28036542 26127754
43536 26127754 27559648 30270465 32891996 35571845 37308916 35873002 31153556 26230683
43528 26230683 23907741 23671451 23268173 22257297 22664677 26283870 32070117 36393115
43520 36393115 36063579 31582603 27201929 26967901 30701812 34582803 35352624 32800789
43512 32800789 28530172 24153501 20901602 19055474 17248840 14268905 11951620 13682719
$$ packed form
43568A14637653l190676k228319n916659r898749q600906l590404j464101m139595
43560G5608244o585019m984472j815171o64021r53478j083614k393847n642325
43552E1486297p112129l511587J575278J831799k395367m777641k951592j444235
43544C2700823l142846m100888m99301M134789L764994r82094l838935j908788
43536B6127754J431894K710817K621531K679849J737071j435914m719446m922873
43528B6230683k322942k36290m03278j010876M07380L619193N786247M322998
43520C6393115l29536m480976m380674k34028L733911L880991P69821k551835
43512C2800789m270617m376671l251899j846128j806634k979935k317285J731099
$$ plain form
43504 13682719 19113435 23543582 24373000 24703746 27603594 30354615 28981517 25817702
43496 25817702 26710535 31836659 35558505 35577536 35683400 37741425 37457067 31681747 24673224
43487 24673224 22508857 24962170 27402078 27785322 27221032 25999455 23855650 22700019
43479 22700019 24616249 28106621 30329701 31988971 35759539 40713898 42971336 41794254
43471 41794254 40421521 40236182 38505756 33288758 26860686 22553213 21129199 21746626
43463 21746626 23742638 25936330 26679150 26218048 26945445 29970450 33405745 35164866
43455 35164866 35372299 34919834 33968785 33349610 35196471 40200008 45737289 48495327 47886794
43446 47886794 45675744 43588748 42644667 43614798 46622104 50795925 55009662 58303696
$$ packed form
43504A3682719N430716M430147Q29418L30746K899848K751021j373098l163815
43496B5817702Q92833N126124L721846J9031J05864K058025k84358n775320p008523
43487B4673224k164367K453313K439908L83244n64290j221577k143805j155631
43479B2700019J916230L490372K223080J659270L770568M954359K257438j177082
43471D1794254j372733j85339j730426n216998o428072m307473j424014O17427
43463B1746626J996012K193692P42820m61102P27397L025005L435295J759121
43455C5164866K07433m52465r51049o19175J846861N003537N537281K758038o08533
43446D7886794k211050k086996r44081R70131L007306M173821M213737L294034
$$ plain form
43438 58303696 59649941 58890486 58121675 60202238 65329630 70951341 75410778 79330854
43430 79330854 82870220 84573167 84302958 84549055 87053608 90636375 94140800 98744235
43422 98744235 104937610 109859602 110730070 109041648 108351537 109604106 111667821 114768539
43414 114768539 119779600 125218007 128635048 130427356 132817624 135553992 136305381 135208144
43406 135208144 135135153 136902165 137951796 136951994 136312992 138504169 142695168 146811983
43398 146811983 150512703 154366750 158323718 162940122 170136491 180513038 191358337 199510442
43390 199510442 205227450 211326806 219366709 228572868 237882362 247143178 256580650 266701095
43382 266701095 278476778 292046865 305336167 315470548 321596043 324878578 325724387
$$ packed form
43438E8303696J346245p59455p68811K080563N127392N621711M459437L920076
43430G9330854L539366J702947k70209K46097K504553L582767L504425M603435
43422I8744235O193375M921992Q70468j688422o90111J252569K063715L100718
43414A14768539N011061N438407L417041J792308K390268K736368P51389j097237
43406A35208144p2991J767012J049631r99802o39002K191177M190999M116815
43398A46811983L700720L854047L956968M616404P196369J0376547J0845299Q152105
43390A99510442N717008O099356Q039903R206159R309494R260816R437472J0120445
43382B66701095J1775683J3570087J3289302J0134381O125495L282535Q45809
$$ plain form
43375 325724387 322802004 315426222 305212557 294123111 282076396 268050164 252777198
43368 252777198 238445326 225863162 213928451 202274392 192117167 183167151 172152309
43361 172152309 157308980 142948919 135672042 135762054 136133034 131236242 123407088 117851877
43353 117851877 114667362 109907178 102617269 95958797 91478201 86780365 80071098 73305623
43345 73305623 68947370 66477612 64308609 62937428 63727565 65907888 67103275 66275233
43337 66275233 64457338 62984999 62234626 61709304 60521176 58360002 56451078 56383548 57375677
43328 57375677 56441183 52586475 49081021 49491117 52750107 54720266 54093997 54050762 57720614
43319 57720614 64279732 70448428 74196755 75784013 76097859 75214870 72631460 68501399
$$ packed form
43375C25724387k922383p375782j0213665j1089446j2046715j4026232j5272966
43368B52777198j4331872j2582164j1934711j1654059j0157225q950016j1014842
43361A72152309j4843329j4360061p276877R0012L70980m896792p829154n555211
43353A17851877l184515m760184p289909o658472m480596m697836o709267o765475
43345G3305623m358253k469758k169003j371181P90137K180323J195387q28042
43337F6275233j817895j472339p50373n25322j188128k161174j908924o7530R92129
43328E7375677r34494l854708l505454M10096L258990J970159o26269m3235L669852
43319E7720614O559118O168696L748327J587258L13846q82989k583410m130061
$$ plain form
43311 68501399 64381036 62214698 62211340 62386547 60988012 58811085 58128937 59801799 62588674
43302 62588674 64994640 66594257 67719709 68991324 70918214 72762907 72233908 68013303
43294 68013303 62515146 60141307 62186497 65129165 64853837 61224171 57440405 55879068
43286 55879068 55759161 54646431 51642885 49015059 50204344 55568240 60971159 62243556
43278 62243556 60400492 60007986 62478822 64156779 62120155 58775594 58551085 62342936
43270 62342936 67487019 71101248 70971186 65391503 55632199 47218909 45046856 47649251
43262 47649251 49433065 47911277 45251862 43370644 41880445 41129311 42556863 44738897
43254 44738897 43623208 38839005 35566568 37356796 41001453 41878407 40536635 39579279
$$ packed form
43311F8501399m120363k166338l358J75207j398535k176927o82148J672862K786875
43302F2588674K405966J599617J125452J271615J926890J844693n28999m220605
43294F8013303n498157k373839K045190K942668k75328l629666l783766j561337
43286E5879068j19907j112730l003546k627826J189285N363896N402919J272397
43278F2243556j843064l92506K470836J677957k036624l344561k24509L791851
43270F2342936N144083L614229j30062n579683r759304q413290k172053K602395
43262D7649251J783814j521788k659415j881218j490199p51134J427552K182034
43254D4738897j115689m784203l272437J790228L644657Q76954j341772r57356
$$ plain form
43246 39579279 37470017 31357319 24174412 22250513 25634903 27048156 22250309 16003779
43238 16003779 14740140 17782705 19900980 19433187 19048064 19769480 19162111 16241950 14379426
43229 14379426 17079674 22891816 27104941 28018108 28952789 32918661 37270322 36492798
43221 36492798 30145719 24694695 25544544 29859811 30504268 25583031 20073802 18262844
43213 18262844 18991258 19696873 21036898 24638152 29051768 31347026 31352950 31312707 31987266
43204 31987266 31683674 28932004 24063147 18308808 13138819 10276685 10590509 12962305
43196 12962305 15679780 18694531 22974078 27975988 31667640 33089273 33038529 32015733
43188 32015733 29557661 26344091 24906476 26615495 29156780 28825352 25016370 20978019
$$ packed form
43246C9579279k109262o112698p182907j923899L384390J413253m797847o246530
43238A6003779j263639L042565K118275m67793l85123P21416o07369k920161j862524
43229A4379426K700248N812142M213125R13167R34681L965872M351661p77524
43221C6492798o347079n451024Q49849M315267O44457m921237n509229j810958
43213A8262844P28414P05615J340025L601254M413616K295258N924m0243O74559
43204C1987266l03592k751670m868857n754339n169989k862134L13824K371796
43196A2962305K717475L014751M279547N001910L691652J421633n0744j022796
43188C2015733k458072l213570j437615J709019K541285l31428l808982m038351
$$ plain form
43180 20978019 20047611 22358352 25569101 27659907 28208203 27856091 27894063 30038517 34972660
43171 34972660 40710990 43927034 43729410 42734736 43393347 44961280 45808164 46859073 49846181
43162 49846181 53306470 54056248 52691795 53805152 59625183 66822843 71276401 73016516
43154 73016516 74474235 76504946 78379099 79472752 78953640 76129760 73005890 73525374
43146 73525374 77725301 79921754 76271143 71086257 71103294 75956202 79773370 80676238
43138 80676238 82502720 87129132 91228422 92102930 91415922 90938434 89181946 85032129
43130 85032129 81035286 80050280 81311066 82398178 82739710 82731215 81600088 78746032 75628643
43121 75628643 74082213 73929176 73823687 73004329 70840463 66428606 60287803 54899842
$$ packed form
43180B0978019r30408K310741L210749K090806N48296l52112L7972K144454M934143
43171C4972660N738330L216044j97624r94674O58611J567933Q46884J050909K987108
43162D9846181L460289P49778j364453J113357N820031P197660M453558J740115
43154G3016516J457719K030711J874153J093653n19112k823880l123870N19484
43146G3525374M199927K196453l650611n184886J7037M852908L817168R02868
43138H0676238J826482M626412M099290Q74508o87008m77488j756488m149817
43130H5032129l996843r85006J260786J087112L41532q495j131127k854056l117389
43121G5628643j546430j53037j05489q19358k163866m411857o140803n387961
$$ plain form
43113 54899842 52034527 50914658 50081716 49262209 48372377 46984666 46155463 48266385 53259707
43104 53259707 57537613 58712920 58985785 61400490 65254239 68151249 70343627 73568599
43096 73568599 77249031 79444264 80375648 81404845 81416104 78083045 72585609 69465566
43088 69465566 71354140 76770427 83418774 90707612 98476785 106112469 113914763 122998228
43080 122998228 132806001 140631116 144484417 144834066 142996939 139662225 135727304 132736817
43072 132736817 131201105 129395343 124636154 115342622 102077529 87670520 76081638
43065 76081638 69649041 67285455 66406022 66113718 66859521 67613655 66071086 62256278 59589712
43056 59589712 61059939 65792633 70563926 73536309 75268719 76799555 78076602 78376299
$$ packed form
43113E4899842k865315j119869q32942q19507q89832j387711q29203K110922M993322
43104E3259707M277906J175307K72865K414705L853749K897010K192378L224972
43096G3568599L680432K195233R31384J029197J1259l333059n497436l120043
43088F9465566J888574N416287O648347P288838P769173P635684P802294R083465
43080A22998228R807773P825115L853301L49649j837127l334714l934921k990487
43072A32736817j535712j805762m759189r293532j3265093j4407009j1588882
43065G6081638o432597k363586q79433k92304P45803P54134j542569l814808k666566
43056E9589712J470227M732694M771293K972383J732410J530836J277047K99697
$$ plain form
43048 78376299 77525104 76123908 74483248 72044178 68848917 67097233 69252153 74170727
43040 74170727 77378678 76340431 73158291 70500800 67653522 63248568 59201527 58110391
43032 58110391 58628490 57724899 56258391 57584566 61334278 63766896 64355340 66449410
43024 66449410 70382472 71684022 68383856 64677966 64108611 64002407 60843013 57084367
43016 57084367 57698333 62714056 67947343 71066611 72358680 71350204 67764530 64898882
43008 64898882 66944390 72870212 77446583 78638981 79559150 82362062 84882257 85284357
43000 85284357 86057711 90458136 97608948 104076492 108667912 112987684 118180446 123484638
42992 123484638 127691951 130275417 131252673 131362642 132298114 135576914 141171054 148129649
$$ packed form
43048G8376299q51195j401196j640660k439070l195261j751684K154920M918574
43040G4170727L207951j038247l182140k657491k847278m404954m047041j091136
43032E8110391N18099r03591j466508J326175L749712K432618N88444K094070
43024F6449410L933062J301550l300166l705890n69355j06204l159394l758646
43016E7084367O13966N015723N233287L119268J292069j008476l585674k865648
43008F4898882K045508N925822M576371J192398R20169K802912K520195M02100
43000H5284357P73354M400425P150812O467544M591420M319772N192762N304192
42992A23484638M207313K583466R77256J09969R35472L278800N594140O958595
$$ plain form
42984 148129649 156255588 165854168 175746858 183186268 186910293 189395894 194587789 203608940
42976 203608940 214223646 224527489 234933087 245336138 252612264 253615119 249489258
42969 249489258 243913141 237607666 228308867 216520272 206787915 201015784 194441849 181918783
42961 181918783 165489847 151517685 142079292 133976935 125586600 119311986 115966056 111478592
42953 111478592 102230876 90708149 82363529 78207480 73878077 66270719 58412317 56003652
42945 56003652 59884519 63889140 61369122 52930827 45493303 43368396 43123778 39266749
42937 39266749 32354383 27732383 27601513 28995887 29895595 32485699 38290710 44167416
42929 44167416 46489710 46597105 48320205 51649157 52778011 50137612 46785444 45911483
$$ packed form
42984A48129649Q125939R598580R892690P439410L724025K485601N191895R021151
42976B03608940J0614706J0303843J0405598J0403051P276126J002855m125861
42969B49489258n576117o305475r298799j1788595r732357n772131o573935j2523066
42961A81918783j6428936j3972162r438393q102357q390335o274614l345930m487464
42953A11478592r247716j1522727q344620m156049m329403p607358p858402k408665
42945E6003652L880867M004621k520018q438295p437524k124907k44618l857029
42937C9266749o912366m622000j30870J394374Q99708K590104N805011N876706
42929D4167416K322294J07395J723100L328952J128854k640399l352168q73961
$$ plain form
42921 45911483 46621008 45704037 42115450 38181161 36816729 38597006 41756673 44583216
42913 44583216 47020102 49347590 50082048 47069114 41071414 36230744 35496048 37049775
42905 37049775 37018499 34476364 31567116 29561896 27554151 25123921 23696311 24429940
42897 24429940 26650708 29108506 30974893 30850105 26935115 19783792 13294065 11020265
42889 11020265 12381760 14246118 15396642 17213691 20128936 21915353 20608706 17488908
42881 17488908 15484191 15211442 14320759 11184275 7859079 7909690 11496840 14382504 12903114
42872 12903114 8693792 6543956 8102507 10359174 10922532 11706421 15095754 18894993
42864 18894993 18830058 15259697 13306025 15580754 18545125 18011277 15073501 13606637
$$ packed form
42921D5911483P09525r16971l588587l934289j364432J780277L159667K826543
42913D4583216K436886K327488P34458l012934n997700m840670p34696J553727
42905C7049775l1276k542135k909248k005220k007745k430230j427610P33629
42897B4429940K220768K457798J866387j24788l914990p151323o489727k273800
42889A1020265J361495J864358J150524J817049K915245J786417j306647l119798
42881A7488908k004717k72749q90683l136484l325196N0611L587150K885664j479390
42872A2903114m209322k149836J558551K256667N63358P83889L389333L799239
42864A8894993o4935l570361j953672K274729K964371n33848k937776j466864
$$ plain form
42856 13606637 14077837 13565951 11170844 9699711 11340574 14522306 16362632 16333749 16220430
42847 16220430 17743119 21263207 25754371 29113224 29436811 26892023 23599559 21057182
42839 21057182 18602031 15108088 11151543 8493828 8210841 10288093 14258634 19074558
42831 19074558 22923080 24435885 23944287 22733842 21460123 20153525 19171858 18831738
42823 18831738 18329700 16418022 13339664 10949116 10565244 11624211 12833570 13818042
42815 13818042 15076582 16876052 18736223 19766276 19283095 17454801 15541702 15065328
42807 15065328 16357633 18139875 18778082 17739995 15647852 13321897 11309301 10153417
42799 10153417 10292394 11287793 11773604 10938987 9709714 9381360 9153701 6638250 1667197
$$ packed form
42856A3606637M71200n11886k395107j471133J640863L181732J840326k8883j13319
42847A6220430J522689L520088M491164L358853L23587k544788l292464k542377
42839B1057182k455151l493943l956545k657715k82987K077252L970541M815924
42831A9074558L848522J512805m91598j210445j273719j306598r81667l40120
42823A8831738n02038j911678l078358k390548l83872J058967J209359R84472
42815A3818042J258540J799470J860171J030053m83181j828294j913099m76374
42807A5065328J292305J782242O38207j038087k092143k325955k012596j155884
42799A0153417J38977R95399M85811q34617j229273l28354k27659k515451m971053
$$ plain form
42790 1667197 -1892707 167449 7596233 16195260 22459099 25706649 26184015 24018312
42782 24018312 20775966 19367804 20841257 23123271 24276820 25041276 26582377 27823565
42774 27823565 27179755 25179102 22938472 19693240 14791917 10812246 11063279 14387006
42766 14387006 16143911 14768579 13802043 16315669 20569021 22953313 22509278 20321684
42758 20321684 16610436 11113710 5242261 1427602 670692 2345089 5813902 10479834
42750 10479834 14573259 15771530 13515204 9789183 7429394 8225892 12301333 18194384
42742 18194384 23410475 25882114 25461206 23702991 22089875 20875667 19738512 18889928
42734 18889928 18836030 19156855 18424816 16064716 13895370 14706463 19043014 24363804 27831359
$$ packed form
42790A667197l559904K060156P428784Q599027O263839L247550M77366k165703
42782B4018312l242346j408162J473453K282014J153549P64456J541101J241188
42774B7823565o43810k000653k240630l245232m901323l979671K51033L323727
42766A4387006J756905j375332r66536K513626M253352K384292m44035k187594
42758B0321684l711248n496726n871449l814659p56910J674397L468813M665932
42750A0479834M093425J198271k256326l726021k359789P96498M075441N893051
42742A8194384N216091K471639m20908j758215j613116j214208j137155q48584
42734A8889928n3898L20825p32039k360100k169346Q11093M336551N320790L467555
$$ plain form
42725 27831359 28911669 28618935 27603482 26377201 26288771 28256492 30889029 31725525 30330655
42716 30330655 28571682 27911822 28110366 28602170 29365381 30181514 30691365 31411433 33114631
42707 33114631 35202706 36519879 37650083 40085621 43102790 44354941 44052884 45183572
42699 45183572 48321060 49876008 47848553 45844073 47826926 51575964 51866726 48818191
42691 48818191 48228657 53396263 60964035 66227948 68965013 71800317 75403562 78140143
42683 78140143 79388610 80649290 83247303 86586316 89244287 90916245 92586377 95080142
42675 95080142 98132643 101021987 103380841 104705339 103766077 99956143 95133927 92352534
42667 92352534 92147137 91746926 88955538 85143081 82897793 82199369 80961674 78451895
$$ packed form
42725B7831359J080310k92734j015453j226281q8430J967721K632537Q36496j394870
42716C0330655j758973o59860J98544M91804P63211Q16133N09851P20068J703198
42707C3114631K088075J317173J130204K435538L017169J252151l02057J130688
42699D5183572L137488J554948k027455k004480J982853L749038K90762l048535
42691D8818191n89534N167606P567772N263913K737065K835304L603245K736581
42683G8140143J248467J260680K598013L339013K657971J671958J670132K493765
42675I5080142L052501K889344K358854J324498r39262l809934m822216k781393
42667I2352534k05397m00211k791388l812457k245288o98424j237695k509779
$$ plain form
42659 78451895 75999796 74770492 75009593 77399099 82818465 90012504 95344500 96267432
42651 96267432 94325489 93617741 96355523 100597528 102767486 102291493 102936738 108683736
42643 108683736 118779033 128394556 134170196 137274434 140708778 146008582 153683051 164236577
42635 164236577 176515136 187043385 193640805 198339114 204236215 210831378 215212985 216570690
42627 216570690 216412681 215423082 213695060 213289409 216254646 219839684 217986047 208861382
42619 208861382 197234338 187851915 180060699 171100597 161291112 152766312 145306569 136877390
42611 136877390 127448599 119469872 114579755 111642364 108171104 102751635 96130616 90189870
42603 90189870 85446338 80103090 73015482 66819471 65215423 67014263 66549678 61421440
$$ packed form
42659G8451895k452099j229304K39101K389506N419366P194039N331996R22932
42651I6267432j941943p07748K737782M242005K169958m75993O45245N746998
42643A08683736J0095297R615523N775640L104238L434344N299804P674469J0553526
42635A64236577J2278559J0528249O597420M698309N897101O595163M381607J357705
42627B16570690j58009r89599j728022m05651K965237L585038j853637r124665
42619B08861382j1627044r382423p791216q960102r809485q524800p459743q429179
42611A36877390r428791p978727m890117k937391l471260n419469o621019n940746
42603I0189870m743532n343248p087608o196011j604048J798840m64585n128238
$$ plain form
42595 61421440 56134007 55484826 57688223 57694189 54770123 52339293 51683911 50613378 48368710
42586 48368710 47318847 48593686 49749535 48634765 46709906 46325785 46825041 45875426
42578 45875426 43540163 42495685 44195094 46700228 47100333 45181068 43690632 44873865
42570 44873865 47524303 48468193 46933499 45983031 48565407 53261472 55688644 53702590
42562 53702590 49322177 45442976 42734499 40644193 39557892 40090248 40977794 39618962
42554 39618962 35185573 30239647 28607261 31755667 37353474 41265850 41046076 37737605
42546 37737605 34384503 32898121 32652315 32066622 30748981 29372976 28037380 26136557
42538 26136557 24038867 23312433 24179913 24055960 20588872 15627578 13744243 16392527
$$ packed form
42595F1421440n287433o49181K203397N966k924066k430830o55382j070533k244668
42586D8368710j049863J274839J155849j114770j924859l84121M99256r49615
42578D5875426k335263j044478J699409K505134M00105j919265j490436J183233
42570D4873865K650438R43890j534694r50468K582376M696065K427172j986054
42562E3702590m380413l879201k708477k090306j086301N32356Q87546j358832
42554C9618962m433389m945926j632386L148406N597807L912376k19774l308471
42546C7737605l353102j486382k45806n85693j317641j376005j335596j900823
42538B6136557k097690p26434Q67480j23953l467088m961294j883335K648284
$$ plain form
42530 16392527 19915802 20524088 19042252 18851054 20904918 23146348 23632439 21819086
42522 21819086 17838575 13273750 11755994 15448013 21150279 23347073 21261088 19122822
42514 19122822 18886044 17217313 11743665 5952127 4395421 6216502 7434368 7354212
42506 7354212 8269509 10067686 9806023 6800790 4169427 4396270 6427687 8154296 9115493
42497 9115493 9592531 9347429 8671195 8870858 10261602 11029773 9475007 6400026 4027194
42488 4027194 3302795 3512779 4065120 5242159 6983978 8052874 7299458 5405095 4304171
42479 4304171 4606381 4753393 3652937 2879769 4282379 6143573 4606104 -632566 -4951490
42470 -4951490 -4438958 -310343 4003547 7572379 11312398 14810033 16846544 17733469
$$ packed form
42530A6392527L523275O08286j481836j91198K053864K241430M86091j813353
42522B1819086l980511m564825j517756L692019N702266K196794k085985k138266
42514A9122822k36778j668731n473648n791538j556706J821081J217866q0156
42506G354212R15297J798177k61663l005233k631363K26843K031417J726609R61197
42497I115493M77038k45102o76234J99663J390744P68171j554766l074981k372832
42488D027194p24399K09984N52341J177039J741819J068896p53416j894363j100924
42479D304171L02210J47012j100456p73168J402610J861194j537469n238670m318924
42470d951490N12532M128615M313890L568832L740019L497635K036511Q86925
$$ plain form
42462 17733469 18253631 17413754 14148264 10270495 8676843 9311287 9889461 9865784 10357060
42453 10357060 10685376 8767814 5075056 2582942 2325711 2477381 2399556 3862417 7144726
42444 7144726 9534642 9234208 7469284 5237196 1575154 -2847471 -4123082 -256095
42436 -256095 4919985 6481681 5000335 4814245 7258887 9495490 9530121 8644481 8294676
42427 8294676 7615167 5270549 1848031 -981338 -2687844 -4047115 -5253680 -4794987
42419 -4794987 -1055144 4834403 8992770 9045952 7526973 8718386 12328266 13400507
42411 13400507 9475500 4607816 3951088 6831929 8292045 6053780 2595931 666440
42403 666440 -87185 -1234612 -2631246 -2850041 -1614750 -561957 -1386439 -3579074 -4597127
$$ packed form
42462A7733469N20162q39877l265490l877769j593652O34444N78174k3677M91276
42453A0357060L28316j917562l692758k492114k57231J51670p7825J462861L282309
42444G144726K389916l00434j764924k232088l662042m422625j275611L866987
42436b56095N176080J561696j481346j86090K444642K236603L4631q85640l49805
42427H294676o79509k344618l422518k829369j706506j359271j206565M58693
42419d794987L739843N889547M158367N3182j518979J191413L609880J072241
42411A3400507l925007m867684o56728K880841J460116k238265l457849j929491
42403F66440p53625j147427j396634k18795J235291J052793q24482k192635j018053
$$ plain form
42394 -4597127 -2789264 379189 2076709 1619096 664917 302467 247391 971186 3601151
42385 3601151 6714236 6452982 1914990 -2300206 -1562446 2967149 6807948 8386157
42377 8386157 9320477 9983045 8938559 6718378 6342544 9023417 12023085 12069509 9252405
42368 9252405 6617828 6988950 10577667 14778503 16177085 13483893 8330465 2929255
42360 2929255 -1826963 -5323429 -6473078 -5858648 -6498513 -9631565 -11378728 -7224993
42352 -7224993 905081 5918091 4146640 -818421 -3572461 -2824083 -611495 1368035
42344 1368035 2612901 2981205 2949407 3548735 4635276 4154016 315613 -5978280 -11459680
42335 -11459680 -12848599 -9065587 -2135133 4104795 7139821 7517590 6871187 5412904
$$ packed form
42394d597127J807863L168453J697520m57613r54179l62450n5076P23795K629965
42385C601151L113085k61254m537992m215196P37760M529595L840799J578209
42377H386157R34320O62568j044486k220181l75834K680873K999668M6424k817104
42368I252405k634577L71122L588717M200836J398582k693192n153428n401210
42360B929255m756218l496466j149649O14430o39865l133052j747163M153735
42352g224993Q130074N013010j771451m965061k754040P48378K212588J979530
42344A368035J244866L68304l1798N99328J086541m81260l838403o293893n481400
42335a1459680j388919L783012O930454O239928L035026L77769o46403j458283
$$ plain form
42327 5412904 3002491 1395892 2701264 5987422 8166769 8276650 8207446 8996105 9281974
42318 9281974 8146290 6839493 6749624 7951467 10473221 14460847 18195817 18685379 15636110
42309 15636110 12432340 11642339 11836503 10589841 8484387 7953049 9574395 11501645
42301 11501645 11718212 9531040 5780711 2642863 2229356 4503307 7400531 9174569
42293 9174569 9275686 7225630 3062717 -949933 -2089103 -1410485 -2933129 -7226535
42285 -7226535 -9335377 -5403031 1785736 6770617 8268496 8789250 9526093 9285693 7407912
42276 7407912 4582377 1462407 -1007101 -971771 1893466 4364955 3086059 -607850
42268 -607850 -2213951 -147325 2516622 2569608 521890 -616825 1211911 5191822 8168555
$$ packed form
42327E412904k410413j606599J305372L286158K179347J09881o9204P88659K85869
42318I281974j135684j306797q9869J201843K521754L987626L734970M89562l049269
42309A5636110l203770p90001J94164j246662k105454n31338J621346J927250
42301A1501645K16567k187172l750329l137848m13507K273951K897224J774038
42293I174569J01117k050056m162913m012650j139170O78618j522644m293406
42285g226535k108842L932346P188767M984881J497879N20754P36843k40400j877781
42276G407912k825535l119970k469508L5330K865237K471489j278896l693909
42268f07850j606101K066626K663947N2986k047718j138715J828736L979911K976733
$$ plain form
42259 8168555 7446809 3876590 1199930 1495725 3031221 4001723 5971736 10955386 17033060
42250 17033060 20203160 19458697 16820877 13331078 8544426 3521021 685493 444169
42242 444169 906250 1079504 1516897 1916057 1319261 981688 3727654 9581848 14852679
42233 14852679 16494190 14962888 12106406 8841902 5869521 4270926 4177511 4525408
42225 4525408 4745010 5067217 5153914 4569651 4520516 6467598 8838095 8079059 3672415
42216 3672415 -657827 -1571587 591979 3766341 6596971 8036838 7246736 5018999
42208 5018999 3047276 1301063 -1260431 -3416365 -2948207 -1696700 -4686089 -12438599
42200 -12438599 -18817784 -19277665 -16876661 -16516289 -17312682 -15430785 -11415196 -9195075
$$ packed form
42259H168555p21746l570219k676660K95795J535496R70502J970013M983650O077674
42250A7033060L170100p44463k637820l489799m786652n023405k835528k41324
42242D44169M62081J73254M37393L99160n96796l37573K745966N854194N270831
42233A4852679J641511j531302k856482l264504k972381j598595r3415L47897
42225D525408K19602L22207Q6697n84263m9135J947082K370497p59036m406644
42216C672415m330242r13760K163566L174362K830630J439867p90102k227737
42208E018999j971723j746213k561494k155934M68158J251507k989389p752510
42200a2438599o379185m59881K401004L60372p96393J881897M015589K220121
$$ plain form
42192 -9195075 -9274065 -8148186 -4226986 116133 2622767 3464636 3101397 1395447 -279506
42183 -279506 844325 5284244 9801456 10697896 7382621 2282473 -1412816 -1645959 1467559
42174 1467559 5942325 9834631 12649200 14442729 14756795 13762454 13300214 14830390 16881527
42165 16881527 16346317 12154858 6420755 2419621 2457014 6671846 12440700 15913638
42157 15913638 15690598 14075779 13482254 13296026 12116232 10981765 11441524 12037221 10267475
42148 10267475 7160982 6115162 7419169 7796267 5894759 4550640 6347692 9989442
42140 9989442 12608452 13186090 12136458 9699916 6593620 4775037 5760103 8678917
42132 8678917 10877352 10233279 7117551 4813860 7112472 13872032 19924649 20728623
$$ packed form
42192i195075p8990J125879L921200M343119K506634Q41869l63239j705950j674953
42183b79506J123831M439919M517212Q96440l315275n100148l695289k33143L113518
42174A467559M474766L892306K814569J793529L14066r94341m62240J530176K051137
42165A6881527n35210m191459n734103m001134L7393M214832N768854L472938
42157A5913638k23040j614819n93525j86228j179794j134467M59759N95697j769746
42148A0267475l106493j045820J304007L77098j901508j344119J797052L641750
42140I989442K619010N77638j049632k436542l106296j818583R85066K918814
42132H678917K198435o44073l115728k303691K298612O759560O052617Q03974
$$ plain form
42124 20728623 18271543 18252469 21864312 24432765 22968746 20723469 21816005 24685644
42116 24685644 24200897 18484247 10710040 5134300 3753620 6180211 10573925 14742890
42108 14742890 17700738 19998684 21851604 21877729 18812058 13658533 8894197 5978652
42100 5978652 4566253 3740856 3246646 3752960 6240566 10769994 15948759 20277453 23575268
42091 23575268 25931880 26001749 22450874 16912960 13072853 12446637 13373507 14513574 16557125
42082 16557125 19577944 21524376 20771667 17769791 13001151 6230583 -549234 -2668821
42074 -2668821 1928779 9233077 13646197 13900530 12140208 9723765 7289428 6827144
42066 6827144 9606893 13089488 13647944 11766162 11123387 13100823 15706859 17534053
$$ packed form
42124B0728623k457080j9074L611843K568453j464019k245277J092536K869639
42116B4685644m84747n716650p774207n575740j380680K426591M393714M168965
42108A4742890K957848K297946J852920K6125l065671n153525m764336k915545
42100E978652j412399q25397m94210N06314K487606M529428N178765M328694L297815
42091B3575268K356612O9869l550875n537914l840107o26216R26870J140067K043551
42082A6557125L020819J946432p52709l001876m768640o770568o779817k119587
42074b668821M597600P304298M413120K54333j760322k416443k434337m62284
42066F827144K779749L482595N58456j881782o42775J977436K606036J827194
$$ plain form
42058 17534053 18977446 19389781 16922910 12204431 8899204 9266414 11725682 13964957
42050 13964957 15984050 18679749 21460448 22771474 21790115 18906981 15759048 14832738
42042 14832738 17191433 20488584 21350582 19817966 18859720 19237073 18155931 14280614
42034 14280614 10796147 11129255 14094308 16064677 16253985 16802837 18383446 18693619 15772262
42025 15772262 10887122 7325246 7115034 9248487 10700964 9225926 5455475 2172647
42017 2172647 1590497 3714154 6923529 9157903 8983677 7194135 7316654 12365822 20360118
42008 20360118 25102886 22696368 15728547 9823089 7719459 8271193 9580478 10783741
42000 10783741 11402817 10999209 9543391 7085714 3538205 -267887 -2221977 -1009690
$$ packed form
42058A7534053J443393M12335k466871m718479l305227L67210K459268K239275
42050A3964957K019093K695699K780699J311026r81359k883134l147933r26310
42042A4832738K358695L297151Q61998j532616r58246L77353j081142l875317
42034A4280614l484467L33108K965053J970369J89308N48852J580609L10173k921357
42025A5772262m885140l561876k10212K133453J452477j475038l770451l282828
42017B172647n82150K123657L209375K234374j74226j789542J22519N049168P994296
42008B0360118M742768k406518o967821n905458k103630N51734J309285J203263
42000A0783741O19076m03608j455818k457677l547509l806092j954090J212287
$$ plain form
41992 -1009690 2108986 4828496 6276914 6683137 5829888 3973508 3494454 6896437 12865792
41983 12865792 16634921 15150472 10316929 6392252 5563516 6839192 8019143 7777069
41975 7777069 6571034 6152111 7538854 9287499 8854423 5963114 3200707 2657222 3611152
41966 3611152 4664436 6368884 9646219 12855800 13284980 11403198 10712171 12577307
41958 12577307 13961844 11961385 8192383 6137281 5876051 4776318 2703123 2754699
41950 2754699 6140486 9805149 10847931 10411357 10807152 11126358 8814484 4344162 1203108
41941 1203108 1614772 4810025 9141343 13276444 15513194 14824883 13030688 13343022 16119363
41932 16119363 18421210 18352293 17173235 16118341 13911483 9305844 4033774 1175470
$$ packed form
41992a009690L118676K719510J448418M06223q53249j856380m79054L401983N969355
41983A2865792L769129j484449m833543l924677q28736J275676J179951k42074
41975G777069j206035m18923J386743J748645m33076k891309k762407n43485R53930
41966C611152J053284J704448L277335L209581M29180j881782o91027J865136
41958A2577307J384537k000459l769002k055102k61230j099733k073195N1576
41950B754699L385787L664663J042782m36574L95795L19206k311874m470322l141054
41941A203108M11664L195253M331318M135101K236750o88311j794195L12334K776341
41932A6119363K301847o8917j179058j054894k206858m605639n272070k858304
$$ plain form
41924 1175470 1777679 4432778 6904294 7148852 4501544 1185564 855755 4108719 7157066
41915 7157066 6541576 3346576 996188 819297 1910742 3481908 4831778 4603551 2714645
41906 2714645 1576203 2772025 4231598 3771520 3512515 6621157 10995449 11260311 6987797
41897 6987797 3735963 4833438 7136083 7064358 6265014 8108971 12234896 16249707 19977475
41888 19977475 23914125 25493909 21486658 13511882 7041761 4714451 4299867 3913212
41880 3913212 5383773 10418318 16396915 19093789 18273200 17549792 18861874 19947838
41872 19947838 18283114 15144022 13662568 14140529 13929189 11839324 10010382 10524786
41864 10524786 12536856 14341266 16201259 18824823 20610280 19278518 15450824 11717298
$$ packed form
41924A175470O02209K655099K471516K44558k647308l315980l29809L252964L048347
41915G157066o15490l195000k350388j76891J091445J571166J349870k28227j888906
41906B714645j138442J195822J459573m60078k59005L108642M374292K64862m272514
41897F987797l251834J097475K302645p1725p99344J843957M125925M014811L727768
41888A9977475L936650J579784m007251p974776o470121k327310m14584l86655
41880C913212J470561N034545N978597K696874q20589p23408J312082J085964
41872A9947838j664724l139092j481454M77961k11340k089865j828942N14404
41864A0524786K012070J804410J859993K623564J785457j331762l827694l733526
$$ plain form
41856 11717298 8673384 5174036 2482623 4194355 10644146 16906230 18715404 17750527
41848 17750527 18398265 21389708 23775844 23987519 23602819 24099276 24521641 23141722 19879590
41839 19879590 16345966 14128943 13243106 12121483 9621251 6981785 6402372 7385665
41831 7385665 6709723 3282210 555736 1740855 4751333 5304211 3739196 4577136 9152621
41822 9152621 12789137 10912611 4969250 219650 -256990 2624935 6399287 8966296
41814 8966296 8935852 6328016 3151316 2022701 3850200 7207558 9684738 9535716 6666200
41805 6666200 2664922 -502070 -2196980 -3064105 -3286229 -2078380 538872 2831170
41797 2831170 3435791 3342504 4242526 5585819 5251182 3174293 2242010 4585442 8432076
$$ packed form
41856A1717298l043914l499348k691413J711732O449791O262084J809174r64877
41848A7750527O47738K991443K386136K11675l84700M96457M22365j379919l262132
41839A9879590l533624k217023q85837j121623k500232k639466n79413R83293
41831G385665o75942l427513k726474J185119L010478N52878j565015Q37940M575485
41822I152621L636516j876526n943361m749600m76640K881925L774352K567009
41814H966296l0444k607836l176700j128615J827499L357358K477180j49022k869516
41805F666200m001278l166992j694910q67125k22124J207849K617252K292298
41797B831170O04621r3287R00022J343293l34637k076889r32283K343432L846634
$$ plain form
41788 8432076 10079551 8248583 4998351 2665624 1601923 1283431 1916284 3594123
41780 3594123 4863368 3920059 1204982 -683691 -82397 1829876 2634814 1170747 -1954154
41771 -1954154 -5072176 -5930910 -2793813 3570479 9739353 12696725 12446474 10626884
41763 10626884 7743242 3589340 -521351 -2522564 -2651914 -3352178 -5597297 -7607302
41755 -7607302 -8135656 -8685467 -10764689 -12824702 -12174075 -8790277 -4859542 -1130314 3692615
41746 3692615 9681366 14245244 15145995 13372483 11585050 10671750 9450314 7475396
41738 7475396 6451765 8154084 11865511 14886238 15403480 14058480 12574065 11611671
41730 11611671 10491467 8528596 5952818 3671764 2674044 3446705 5275792 6224382
$$ packed form
41788H432076J647475j830968l250232k332727j063701l18492O32853J677839
41780C594123J269245r43309k715077j888673O01294J912273Q04938j464067l124901
41771a954154l118022q58734L137097O364292O168874K957372k50251j819590
41763A0626884k883642m153902m110691k001213j29350p00264k245119k010005
41755g607302n28354n49811k079222k060013O50627L383798L930735L729228M822929
41746C692615N988751M563878R00751j773512j787433r13300j221436j974918
41738G475396j023631J702319L711427L020727N17242j345000j484415r62394
41730A1611671j120204j962871k575778k281054r97720P72661J829087R48590
$$ plain form
41722 6224382 4654382 998157 -2523673 -3922661 -2504463 1767030 8433825 15532471
41714 15532471 19881564 19659620 16018424 11226766 6206115 1278245 -1663218 -152150
41706 -152150 5337017 10883596 13162047 12674543 11958557 11930764 11673248 11100066 11686021
41697 11686021 14049174 16347694 16153439 13198853 9298381 5992142 3403735 1471183
41689 1471183 1074346 3000360 6241045 8448365 8445240 7543301 7622888 8248486 6772753
41680 6772753 1729655 -4694301 -8499019 -7913236 -4673487 -1395015 946047 2284875
41672 2284875 1733996 -1488817 -5648651 -7088158 -4244999 113827 1878854 154058
41664 154058 -2358694 -3051331 -1985676 -677453 121659 484494 165944 -1181861 -2824995
$$ packed form
41722F224382j570000l656225l521830j398988J418198M271493O666795P098646
41714A5532471M349093k21944l641196m791658n020651m927870k941463J511068
41706a52150N489167N546579K278451m87504p15986k7793k57516n73182N85955
41697A1686021K363153K298520j94255k954586l900472l306239k588407j932552
41689A471183l96837J926014L240685K207320l125r01939P9587O25598j475733
41680F772753n043098o423956l804718N85783L239749L278472K341062J338828
41672B284875n50879l222813m159834j439507K843159M358826J765027j724796
41664A54058k512752o92637J065655J308223P99112L62835l18550j347805j643134
$$ plain form
41655 -2824995 -3340132 -2707726 -2947654 -5562330 -8876954 -9478640 -6646134 -3829882 -4522768
41646 -4522768 -7689243 -9070187 -6717546 -3270658 -2330911 -4390392 -7220256 -8595570
41638 -8595570 -7316193 -3141397 2186858 4729944 1573370 -5586637 -11826646 -14109565
41630 -14109565 -13429397 -11976764 -10519982 -9406831 -9788843 -11830642 -13000114 -10449956
41622 -10449956 -4949118 -646677 -542987 -3388472 -5504119 -4717607 -1884236 828452
41614 828452 2313284 3207783 4756458 7302616 9885245 11221879 11009372 10209117 10057258
41605 10057258 10853479 11782446 11854201 10765291 8701829 5646380 1399679 -3734650 -8725180
41596 -8725180 -12309162 -13507070 -12159574 -9739000 -8995384 -11141468 -13414240 -11486990
$$ packed form
41655b824995n15137O32406k39928k614676l314624o01686K832506K816252o92886
41646d522768l166475j380944K352641L446888R39747k059481k829864j375314
41638h595570J279377M174796N328255K543086l156574p160007o240009k282919
41630a4109565O80168J452633J456782J113151l82012k041799j169472K550158
41622a0449956N500838M302441J03690k845485k115647P86512K833371K712688
41614H28452J484832Q94499J548675K546158K582629J336634k12507q00255j51859
41605A0057258P96221R28967P1755j088910k063462l055449m246701n134329m990530
41596h725180l583982j197908J347496K420574P43616k146084k272772J927250
$$ plain form
41588 -11486990 -4985322 1499930 4061029 3837593 3856256 3943940 1972976 -1385380 -3012402
41579 -3012402 -2024665 -370060 1348541 4719024 9351760 11821071 10564211 8481620
41571 8481620 8604061 10354114 12433544 15881646 20617802 21853290 14983676 3194114
41563 3194114 -4566922 -3866659 622367 1932410 -921025 -3409826 -2240788 864423
41555 864423 2103372 737570 -36752 2357941 5955362 6960165 5586430 5549300 7066958
41546 7066958 5099013 -2393653 -8867858 -7123280 113448 3858874 1576331 -1035429
41538 -1035429 -1001342 -2594240 -8042128 -11353953 -7037958 343639 1992846 -2790252
41530 -2790252 -6617207 -4826612 -5620 4006424 6570255 7605744 5895628 2428520
$$ packed form
41588a1486990O501668O485252K561099k23436J8663Q7684j970964l358356j627022
41579c012402R87737J654605J718601L370483M632736K469311j256860k082591
41571H481620J22441J750053K079430L448102M736156J235488o869614j1789562
41563C194114p761036P00263M489026J310043k853435k488801J169038L105211
41555H64423J238949j365802p74322K394693L597421J004803j373735l7130J517658
41546G066958j967945p492666o474205J744578P236728L745426k282543k611760
41538a035429L4087j592898n447888l311825M315995P381597J649207m783098
41530b790252l826955J790595M820992M012044K563831J035489j710116l467108
$$ plain form
41522 2428520 1389505 4915299 9578836 10761898 8456554 6150430 5570658 5271141
41514 5271141 3605190 610333 -2783846 -5294130 -5092444 -1258305 3911397 5795830
41506 5795830 2005837 -4639777 -8814203 -8214432 -5594933 -5224313 -8068118 -11010594
41498 -11010594 -10495300 -6186477 -881089 2489677 3138436 2155032 1079468 1151382 3155149
41489 3155149 6904280 10695593 12105598 10207023 7019932 6046058 8865108 13470962
41481 13470962 16383401 16038702 13452179 9932322 5450768 -261997 -6092725 -10077605
41473 -10077605 -11211485 -9906089 -6875033 -2489756 2555576 6639318 7887263 5597534
41465 5597534 1020582 -3363563 -5695630 -6070183 -5804707 -5423951 -4125751 -1660606 226270
$$ packed form
41522B428520j039015L525794M663537J183062k305344k306124n79772k99517
41514E271141j665951k994857l394179k510284K01686L834139N169702J884433
41506E795830l789993o645614m174426N99771K619499L70620k843805k942476
41498a1010594N15294M308823N305388L370766O48759r83404j075564P1914K003767
41489C155149L749131L791313J410005j898575l187091r73874K819050M605854
41481A3470962K912439l44699k586523l519857m481554n712765n830728l984880
41473a0077605j133880J305396L031056M385277N045332M083742J247945k289729
41465E597534m576952m384145k332067l74553K65476L80756J298200K465145J886876
$$ plain form
41456 226270 -518313 -3418381 -5676007 -5434439 -3586198 -1817390 -200011 2055333 4376398
41447 4376398 5099098 3861680 2119946 972689 103855 -395750 977131 4571664 7366665
41438 7366665 5910454 1212081 -1958281 -1136945 1154299 1990078 2428473 4705380 7063458
41429 7063458 5045431 -2281638 -10510030 -14840352 -14423348 -11278641 -7506053 -4692218
41421 -4692218 -3720187 -3483374 -1530095 2383137 5062174 4141039 2067284 3278369 8156353
41412 8156353 12516554 13172182 11428264 10248755 10235894 10080500 9553001 9857043 11220211
41403 11220211 12097124 11531242 10904730 11854275 13080232 11275113 5816777 653320 -134751
41394 -134751 2542090 4283108 3311368 2452720 4456066 7812342 8813026 6256672 2454830
$$ packed form
41456B26270p44583k900068k257626K41568J848241J768808J617379K255344K321065
41447D376398P22700j237418j741734j147257q68834m99605J372881L594533K795001
41438G366665j456211m698373l170362Q21336K291244Q35779M38395K276907K358078
41429G063458k018027p327069q228392m330322M17004L144707L772588K813835
41421d692218R72031K36813J953279L913232K679037r21135k073755J211085M877984
41412H156353M360201O55628j743918j179509j2861j55394n27499L04042J363168
41403A1220211Q76913n65882o26512R49545J225957j805119n458336n163457p88071
41394a34751K676841J741018r71740q58648K003346L356276J000684k556354l801842
$$ plain form
41385 2454830 396883 1229231 3874083 5952356 5515100 2783635 -62176 -1104251
41377 -1104251 -34738 2582034 5772952 7523336 5841280 1720683 -818882 774784
41369 774784 4709550 8039068 10709073 14130833 17604294 19297555 19749145 21086683
41361 21086683 23023050 22701304 18757360 12906258 7204849 2195616 -1940638 -4864152
41353 -4864152 -7169066 -9665908 -11179557 -9594242 -5753973 -3664539 -5539346 -8809308
41345 -8809308 -9481725 -6794825 -3252988 -1386154 -1538945 -1905526 -337375 2863562 4388699
41336 4388699 2068558 -1081340 -35753 5058965 8674308 7723189 5434679 5516123 6672660
41327 6672660 6143046 5091048 6231755 8493440 8585910 6596077 5684003 6764120 7576277
$$ packed form
41385B454830k057947Q32348K644852K078273m37256k731465k845811j042075
41377a104251J069513K616772L190918J750384j682056m120597k539565J593666
41369G74784L934766L329518K670005L421760L473461J693261M51590J337538
41361B1086683J936367l21746l943944n851102n701409n009233m136254k923514
41353d864152k304914k496842j513649J585315L840269K089434j874807l269962
41345h809308o72417K686900L541837J866834j52791l66581J568151L200937J525137
41336D388699k320141l149898J045587N094718L615343r51119k288510Q1444J156537
41327F672660n29614j051998J140707K261685R2470j989833r12074J080117Q12157
$$ plain form
41318 7576277 7068137 6850257 7663368 7839591 6480808 5463694 6848232 10068390 12687185
41309 12687185 12614677 9289240 4318259 1182352 2419237 6568388 9523670 9343776
41301 9343776 8145241 8824527 11499411 13819791 13636956 10959210 8042342 7302579 8360496
41292 8360496 8254470 5935561 4584978 6624549 8398387 4577948 -2692340 -4917711
41284 -4917711 875698 7083503 5848166 -330064 -3306723 -1212170 566316 -936788
41276 -936788 -2101960 542734 4765148 6631475 6428753 7074542 8619645 8128987 4897652
41267 4897652 2530036 4255388 7908833 7917835 2357222 -4042652 -5378378 -1823113 896619
41258 896619 -924495 -4630616 -5480999 -2785861 290320 1266972 62693 -2844220 -7096118
$$ packed form
41318G576277n08140k17880Q13111J76223j358783j017114J384538L220158K618795
41309A2687185p2508l325437m970981l135907J236885M149151K955282j79894
41301I343776j198535O79286K674884K320380j82835k677746k916868p39763J057917
41292H360496j06026k318909j350583K039571J773838l820439p270288k225371
41284d917711N793409O207805j235337o178230k976659K094553J778486j503104
41276i36788j165172K644694M222414J866327k02722O45789J545103m90658l231335
41267D897652k367616J725352L653445R002n560613o399874j335726L555265K719732
41258H96619j821114l706121q50383K695138L076181R76652j204279k906913m251898
$$ plain form
41249 -7096118 -11265020 -13348661 -12944448 -11341291 -9467330 -7511131 -6373524 -7140366
41241 -7140366 -8757724 -8603889 -6145679 -3777587 -3022621 -2236316 341338 3332073 4118975
41232 4118975 2595327 914848 399883 534108 294953 -1110625 -3967890 -6889689 -6992230
41223 -6992230 -3197412 1594462 3814960 3792793 4478160 6498095 7813518 8145376 9937016
41214 9937016 13904135 17144691 17520756 16995590 18339937 20869978 21894824 20508315
41206 20508315 17549638 13563148 9376963 7144942 8032012 10117108 11275542 12608174
41198 12608174 15704604 17976149 15151841 8223140 3420407 4383618 8202793 10313330
41190 10313330 9494766 6544701 1971211 -2591453 -4050975 -1797370 596138 113230
$$ packed form
41249g096118m168902k083641M04213J603157J873961J956199J137607p66842
41241g140366j617358J53835K458210K368092P54966P86305K577654K990735P86902
41232D118975j523648j680479n14965J34225k39155j405578k857265k921799j02541
41223f992230L794818M791874K220498k2167O85367K019935J315423L31858J791640
41214I937016L967119L240556L76065n25166J344347K530041J024846j386509
41206B0508315k958677l986490m186185k232021Q87070K085096J158434J332632
41198A2608174L096430K271545k824308o928701m802733R63211L819175K110537
41190A0313330q18564k950065m573490m562664j459522K253605K393508m82908
$$ plain form
41182 113230 -1905541 -3208681 -4739928 -7837714 -10164613 -8756289 -5168503 -3082034
41174 -3082034 -2286085 89132 3358629 3764064 1187166 -221980 779023 193681 -4180538
41165 -4180538 -8380996 -8081957 -4592332 -1469564 1102176 4110840 4854890 -214456
41157 -214456 -8792156 -14016479 -12900478 -9282646 -7468922 -6837524 -4651820 -1165085
41149 -1165085 774373 -356037 -3553495 -7158723 -9949587 -10906357 -9885968 -8531013
41141 -8531013 -8604229 -8958021 -6178759 350528 5726249 4429153 -2428005 -7523450 -5740614
41132 -5740614 331220 4698142 5247805 4238778 3434867 2274690 437897 -1083646
41124 -1083646 -1969932 -3066532 -4397077 -4942109 -4681925 -4467801 -3747385 -1436670 397280
$$ packed form
41182A13230k018771j303140j531247l097786k326899J408324L587786K086469
41174c082034P95949K375217L269497M05435k576898j409146J001003n85342m374219
41165d180538m200458K99039L489625L122768K571740L008664P44050n069346
41157b14456q577700n224323J116001L617832J813724O31398K185704L486735
41149a165085J939458j130410l197458l605228k790864r56770J020389J354955
41141h531013p3216l53792K779262O529287N375721j297096o857158n095445J782836
41132e740614O071834M366922N49663j009027q03911j160177j836793j521543
41124a083646q86286j096600j330545n45032K60184K14124P20416K310715J833950
$$ plain form
41115 397280 -2681986 -11239311 -19458579 -21155285 -16294486 -9814712 -6139991 -6535607
41107 -6535607 -9469315 -11477495 -9773507 -5901791 -4512206 -6756151 -8014070 -4746770
41099 -4746770 -160657 735579 -1244513 -1495796 766892 2135761 1394447 1227033 3346903
$$ packed form
41115C97280l079266q557325q219268j696706M860799O479774L674721l95616
41107f535607k933708k008180J703988L871716J389585k243945j257919L267300
41099d746770M586113Q96236j980092k51283K262688J368869p41314j67414K119870
$$ [...]
##END NTUPLES=NMR SPECTRUM
##END=
