##TITLE=31Pdec_DE-155_R_TFA
 DMSO+CCl4,64 sc
 23.6.2026
##JCAMPDX= 6.0         $$ Bruker NMR JCAMP-DX V2.0
##DATA TYPE= NMR SPECTRUM
##DATA CLASS= NTUPLES
##ORIGIN= UXNMR, Bruker Analytische Messtechnik GmbH
##OWNER= root
$$ XWIN-NMR		Version 3.5
$$ Tue Jun 23 15:12:51 2026 Russian Standard Time (UT+4h)  she@DPX200
##.OBSERVE FREQUENCY= 81.013821
##.OBSERVE NUCLEUS= ^31P
##.ACQUISITION MODE= SIMULTANEOUS
##.ACQUISITION SCHEME= undefined
##.AVERAGES= 64
##.DIGITISER RES= 17
##SPECTROMETER/DATA SYSTEM= spect
##.PULSE SEQUENCE= zgpg30
##.SOLVENT NAME= CDCl3
##.SHIFT REFERENCE= (INTERNAL, CDCl3, 0, 197.392)
##AUDIT TRAIL= $$ (NUMBER, WHEN, WHO, WHERE, WHAT)
$$ ##TITLE= Audit trail, XWIN-NMR		Version 3.5
$$ ##JCAMPDX= 5.01
$$ ##ORIGIN= Bruker BioSpin GmbH
$$ ##OWNER= she
$$ F:/spectra/data/she/nmr/P31/2/pdata/1/auditp.txt
$$ ##AUDIT TRAIL=  $$ (NUMBER, WHEN, WHO, WHERE, WHAT)
(   1,<2026-06-23 15:11:50.81 +0400>,<she>,<DPX200>,
      <created by zg, POWCHK disabled, PULCHK disabled
       configuration hash MD5:
       00 E9 B6 7A A2 85 ED C7 34 08 36 98 17 FE 4E 26
       data hash MD5: 32K
       42 C6 BB 3D 1C CA 83 5C 60 3D 78 04 59 01 D0 01>)
(   2,<2026-06-23 15:11:53.21 +0400>,<she>,<DPX200>,
      <Start of raw data processing
       efp BC_mod = 2 LB = 1.5 FT_mod = 6 PKNL = 1 PHC0 = 1741.182 PHC1 = -362.6993 SI = 64K 
       data hash MD5: 64K
       01 FE 8C 77 72 47 F2 10 FC D7 C3 38 41 B3 86 88>)
(   3,<2026-06-23 15:12:15.81 +0400>,<she>,<DPX200>,
      <pk PHC0 = 85.19588 PHC1 = 0 
       data hash MD5: 64K
       78 51 B2 41 11 F7 D5 38 F4 E8 0F 1F 7B 76 41 A4>)
(   4,<2026-06-23 15:12:20.53 +0400>,<she>,<DPX200>,
      <abs ABSG = 5 
       data hash MD5: 64K
       D7 4F 34 65 0D 4A 6D 67 C2 AF CD 3B F3 DA 87 6E>)
$$ ##END=
$$ 
$$ hash MD5
$$ 0D A0 55 D7 82 9A C2 1F 0F 3F F5 F6 75 3B FE A5
##$RELAX= 
##$RELAX= 
##$RELAX= 
##$RELAX= 
##$RELAX= 
##$RELAX= 
##$RELAX= 
##$RELAX= 
$$ Bruker specific parameters
$$ --------------------------
##$DU= <F:/spectra>
##$EXPNO= 2
##$NAME= <P31>
##$PROCNO= 1
##$TYPE= <nmr>
##$USER= <she>
##$AMP= (0..31)
100 100 100 100 100 100 100 100 100 100 100 100 100 100 100 100 100 100 
100 100 100 100 100 100 100 100 100 100 100 100 100 100 
##$AQSEQ= 0
##$AQ_mod= 1
##$AUNM= <au_zg>
##$AUTOPOS= <>
##$BF1= 81.014009
##$BF2= 200.13
##$BF3= 200.13
##$BF4= 200.13
##$BF5= 200.13
##$BF6= 200.13
##$BF7= 200.13
##$BF8= 200.13
##$BYTORDA= 1
##$CFDGTYP= 0
##$CFRGTYP= 5
##$CHEMSTR= <none>
##$CNST= (0..31)
1 1 145 1 1 1 1 1 1 1 1 1 1 1 1 1 1 1 1 1 1 1 1 1 1 1 1 1 1 1 1 1 
##$CPDPRG= <waltz16>
##$CPDPRG1= <>
##$CPDPRG2= <waltz16>
##$CPDPRG3= <>
##$CPDPRG4= <mlev>
##$CPDPRG5= <mlev>
##$CPDPRG6= <mlev>
##$CPDPRG7= <mlev>
##$CPDPRG8= <mlev>
##$CPDPRGB= <>
##$CPDPRGT= <>
##$D= (0..31)
0 1 0 0 0 0 0 0 0 0.06 0 0.03 2e-05 3e-06 0 0 0.0002 0 0 0 0 0 0 0 0 0 
0 0 0 0 0 0 
##$DATE= 1782213110
##$DBL= (0..7)
120 120 120 11 120 120 24 19 
##$DBP= (0..7)
150 150 150 150 150 150 150 150 
##$DBP07= 0
##$DBPNAM0= <>
##$DBPNAM1= <>
$$ [...]
##$SUBNAM3= <"">
##$SUBNAM4= <"">
##$SUBNAM5= <"">
##$SUBNAM6= <"">
##$SUBNAM7= <"">
##$SUBNAM8= <"">
##$SUBNAM9= <"">
##$SW= 400.765351723535
##$SWIBOX= (0..15)
0 1 3 0 0 0 0 0 0 0 0 0 0 0 0 0 
##$SW_h= 32467.5324675325
##$TD= 32768
##$TD0= 1
##$TE= 0
##$TE2= 300
##$TE3= 300
##$TEG= 300
##$TL= (0..7)
0 120 53 12 22 120 120 120 
##$TP= (0..7)
150 150 150 150 150 150 150 150 
##$TP07= 0
##$TPNAME0= <>
##$TPNAME1= <>
##$TPNAME2= <>
##$TPNAME3= <>
##$TPNAME4= <>
##$TPNAME5= <>
##$TPNAME6= <>
##$TPNAME7= <>
##$TPOAL= (0..7)
0.5 0.5 0.5 0.5 0.5 0.5 0.5 0.5 
##$TPOFFS= (0..7)
0 0 0 0 0 0 0 0 
##$TUNHIN= 0
##$TUNHOUT= 0
##$TUNXOUT= 0
##$USERA1= <user>
##$USERA2= <user>
##$USERA3= <user>
##$USERA4= <user>
##$USERA5= <user>
##$V9= 5
##$VALIST= <valist>
##$VCLIST= <CCCCCCCCCCCCCCC>
##$VD= 0
##$VDLIST= <DDDDDDDDDDDDDDD>
##$VPLIST= <PPPPPPPPPPPPPPP>
##$VTLIST= <TTTTTTTTTTTTTTT>
##$WBST= 1024
##$WBSW= 4
##$XGAIN= (0..3)
0 0 0 0 
##$XL= 0
##$YL= 0
##$YMAX_a= 3379
##$YMIN_a= -23234
##$ZGOPTNS= <>
##$ZL1= 120
##$ZL2= 120
##$ZL3= 120
##$ZL4= 120
##$ABSF1= 197.3918
##$ABSF2= -203.3724
##$ABSG= 5
##$ABSL= 3
##$ALPHA= 0
##$AQORDER= 0
##$ASSFAC= 0
##$ASSFACI= 0
##$ASSFACX= 0
##$ASSWID= 0
##$AUNMP= <proc_1d>
##$AZFE= 0.1
##$AZFW= 0.5
##$BCFW= 0
##$BC_mod= 2
##$BYTORDP= 0
##$COROFFS= 0
##$CY= -3
##$DATMOD= 1
##$DC= 0
##$DFILT= <>
##$DTYPP= 0
##$F1P= 0
##$F2P= 0
##$FCOR= 1
##$FTSIZE= 65536
##$FT_mod= 6
##$GAMMA= 0
##$GB= 0
##$INTBC= 1
##$INTSCL= 9.790993e-09
##$ISEN= 30
##$LB= 1.5
##$LEV0= 0
##$LPBIN= 0
##$MAXI= 10000
##$MC2= 0
##$MEAN= 0
##$ME_mod= 0
##$MI= 50
##$NCOEF= 0
##$NC_proc= -8
##$NLEV= 6
##$NOISF1= 182.463
##$NOISF2= 159.3651
##$NSP= 0
##$NTH_PI= 0
##$NZP= 0
##$OFFSET= 197.3918
##$PC= 4
##$PHC0= 1826.378
##$PHC1= -362.6993
##$PH_mod= 1
##$PKNL= yes
##$PPARMOD= 0
##$PSCAL= 0
##$PSIGN= 0
##$REVERSE= no
##$SF= 81.014063255964
##$SI= 65536
##$SIGF1= 159.3651
##$SIGF2= -187.1042
##$SINO= 113.3802
##$SIOLD= 16384
##$SREGLST= <1H.CDCl3>
##$SSB= 0
##$STSI= 65536
##$STSR= 0
##$SW_p= 32467.5324675325
##$SYMM= 0
##$S_DEV= 0
##$TDeff= 32768
##$TDoff= 0
##$TI= <>
##$TILT= no
##$TM1= 0
##$TM2= 0
##$TOPLEV= 0
##$USERP1= <user>
##$USERP2= <user>
##$USERP3= <user>
##$USERP4= <user>
##$USERP5= <user>
##$WDW= 1
##$XDIM= 65536
##$YMAX_p= 391831437
##$YMIN_p= -21175229
$$ End of Bruker specific parameters
$$ ---------------------------------
##NTUPLES= NMR SPECTRUM
##VAR_NAME=  FREQUENCY,     SPECTRUM/REAL,   SPECTRUM/IMAG
##SYMBOL=    X,             R,               I
##VAR_TYPE=  INDEPENDENT,   DEPENDENT,       DEPENDENT
##VAR_FORM=  AFFN,          ASDF,            ASDF
##VAR_DIM=   65536,         65536,           65536
##UNITS=     HZ,            ARBITRARY UNITS, ARBITRARY UNITS
##FACTOR=    0.49542278885378, 1,            1
##FIRST=     15991.5117654749, 0,            0
##LAST=      -16476.0207020576, 0,           0
##MIN=       -16476.0207020576, -21175229,   0
##MAX=       15991.5117654749, 391831437,    0
$$ Real data points
##PAGE= N=1
##DATA TABLE= (X++(R..R)), XYDATA
$$ [...]
7497G87213Q73326j598544j529835P90807J198823j658631m162110k766276J624510
7488f440717N234153N467613K650260q44367k559153j969951q14936q14904j475916
7479a567918j112993N61618K248139L013715K928469K029163K41097j687237k625267
7470D028786k522040k201944j794218o82536J053684K506792L231214L355471
7462F975209K523316K44890k601248m122956l577642j979553m97246M36731N00815
7453b097684l53400r35076K06395K378057L088773J490752k71065j35601J101953
7444D473104J445136P33572K88557L51999k09524j668031k491986j279900J189391
7435B832318K608750J711271l87050j720460j934158k338567l428876l660250
$$ plain form
7497 787213 1660539 61995 -1467840 -677033 521790 -1136841 -5298951 -8065227 -6440717
7488 -6440717 -1206564 4261049 6911309 6066942 3507789 1537838 722902 -92002 -1567918
7479 -1567918 -2680911 -2119293 128846 3142561 6071030 8100193 8341290 6654053 4028786
7470 4028786 1506746 -695198 -2489416 -3171952 -2118268 388524 3619738 6975209
7462 6975209 9498525 9743415 7142167 3019211 -558431 -2537984 -3035230 -2598499 -2097684
7453 -2097684 -2451084 -3386160 -3179765 -801708 2287065 3777817 3506752 3371151 4473104
7444 4473104 5918240 6651812 6940369 7292368 7082844 5414813 2922827 1642927 2832318
7435 2832318 5441068 7152339 6765289 5044829 3110671 772104 -2656772 -6317022
7427f317022j718643R83651J706774l7171j886097j657194M34376K710825L779953
7418b000548L091058J122682n69134p02335j2394m02199k041643k776410j070328
7409e361251J770046L142495J992351m80359k105638j416851R70322K493064J332480
7400B336659j050333j634311l4948J163708N24476m59759n63776q34699j705573
7391b258556j097114J921468M087840K017051k344217m072416k142394q0671o5451
7382d034460m82737J3985M7395j203435j719577q1780J462957L14200j872553
7373g556005j174015K598466N005473K676547k377971n299747l833265L1645L127628
7364f801244M359486M625401M550698L461009P60557k577661m686041m625629
$$ plain form
7427 -6317022 -8035665 -7052014 -5345240 -5382411 -7268508 -8925702 -8491326 -5780501 -2000548
7418 -2000548 1090510 2213192 1644058 941723 929329 527130 -1514513 -4290923 -5361251
7409 -5361251 -3591205 -448710 1543641 1063282 -1042356 -2459207 -1488885 1004179 2336659
7400 2336659 1286326 -347985 -382933 780775 1305251 845492 281716 -552983 -2258556
7391 -2258556 -3355670 -1434202 2653638 4670689 2326472 -1745944 -3888338 -3969009 -4034460
7382 -4034460 -4517197 -4503212 -4455817 -5659252 -7378829 -7460609 -5997652 -5683452 -7556005
7373 -7556005 -8730020 -6131554 -1126081 1550466 -827505 -6127252 -9960517 -9928872 -6801244
7364 -6801244 -2441758 2183643 6734341 10195350 10955907 8378246 3692205 -933424
7356i33424k835311j67982K441110L516808J801506j823017m294719l350137o3155
7347e708321K457121K534244J211890K83928O7210m61714j849141l122764k809773
7338g397320q62392R53658J107582M08744J053300L390972M891670L300705p0607
7329F776312j711408l62356J515984J203087q22278k036969j484218n42562l05435
7320B230157n4004R46350J662819P42688j112233j922347j323585q91569j321421
7311a043145j176712N71906K393653K180930L54392q10652m25263K85993L36786
7302B667888J40451j0244q02303k372498l302289k251280K36469K444304L309682
7293F0180K805245J275033o57885k001879k100215j245566j43822Q23650J444578
$$ plain form
7356 -933424 -3768735 -3936717 -1495607 2021201 3822707 1999690 -2295029 -5645166 -5708321
7347 -5708321 -3251200 -716956 494934 778862 846072 384358 -1464783 -4587547 -7397320
7338 -7397320 -8259712 -7306054 -6198472 -5789728 -4736428 -1345456 3546214 6846919 6776312
7329 6776312 5064904 4702548 6218532 7421619 6599341 4562372 3078154 2535592 2230157
7320 2230157 2176153 3122503 4785322 5528010 4415777 2493430 1169845 278276 -1043145
7311 -1043145 -2219857 -1647951 745702 2926632 3281024 2470372 2045109 2331102 2667888
7302 2667888 2808339 2798095 1995792 -376706 -3678995 -5930275 -5693806 -3249502 60180
7293 60180 2865425 4140458 3482573 1480694 -619521 -1865087 -2008909 -1185259 259319
7284B59319J452903R88509O19187M04645k35096j150935j094927K99862J348784
7275B892251O15870n71914J07587K102420K148835j229004n268585o076653l069403
7266h348596P13927K132206R24121o90459q56854r3949M603k93255J052848M002068
7256a453340M861342J052665m036770m567517l38119K682180Q77334k104239j333108
7247d359572K160665L783688K502181J241025J354570J109686k97990j237038
7239F257215r76235j033173j914919j694433L46796J459853p32197m177514m935207
7230g399814k542409q8662M77809L43433R63848J785971J819103J486648J412818
7221a741255P20598j586029m151339m249902j524011J128008J341401L26987N61335
$$ plain form
7284 259319 1712222 2700731 3319918 3724563 3489467 2338532 1243605 1543467 2892251
7275 2892251 3508121 2936207 3043794 5146214 7295049 6066045 797460 -5279193 -8348596
7266 -8348596 -7634669 -5502463 -4578342 -5268801 -6125655 -6219604 -6215001 -6508256 -5455408 -1453340
7256 -1453340 3408002 4460667 423897 -4143620 -4481739 -1799559 -922225 -3026464 -4359572
7247 -4359572 -2198907 1584781 4086962 5327987 6682557 7792243 7494253 6257215
7239 6257215 5280980 4247807 2332888 638455 985251 2445104 1712907 -2464607 -7399814
7230 -7399814 -9942223 -10030885 -9553076 -9209643 -8245795 -6459824 -4640721 -3154073 -1741255
7221 -1741255 -1020657 -2606686 -6758025 -11007927 -12531938 -11403930 -10062529 -9735542 -9174207
7212i174207J824754J939674P59993L93489J164074O69474j749453k842252k67876
7203g282330L097932L006253Q5940j516239n30204N07038K10652j06250j40175
7194b667383j452010l482541k937047Q87147L863651K616863p16400j928290l16271
7185f132281J855379L101158L096760J337153j707876l693089l218176j934172
7177g295144j508629o33245K059883M310665L121904k51566k050460j612080j319592
7168e178264j813279j428122j46706M6051r15025p27226J184441K621395K374475
7159c982260J757244J678491J383087Q02679R42492J261558O5859j785843j381355
7150G41952R58137J098960k275585m625089k052650K647046L927516R16791k578725
$$ plain form
7212 -9174207 -7349453 -5409779 -4649786 -4256297 -3092223 -2422749 -4172202 -7014454 -7282330
7203 -7282330 -4184398 -1178145 -1092205 -2608444 -3138648 -2631610 -2420958 -2527208 -2667383
7194 -2667383 -4119393 -7601934 -10538981 -9651834 -5788183 -3171320 -3887720 -5816010 -6132281
7185 -6132281 -4276902 -1175744 1921016 3258169 1550293 -2142796 -5360972 -7295144
7177 -7295144 -8803773 -9437018 -7377135 -3066470 55434 -196132 -2246592 -3858672 -5178264
7168 -5178264 -6991543 -8419665 -8566371 -8520320 -9435345 -10162571 -8978130 -6356735 -3982260
7159 -3982260 -2225016 -546525 836562 1639241 2581733 3843291 3909150 2123307 741952
7150 741952 1700089 2799049 523464 -4101625 -6154275 -3507229 420287 1337078 -1241647
7141a241647l577852k081195Q02462L581360M119584J649347j343605j616403
7133B92051Q33049L197043L633626K641198J250798j56279j423359k510256l615951
7124D141920m488877m276365k844555j241986j64363O65751J042779K82319m94217
7115g377594J144588M583473N415572J600370k621520k398845P06479J549778
7107B602301o33287j927160n88675P95428L79094k66231K32331N98678k19000
7098I73479p71807M18316K336711L069584K288514R58972p1721m57219n67564
7089H177265j526173l614669m928156l598543r85091j07767j090412j186206M99129
7080h360623J784821J675065K092173L714929L714925K48187l707343m104710
$$ plain form
7141 -1241647 -4819499 -6900694 -6098232 -2516872 1602712 3252059 1908454 292051
7133 292051 1125100 4322143 7955769 10596967 11847765 11691486 10268127 7757871 4141920
7124 4141920 -346957 -4623322 -7467877 -8709863 -8874226 -8208475 -7165696 -6883377 -7377594
7115 -7377594 -6233006 -1649533 3766039 5366409 2744889 346044 1052523 2602301
7107 2602301 1969014 41854 -546821 248607 627701 361470 593801 1192479 973479
7098 973479 201672 619988 2956699 6026283 8314797 9273769 9202048 8744829 8177265
7089 8177265 6651092 3036423 -1891733 -5490276 -6475367 -6583134 -7673546 -8859752 -8360623
7080 -8360623 -6575802 -4900737 -2808564 906365 4621290 4869477 1162134 -2942576
7072b942576j396211P01339N39580l62189n89339l08840J50194P50913R16014
7063b541115J97708m72394M0455J096472J296294Q99645J126479J520831N19075
7054C683450j374344j710958l1737R76479m70420k436188k349339r14060n24965
7045e152082j198376r85268K21795N11725k19912L73241K778441M024569K547625
7036B901758J436262L371660M980033J154340o163507r213081n039172O86681
7028e885026K345969J386041J429358J622557k08883j897514m62392J456820p32563
7019i45633n008998m805685N52583M520082L524675J612230K538946L696684J657195
7010G342079j640764k725590k329971k639222k388179L18806L086247K340048
$$ plain form
7072 -2942576 -4338787 -3637448 -3097868 -3460057 -4049396 -4358236 -4208042 -3457129 -2541115
7063 -2541115 -2343407 -2815801 -2775346 -1678874 -382580 517065 1643544 3164375 3683450
7054 3683450 2309106 598148 566411 1542890 1072470 -1363718 -3713057 -4627117 -5152082
7045 -5152082 -6350458 -7335726 -7113931 -6602206 -6822118 -6448877 -3670436 354133 2901758
7036 2901758 4338020 7709680 12689713 13844053 7680546 -1532535 -6571707 -5885026
7028 -5885026 -3539057 -2153016 -723658 898899 690016 -1207498 -1669890 -213070 -945633
7019 -945633 -5954631 -10760316 -10207733 -5687651 -2162976 -550746 1988200 5684884 7342079
7010 7342079 5701315 2975725 645754 -1993468 -4381647 -4062841 -976594 1363454
7002A363454m91905r81136J307504K765469K069853J637747K553709K647141O25407
6993A3497243j756092k956433l783576m823753m644070k326756M30350J527640
6985d835447J199449J023164J430306J613172J142550N13159L28347N27526M02269
6976C344495n21501j490474j107711N92872J722012J131694J51065K68686M75220
6967D566358r01451k778363k492918n9884J530862N50140j386047j968503p76595
6958c716401J268967K942852K731158K1097l011068k897122O94292L961206L573254
6949E568235N59016j663287j591504m95338m0934n17382j020041n69626P17198
6940I46337J486843P53513p20399j711044k516396l836362m313955j921568K127018
$$ plain form
7002 1363454 871549 -109587 1197917 3963386 6033239 7670986 10224695 12871836 13497243
6993 13497243 11741151 8784718 5001142 177389 -4466681 -6793437 -6363087 -4835447
6985 -4835447 -3635998 -2612834 -1182528 430644 1573194 2086353 2414700 2942226 3344495
6976 3344495 2822994 1332520 224809 817681 2539693 3671387 3822452 4091138 4566358
6967 4566358 3664907 886544 -1606374 -1666258 -135396 414744 -971303 -2939806 -3716401
6958 -3716401 -2447434 495418 3226576 3247673 236605 -2660517 -1966225 1994981 5568235
6949 5568235 6127251 4463964 2872460 2377122 2336188 1818806 798765 229139 946337
6940 946337 2433180 3186693 2466294 755250 -1761146 -5597508 -9911463 -11833031 -9706013
6931i706013L962568K428852P85228J587952K928168J990560l09030j086647J9546
6922B601184J048994J089788P09852Q2406o97750m03431J550077L008929J599022
6913A0589071j344814k366058r63167J02569n33871j254382r42635o78037j004036
6904A604640o94673M24176M37770j202618k038490m55913J452218J233979j66798
6895E94291p38513j148556k750886l726835j387387K510107L164442k46585l063950
6886f793872j798073J413837K793429K188245J979760L079400M470016N075107
6878A2407849M003980O16890l557845m837519j932046J171047J3902l825406m678831
6869f17979q51969L118239K902292m18336k909475k628767l05585K323023L070689
$$ plain form
6931 -9706013 -5743445 -3314593 -2529365 -941413 1986755 3977315 3668285 2581638 2601184
6922 2601184 3650178 4739966 5449818 5532224 4834474 4431043 5981120 8990049 10589071
6913 10589071 9244257 6878199 5915032 6017601 5483730 4229348 3286713 2608676 1604640
6904 1604640 909967 1334143 1771913 569295 -1469195 -1925108 -472890 761089 594291
6895 594291 -144222 -1292778 -4043664 -7770499 -9157886 -6647779 -3483337 -3729922 -6793872
6886 -6793872 -8591945 -7178108 -4384679 -2196434 -216674 2862726 7332742 12407849
6878 12407849 16411829 17028719 13470874 8633355 6701309 7872356 7886258 4060852 -617979
6869 -617979 -1469948 1648291 4550583 4132247 1222772 -1405995 -1711580 611443 3682132
6860C682132L83876m152287o202324l589563P38087K594095J733792P96215O24552
6851c391425k20436j843635k149025j75696K128520K439572P47492j262927k228370
6842e955930j807961m07273J100967J949230K069216J746399R88932r209k67729
6833e93358Q72747K234064J762620q22605l478684m145886k662564l11569J531682
6824e613553K140641J710635J075379O53343L4184p71646o19551R05799J876824
6815A392055L12494k435802l006009p76842J204097N75260j475154k575879k059744
6806h845524l06312K477140N174884N527538K958403j9813j143433j388917k390885
6797B043081k820558o11288K467979K504780l36495j470653J058112L186074R99348
$$ plain form
6860 3682132 4066008 -86279 -6288603 -9878166 -9140079 -6545984 -4812192 -4015977 -3391425
6851 -3391425 -3611861 -5455496 -7604521 -7780217 -5651697 -3212125 -2464633 -3727560 -5955930
6842 -5955930 -7763891 -8171164 -7070197 -5120967 -3051751 -1305352 -316420 -325629 -593358
6833 -593358 279389 2513453 4276073 3453468 -25216 -4171102 -6833666 -7145235 -5613553
6824 -5613553 -3472912 -1762277 -686898 -33555 629 -771017 -1390568 -484769 1392055
6815 1392055 1704549 -731253 -3737262 -4514104 -3310007 -2734747 -4209901 -6785780 -8845524
6806 -8845524 -9151836 -6674696 -1499812 4027726 6986129 6966316 5822883 4433966 2043081
6797 2043081 -777477 -1388765 1079214 3583994 3247499 1776846 2834958 6021032 7020380
6788G020380k975261l347438J67713K586702J051260j788805k673666k194562
6780b153677k258057k188530m76709J537654J303513m45978m15913K007803L752569
6771F62675L035579J830964J746939Q18726k771251o296267n454786o44153L214675
6762c856899L032377P82300m8410J251914K768111K637441O32546j922239l256131
6753B021010k708507j128851N68388K222400L048620J278413k859327n461822
6745c019676l175440J815946M148546K146096r09425k091361j760031r31423M00124
6736c376644J366952M00516j356198m95455L087106M836353K077587j704401k101456
6727B734360m1325P55787j31558l95200J36307n36130k446800l192353j538572
$$ plain form
6788 7020380 4045119 697681 865394 3452096 4503356 2714551 40885 -2153677
6780 -2153677 -4411734 -6600264 -7076973 -5539319 -4235806 -4681784 -5097697 -3089894 662675
6771 662675 3698254 5529218 7276157 8094883 5323632 -972635 -6427421 -7071574 -3856899
6762 -3856899 -824522 -42222 -90632 1161282 3929393 6566834 7199380 5277141 2021010
6753 2021010 -687497 -1816348 -1247960 974440 4023060 5301473 2442146 -3019676
6745 -3019676 -6195116 -4379170 -230624 1915472 1006047 -1085314 -2845345 -3776768 -3376644
6736 -3376644 -2009692 -1609176 -2965374 -3460829 -373723 4462630 6540217 4835816 2734360
6727 2734360 2693035 3448822 3317264 2922064 3058371 2522241 75441 -3116912 -4655484
6718d655484J250826L442489L970525K331023l79054j425251O2396R38966j609523
6709C926913n040993m578059m16843K508342J858405N22207J141618K283774J756686
6700C962050J56645r96849j798476k479938j829231O07832K602611J833539p68125
6691A290058k205000j211669N85158P89963j355712m120525m508431j299399L047088
6682h988469M891409L763925K334591K073829J618508J13471q78097m39384m79575
6673D010208k473673m244580k820998R64950L551455L360183J768976J12126j470667
6664B757980k408593j692450J10083J097805P78799N24566Q07959K25515j727953
6655D73711l014275j819734N46038J459689P95727Q31327K550818M114120L565560
$$ plain form
6718 -4655484 -3404658 37831 4008356 6339379 5960325 4535074 4597470 5536436 3926913
6709 3926913 -1114080 -5692139 -6108982 -3600640 -1742235 -1220028 -78410 2205364 3962050
6700 3962050 4118695 3121846 1323370 -1156568 -2985799 -2377967 224644 2058183 1290058
6691 1290058 -914942 -2126611 -1541453 -751490 -2107202 -6227727 -10736158 -12035557 -8988469
6682 -8988469 -4097060 -333135 2001456 4075285 5693793 5807264 4929167 4489783 4010208
6673 4010208 1536535 -2708045 -5529043 -4564093 -1012638 2347545 4116521 4228647 2757980
6664 2757980 349387 -1343063 -1232980 -135175 643624 1168190 1976149 2201664 473711
6655 473711 -2540564 -4360298 -3814260 -2354571 -1558844 -727517 1823301 5937421 9502981
6646I502981J402711n59294j612088k120707k004225r56069K04017K40782l64377
6637C733731P4923J374035J166867j117293k281918L11036M083141L976448o68421
6628A0652549n048768n094709k010315L08713P9392j520137k602599k177964n10900
6619g924738J036603J196237K83024m14192p45069j629979k729624k300713p8825
6610a3307276J881184K290436K310854K837631K582028Q31297l15333Q12350J976216
6601A899387P1608l687695n177859l287231q18595L89847J504150L264300M141739
6592a700349L310020K381331K444538K014622j06418k243577k325744j023199
6584B751224j25322M91667J731482K540659J204624j395895k639763j911328q72640
$$ plain form
6646 9502981 10905692 10346398 8734310 6613603 4609378 3653309 3857326 4098108 3733731
6637 3733731 3808654 5182689 6349556 5232263 2950345 3261381 7344522 11320970 10652549
6628 10652549 5603781 509072 -1501243 -1192530 -1113138 -2633275 -5235874 -7413838 -7924738
6619 -7924738 -6888135 -5691898 -5408874 -5823066 -6568135 -8198114 -10927738 -13228451 -13307276
6610 -13307276 -11426092 -9135656 -6824802 -3987171 -1405143 -573846 -889179 -76829 1899387
6601 1899387 1970995 -1716700 -6894559 -10181790 -11000385 -10610538 -9106388 -5842088 -1700349
6592 -1700349 1609671 3991002 6435540 8450162 8343744 6100167 3774423 2751224
6584 2751224 2625902 3117569 4849051 7389710 8594334 7198439 4558676 2647348 1774708
6575A774708l17168M15777R54343l6912j838002j966407m53748m37007k849354
6566d753770m050361j407652J989029J872958m65516m89738K090298L202722J420761
6557e91269j77822K6346m37934k777287l731982r27645K440494K158887o19482
6548d637694j651151k20577P40758q2642j083631j115682n38222P43626K881325
6539d963890M096948K516498l13696j222660l64117n23384j762428j314456Q08471
6530c042714J168945p73105q87169K587853N164492K885633j233548j990333Q9817
6521C969871O71830q01873r02670J247474K457400R14372j253089j933160j907028
6512B463127k330909k371784j189433n6043n01714j677740j414533O28295K364350
$$ plain form
6575 1774708 1457540 1873317 2827660 2790748 952746 -1013661 -1467409 -1904416 -4753770
6566 -4753770 -8804131 -10211783 -8222754 -6349796 -6815312 -7305050 -5214752 -2012030 -591269
6557 -591269 -769091 -742745 -1180679 -3957966 -7689948 -8617593 -6177099 -4018212 -4637694
6548 -4637694 -6288845 -6509422 -5768664 -5851306 -6934937 -8050619 -8588841 -7845215 -4963890
6539 -4963890 -866942 1649556 1335860 113200 -250917 -774301 -2536729 -3851185 -3042714
6530 -3042714 -1873769 -2646874 -3534043 -946190 4218302 7103935 5870387 3880054 3969871
6521 3969871 4641701 3839828 2937158 4184632 6642032 7556404 6303315 4370155 2463127
6512 2463127 132218 -2239566 -3428999 -3485042 -3986756 -5664496 -7079029 -6450734 -4086384
6503d086384K018223N28135L58535J944966K621797L84958k373748j542999K409149
6494B262632M268854J393000k463319l016001j541888j408561j659197Q06066
6486a358414M440479M337426K29593k487526r32208J253099K45023k198137k422226
6477A107109p05592K73985L43069J400400L359481L969590K371159J53369j214655
6468A1057915j966093k771012l394067l116700j776714q5742R82128J239261J451713
6459A620689J896774J397915q68453l187990l005241p14423O44948j85914j186278
6450c587973p37227J2058k30235o62200m91583n69565q70183P99836M763286O804435
6440E230649L240530l132871o112115l998026m92625J525181K688480L487919
$$ plain form
6503 -4086384 -2068161 -1540026 -1181491 763475 3385272 3770230 1396482 -146517 2262632
6494 2262632 6531486 7924486 5461167 2445166 903278 -505283 -2164480 -1358414
6486 -1358414 3082065 7419491 7649084 5161558 4229350 5482449 5727472 3529335 1107109
6477 1107109 401517 675502 1018571 2418971 5778452 9748042 12119201 12272570 11057915
6468 11057915 9091822 6320810 2926743 -189957 -1966671 -2052413 -1070285 168976 1620689
6459 1620689 3517463 4915378 4046925 858935 -2146306 -2860729 -2215781 -2401695 -3587973
6450 -3587973 -4325200 -4313142 -4543377 -5205577 -5697160 -6266725 -7136908 -6337072 -1573786 5230649
6440 5230649 8471179 5338308 -773807 -4771833 -5264458 -3739277 -1050797 2437122
6432B437122K508058k50314k003234j070482P09834J194158Q87725Q54391L53722
6423E620980j104553j704011j21114J432753R6938k881607l622488j425290L32214
6414c376178l75627j175380O45577L488222L417236j92461l500144k995800L76106
6405c688449K913257K881538J983858K200921K873272K054915l08825k384645
6397H525842l347207m096049m565202k795521J543754M798336L407050o81329
6389B789674k062226O22864K862305J144681j927395k016510K43004O68142j720488
6380F04051l471538k284322m6969P95890P45397J371834K417365K820934K727380
6371E680022K380477P33256k394005m198627j962981K355885L755903O84191k991613
$$ plain form
6432 2437122 4945180 4694866 2691632 1621150 2330984 3525142 4412867 5267258 5620980
6423 5620980 4516427 2812416 2691302 4124055 4220993 1339386 -2283102 -3708392 -3376178
6414 -3376178 -3751805 -4927185 -4281608 -793386 2623850 2431389 -1068755 -4064555 -3688449
6405 -3688449 -775192 2106346 4090204 6291125 9164397 11219312 10910487 8525842
6397 8525842 5178635 1082586 -3482616 -6278137 -4734383 63953 3471003 2789674
6389 2789674 727448 1350312 4212617 5357298 3429903 1413393 1656397 2324539 604051
6380 604051 -2867487 -5151809 -5198778 -4402888 -3657491 -2285657 131708 2952642 5680022
6371 5680022 8060499 8793755 6399750 2201123 238142 2594027 6349930 7034121 4042508
6362D042508l361678j121355P06520J339908K054103K716455J422794k109022
6354E690233m999588m332343q11976K022933K048162P81626Q23813K094747K113667
6345E431274n8517k038565j414630O11764Q10910j474475l528206l231506j691432
6336f583383j018260j243201q64875O21234K226135L015034K939576K295150J261299
6327B648709J3993j206523k124892k409896j975139j349532j130031r72714L2702
6318h473323J765715K844084K387485J018589k80072j095569r05812Q80010L189536
6309A330643L368936O94878j732244q51008J801694K201660j25522j542693j33985
6300E012359J450716N83948j046894m55353J537882J631336n29821j849984q64284
$$ plain form
6362 4042508 680830 -440525 265995 1605903 3660006 6376461 7799255 5690233
6354 5690233 690645 -3641698 -4453674 -2430741 -382579 399047 1222860 3317607 5431274
6345 5431274 5372757 3334192 1919562 2531326 3342236 1867761 -1660445 -4891951 -6583383
6336 -6583383 -7601643 -8844844 -9709719 -9088485 -6862350 -3847316 -907740 1387410 2648709
6327 2648709 2662702 1456179 -668713 -3078609 -5053748 -6403280 -7533311 -8506025 -8473323
6318 -8473323 -6707608 -3863524 -1476039 -457450 -737522 -1833091 -2738903 -1858893 1330643
6309 1330643 4699579 5394457 3662213 2811205 4612899 6814559 6689037 5146344 5012359
6300 5012359 6463075 7047023 6000129 5544776 7082658 8713994 8184173 6334189 5469905
6291E469905N6493j255238l374507l815961k740810j795327r00102R95405K869953
6282d490189K443830J8629j454142p11899K60440M2173J80047J887203L061347
6273A237439J442406j192518j366865N99023J007781j390369l432868k225750
6265e321721J010607L018821K371635J42949j641490j393795O73686K098624Q07765
6256A767081j601856j594806Q60245J661616j253268m296036l251160O38003K713076
6247d357105J392458o01343o98912Q04648K337727K930982K362259J133945K53302
6238E557961j29799j140334l003049l781465k101860K81442R33065L82140N91052
6229b410847J077795k3933j817894j451244R18252J905386L57778p95302M94686
$$ plain form
6291 5469905 5526398 4271160 896653 -2919308 -5660118 -7455445 -8355547 -7360142 -4490189
6282 -4490189 -2046359 -2027730 -3481872 -4193771 -3933331 -3891158 -3711111 -1823908 1237439
6273 1237439 2679845 1487327 120462 719485 1727266 336897 -3095971 -5321721
6265 -5321721 -4311114 -1292293 1079342 1222291 -419199 -1812994 -1139308 959316 1767081
6256 1767081 165225 -1429581 -569336 1092280 -160988 -4457024 -7708184 -7070181 -4357105
6247 -4357105 -2964647 -3565990 -4264902 -3460254 -1122527 1808455 4170714 5304659 5557961
6238 5557961 5428162 4287828 1284779 -2496686 -4598546 -4317104 -3384039 -3001899 -2410847
6229 -2410847 -1333052 -1356985 -3174879 -4626123 -3707871 -1802485 -1444707 -2240009 -1745323
6220a745323K146172J615777k34488j250268j469669k022081k504846j951241
6212g415967r90086p73730q60543j41703J129021J986412K386089K526143J696574
6203d57790l89125k155954j924739k78330R93402J372925J347948P46034o54299
6194a399928j684944j055360M69975J021602J87711j096242k361405l311849k676725
6185a1907165J61732L030488L141539J085199q3268M69910O61066l32814n85715
6176d359028R03712K204254J671687M61732L7564l73201j723577k639893j355844
6167e172594J301317L020548K922098J529954p66265l194198l927664k223257
6159f510061j03122L37738O0991R92808K139508J067987j474342k062920K11088
$$ plain form
6220 -1745323 400849 2016626 1782138 531870 -937799 -2959880 -5464726 -7415967
6212 -7415967 -8406053 -9179783 -10040326 -10182029 -9053008 -7066596 -4680507 -2154364 -457790
6203 -457790 -846915 -3002869 -4927608 -5205938 -4212536 -2839611 -1491663 -745629 -1399928
6194 -1399928 -3084872 -4140232 -3670257 -2648655 -2460944 -3557186 -5918591 -9230440 -11907165
6185 -11907165 -11745433 -8714945 -5573406 -4488207 -4571475 -4101565 -3440499 -3773313 -4359028
6176 -4359028 -3455316 -1251062 420625 882357 919921 546720 -1176857 -3816750 -5172594
6167 -5172594 -3871277 -850729 2071369 3601323 2835058 -359140 -4286804 -6510061
6159 -6510061 -6613183 -6275445 -6214454 -5221646 -3082138 -2014151 -3488493 -5551413 -5340325
6150e340325K503195K634314J445152J25275j334480k080923n04376K143287K151022
6141A742141n67504j049789K872356N621508J624305n382922p050322k652870
6133d843097L60682j777442l872311p43861M633089O099547L167177K49796l62586
6124B910994k69766r91562k086687k763157k494790o20333K222315L253827Q71653
6115C2494k168685j975120Q30164K179639R73442M06229K167168L368208J267440
6106G080979k205027l402032k191677j202439j184644l58516J765442K832464
6098A134550R53555k227665l251091j041484J763302J844456j095802m200906
6090f121085m785210k894533j77020K676043N905721Q474943P850326K974857
$$ plain form
6150 -5340325 -2837130 -202816 1242336 1367611 33131 -2047792 -2552168 -408881 1742141
6141 1742141 1174637 124848 2997204 8618712 10243017 4860095 -2190227 -4843097
6133 -4843097 -4482415 -6259857 -10132168 -10876029 -6242940 -143393 3023784 3273580 2910994
6124 2910994 2641228 1649666 -437021 -3200178 -5694968 -6315301 -4092986 -839159 32494
6115 32494 -2136191 -4111311 -3281147 -1101508 -128066 278163 2445331 5813539 7080979
6106 7080979 4875952 1473920 -717757 -1920196 -3104840 -3463356 -1697914 1134550
6098 1134550 2088105 -139560 -3390651 -4432135 -2668833 -824377 -1920179 -6121085
6090 -6121085 -10906295 -13800828 -13977848 -11301805 -5396084 3078859 10929185 13904042
6082A3904042l572407p545918o966766l549274n04773N41267N45359J374140L385878
6073b388452M933904M365619J992293m33537j732015k091660k300161l022179
6065f76188m395128n376813m082630j49991L683387M125186J403732j039670j117007
6056g625122l05344o43509j615319j401369K70389K096925L124151L354589L015303
6047B70694K282370J341297Q4249j694879l392686l752819k460380p14711K68762
6038g768103M56143M19680O51881J607100L054227L360020J306318j262769j141490
6029F83007J340849K202013j66193k318282j303070O86634N67912q446K102559
6020C786983N027874M151132j3856j991388J48325J947753j21137l372956l544555
$$ plain form
6082 13904042 10331635 2785717 -4181049 -7730323 -8235096 -7693829 -7148470 -5774330 -2388452
6073 -2388452 2545452 6911071 8903364 8469827 6737812 4646152 2345991 -676188
6065 -676188 -5071316 -10448129 -14530759 -14680750 -10997363 -6872177 -5468445 -6508115 -7625122
6056 -7625122 -7930466 -8573975 -10189294 -11590663 -11320274 -9223349 -6099198 -2744609 270694
6047 270694 2553064 3894361 3978610 2283731 -1108955 -4861774 -7322154 -8036865 -7768103
6038 -7768103 -7311960 -6892280 -6240399 -4633299 -1579072 1780948 3087266 1824497 683007
6029 683007 2023856 4225869 4059676 1741394 438324 1124958 1692870 1684424 3786983
6020 3786983 8814857 12965989 12952133 10960745 11109070 13056823 12935686 9562730 6018175
6011F018175q80164J345744J524470K17799j647128k608710r27270K573970M097242
6002I714128J765206j284200j415304J68436l0514j828323k006473m3129R63811
5993F003638p22717l155199l998869l136339j263505J306263L503493L709588
5985B246353K190694J125713J277509R65488n59945j313743M8423J326718k81664
5976G025546l764252n373419l489127j76591J887345K091563J389649P78189P39701
5967A108604J146305J308510O83530m22672j274019j500732r88314L89775K094638
5958B545625K630517J097660j358987k843516l104548l278398l470959k323823
5950a0106429N75651L341125L749763J724822q45554k138217j680409j94683J196716
$$ plain form
6011 6018175 5138011 6483755 8008225 8226024 6578896 3970186 3042916 5616886 9714128
6002 9714128 11479334 10195134 8779830 8948266 8917752 7089429 5082956 5039827 6003638
5993 6003638 5280921 2125722 -1873147 -5009486 -6272991 -4966728 -1463235 2246353
5985 2246353 4437047 5562760 6840269 7805757 7245812 5932069 5980492 7307210 7025546
5976 7025546 3261294 -2112125 -5601252 -5777843 -3890498 -1798935 -409286 368903 1108604
5967 1108604 2254909 3563419 4246949 3824277 2550258 1049526 61212 450987 2545625
5958 2545625 5176142 6273802 4914815 2071299 -1033249 -4311647 -7782606 -10106429
5950 -10106429 -9530778 -6189653 -2439890 -715068 -1560622 -3698839 -5379248 -5573931 -4377215
5941d377215J850181K026832K308030K646734K414293J310125k67164j620201
5933F291615k061974j284894j73547n69965k967478n060319m331901j671586k22036
5924a2052085p34962p88455Q63797K232774J756608J004588J545215J853151K24700
5915d094669j517713p21226J382991J547590M5032J31520K272649L253865J588455
5906C888494l89691r86963j613388k969828k689800N12005L568243L120826M02018
5897B841916j183492j276385j798099k520624j433555R18711J391328q04725k320649
5888f185574k62408L623681N042132K390087j453319k493579j78843J934458O19199
5879C035834k481779k639774J295933M676637L227307j097244l326949k575933
$$ plain form
5941 -4377215 -2527034 -500202 1807828 4454562 6868855 8178980 7911816 6291615
5933 6291615 4229641 2944747 2771200 2201235 -766243 -5826562 -10158463 -11830049 -12052085
5924 -12052085 -12787047 -13575502 -12711705 -10478931 -8722323 -7717735 -6172520 -4319369 -4094669
5915 -4094669 -5612382 -6333608 -4950617 -3403027 -3357995 -3226475 -953826 2300039 3888494
5906 3888494 3498803 2511840 898452 -2071376 -4761176 -4249171 -680928 2439898 2841916
5897 2841916 1658424 382039 -1416060 -3936684 -5370239 -4451528 -3060200 -3864925 -6185574
5888 -6185574 -6447982 -2824301 2217831 4607918 3154599 661020 482177 2416635 3035834
5879 3035834 554055 -2085719 -789786 3886851 7114158 6016914 2689965 114032
5871A14032k046162k855638k357797P07671L475532L255567J514062J186391K121393
5862E115051J806169l77432j993627q08600K071897K929360n26975n790698p243567
5853d818422k424285M330014O513419L064052j265468k783920k577705k629665
5845b591980k117516J10831K370095K430995J045601L77938M97793K59461K39716
5836B622934J572261K756893J148035k451004m060696k028749P27198J111489
5828A398361j00395k30066J234281K449640K011031K80498j503327k187299j176122
5819B176602R93996K701858K574182P11315j657372l277325l363267j806808L55133
5810e91686J261740K8670j896125k055948K04355K950875L911650K826978J059670
$$ plain form
5871 114032 -1932130 -4787768 -7145565 -6437894 -2962362 293205 1807267 2993658 5115051
5862 5115051 6921220 6543788 4550161 3741561 5813458 8742818 8215843 2425145 -4818422
5853 -4818422 -7242707 -2912693 3600726 6664778 5399310 2615390 37685 -2591980
5845 -2591980 -4709496 -4598665 -2228570 202425 1248026 1625964 2123757 2383218 2622934
5836 2622934 4195195 6952088 8100123 5649119 1588423 -440326 286872 1398361
5828 1398361 1297966 1067900 2302181 4751821 6762852 7043350 5540023 3352724 2176602
5819 2176602 3170598 5872456 8446638 9157953 7500581 4223256 859989 -946819 -591686
5810 -591686 670054 698724 -1197401 -3253349 -3048994 -98119 3813531 6640509 7700179
5801G700179m97463k060217l525670l703786j903647M54868J158555M1749q22757
5792c158189q5427J083366R62326j49396o32154p1627M78459N51196R46793J915207
5782A840554K042098L5778k986327m197476k291675O91377J448236p28003k893019
5773g038457j830297J975801M770671L951512Q81658j188785q38822Q14962K131488
5764C629731K315248J276840m79259j854894k057377j452000q09971k11812L25238
5755F81744o6425j755543k945315j549370J338914K352474P37787l68360J202539
5746c71555L249320K824412Q77902K44620O78770l45470k532172k629206n1260
5737A945361J366240q79380l829808l499347q92844p3186j658198k126537M86744
$$ plain form
5801 7700179 7202716 5142499 1616829 -2086957 -3990604 -3535736 -2377181 -2335432 -3158189
5792 -3158189 -3243616 -2160250 -1197924 -1347320 -1979474 -2051101 -1572642 -1021446 -74653 1840554
5782 1840554 3882652 3918430 932103 -3265373 -5557048 -4865671 -3417435 -4145438 -7038457
5773 -7038457 -8868754 -6892953 -2122282 1829230 2710888 1522103 683281 1498243 3629731
5764 3629731 5944979 7221819 6742560 4887666 2830289 1378289 568318 356506 681744
5755 681744 615319 -1140224 -4085539 -5634909 -4295995 -1943521 -1205734 -1574094 -371555
5746 -371555 2877765 5702177 6580079 6824699 7503469 7157999 4625827 1996621 1945361
5737 1945361 3311601 2432221 -1397587 -4896934 -5789778 -5862964 -7521162 -9647699 -9160955
5728i160955L741461M511027K720354J49004k023504k858551j068046K865427
5720a123783N342108L071475k427792n973886m637639p36706J581992J123187
5712c781044l2179J37435J428631K439464K484179J876516J027182K46449K22580
5703F049213J351043K153145L7364m813714p749823m593818K135128N282150K098379
5694A949067k286388k326713N35446J343643l11412n62185J538582K452990N39237
5685B872267q77041R90652L622092K930127p78912l692126l790811k392915j253983
5676b370650o88533l46658P3022Q53885J740996J746270N18025p75583j015357
5667b64583o65845m76539K37753K256709M224152L807764Q36164k465909m191218
$$ plain form
5728 -9160955 -5419494 -908467 1811887 1960891 -62613 -2921164 -3989210 -1123783
5720 -1123783 4218325 7289800 4862008 -1111878 -5749517 -6486223 -4904231 -3781044
5712 -3781044 -3813223 -3675788 -2247157 192307 2676486 4553002 5580184 5826633 6049213
5703 6049213 7400256 9553401 9590765 4777051 -2972772 -7566590 -5431462 -149312 1949067
5694 1949067 -337321 -2664034 -2128588 -784945 -1096357 -1658542 -119960 2333030 2872267
5685 2872267 1995226 2985878 6607970 9538097 8759185 5067059 1276248 -1116667 -2370650
5676 -2370650 -3059183 -3405841 -3332819 -2478934 -737938 1008332 1526357 750774 -264583
5667 -264583 -930428 -1406967 -1169214 1087495 5311647 9119411 9955575 7489666 3298448
5658C298448m095144k559329j67067J591428J170558q01834j649104J50717K903083
5649a58244L642551J549418j193473j772837K22409K201849J447456j396719k888707
5640A653703j469972M0964j695305n504727o989729m331928j43292K598981L753147
5631a2088158M375951M456327L761433K971063K304506O28600k255211l865346
5623B89165j890686J945908L355621R74163j781621j197829K009464L809501J907840
5614I421526j758498l581586k200728O43749K388924J886058l25242k839826m141808
5605e07431l455046j549434j87029j83638n50220j17886P39452Q75029J32257
5596d803946p85603j566727k076858j491626O64035K934462L303322K102905J476732
$$ plain form
5658 3298448 -796696 -3356025 -3523092 -1931664 -761106 -1562940 -3212044 -3061327 -158244
5649 -158244 3484307 5033725 3840252 2067415 2289824 4491673 5939129 4542410 1653703
5640 1653703 183731 224695 -1470610 -6975337 -13965066 -18296994 -18440286 -15841305 -12088158
5631 -12088158 -7712207 -3255880 505553 3476616 5781122 6409722 4154511 289165
5623 289165 -1601521 344387 3700008 4674171 2892550 1694721 3704185 7513686 9421526
5614 9421526 7663028 4081442 1880714 2524463 4913387 6799445 6474203 3634377 -507431
5605 -507431 -3962477 -5511911 -5698940 -5882578 -6432798 -6550684 -5811232 -4936203 -4803946
5596 -4803946 -5589549 -7156276 -9233134 -10724760 -10060725 -7126263 -3822941 -1720036 -243304
5587b43304J771360R81348j369030k519120n44019K071754J575351j641077l626992
5578c543729k423722k63045R3777j186522k119314j703180m84810N92390J009832
5569a0028323J048566J763093L697115N369348M336293M03146l519009m698181
5561a627952l542736k174070j315418k95978P56160R05534M27808O97140J686979
5552d482533J581239l20284k128940k000944p03917m3541K3072Q57016K455812
5543d763020L214627K209547K30204j303754j215730J046455M208452M958302
5535H585083J291187l986508n728896k981246k89754j250344l534460k654493
5527a0549431J366808M081771K572342j377905m039929l563439q42846J708872
$$ plain form
5587 -243304 1528056 2509404 1140374 -1378746 -1922765 148989 1724340 83263 -3543729
5578 -3543729 -5967451 -6230496 -6136719 -7323241 -9442555 -11145735 -11630545 -11038155 -10028323
5569 -10028323 -8979757 -7216664 -3519549 1849799 6186092 6589238 3070229 -1627952
5561 -1627952 -5170688 -7344758 -8660176 -8956154 -8199994 -7294460 -6866652 -6169512 -4482533
5552 -4482533 -2901294 -3221578 -5350518 -7351462 -8055379 -8098920 -8075848 -7218832 -4763020
5543 -4763020 -1548393 661154 891358 -412396 -1628126 -581671 3626781 8585083
5535 8585083 9876270 5889762 160866 -2820380 -3110134 -4360478 -7894938 -10549431
5527 -10549431 -9182623 -5100852 -2528510 -3906415 -7946344 -11509783 -12352629 -10643757
5519a0643757J861954o33186l474931l811511j006004K989277N581484N285525
5511c851149K394463r66071k137478n62171J417710J562927O79829R62483K271560
5502A772103K336703M41710j479466j828972j310374j183793j406950j467736
5494d126775j497347j456655n42997J328274K478698J367481r50540j699049J77090
5485d921820K584519K926689J473317R00213K332302L341018J282618k399559
5477G519297l614074j307727J106164Q67170n99641j061307j309130k650791l168342
5468d218381m67168L391835M004671J015503j727863k055023j224719J08460K826330
5459A653645N467879M424169j99140l520178k949022j831381l206568m486371
$$ plain form
5519 -10643757 -8781803 -9414989 -12889920 -16701431 -17707435 -14718158 -9136674 -3851149
5511 -3851149 -1456686 -2422757 -4560235 -5122406 -3704696 -2141769 -1461940 -499457 1772103
5502 1772103 4108806 4550516 3071050 1242078 -68296 -1252089 -2659039 -4126775
5494 -4126775 -5624122 -7080777 -7623774 -6295500 -3816802 -2449321 -3399861 -5098910 -4921820
5485 -4921820 -2337301 589388 2062705 2962918 5295220 8636238 9918856 7519297
5477 7519297 3905223 2597496 3703660 4570830 3971189 2909882 1600752 -1050039 -4218381
5468 -4218381 -4685549 -1293714 2710957 3726460 1998597 -56426 -1281145 -1172685 1653645
5459 1653645 7121524 11545693 11346553 7826375 4877353 3045972 -160596 -4646967
5451d646967k333977J072290J544778j68162j49367J838022K564173J350707N55485
5442A626982L41189j616356m537132m051044P73452M660891L296497n48143j574477
5433a628141K99305R34350r88280k456566j527350p7689l1470l07801M25048P37432
5423d621162q70994k119305M24722N272883O634721K251477l034905l807826j043979
5414i14368O54200K20067J86098J010030L78167j701847k059950K7155Q68904
5405a331544j736419m507580l519629P5296K397355K436882J915702J474912N25281
5396b269744l58253k69291l81005k312482m549513l657152P63662M961958N369265
5387b702555K161672j742720l636487k839441q83643L8830m60258o28473O93217
$$ plain form
5451 -4646967 -6980944 -5908654 -4363876 -4532038 -4681405 -2843383 -279210 1071497 1626982
5442 1626982 1968171 351815 -4185317 -8236361 -7462909 -2802018 494479 -53664 -1628141
5433 -1628141 -1328836 -394486 -1382766 -3839332 -5366682 -5444371 -5475841 -5783642 -5358594 -4621162
5423 -4621162 -5492156 -7611461 -7186739 -1913856 4720865 6972342 3937437 129611 -914368
5414 -914368 -260168 -40101 145997 1156027 1534194 -167653 -2227603 -2200448 -1331544
5405 -1331544 -3067963 -7575543 -11095172 -11019876 -8622521 -6185639 -4269937 -2795025 -2269744
5396 -2269744 -2627997 -2897288 -3278293 -5590775 -10140288 -13797440 -13033778 -8071820 -2702555
5387 -2702555 -540883 -2283603 -5920090 -8759531 -9643174 -9604344 -10064602 -10693075 -9999858
5378i999858K321270K731673K158168J290547k44758k264692k854269j099986
5370g961905Q57148J002843O96972J817898K801507J293171j003010n75586J841911
5361G70949K264996J90025o67805J077107K116228J15659k622654l226998k313510
5352b296003j747537j472929q40748m33181m02291O21673K927493M288219L121369
5343C766065R37862k89822r82077k075637k545253j339496R8598K5056l69973
5334b774677J136182L678747M208646K225138O05517J229315K341649J423223
5326A4073740j163482k950400k829240k140012k384298l202569l262876k259402
5318f118539q93764O97945K932335N024170N065727K736726J91950j059909k323050
$$ plain form
5378 -9999858 -7678588 -4946915 -2788747 -1498200 -1742958 -4007650 -6861919 -7961905
5370 -7961905 -7104757 -6101914 -5404942 -3587044 -785537 507634 -495376 -1070962 770949
5361 770949 3035945 3225970 2558165 3635272 5751500 5867159 3244505 17507 -2296003
5352 -2296003 -4043540 -5516469 -6357217 -6790398 -7192689 -6571016 -3643523 644696 3766065
5343 3766065 4703927 4414105 3432028 1356391 -1188862 -2528358 -2429760 -2404704 -2774677
5334 -2774677 -1638495 2040252 6248898 8474036 9079553 10308868 12650517 14073740
5326 14073740 12910258 9959858 7130618 4990606 2606308 -596261 -3859137 -6118539
5318 -6118539 -7012303 -6314358 -3382023 1642147 6707874 9444600 9636550 8576641 6253591
5309F253591m833533o534911m611853k01439K630194K356278J355090J619301
5301a967282K106704J164242q75269k479249k497118n25455K487759L930345J979651
5292C324328j499608k789640j167893N28360L07531p56895j128165q36084k13809
5283d231875Q13431J505400Q05775m99895o06074K59283M70162M68698J910714
5274H95619L373471J499444k782503m199164j062866J754571M00265k247666j955245
5265d324074J29749M15966q90410j092596r9373J96731j14929L99517J291936
5256d087483J152959M82706N30765O61382k20930j159864q33996l341L95791J393031
5246a688980L277495L355176O4463l160074k407596M29122N93327j935823k889308
$$ plain form
5309 6253591 1420058 -5114853 -9726706 -9928145 -7297951 -4941673 -3586583 -1967282
5301 -1967282 139422 1303664 428395 -2050854 -4547972 -5073427 -2585668 1344677 3324328
5292 3324328 1824720 -964920 -2132813 -1604453 -1296922 -2053817 -3181982 -4018066 -4231875
5283 -4231875 -3418444 -1913044 -1107269 -1607164 -2213238 -1953955 -1483793 -1015095 895619
5274 895619 4269090 5768534 2986031 -1213133 -2275999 -521428 -121163 -2368829 -4324074
5265 -4324074 -4194325 -3778359 -4668769 -5761365 -5860738 -5664007 -5778936 -5379419 -4087483
5256 -4087483 -2934524 -2451818 -1921053 -1259671 -1480601 -2640465 -3474461 -3477802 -3082011 -1688980
5246 -1688980 1588515 4943691 5008154 1848080 -559516 -130394 462933 -1472890 -4362198
5237d362198r51944N79635m54255k202403k365721r68940J025384K814555L235405
5228c650482J908693P20270J487890K810282K149063R0938p95372m08475p76881
5219C535926k030501k390093j473066n9340K259557N215914N279553L9736o028986
5210D348700o129651j066315J790016k29753j864415M42837K874504J548440q04663
5201I09700m8375K324505K363454M20243j75135R76330J149141q94148l460278
5192C565437m479385l298354o97393J489218J848455J159080J080613J103305
5184A770976m75408k583930k194025M06245J616615Q08314J437262M053730M042389
5175H882168l93172l774993j534284K502063K468177j46508j47099J675394R0708
$$ plain form
5237 -4362198 -5314142 -4734507 -5188762 -7391165 -9756886 -10725826 -9700442 -6885887 -3650482
5228 -3650482 -1741789 -1021519 466371 3276653 5425716 5516654 4721282 4312807 3535926
5219 3535926 1505425 -884668 -2357734 -2417074 -157517 5058397 10337950 10377686 4348700
5210 4348700 -1780951 -2847266 -1057250 -1287003 -3151418 -2708581 165923 1714363 909700
5201 909700 861325 3185830 5549284 5969527 5794392 6770722 7919863 7025715 3565437
5192 3565437 -913948 -4212302 -4909695 -3420477 -1572022 -412942 667671 1770976
5184 1770976 1295568 -1288362 -3482387 -3076142 -1459527 -651213 786049 4839779 8882168
5175 8882168 8488996 4714003 3179719 5681782 8149959 8003451 7856352 9531746 9622454
5166I622454m877925p318813m618049p13078P46764P21469R05472O92211j59480
5157d998975j29287R47135R90372n61160j533397r30496o03555j525437j837286
5148a0182086l40518J322998J826503K282529L175984K498152l92660k131868
5140a940966l13L080351K064555k922800o547315n246275j035372J932128J918340
5131h697667N8729j618196j720452l37081J068542J371762J159656J327123J075921
5122f311663o75871k351271j012806K874756M997982L057552K54166M15894K108591
5113C357330J282947j692514k308731N80827K352626k97466l941161l396506P79952
5104c282696L739273L526515K533678K364188J584007o81284k583889k512099
$$ plain form
5166 9622454 4744529 -2574284 -7192333 -7905411 -7158647 -6437178 -5531706 -4839495 -4998975
5157 -4998975 -5128262 -4181127 -3190755 -3751915 -5285312 -6215808 -6819363 -8344800 -10182086
5148 -10182086 -10522604 -9199606 -7373103 -5090574 -1914590 583562 190902 -1940966
5140 -1940966 -1941279 1139072 3203627 280827 -6266488 -11512763 -12548135 -10616007 -8697667
5131 -8697667 -8638938 -10257134 -11977586 -12314667 -11246125 -9874363 -8714707 -7387584 -6311663
5122 -6311663 -6987534 -9338805 -10351611 -7476855 -2478873 578679 832845 1248739 3357330
5113 3357330 4640277 2947763 639032 1219859 3572485 3275019 -666142 -4062648 -3282696
5104 -3282696 456577 3983092 6516770 8880958 10464965 9783681 7199792 4687693
5096D687693j508847j173870j316531j185034j109201j356463r95292M88128J772464
5087a696953J474966K97241p5411N61974Q93436L5624j416441k006556p48772
5078b680892J608910K801243J630541k4362M04109K044510J498361j731377l881963
5069A669080k398527K69402N47682j141745j834843o35794R62321J878445J815445
5060A131466J62091k654537l939899j909611Q99901P10888j713517k067224Q27944
5051h552498L322888K736770J053241J058449J966430J385689n25140j536796
5043I09033q19201L68872Q82158P42959L08242j48523k17082J56327K47338l57098
5033B073025p02715K61996J687409J567510m35209k350388k512925j473476n68406
$$ plain form
5096 4687693 3178846 2004976 688445 -496589 -1605790 -2962253 -3957545 -3469417 -1696953
5087 -1696953 -221987 75254 -157 561817 1455253 1490877 74436 -1932120 -2680892
5078 -2680892 -1071982 1729261 3359802 3335440 3739549 5784059 7282420 5551043 1669080
5069 1669080 -729447 -460045 87637 -1054108 -2888951 -3524745 -2562424 -683979 1131466
5060 1131466 1293557 -1360980 -5300879 -7210490 -6310589 -5599701 -7313218 -9380442 -8552498
5051 -8552498 -5229610 -2492840 -1439599 -381150 1585280 2970969 2445829 909033
5043 909033 89832 458704 1340862 2083821 2392063 2243540 2026458 2182785 2430123 2073025
5033 2073025 1370310 1632306 3319715 4887225 4452016 2101628 -411297 -1884773 -2453179
5024b453179J17631J122120J914452J496519K73182m41355p42261j984891l813260
5015d511042l461867N24946N367493O666023L282680j729285m401825k956017
5007a218894J263927M429043K894741k810894p450946o558235j731878J721703
4999i461433J614101N27734J029106K536004L519564L750317L145587R82706k173961
4990E469725l768988k114024J353226L783090L723055J574585j287283l124510
4982E608876k936619j602542q20685q46725p17868m24667p73608j225852l51483
4973d091173J408777K048469J356306J189128J944307J797322K48123p10942j87125
4964E003192j54651k052084m180588m143060j861421J015498K830961K437218
$$ plain form
5024 -2453179 -2335548 -1213428 701024 2197543 2470725 2029370 1287109 -697782 -4511042
5015 -4511042 -7972909 -7447963 -2080470 4585553 7868233 6138948 1737123 -1218894
5007 -1218894 45033 4474076 7368817 4557923 -2893023 -9451258 -11183136 -9461433
4999 -9461433 -7847332 -7319598 -6290492 -3754488 -234924 3515393 6660980 7643686 5469725
4990 5469725 1700737 -413287 939939 4723029 8446084 10020669 8733386 5608876
4982 5608876 2672257 1069715 249030 -597695 -1315563 -1740230 -2513838 -3739690 -4091173
4973 -4091173 -2682396 -633927 722379 1911507 3855814 5653136 5901259 5190317 5003192
4964 5003192 4848541 2796457 -1384131 -5527191 -7388612 -6373114 -3542153 -1104935
4956a104935J33179j642210r14380P40624N68322o39484p5063J568222J111287
4947b54438q02163l01427K230919J788870k532982n127933k756953O46900J213374
4938e895833Q28983J932564K795939K076876K126551L533239K412182k352755
4930G457746n347226l001519M89279P32655O6515J323695J646964r60770j909484
4921D97855J789025M436483Q36178m096619l705552j056845k372654n170366l543395
4912a2385890J26199j72313k404855p46477K738843K052381j107357j096550M39761
4903a2556258j156235k590759J400811N735883K433466l937900k970787L431238
4895a0210541N158530K223257K308799L816932m59332o046151k740412M969005
$$ plain form
4956 -1104935 -971756 -2613966 -3528346 -2787722 -2219400 -2858884 -2933947 -1365725 -254438
4947 -254438 -1056601 -1358028 872891 2661761 128779 -4999154 -7756107 -7109207 -5895833
4938 -5895833 -5066850 -3134286 -338347 1738529 3865080 7398319 9810501 7457746
4930 7457746 2110520 -890999 -401720 330935 397450 1721145 3368109 2407339 497855
4921 497855 2286880 6723363 7559541 3462922 -242630 -1299475 -3672129 -8842495 -12385890
4912 -12385890 -12259691 -12432004 -14836859 -15583336 -12844493 -10792112 -11899469 -12996019 -12556258
4903 -12556258 -13712493 -16303252 -14902441 -9166558 -6733092 -10670992 -13641779 -10210541
4895 -10210541 -5052011 -2828754 -519955 3296977 2837645 -3208506 -5948918 -979913
4887i79913M246822k222930j548969L341356q64484r022943m412090O803369L285915
4878a373867q375471m66738K0728708J8611458Q98927K8286328J10086545J51786566
4870C20182456P1648981p0769430j39010745r3520542k3105624n940297k0794406
4863C8690393j7184113L21876J187536r393031p165515L572626K552665o286813
4855F295624m747676L950120K945112n318370m376764N232023P855921J028190
4847A2864180k965480q91970j263684m747786k800165M080084N544324j20329
4839I699174l412971q23676P31180j654717k295861Q31873K093682p33231k626662
4830A808791j163990q5887p68706L52947L609231M243469J073583j115979o4397
$$ plain form
4887 -979913 3266909 1043979 -504990 2836366 1971882 -7051061 -11463151 -4659782 -1373867
4878 -1373867 -9749338 -10216076 10512632 29124090 30023017 58309345 168395890 320182456
4870 320182456 391831437 321062007 182051262 88530720 65425096 59484799 38690393
4863 38690393 21506280 21828156 23015692 13622661 6457146 10029772 12582437 6295624
4855 6295624 1547948 5498068 8443180 3124810 -1251954 3980069 11835990 12864180
4847 12864180 9898700 9006730 7743046 2995260 195095 4275179 9819503 9699174
4839 9699174 6286203 5462527 6193707 4538990 2243129 3075002 5168684 4435453 1808791
4830 1808791 644801 558914 -209792 143155 3752386 7995855 9069438 7953459 7889062
4821G889062O22484j198235k528740j181795P06947J143611R28642M68943j042454
4812E808465k391938j206237J407602J876491K5168q50071K85237J206300R13079
4803G074096L08620j035331l766434n197744k328211K239328L119925L82796j016044
4794b18999K78993N81241j346167j919071O10901K885726J886237r58597k867760
4785a067496l062952j845357K23156J625826J505348J582242L130286L559395
4777E650448N11844k506823n25366M152278M490415l35390l904225l076787j873568
4768B582826k987765l011636N50635M052872L559220P38780r54402j528968k285406
4759G16156k477547j648027j663653l149804l258150o8649L890355N275350M035003
$$ plain form
4821 7889062 8511546 7313311 4784571 3602776 4309723 5453334 6381976 6850919 5808465
4812 5808465 3416527 2210290 3617892 5494383 5519551 4669480 4954717 6161017 7074096
4803 7074096 7382716 6347385 2580951 -2616793 -4945004 -2705676 414249 797045 -218999
4794 -218999 59994 641235 -704932 -2624003 -2013102 872624 2758861 1800264 -1067496
4785 -1067496 -4130448 -5975805 -5752649 -4126823 -2621475 -1039233 2091053 5650448
4777 5650448 6162292 3655469 3130103 7282381 11772796 11437406 7533181 4456394 2582826
4768 2582826 -404939 -3416575 -2865940 1186932 4746152 5484932 4530530 3001562 716156
4759 716156 -1761391 -3409418 -5073071 -8222875 -11481025 -11549674 -7659319 -2383969 1651034
4750A651034J534490j922715n068233m813241o45965L167382K914685K49434j144028
4741d077157p53161l3303J106372L042869L899427J879292j281541k228425l22766
4732A231607K159540K946455J249361j951180l680768j340524L139636M271443
4724H025570L8100n028072o003020l512438p99284J499053L788319L976399M36636
4715B421263l472445k937595J179928L473830J823509n70379j146553j266609
4707d95051k302770k596693n46446K190407K959810J689917J32527j051782k342570
4698b362651l278495k466913R8344K246065J999796O5253j000350N637J573186
4689c120128J757674P97531L88100J023339J531766J094429K65782j57156n705
$$ plain form
4750 1651034 3185524 1262809 -3805424 -8618665 -9264630 -6097248 -3182563 -2933129 -4077157
4741 -4077157 -4830318 -4863621 -3757249 -714380 3185047 5064339 3782798 1554373 1231607
4732 1231607 3391147 6337602 7586963 5635783 1955015 614491 3754127 8025570
4724 8025570 8063670 3035598 -2967422 -6479860 -7279144 -5780091 -1991772 1984627 2421263
4715 2421263 -1051182 -3988777 -2808849 664981 2488490 1918111 771558 -495051
4707 -495051 -2797821 -5394514 -5940960 -3750553 -790743 899174 1031701 -20081 -2362651
4698 -2362651 -5641146 -8108059 -8009715 -5763650 -3763854 -3698601 -4698951 -4693314 -3120128
4689 -3120128 -1362454 -564923 -176823 846516 2378282 3472711 3738493 3581337 3575632
4680C575632O66523J627143J994987R91318p33626j752043j781174j604783j281396
4671A702581j21587J543671K276755J354339p05301l077230m546229l435316P5323
4662d932994K573586J380750j014267k52216K835700L239053J6269k007542l16830
4653A521509J209952p26892l003512j465288J944803K391403k97549k144931j323377
4644a893882M51231J579707J738638M54758j929792k952584j073056J173446N10205
4635a941329j848104k058593K66725J882121J321258M50970N55257O38810J22663
4626f10222q6185J40239l08516j391203j624343o24230M06699R43689J556159
4617a597913K032159J567438Q57767J381668K455300J750099q49594k642014k102113
$$ plain form
4680 3575632 4242155 5869298 7864285 8855603 8121977 6369934 4588760 2983977 1702581
4671 1702581 1580994 3124665 5401420 6755759 6050458 2973228 -1573001 -5008317 -4932994
4662 -4932994 -2359408 -978658 -1992925 -2245141 590559 3829612 3845881 1838339 1521509
4653 1521509 2731461 2004569 -998943 -2464231 -519428 1871975 1574426 -570505 -1893882
4644 -1893882 -1442651 137056 1875694 2330452 400660 -2551924 -3624980 -2451534 -1941329
4635 -1941329 -3789433 -5848026 -5581301 -3699180 -2377922 -1926952 -1371695 -732885 -610222
4626 -610222 -696407 -556168 -864684 -2255887 -3880230 -4504460 -4097761 -3154072 -1597913
4617 -1597913 434246 2001684 2859451 4241119 6696419 8446518 7596924 4954910 2852797
4608B852797r80831j374045k719188k863228q25499K212764L870217K638884j45177
4599B666694j276127J75051J281239k18990j929882n54166K222183J983497j273425
4590C076074l243089k461218j961742k879568k044257J767385M442265K852947
4582d51203J56125N81220K500856J591902j545325k313587K47934J924203k4947
4573B667178k977680l261701j201512J83147l95772j404896j034314P25584K504826
4564d195140L152370K596291J377954j86576j913985k998905k283665J87284K516100
4555a748272K681424Q62528n24963N84186L320138M284730J225489l746382n872563
4546A066315l343706K96122Q05334j107120j241760J655474L996705K550170j096565
$$ plain form
4608 2852797 1871966 497921 -2221267 -5084495 -5909994 -3697230 172987 2811871 2666694
4599 2666694 1390567 1565618 2846857 2627867 697985 143819 2366002 4349499 3076074
4590 3076074 -167015 -2628233 -4589975 -7469543 -9513800 -7746415 -3304150 -451203
4582 -451203 -295078 286142 2786998 4378900 2833575 519988 767922 2692125 2667178
4573 2667178 -310502 -3572203 -4773715 -4590568 -4986340 -6391236 -7425550 -6699966 -4195140
4564 -4195140 -1042770 1553521 2931475 2744899 830914 -2167991 -4451656 -4264372 -1748272
4555 -1748272 933152 1795680 1270717 1854903 5175041 9459771 10685260 6938878 1066315
4546 1066315 -2277391 -1981269 -1175935 -2283055 -3524815 -1869341 2127364 4677534 3580969
4537C580969k825714j194379J190837R23119k388063n346158m043390J241668
4529h861111N512873M713688Q62191q66052O67254J715715O3783j695091p68402
4520A344848J454153J980770N63554j013504j951202k323752j654241J8902J022291
4511e58181J74858j211600j407699q82344p51559k33211J745019L693115L259455
4502C827853J068239n3117N99879Q92667l59437j554164j021817M92458J084087
4493D976648P6556j662098k862723k738828j385023K65506J093583M42820j681524
4484c475083m233504m952753k177166K397920M502686K269281j084895j362541
4476h116055J154583K631489J227040q41384p65273J508703L900064M663521L676923
$$ plain form
4537 3580969 755255 -439124 751713 1674832 -713231 -6059389 -10102779 -8861111
4529 -8861111 -3348238 1365450 2227641 1361589 2028843 3744558 3808341 2113250 1344848
4520 1344848 2799001 4779771 5343325 4329821 2378619 54867 -1599374 -1580472 -558181
4511 -558181 -383323 -1594923 -3002622 -3884966 -4636525 -4869736 -3124717 568398 3827853
4502 3827853 4896092 4842975 5442854 6335521 5976084 4421920 3400103 3892561 4976648
4493 4976648 5053204 3391106 528383 -2210445 -3595468 -3329962 -2236379 -1793559 -3475083
4484 -3475083 -7708587 -12661340 -14838506 -12440586 -7937900 -5668619 -6753514 -8116055
4476 -8116055 -6961472 -4329983 -3102943 -3944327 -4709600 -3200897 699167 5362688 9039611
4467I039611K062049P70237n78280k753093m681522l888514j96382K953176K712658
4458E439940O80107K50439J572079J921783J92405j912081k771624k230212l47767
4449B795069K477694M149513K424736j655807m189719k883924O22927L100723
4441F841212K758393Q7354k612207k894022r79723j4722j655103l077285j271804
4432b817907J575411J200467j572632k024014M43303J373223p59871j775754P50891
4423c606883L103055J891645l31279j38408P45437n52139j981477k45274K408442
4414A293119J324776k364264l086985J30216K171848K9721l142836l664992k067636
4405i377033j81648K057086M223620L647223n22072m127073k580476K694262N726358
$$ plain form
4467 9039611 11101660 11871897 11293617 8540524 3859002 -29512 -225894 2727282 5439940
4458 5439940 6120047 6370486 7942565 9864348 10056753 8144672 5373048 3142836 2795069
4449 2795069 5272763 9422276 11847012 10191205 6001486 3117562 3740489 6841212
4441 6841212 9599605 9686959 7074752 4180730 3201007 3186285 1531182 -1546103 -2817907
4432 -2817907 -1242496 -42029 -1614661 -3638675 -3195372 -1822149 -2582020 -4357774 -3606883
4423 -3606883 -503828 1387817 1056538 918130 1663567 1111428 -870049 -1115323 1293119
4414 1293119 2617895 253631 -2833354 -2703138 -531290 -501569 -3644405 -7309397 -9377033
4405 -9377033 -9558681 -7501595 -3277975 369248 -152824 -4279897 -6860373 -4166111 1560247
4396A560247L482489r79285l138645k366679j451272k218627l374391k710899
4388a1197062j56759K280791L072762K481459J328011j94184j885870k874676
4380g145528k481017j028271P53945K212577K363396N95959j544171j287112J422946
4371f137276L118723J716157j62431O10609K420440J527127j539462k470560K52659
4362f64014L372467L842873K101249k90669k620839l662648k020263O61214L77414
4353A096784l326955n480816k360781K877894M520145K071052j5629P35151K045718
4344B162563J307706m81576o77818R75416K105047J128232n55491o30883N37158
4335E870354J64454k447167l837173j100437K959308K974885j132836l653604
$$ plain form
4396 1560247 5042736 4063451 924806 -1441873 -2893145 -5111772 -8486163 -11197062
4388 -11197062 -11353821 -9073030 -6000268 -3518809 -2190798 -2384982 -4270852 -7145528
4380 -7145528 -9626545 -10654816 -9900871 -7688294 -5324898 -4728939 -6273110 -7560222 -6137276
4371 -6137276 -3018553 -1302396 -1464827 -854218 1566222 3093349 1553887 -916673 -664014
4362 -664014 2708453 6551326 8652575 8361906 5741067 2078419 58156 719370 1096784
4353 1096784 -2230171 -7710987 -10071768 -7193874 -2673729 -602677 -618306 116845 2162563
4344 2162563 3470269 2988693 2310875 3286291 5391338 6519570 5964079 5333196 5870354
4335 5870354 6034808 3587641 -249532 -1349969 1609339 4584224 3451388 -202216
4327b02216j318112K243407K461424M15852J06597J923384K812219J511532j52761
4318I801326p41823q02667r13124n96093M81367J803471K493014J607808j125164
4309A2008115l891167l820290j017456N72315j312361l175257p12849L975003
4301B626053M684675J18611m163694l623264k96282J252822j1316j896245k707670
4292d016310k178251l80367K040328L557081L369329K531717K321069K453359
4284I697955J982728Q76745m56752k138062l991378m649153l003842j53398J475151
4275c60006R48571k49485k94119P76700J417542P97262m5396K94382J358517J160910
4265E804878r97593l198363l183932j017539J525503L277885M051922L448079
$$ plain form
4327 -202216 -1520328 723079 3184503 3600355 3706952 5630336 8442555 9954087 9801326
4318 9801326 9059503 8256836 7343712 6747619 7228986 9032457 11525471 13133279 12008115
4309 12008115 8116948 4296658 3279202 3851517 2539156 -636101 -1348950 2626053
4301 2626053 7310728 7429339 3265645 -357619 -653901 598921 587605 -1308640 -4016310
4292 -4016310 -6194561 -6574928 -4534600 -977519 2391810 4923527 7244596 9697955
4284 9697955 11680683 12557428 12100676 9962614 5971236 1322083 -1681759 -1835157 -360006
4275 -360006 588565 339080 44961 821661 2239203 3036465 2991069 3285451 4643968 5804878
4265 5804878 4807285 1608922 -1575010 -2592549 -1067046 2210839 6262761 9710840
4257I710840J001967k537383n312146n796917l590170M70817M108328M651166
4249B706502J768117j649520k685349j461665L16325K150209L845622L554859
4241H545100K8718m009348m278134o97457K488818K524314Q98948p3230j38501
4232E289228L03433J430603K585875K191366K53702j240428j246760p26007k42908
4223H598104Q48194K109918J796927o954q45177K19528Q91832o35792k750360
4214A0226220k971566j414690j8339J69301l58453m95420N29552K187193K901172
4205A0754970K317670J911181J714905p72718n329437o347846o66806N547067
4197I128986M892067M44005L44956L624775L074357M13702L852173J0283065Q333404
$$ plain form
4257 9710840 10712807 8175424 2863278 -2933639 -6523809 -6052992 -1944664 2706502
4249 2706502 4474619 2825099 139750 -1321915 -1005590 1144619 4990241 8545100
4241 8545100 8573818 4564470 286336 -411121 2077697 4602011 5500959 5427729 5289228
4232 5289228 5592661 7023264 9609139 11800505 12054207 10813779 9567019 8841012 8598104
4223 8598104 9446298 11556216 13353143 13346189 12501012 12720540 13612372 12976580 10226220
4214 10226220 7254654 5839964 5821625 5990926 5632473 5137053 5666605 7853798 10754970
4205 10754970 13072640 14983821 16698726 15926008 10596571 4248725 3581919 9128986
4197 9128986 14021053 14465058 14810014 18434789 21509146 21922848 25775021 36058086 44391490
4188D4391490L363870J6816260M7906137N8561730J9943121m0902492o8897187
4181H1182929m8874051j7271038o984883j0911586q437222p8533J883856j657781
4173a1148309r88206L606517M442645J484200O38472J763376O22154j179180O40451
4164a17880L417531J606385k561803k654713L20873O6399l065307k634206J932052
4155c690669L951283Q95165j808465j67436K864266L398589J689336p42353l399855
4146B989861m582614k105640K188938L398942M04960k643705k733432j498372
4138d581062j225428j561693j564974j476685j286945m14332P11041J299128J943634
4129h157316K972208K502184l40118k238214k13858K779139K216104j83849L97536
$$ plain form
4188 44391490 47755360 64571620 112477757 171039487 190982608 150080116 81182929
4181 81182929 32308878 15037840 8052957 -2858629 -11295851 -11374384 -9490528 -11148309
4173 -11148309 -12136515 -8529998 -4087353 -2603153 -1964681 -201305 420849 -758331 -117880
4164 -117880 3299651 4906036 2344233 -310480 10393 76792 -2988515 -5622721 -3690669
4155 -3690669 260614 1155779 -652686 -820122 2044144 5442733 7132069 6389716 2989861
4146 2989861 -1592753 -3698393 -1509455 1889487 2294447 -349258 -3082690 -4581062
4138 -4581062 -5806490 -7368183 -8933157 -10409842 -11696787 -12111119 -11400078 -10100950 -8157316
4129 -8157316 -5185108 -2682924 -3023042 -5261256 -5475114 -2695975 -479871 -663720 -266184
4120b66184K735451J560796k065622j489549L540078N156013L26129l811332j815920
4111C869860J613896O91237j921418j490628k67756k242809m289220j227379L962072
4102a302145L836634j494793m393498j267787L295586M445955K646824K59968
4094F026744j946363l378490l017397j553025q36622p49075K40179J622254J567439
4085b024356P86522J629813L343312K530973j142483l954937l740091k395664
4077d966911j562611O1332L141309N142787L988235J592237J100243K405104K700298
4068A3602023L37693l515799o157758n348709j229889L043194L926934J318169
4060E975858j600568k484786j920860j260411q06967p81993j569355k074153m33136
$$ plain form
4120 -266184 2469267 4030063 1964441 474892 4014970 9170983 9497112 5685780 3869860
4111 3869860 5483756 6174993 4253575 2762947 2495191 252382 -4036838 -5264217 -1302145
4102 -1302145 2534489 1039696 -3353802 -4621589 -1326003 3119952 5766776 6026744
4094 6026744 4080381 701891 -2315506 -3868531 -4705153 -5454228 -5214049 -3591795 -2024356
4085 -2024356 -1237834 391979 3735291 6266264 5123781 1168844 -2571247 -4966911
4077 -4966911 -6529522 -6468190 -3326881 1815906 5804141 7396378 8496621 10901725 13602023
4068 13602023 13939716 10423917 4266159 -1082550 -2312439 730755 4657689 5975858
4060 5975858 4375290 1890504 -30356 -1290767 -2097734 -2879727 -4449082 -6523235 -6956371
4051f956371K463481K966639o9529k768169j405960K191565L377556J204552r72246
4042C1518o89673P94044R10248j222686m387484o208952m661679k39067L642058
4033a2031673M019216J839554L34017L96508j64542k658250n178799n149545k423121
4024b1016635J206813M175883N733075N571990M224416L132308L116098L138613
4016I282561J604825j325980l637223l657178j703268M54483J190655J18974j729349
4007E98500k594693j393405J146173K995307K826607J345694K75120K09074J37243
3998E545620p64724j702936j381245p1693N52491k52944j239617r86477J06271
3989a95254N33601j43149q86825q16673k69460j0364j18590q1256L52454P47106
$$ plain form
4051 -6956371 -4492890 -1526251 -1595780 -4363949 -5769909 -3578344 -200788 1003764 31518
4042 31518 -658155 135889 1046137 -176549 -4564033 -10772985 -15434664 -15673731 -12031673
4033 -12031673 -8012457 -6172903 -5838886 -5442378 -5606920 -8265170 -13443969 -18593514 -21016635
4024 -21016635 -19809822 -15633939 -9900864 -4328874 -104458 3027850 6143948 9282561
4016 9282561 10887386 9561406 5924183 2267005 563737 1018220 2208875 2327849 598500
4007 598500 -1996193 -3389598 -2243425 751882 3578489 4924183 5199303 5408377 5545620
3998 5545620 4780896 3077960 1696715 1625022 2177513 1924569 684952 -301525 -195254
3989 -195254 338347 195198 -691627 -1508300 -1777760 -1788124 -1906714 -1987970 -1635516 -888410
3979h88410L74682r29877k216902k049106o7436K367858L628344L586584L197812
3970G003549K649435J136813j343353l249756l284051k054002j111111r59498
3962a211974r07517m29958K89285R32902J241450P32220q33709k579780k941489
3953e708570j307175J267999L162641L523048K444613N48942j227780j984296
3945G19422j604923j014756j245918k202418k574298j113975J930803M648610
3937b457453M947797K482352r26609k943448k710748j139779M05888J282945J545567
3928D86512J219069n2107k320539m206832l303655J010983N458383N555342J130496
3919D977652k849543k342754Q48242K268667R94390m18325q10439j374362k041771
$$ plain form
3979 -888410 -513728 -1443605 -3660507 -5709613 -5777049 -3409191 219153 3805737 7003549
3970 7003549 9652984 10789797 9446444 6196688 2912637 858635 -252476 -1211974
3962 -1211974 -2119491 -2549449 -2260164 -1327262 -85812 646408 -187301 -2767081 -5708570
3953 -5708570 -7015745 -5747746 -2585105 937943 3382556 3931498 2703718 719422
3945 719422 -885501 -1900257 -3146175 -5348593 -7922891 -9036866 -7106063 -2457453
3937 -2457453 2490344 4972696 4046087 1102639 -1608109 -2747888 -2342000 -1059055 486512
3928 486512 1705581 1653474 -667065 -4873897 -8177552 -7166569 -1708186 3847156 4977652
3919 4977652 2128109 -214645 633597 2902264 3896654 3478329 2667890 1293528 -748243
3910g48243j053289J170791J714004N9291n74317J315682K618777Q09183j703096
3901C608783j857952j150626k268462l417775j189347K778898L639026J070392
3893A212937m95432N01361O57922j683669l192266j352769J224892J280963j42502
3884a988563l40682O63124J438339K005145K342555Q56918k348378l439477k3387
3875h34406L981174L183051j178031k986159m83875J582905j87319k940581k731944
3866b595185n31322J65477r10796j031637O81106J937136R38810j129511k082248
3857d558170j520894m91438O25977K376215M451369N072687K996407n83371l156983
3848E211799l600768k770482j721132o71733K44878O56695P11509Q53283O38912
$$ plain form
3910 -748243 -1801532 -630741 1083263 1142554 568237 1883919 4502696 5311879 3608783
3901 3608783 1750831 600205 -1668257 -5086032 -6275379 -3496481 142545 1212937
3893 1212937 717505 1218866 1876788 193119 -2999147 -4351916 -3127024 -1846061 -1988563
3884 -1988563 -2329245 -1666121 -227782 1777363 4119918 4976836 2628458 -811019 -834406
3875 -834406 3146768 6329819 5151788 2165629 1681754 3264659 3077340 136759 -2595185
3866 -2595185 -3126507 -2961030 -3871826 -4903463 -4222357 -2285221 -1346411 -2475922 -4558170
3857 -4558170 -6079064 -6570502 -5944525 -3568310 883059 5955746 8952153 8368782 5211799
3848 5211799 1611031 -1159451 -2880583 -3552316 -3307438 -2650743 -1939234 -1085951 -447039
3839d47039o09042j727721n05120K599142L980278J755055j235447j559733k20439
3830B029934n37496k548695l152607j299290O44982J048230J092419J720938J652141
3821F50556J07828j070872k14580J136436M33323j725998k184996J81651K728584
3812D1932K616995N67548k64957J431406L397951K773511j98707k524355k244926
3803E596398n99920l3835j128389k267306j662431R16666L807386M443800J655394
3794A0727763k471572m248510k710615q89430j614584l636842l747248j416918
3786a0007956J040466K189366K807986L564247L669359K357980J25700j872018
3778C875130k556246j280629J264007K909339K201224K34354j086492j620443
$$ plain form
3839 -447039 -1056081 -2783802 -3288922 -689780 3290498 5045553 3810106 2250373 2029934
3830 2029934 1492438 -1056257 -4208864 -5508154 -4863172 -3814942 -2722523 -1001585 650556
3821 650556 758384 -312488 -527068 609368 1042691 -683307 -2868303 -2686652 41932
3812 41932 2658927 3226475 2961518 4392924 7790875 10564386 10365679 7841324 5596398
3803 5596398 4996478 4962643 3834254 1566948 -95483 821183 4628569 9072369 10727763
3794 10727763 8256191 4007681 1297066 407636 -1206948 -4843790 -8591038 -10007956
3786 -10007956 -8967490 -6778124 -3970138 -405891 3263468 5621448 5747148 3875130
3778 3875130 1318884 38255 1302262 4211601 6412825 6647179 5560687 3940244
3770C940244j967165j213189J459319L811864K659669j192191l603303k920053
3762I75195j548416j230528q02455J36419m02752k585381k969378O2562K734066
3753e630668J489844r67903J33726L673931M214897O71834k164842j449198l59095
3744c87474k101240m149399k145643K912841N466946K850589j480010k858518
3736a891908r11489J365653K163214K118548J660523j36789l125417m762853l179819
3727f700337j97717J009296L89824M69975J729687J791555j39424j331026L09786
3718b668381K891713L545477K470656J473190N07931j223967k180409j26050L465347
3709H155507M188275N91896l543047m025840j258375R70484K56770k256004l767458
$$ plain form
3770 3940244 1973079 759890 2219209 6031073 8690742 7498551 3895248 975195
3762 975195 -573221 -1803749 -2606204 -2469785 -2872537 -5457918 -8427296 -8364734 -5630668
3753 -5630668 -4140824 -5108727 -4975001 -1301070 2913827 3585661 1420819 -28379 -387474
3744 -387474 -2488714 -6638113 -8783756 -5870915 -403969 2446620 966610 -1891908
3736 -1891908 -2803397 -1437744 725470 2844018 4504541 4367752 1242335 -3520518 -6700337
3727 -6700337 -6898054 -5888758 -5498934 -5028959 -3299272 -1507717 -1647141 -2978167 -2668381
3718 -2668381 223332 3768809 6239465 7712655 8220586 6996619 4816210 4690160 8155507
3709 8155507 12343782 12935678 9392631 5366791 4108416 5078900 5335670 3079666 -687792
3700f87792k796038m07337J131090R09229K00585L40519O82657r7403j394566
3691b119056j297613K24815Q59689o25564k330345j863360K87854J624913J178626
3682d060041M94705J074725K298212K531553J387393k4320o85928n13178L91404
3673B894525K162522M160712M498006J958715j818697l534180k002169M21517
3665H740951Q10128r30547k510583k411789j481776j392008k253715k268317L6699
3656c660957L396751M570079K230291q73787j136810J219813K766096J887392
3648A0398868N14700L00360l573j721612l294614k526342j86330J095571N98971
3639E175999o6083K39912R27011R35313k42520k371477m087466l523036p03490
$$ plain form
3700 -687792 -3483830 -3891167 -2760077 -1850848 -1650263 -1309744 -627087 -724490 -2119056
3691 -2119056 -3416669 -3191854 -2332165 -2957729 -5288074 -7151434 -6863580 -5238667 -4060041
3682 -4060041 -3565336 -2490611 -192399 2339154 3726547 3702227 3016299 2503121 2894525
3673 2894525 5057047 9217759 13715765 15674480 13855783 10321603 8319434 8740951
3665 8740951 9551079 8620532 6109949 3698160 2216384 824376 -1429339 -3697656 -3660957
3656 -3660957 -264206 4305873 6536164 5662377 4525567 5745380 8511476 10398868
3648 10398868 10913568 11213928 11210355 9488743 6194129 3667787 3481457 4577028 5175999
3639 5175999 5109916 5349828 6276839 7212152 6969632 4598155 510689 -3012347 -3715837
3630c715837J661005J364927l66924r70522m16136o15618j688875j539301P31298
3621e555983L251726L727747J855151p71881j967897m91339K454302L873749K491007
3612H866582N56426M32066Q98948m63326k584849k279569J51980P95219j788205
3603D585272m287389l925425k429801k467830l054638j471242J993619M177640
3595f879794L317204R07921o56737o76903o8245L46389Q09913J758488K401772
3586A260008J426981m04692k79451K344321L478663k13402n447632n808160r00446
3577d543810K836758J443560j462129j274397O42334M89797j043707k98111K734617
3568d75088M106557J924417j248105k373334j337882J12873M74416q79845l195326
$$ plain form
3630 -3715837 -2054832 -689905 -1056829 -2027351 -2443487 -3059105 -4747980 -6287281 -5555983
3621 -5555983 -2304257 1423490 3278641 2506760 538863 47524 2501826 6375575 8866582
3612 8866582 9423008 9855074 10754022 10290696 7705847 5426278 5578258 6373477 4585272
3603 4585272 297883 -3627542 -6057343 -8525173 -11579811 -13051053 -11057434 -6879794
3595 -6879794 -3562590 -2654669 -3311406 -3988309 -4056554 -3710165 -2900252 -1141764 1260008
3586 1260008 2686989 2282297 2002846 4347167 7825830 7612428 2164796 -3643364 -4543810
3577 -4543810 -1707052 -263492 -1725621 -3000018 -2357684 -1867887 -2911594 -3209705 -475088
3568 -475088 3631469 5555886 4307781 1934447 596565 709438 1183854 304009 -2891317
3559b891317m234402k454463O03896J849859O64730m02105P01240K830394L307862
3550b4306J173253j885830l274265j880881R07788K625905K345079J394668J273400
3541B654811J809687J971181J437501N40781l79726q05688l54838Q4326q53879
3532F104156k266489j340903J916552K989354j175901o663216p004303j977663
3524i418413K419740K708221J866833L153723M507624K303548k256419m456624
3516H28233k729638m40566o95293k199715j701406J119998L210515K365973Q1645
3507a60254p61398J67192P76402J71760j47701P50967J440122P03532k16405P5406
3497B799623M82999m19004j310377l49183R22133k56630k560620j940804J532466
$$ plain form
3559 -2891317 -7125719 -9580182 -8976286 -7126427 -6461697 -6863802 -6162562 -3332168 -24306
3550 -24306 1148947 -736883 -4011148 -5892029 -4984241 -2358336 -13257 1381411 2654811
3541 2654811 4464498 6435679 7873180 8413961 8034235 7228547 6873709 6958035 6104156
3532 6104156 3837667 2496764 4413316 7402670 6226769 -436447 -7440750 -9418413
3524 -9418413 -6998673 -4290452 -2423619 730104 5237728 7541276 5284857 828233
3516 828233 -1901405 -2341971 -3037264 -5236979 -6938385 -5818387 -2607872 -241899 -160254
3507 -160254 -921652 -754460 21942 193702 46001 796968 2237090 2940622 2724217 2799623
3497 2799623 3282622 2863618 1553241 1204058 2126191 1869561 -691059 -2631863 -1099397
3488a099397L088663Q87546p56957J444443L917511J811410k931151m277322j168373
3479I16373J418543K39013k287498k852975j776371r52341n30592J50729N84273
3470e090846J82423k43815P5823L10356l78036r60974j61514J060895P46568q39615
3460e298735j308249M71647K878999L835901L178170K145314J554151J178012
3452H635210M14319q65370j938465j823937o00752L52055J36006l06356K41114
3443D243824J029034M10976j212599j698424n42053M58370N09939J079230K536499
3434F814796K421520n86741l401845k395752J102908K672727J174450m89891o41798
3425F670374p96176j751524j673675K51004J535966N1322k410735k584041j76919
$$ plain form
3488 -1099397 1989266 2876812 2119855 3564298 7481809 9293219 6362068 2084746 916373
3479 916373 2334916 2573929 286431 -2566544 -4342915 -5295256 -5825848 -5675119 -5090846
3470 -5090846 -4908423 -5152238 -5076415 -4766059 -5144095 -6105069 -6266583 -5205688 -4459120 -5298735
3460 -5298735 -6606984 -6135337 -3256338 579563 3757733 5903047 7457198 8635210
3452 8635210 9049529 8184159 6245694 4421757 3821005 4173060 4309066 4002710 4243824
3443 4243824 5272858 5683834 4471235 2772811 2230758 2689128 3199067 4278297 6814796
3434 6814796 9236316 8649575 5247730 2851978 3954886 6627613 7802063 7312172 6670374
3425 6670374 5874198 4122674 2448999 2700003 4235969 4287291 1876556 -707485 -884404
3416h84404K118524J951976p31822l838124m237992m61418M598302N708256J515191
3407E738489l326694l974378j134194J194163J460534J078619Q07593j558j118916
3398G23658j290680k92282R71262K003888K560897J897794K00673m71660Q92599
3389G196149J747164o13136m306201n035863k327240J90629N05065K18329N04222
3380a920882K24272q08403n93797J284452K088493K43762j741370j093841Q83752
3371a433562Q73989j713510m377701m750259k359533J760979N630339P327086
3363I57828O589447M656108K168240j198372m643047o059371m916305l064108
3355e509580j559124P45491L893177M971005K111181j905353l050008j538423
$$ plain form
3416 -884404 1234120 3186096 2454274 -1383850 -5621842 -6083260 -1484958 4223298 5738489
3407 5738489 2411795 -1562583 -2696777 -1502614 -42080 1036539 1844132 1842574 723658
3398 723658 -567022 -859304 111958 2115846 4676743 6574537 6775210 6303550 7196149
3389 7196149 8943313 8330177 4023976 -1011887 -3339127 -3148498 -2643433 -2425104 -1920882
3380 -1920882 -1696610 -2505013 -3098810 -1814358 274135 517897 -1223473 -2317314 -1433562
3371 -1433562 -559573 -2273083 -6650784 -11401043 -13760576 -11999597 -6369258 957828
3363 957828 7547275 12203383 14371623 13173251 8530204 2470833 -2445472 -5509580
3355 -5509580 -7068704 -6323213 -2430036 2540969 4652150 2746797 -303211 -1841634
3347a841634q58138k229168l166518j578687J278916K658513J665293P3897J95744
3338c801782J998026K769030P20001j735131p50070K967978M462365J894125m29321
3329H095221J150138L735787K557279j581090m121304l828846l140945k832555
3321C3685j404711P64762J513521J016965J216876J295482j251189m788527m359575
3312e962711M73714M123358L237595R95349N27789k46840l215429m761310j372119
3303f200604L322415L342620k74618j401934J067326J814067j623233m521178
3295d475139k353698K353087L909303J167445j922875j821841J176767M223721
3287B256770M754493K455802n42724j847293j501718j589294l012477m191839
$$ plain form
3347 -1841634 -2699772 -4928940 -8095458 -9674145 -8395229 -5736716 -4071423 -3997526 -3801782
3338 -3801782 -1803756 965274 1685275 -49856 -799926 2168052 6630417 8524542 8095221
3329 8095221 9245359 12981146 15538425 13957335 9836031 6007185 2866240 33685
3321 33685 -1371026 -606264 907257 1924222 3141098 4436580 3185391 -1603136 -5962711
3312 -5962711 -5488997 -1365639 1871956 2867305 3395094 3148254 -67175 -4828485 -6200604
3303 -6200604 -2878189 464431 189813 -1212121 -144795 1669272 46039 -4475139
3295 -4475139 -6828837 -4475750 -566447 600998 -1321877 -3143718 -1966951 2256770
3287 2256770 7011263 9467065 8924341 7077048 5575330 3986036 973559 -3218280
3279c218280l492061j368829O76030J831186J877193Q50366k63078M0195J615541
3270a451737K351703J095141n94572q55110j42257J00978l0581M70986J461416
3261B405967J948840J531530R2747k550253n023878m328230P8008L918129L122501
3252A195361k34701j022562R31532Q92493k522870m592575j851289K661445M381629
3243a61537L369161K118213P86291j410429k774515j378887J009216J149409q84961
3234A821961k597638l174851l124659j563343K020212M752970L592965M40352
3226B167969n60753K97171m89197k585206k100053R53627J973541k45156j312515
3217a900572Q66141K445338R46689p0239K160957L808611P01750m184715n123613
$$ plain form
3279 -3218280 -6710341 -8079170 -7403140 -5571954 -3694761 -2844395 -3107473 -3067278 -1451737
3270 -1451737 899966 1995107 1400535 545425 403168 504146 473565 944551 2405967
3261 2405967 4354807 5886337 5979084 3428831 -1595047 -5923277 -5845269 -1927140 1195361
3252 1195361 960660 -61902 869630 1762123 -760747 -5353322 -7204611 -4543166 -161537
3243 -161537 3207624 5325837 6112128 4701699 1927184 548297 1557513 2706922 1821961
3234 1821961 -775677 -3950528 -7075187 -8638530 -6618318 -1865348 1727617 2167969
3226 2167969 1607216 1904387 1415190 -1170016 -3270069 -2316442 -342901 -588057 -1900572
3217 -1900572 -1034431 1410907 2357596 2287357 4448314 8256925 8958675 4773960 -349653
3208c49653k014956J029218K422368L051584K272535m57991k233846m95225J910301
3199E134335R32569j686834j635996o765j070877l655792k563572J769102L168011
3190C84181J16642j847005l2725J127201j180611k809972m72091J908419L2761
3181b773200l224819k929707j05489J367532J956635M192563O151403L914946
3173H549864j047145l174695q52542K195021K998947J828104q15414m407192n761179
3164d86231j709278M813586O615499J704945l846035m472533k031203j358597
3156g69847k897095l571316k417060j211469o02862O62049K642054L382111K003280
3147b780155M11551O35891J828306J483463q56599k747810k063434L29576K164105
$$ plain form
3208 -349653 -2364609 -1335391 1086977 4138561 6411096 5953105 3719259 3224034 5134335
3199 5134335 6066904 4380070 2744074 2737309 1666432 -1989360 -4552932 -2783830 384181
3190 384181 500823 -1346182 -1378907 -251706 -1432317 -4242289 -4714380 -2805961 -2773200
3181 -2773200 -5998019 -8927726 -9033215 -7665683 -5709048 -1516485 4634918 8549864
3173 8549864 7502719 4328024 3475482 5670503 8669450 10497554 9682140 5274948 -486231
3164 -486231 -2195509 2618077 9233576 10938521 7092486 2619953 588750 -769847
3156 -769847 -3666942 -7238258 -9655318 -10866787 -11469649 -10807600 -8165546 -4783435 -2780155
3147 -2780155 -2368604 -1732713 95593 1579056 722457 -2025353 -4088787 -3759211 -1595106
3138a595106K907043L524384L759180K135789r81565k931614k514361j803876
3130B499874k527510k986916j017692J927771K701816J237646J82921M23191L13729
3121B754830o77801r07359K25322R87719L51551k33609N17686J437019Q59875
3112E315233o71831j243158j58316J478713K112082R86345j179899k380062j197384
3103C061723J130871J729163l40278k797001l138780j672542n39286o54840r10895
3094d131865k20069O98856K16758j543954j789891J791235O891129P790280K224301
3085A1926780m873652o940776l673819k66562K85085J60143J707657L543993L368959
3076E237808J591816L0427q01365j198275q85538J40448R25394J012018R41937
$$ plain form
3138 -1595106 1311937 4836321 8595501 10731290 9749725 6818111 4303750 2499874
3130 2499874 -27636 -3014552 -4032244 -2104473 597343 1834989 2017910 2441101 2754830
3121 2754830 2077029 1169670 1394992 2382711 2734262 2500653 3018339 4455358 5315233
3112 5315233 4643402 3400244 3241928 4720641 6832723 7819068 6639169 4259107 3061723
3103 3061723 4192594 5921757 5581479 2784478 -354302 -2026844 -2566130 -3220970 -4131865
3094 -4131865 -4351934 -3653078 -3436320 -4980274 -6770165 -4978930 1912199 9702479 11926780
3085 11926780 7053128 112352 -3561467 -3828029 -3542944 -3382801 -1675144 1868849 5237808
3076 5237808 6829624 6860051 6058686 4860411 3974873 4115321 5040715 6052733 6994670
3067F994670M11738j721576m374204m076682J9145L730259L189512K05419r13316
3058C464965J94588M69375r35953j649459m18278J178390J573044P93487q20143
3049C850016k596209k418384J055446M927150M430476m66685m392305l771347
3041F18158j196280o88401j862556j593307Q49246L337010M149163L097021M95451
3032G205505k538462l654576j610267J448037K278971P39420n31050l31584k65258
3023B740736j488859k537069j634990M68019J482658N88073q01810r57139M15998
3014a724383K273296L381828L161077J724617m68700k689936l816397k877433
3006a036031k60899K075977K320418N54481j759078l617826m853652m951020k975817
$$ plain form
3067 6994670 7406408 5684832 1310628 -2766054 -2746909 983350 4172862 4378281 3464965
3058 3464965 3659553 4128928 3192975 1543516 1125238 2303628 3876672 4670159 3850016
3049 3850016 1253807 -1164577 -109131 4818019 9248495 8781810 4389505 618158
3041 618158 -578122 -1266523 -3129079 -4722386 -3873140 -536130 3613033 6710054 7205505
3032 7205505 4667043 1012467 -597800 850237 3129208 3868628 3337578 3005994 2740736
3023 2740736 1251877 -1285192 -2920182 -2452163 -969505 -381432 -1183242 -2140381 -1724383
3014 -1724383 548913 3930741 7091818 8816435 8347735 5657799 1841402 -1036031
3006 -1036031 -1296930 779047 3099465 3653946 1894868 -1722958 -6576610 -11527630 -14503447
2997a4503447P38142L964683M668366L203979J606152J107323J249623J113554
2989C148375K83101j381848l618496m986323l624497R1366K736399J436560k103085
2980h018448l179973n5807L691257L874689R24344j466955j583746j010397j134788
2971g959824j165599l24042M42035K99574J41182O75186N96894j138247k492641
2962a0925482o41137L260159M679315J846954j516252j338881J166024J597045
2954a872255j144411l572001k928889q25561k16433r87284q01846P87417J648003
2945i913260N59154q35069m79380J259899K482268K464392K055579J825758J243079
2936F62420j53519j747083k364292j364092Q08867K739814K899680R95683j557269
$$ plain form
2997 -14503447 -13765305 -9800622 -5132256 -1928277 -322125 785198 2034821 3148375
2989 3148375 3431476 2049628 -1568868 -6555191 -10179688 -10088322 -7351923 -5915363 -8018448
2980 -8018448 -11198421 -11254228 -7562971 -3688282 -2763938 -4230893 -5814639 -6825036 -7959824
2971 -7959824 -9125423 -9449465 -9007430 -8707856 -8566674 -7891488 -7294594 -8432841 -10925482
2962 -10925482 -11566619 -8306460 -3627145 -1780191 -3296443 -4635324 -3469300 -1872255
2954 -1872255 -3016666 -6588667 -9517556 -10343117 -10559550 -11546834 -12348680 -11561263 -9913260
2945 -9913260 -9354106 -10189175 -10668555 -9408656 -6926388 -4461996 -2406417 -580659 662420
2936 662420 508901 -1238182 -3602474 -4966566 -4157699 -1417885 1481795 2477478 920209
2927I20209k928252k459380p01492J455227K988008K882270J256468k34188m58031
2918B720839o27239k296170m170198l487663o40718O62597j047708k343533L9569
2909a1190224M018478N054593K580984J13441l38611l73841j386250k046082j030814
2900d598326K72124j63922j700470j866114M4686J937222J664765l12915j596782
2891f319732p48223J136493J978302J342323P23676J298922K466267K978948K457758
2882G314734J233102j93437r32352l20800N34188l96230k664310l118175p54394
2873G02326R77296n13111k210079j90102L323012L083275k76179r42722K213966
2864F167682L415147l62689m177774l153187K03998J314311R36334J735395J910968
$$ plain form
2927 920209 -2008043 -4467423 -5168915 -3713688 -725680 2156590 3413058 3178870 2720839
2918 2720839 2093600 -202570 -4372768 -7860431 -8501149 -7838552 -8886260 -11229793 -11190224
2909 -11190224 -7171746 -2117153 463831 577272 238661 -135180 -1521430 -3567512 -4598326
2900 -4598326 -4326202 -4490124 -6190594 -8056708 -8012022 -6074800 -4410035 -4722950 -6319732
2891 -6319732 -7067955 -5931462 -3953160 -2610837 -1887161 -588239 1878028 4856976 7314734
2882 7314734 8547836 8354399 7422047 7101247 7635435 7239205 4574895 1456720 702326
2873 702326 1679622 1166511 -1043568 -1233670 2089342 5172617 4896438 3953716 6167682
2864 6167682 9582829 9220140 5042366 1889179 2093177 3407488 4343822 6079217 7990185
2855G990185j197305m394835k700112J759402K250441j840978m086349j287291
2847c506842K423685L307283L089427L657331K831573q27274l989716l509370
2839C476097j478934j249675j846826o94575R85025K63069j914890j985959L40161
2830d106507J836805J163430N49893J692044L300931L536675K316283M44813j463612
2821I270755k547515j971547k95590P67267L45458r25348k168598k861449k247880
2812b634447K28864L541794N462772M903844L004466J485869O78501l30211k024185
2803A4317267l514960l544778k310047j458581j599000r32679J830590M078978
2795F866790J909829l582874o270917k928183K178586L278539O48815j332732
$$ plain form
2855 7990185 6792880 2398045 -302067 1457335 3707776 1866798 -2219551 -3506842
2847 -3506842 -1083157 2224126 5313553 8970884 11802457 10975183 6985467 3476097
2839 3476097 1997163 747488 -1099338 -1793913 -808888 -545819 -2460709 -4446668 -4106507
2830 -4106507 -2269702 -1106272 -556379 1135665 4436596 7973271 10289554 10734367 9270755
2821 9270755 6723240 4751693 4456103 5223370 5568828 4643480 2474882 -386567 -2634447
2812 -2634447 -2405583 1136211 6598983 11502827 14507293 15993162 16671663 16341452 14317267
2803 14317267 10802307 7257529 4947482 3488901 1889901 957222 2787812 6866790
2795 6866790 8776619 5193745 -1077172 -4005355 -1826769 1451770 2100585 767853
2787G67853j156503p35719m68417J268551L788265L964852J313324q80387p35915
2778G125904k58099j006373j035002J336945L752691K905205n42172l030795k861611
2769F386693j316640O9925R60855J390183J487694J775891K220010J500036j185152
2760A3289495m140084m793036l008568r90664m1080N26710R37679k27098l309786
2751a756432n400655l251769K016742N471621M298073J145435O2857Q69892K44298
2742C700062k376632l527674j196554J794467K019049L27755l89873j19056p34445
2733e02901j552121j92105K433305K470815p48764l110825j806387P55877J259936
2724i93170K78002J7244J75455o56655j516515m52977J787560K591077J341030
$$ plain form
2787 767853 -388650 -1124369 -1592786 -324235 3464030 7428882 8742206 7861819 7125904
2778 7125904 6867805 5861432 4826430 6163375 9916066 12821271 12279099 9248304 6386693
2769 6386693 5070053 5139978 6100833 7491016 8978710 10754601 12974611 14474647 13289495
2760 13289495 9149411 4356375 1347807 357143 316063 842773 1780452 1553354 -1756432
2751 -1756432 -7157087 -10408856 -8392114 -2920493 1377580 2523015 2585872 3455764 3700062
2742 3700062 1323430 -2204244 -3400798 -1606331 412718 740473 350600 231544 -502901
2733 -502901 -2055022 -2247127 186178 2656993 1908229 -1202596 -3008983 -2253106 -993170
2724 -993170 -715168 -697924 -522469 -1179124 -2695639 -3148616 -1361056 1230021 2571051
2715B571051j92988p52048m50776O55956K424157L459660K450491L80524o96494
2706I849533o24229o84219q12313O2697J242944P77385j080708j856188q25284
2697F049618j33260j071371k102177j941055j854669k914918l254038n86414L873918
2688c934366O400935N044225J181102k528852m084743k742034M22618K666466
2680B425351J836113j370373m245177m859736l232372n08166J769389K274965
2672e910006J290510R22703K375393L712778K390012n63652j612678j2111J132455
2663C725404M0426q88293M76903J804604J1059k936944k292528J963280M355076
2654F258987J567677l018448m341626k122098J62203N01320k55420r42112j344306
$$ plain form
2715 2571051 2378063 1626015 1175239 1831195 4255352 7715012 10165503 10546027 9849533
2706 9849533 9225304 8541085 7728772 7791469 9034413 9811798 8731090 6874902 6049618
2697 6049618 5916358 4844987 2742810 801755 -1052914 -3967832 -7221870 -7808284 -3934366
2688 -3934366 2466569 7510794 8691896 6163044 2078301 -663733 -241115 2425351
2680 2425351 4261464 2891091 -1354086 -6213822 -9446194 -9954360 -8184971 -5910006
2672 -5910006 -4619496 -3696793 -1321400 2391378 4781390 4217738 2605060 2592949 3725404
2663 3725404 3765830 2877537 3354440 5159044 5170103 2233159 -59369 1903911 6258987
2654 6258987 7826664 4808216 466590 -1655508 -1493305 -991985 -1247405 -2189517 -3533823
2645c533823j365350q81532j89018N90799J749348K590429J344058j837873l542336
2636e075298j215524K750480L914071J762704l21229l50641M80235J061267J749185
2627D755250K146507J060519o71990q14826R3947r74670l977517m734950j364442
2618d482172K371886K810724J554567J615013K088058P57486j076103j003782
2610D635677l90015j910334l892326k370008J958781M012199J680935j792584
2602A932325l276520l162904k521953j128382L76790J78086j397066j665209k455
2593a0667288R73947J3606o22416N90628J701854J104191O46408K102158L585894
2584e71018K742006R69823R28980J816148R01951j505365k445915j162119m2538
$$ plain form
2645 -3533823 -4899173 -5780705 -5969723 -5378924 -3629576 -1039147 304911 -1532962 -5075298
2636 -5075298 -6290822 -3540342 373729 2136433 1815204 1464563 1944798 3006065 4755250
2627 4755250 6901757 7962276 7290286 6475460 6569407 5594737 1617220 -3117730 -4482172
2618 -4482172 -2110286 700438 2255005 3870018 5958076 6715562 5639459 4635677
2610 4635677 4245662 2335328 -1556998 -3927006 -1968225 2043974 3724909 1932325
2602 1932325 -1344195 -4507099 -7029052 -8157434 -7780644 -7602558 -8999624 -10664833 -10667288
2593 -10667288 -9693341 -9679735 -10302151 -9711523 -8009669 -6905478 -6259070 -4156912 -571018
2584 -571018 2170988 3140811 4069791 5885939 6787890 5282525 2836610 1674491 1631953
2575A631953n50533j243699n12357J061062J932646J585787O31740m0654L2977
2566D528922L46822q5753j020302p34569J349493L038789K152784j57301j128299
2557H290586o04894q14833k193583k480020o10615J304095J266145L94726Q20340
2548E371947K144934K075167q5579k389651k710389j079025O62409Q86100l53867
2539D522046j611869j659547o27220O31179J800760K885015L011903Q89106k985450
2530F855923n735466m856242j144545K033928K319981N47862o65782L4771J453318
2521H43748J520963q7258j579184j484056o41976p67957j560121r00544J779634
2512b876751M083654L652326J193380r23521j895459k347862j852114O60908L804941
$$ plain form
2575 1631953 1081420 -162279 -674636 386426 2319072 3904859 4536599 4495945 4528922
2566 4528922 4875744 4789991 3769689 3035120 4384613 7423402 9576186 9418885 8290586
2557 8290586 7685692 6870859 4677276 2197256 1586641 2890736 4156881 4551607 5371947
2548 5371947 7516881 9592048 9506469 7116818 4406429 3327404 3989813 4875913 4522046
2539 4522046 2910177 1250630 623410 1254589 3055349 5940364 8952267 9841373 6855923
2530 6855923 1120457 -3735785 -4880330 -2846402 -526421 21441 -644341 -609570 843748
2521 843748 2364711 2277453 698269 -785787 -1427763 -2195720 -3755841 -4656385 -2876751
2512 -2876751 1206903 4859229 6052609 5129088 3233629 885767 -966347 -305439 3499502
2503C499502L958919K449m442238n469904l765447k563221k256809m71230K846042
2494h661937M269147K060124p57031p10875J129223J256922p50808k004539j070746
2485e240520J99052J01676l92932J84056J187452J228647R07912K065008M456218
2476D696569N058906J621383m004855p335096o040824k163357Q71864K110127
2468e185283K609470K363127L27294k475325k947176l50788J955979J357070J42537
2459b203095J819945N043976N074946P80022l647034m449869k435620l60529P31529
2450C54271R86606J07984j693335k724379j674348M50976J565350R17473o08126
2441b317528j753960j708207m59440J071904J854656J807518J349565L73191j069474
$$ plain form
2503 3499502 7458421 7460870 3018632 -2451272 -6216719 -8779940 -11036749 -11507979 -8661937
2494 -8661937 -4392790 -2332666 -3089697 -3800572 -2671349 -1414427 -2165235 -4169774 -5240520
2485 -5240520 -5041468 -4939792 -5332724 -5148668 -3961216 -2732569 -1824657 240351 4696569
2476 4696569 9755475 11376858 7372003 36907 -6003917 -8167274 -7295410 -5185283
2468 -5185283 -2575813 -212686 114608 -2360717 -5307893 -5658681 -3702702 -2345632 -2203095
2459 -2203095 -383150 4660826 9735772 10515794 6868760 2418891 -16729 -377258 354271
2450 354271 1340877 1448861 -244474 -2968853 -4643201 -4192225 -2626875 -1709402 -2317528
2441 -2317528 -4071488 -5779695 -6239135 -5167231 -3312575 -1505057 -155492 217699 -851775
2432h51775j720426o12473R48305J106543N50469J116384J887228L45535k532198
2423B37592k645258O90535K954698J168029j726947j957421n93476p32458k187358
2414d792064k769273k430298k355556j837269L38153K913649L799093L180195
2406c953370K169732L85525k092123k796750n36263J511132M69900j070517N83360
2397e329374L335570K818384P70001K557333O901630O170764j530365q194634
2389G499309p058861j447150J608332J069650L26775K60102n90725j490549l36527
2380a59644K119767L009440J671172J3996p65966j000393p54136J18381N76539
2371D829156n64195k449558l058419k077810j213716j713017k859239k887863
$$ plain form
2432 -851775 -2572201 -3184674 -2236369 -1129826 -579357 537027 2424255 2769790 237592
2423 237592 -2407666 -1717131 1237567 2405596 678649 -1278772 -1872248 -2604706 -4792064
2414 -4792064 -7561337 -9991635 -12347191 -14184460 -13846307 -10932658 -7133565 -3953370
2406 -3953370 -1783638 -1398113 -3490236 -6286986 -6823249 -5312117 -4842217 -5912734 -5329374
2397 -5329374 -1993804 824580 1594581 4151914 11053544 17224308 15693943 7499309
2389 7499309 440448 -1006702 601630 1671280 1998055 2258157 1667432 176883 -159644
2380 -159644 1960123 4969563 6640735 6654731 5888765 4888372 4134236 4252617 4829156
2371 4829156 4264961 1815403 -1243016 -3320826 -4534542 -6247559 -9106798 -11994661
2363a1994661p16282K796391M968822L704310K53985j733439n46041J647206J889741
2354B70032j04592k448131l463903k634179o19590Q78636P17362J97890J513970
2345e692505M059228M785359K794061O03752j50812r54795k751067l519673j895145
2336b721597p0361l23028j413962j265279m50662K161J325832L942195M608787
2327C634086J003852l264141l095651N09962K455878J636352J241251J737946
2319E859535M5574l527051l936786O42429M940932L920798k85839k357779j320972
2310C980841j64430k45860j70398O98010J115510L98355n11932q17321j033711
2301C249064j868999k838403k566564n24447J618497J177193k119302m737903
$$ plain form
2363 -11994661 -12710943 -9914552 -4945730 -1241420 -987435 -2720874 -3266915 -1619709 270032
2354 270032 165440 -2282691 -5746594 -8380773 -9000363 -8121727 -7404365 -7206475 -5692505
2345 -5692505 -1633277 3152082 5946143 6549895 6399083 5444288 2693221 -826452 -2721597
2336 -2721597 -2791958 -3114986 -4528948 -5794227 -6244889 -6242728 -4916896 -974701 3634086
2327 3634086 4637938 1373797 -1721854 -1211892 1243986 2880338 4121589 5859535
2319 5859535 5905109 2378058 -1558728 -916299 4024633 7945431 7659592 5301813 3980841
2310 3980841 3816411 3570551 3400153 4098163 5213673 5612028 5100096 4282775 3249064
2301 3249064 1380065 -1458338 -4024902 -4549349 -2930852 -1753659 -3872961 -8610864
2293h610864l151813J371033M016387K561306k15018r69878j13990j19293j406502
2284f638632j946406j81749L099737N475201M842940J334109k333294l274064
2276C77842j463034O46370J450191J548798J654655J237150P2262p56994n89528
2267D177712l69178q98700j301371n09520Q59517J375493O85883m46716j190212
2258B382908j016424L8810R40349N74332m85861n13950O71884J283372M34850
2249D310270n50601o20185o60428j429758j916399j276379l84957J44619J255012
$$ plain form
2293 -8610864 -11762677 -10391644 -6375257 -3813951 -4028969 -4998847 -5112837 -5232130 -6638632
2284 -6638632 -8585038 -8766787 -5667050 -191849 4651091 5985200 3651906 377842
2276 377842 -1085192 -438822 1011369 2560167 4214822 5451972 5524234 4767240 4177712
2267 4177712 3808534 2909834 1608463 1098943 1958460 3333953 4019836 3573120 2382908
2258 2382908 1366484 1405294 2345643 2919975 2434114 1920164 2592048 3875420 4310270
2249 4310270 3759669 3139484 2479056 1049298 -867101 -2143480 -2528437 -2383818 -1128806
$$ [...]
##END NTUPLES=NMR SPECTRUM
##END=
