##TITLE=31Pdec_DE-155_DEP_TFA
 DMSO,64 sc
 29.6.2026
##JCAMPDX= 6.0         $$ Bruker NMR JCAMP-DX V2.0
##DATA TYPE= NMR SPECTRUM
##DATA CLASS= NTUPLES
##ORIGIN= UXNMR, Bruker Analytische Messtechnik GmbH
##OWNER= root
$$ XWIN-NMR		Version 3.5
$$ Mon Jun 29 14:13:47 2026 Russian Standard Time (UT+4h)  she@DPX200
##.OBSERVE FREQUENCY= 81.013821
##.OBSERVE NUCLEUS= ^31P
##.ACQUISITION MODE= SIMULTANEOUS
##.ACQUISITION SCHEME= undefined
##.AVERAGES= 64
##.DIGITISER RES= 17
##SPECTROMETER/DATA SYSTEM= spect
##.PULSE SEQUENCE= zgpg30
##.SOLVENT NAME= DMSO
##.SHIFT REFERENCE= (INTERNAL, DMSO, 0, 197.392)
##AUDIT TRAIL= $$ (NUMBER, WHEN, WHO, WHERE, WHAT)
$$ ##TITLE= Audit trail, XWIN-NMR		Version 3.5
$$ ##JCAMPDX= 5.01
$$ ##ORIGIN= Bruker BioSpin GmbH
$$ ##OWNER= she
$$ F:/spectra/data/she/nmr/P31/2/pdata/1/auditp.txt
$$ ##AUDIT TRAIL=  $$ (NUMBER, WHEN, WHO, WHERE, WHAT)
(   1,<2026-06-29 14:11:45.10 +0400>,<she>,<DPX200>,
      <created by zg, POWCHK disabled, PULCHK disabled
       configuration hash MD5:
       00 E9 B6 7A A2 85 ED C7 34 08 36 98 17 FE 4E 26
       data hash MD5: 32K
       0C 43 2E 86 78 78 FF 8F 6E 5E 39 3C 19 F1 41 4D>)
(   2,<2026-06-29 14:11:47.68 +0400>,<she>,<DPX200>,
      <Start of raw data processing
       efp BC_mod = 2 LB = 1.5 FT_mod = 6 PKNL = 1 PHC0 = 1720.415 PHC1 = -3.301208 SI = 64K 
       data hash MD5: 64K
       29 91 64 BE 05 C9 25 D4 F8 4E 42 EA 9C DA BB F3>)
(   3,<2026-06-29 14:12:14.31 +0400>,<she>,<DPX200>,
      <pk PHC0 = 156.4674 PHC1 = 0 
       data hash MD5: 64K
       02 F3 CC A3 08 5E 22 DD 15 1B A8 D5 C3 8D 0F 78>)
$$ ##END=
$$ 
$$ hash MD5
$$ C2 A8 2B 3C 03 2F 2B 98 AD 0F 49 3F F1 3D 46 5D
##$RELAX= 
##$RELAX= 
##$RELAX= 
##$RELAX= 
##$RELAX= 
##$RELAX= 
##$RELAX= 
##$RELAX= 
$$ Bruker specific parameters
$$ --------------------------
##$DU= <F:/spectra>
##$EXPNO= 2
##$NAME= <P31>
##$PROCNO= 1
##$TYPE= <nmr>
##$USER= <she>
##$AMP= (0..31)
100 100 100 100 100 100 100 100 100 100 100 100 100 100 100 100 100 100 
100 100 100 100 100 100 100 100 100 100 100 100 100 100 
##$AQSEQ= 0
##$AQ_mod= 1
##$AUNM= <au_zg>
##$AUTOPOS= <>
##$BF1= 81.014009
##$BF2= 200.13
##$BF3= 200.13
##$BF4= 200.13
##$BF5= 200.13
##$BF6= 200.13
##$BF7= 200.13
##$BF8= 200.13
##$BYTORDA= 1
##$CFDGTYP= 0
##$CFRGTYP= 5
##$CHEMSTR= <none>
##$CNST= (0..31)
1 1 145 1 1 1 1 1 1 1 1 1 1 1 1 1 1 1 1 1 1 1 1 1 1 1 1 1 1 1 1 1 
##$CPDPRG= <waltz16>
##$CPDPRG1= <>
##$CPDPRG2= <waltz16>
##$CPDPRG3= <>
##$CPDPRG4= <mlev>
##$CPDPRG5= <mlev>
##$CPDPRG6= <mlev>
##$CPDPRG7= <mlev>
##$CPDPRG8= <mlev>
##$CPDPRGB= <>
##$CPDPRGT= <>
##$D= (0..31)
0 1 0 0 0 0 0 0 0 0.06 0 0.03 2e-05 3e-06 0 0 0.0002 0 0 0 0 0 0 0 0 0 
0 0 0 0 0 0 
##$DATE= 1782727904
##$DBL= (0..7)
120 120 120 11 120 120 24 19 
##$DBP= (0..7)
150 150 150 150 150 150 150 150 
##$DBP07= 0
##$DBPNAM0= <>
##$DBPNAM1= <>
##$DBPNAM2= <>
##$DBPNAM3= <>
##$DBPNAM4= <>
##$DBPNAM5= <>
##$DBPNAM6= <>
##$DBPNAM7= <>
##$DBPOAL= (0..7)
0.5 0.5 0.5 0.5 0.5 0.5 0.5 0.5 
##$DBPOFFS= (0..7)
$$ [...]
##$SUBNAM3= <"">
##$SUBNAM4= <"">
##$SUBNAM5= <"">
##$SUBNAM6= <"">
##$SUBNAM7= <"">
##$SUBNAM8= <"">
##$SUBNAM9= <"">
##$SW= 400.765351723535
##$SWIBOX= (0..15)
0 1 3 0 0 0 0 0 0 0 0 0 0 0 0 0 
##$SW_h= 32467.5324675325
##$TD= 32768
##$TD0= 1
##$TE= 0
##$TE2= 300
##$TE3= 300
##$TEG= 300
##$TL= (0..7)
0 120 53 12 22 120 120 120 
##$TP= (0..7)
150 150 150 150 150 150 150 150 
##$TP07= 0
##$TPNAME0= <>
##$TPNAME1= <>
##$TPNAME2= <>
##$TPNAME3= <>
##$TPNAME4= <>
##$TPNAME5= <>
##$TPNAME6= <>
##$TPNAME7= <>
##$TPOAL= (0..7)
0.5 0.5 0.5 0.5 0.5 0.5 0.5 0.5 
##$TPOFFS= (0..7)
0 0 0 0 0 0 0 0 
##$TUNHIN= 0
##$TUNHOUT= 0
##$TUNXOUT= 0
##$USERA1= <user>
##$USERA2= <user>
##$USERA3= <user>
##$USERA4= <user>
##$USERA5= <user>
##$V9= 5
##$VALIST= <valist>
##$VCLIST= <CCCCCCCCCCCCCCC>
##$VD= 0
##$VDLIST= <DDDDDDDDDDDDDDD>
##$VPLIST= <PPPPPPPPPPPPPPP>
##$VTLIST= <TTTTTTTTTTTTTTT>
##$WBST= 1024
##$WBSW= 4
##$XGAIN= (0..3)
0 0 0 0 
##$XL= 0
##$YL= 0
##$YMAX_a= 3036
##$YMIN_a= -19119
##$ZGOPTNS= <>
##$ZL1= 120
##$ZL2= 120
##$ZL3= 120
##$ZL4= 120
##$ABSF1= 0
##$ABSF2= 0
##$ABSG= 0
##$ABSL= 0
##$ALPHA= 0
##$AQORDER= 0
##$ASSFAC= 0
##$ASSFACI= 0
##$ASSFACX= 0
##$ASSWID= 0
##$AUNMP= <proc_1d>
##$AZFE= 0.1
##$AZFW= 0.5
##$BCFW= 0
##$BC_mod= 2
##$BYTORDP= 0
##$COROFFS= 0
##$CY= -3
##$DATMOD= 1
##$DC= 0
##$DFILT= <>
##$DTYPP= 0
##$F1P= 0
##$F2P= 0
##$FCOR= 1
##$FTSIZE= 65536
##$FT_mod= 6
##$GAMMA= 0
##$GB= 0
##$INTBC= 1
##$INTSCL= 9.790993e-09
##$ISEN= 30
##$LB= 1.5
##$LEV0= 0
##$LPBIN= 0
##$MAXI= 10000
##$MC2= 0
##$MEAN= 0
##$ME_mod= 0
##$MI= 50
##$NCOEF= 0
##$NC_proc= -8
##$NLEV= 6
##$NOISF1= 182.463
##$NOISF2= 159.3651
##$NSP= 0
##$NTH_PI= 0
##$NZP= 0
##$OFFSET= 197.3918
##$PC= 4
##$PHC0= 1876.882
##$PHC1= -3.301208
##$PH_mod= 1
##$PKNL= yes
##$PPARMOD= 0
##$PSCAL= 0
##$PSIGN= 0
##$REVERSE= no
##$SF= 81.014063255964
##$SI= 65536
##$SIGF1= 159.3651
##$SIGF2= -187.1042
##$SINO= 113.3802
##$SIOLD= 16384
##$SREGLST= <1H.CDCl3>
##$SSB= 0
##$STSI= 65536
##$STSR= 0
##$SW_p= 32467.5324675325
##$SYMM= 0
##$S_DEV= 0
##$TDeff= 32768
##$TDoff= 0
##$TI= <>
##$TILT= no
##$TM1= 0
##$TM2= 0
##$TOPLEV= 0
##$USERP1= <user>
##$USERP2= <user>
##$USERP3= <user>
##$USERP4= <user>
##$USERP5= <user>
##$WDW= 1
##$XDIM= 65536
##$YMAX_p= 366789577
##$YMIN_p= -163177974
$$ End of Bruker specific parameters
$$ ---------------------------------
##NTUPLES= NMR SPECTRUM
##VAR_NAME=  FREQUENCY,     SPECTRUM/REAL,   SPECTRUM/IMAG
##SYMBOL=    X,             R,               I
##VAR_TYPE=  INDEPENDENT,   DEPENDENT,       DEPENDENT
##VAR_FORM=  AFFN,          ASDF,            ASDF
##VAR_DIM=   65536,         65536,           65536
##UNITS=     HZ,            ARBITRARY UNITS, ARBITRARY UNITS
##FACTOR=    0.49542278885378, 1,            1
##FIRST=     15991.5117654749, 0,            0
##LAST=      -16476.0207020576, 0,           0
##MIN=       -16476.0207020576, -163177974,  0
##MAX=       15991.5117654749, 366789577,    0
$$ Real data points
##PAGE= N=1
##DATA TABLE= (X++(R..R)), XYDATA
$$ [...]
$$ plain form
7486 -2638147 -3093069 -3872482 -5853959 -8568930 -10389746 -10144016 -8584740 -7585324 -7834021
7477 -7834021 -8226571 -7726135 -6681960 -5747593 -4689405 -3321764 -2700554 -4007593 -6730155
7468 -6730155 -9317031 -11318790 -13310543 -14732309 -13724933 -9915823 -5765595 -3723942
7460 -3723942 -3018201 -956418 2887232 5580600 4507430 829858 -1888634 -1971434 -1153079
7451 -1153079 -1513687 -2162041 -310200 4644714 9647880 11174379 8714264 4264177 -291869
7442 -291869 -3655606 -4066252 -470515 4996168 8183017 7631192 6108224 6263260 6971928
7433 6971928 5986651 4179460 4084560 5220740 4363659 720736 -2420021 -2400309 -822485
7424 -822485 -564020 -1181247 193672 4188908 7805021 7959561 4924330 1686910 668867
$$ packed form
7486b638147m54922p79413j981477k714971j820816K45730J559276R99416k48697
7477g834021l92550N00436J044175R34367J058188J367641O21210j307039k722562
7468f730155k586876k001759j991753j421766J007376L809110M150228K041653
7460c723942P05741K061783L843650K693368j073170l677572k718492q2800Q18355
7451a153079l60608o48354J851841M954914N003166J526499k460115m450087m556046
7442b91869l363737m10646L595737N466683L186849n51825j522968J55036P08668
7433F971928r85277j807191r4900J136180q57081l642923l140757J9712J577824
7424h22485K58465o17227J374919L995236L616113J54540l035231l237420j018043
$$ plain form
7415 668867 1577971 2319997 1755928 1113713 2121897 4129337 4405443 1650294 -2146875
7406 -2146875 -4179052 -3989722 -3144017 -2852867 -3261645 -4133567 -4597202 -2953186 1329403
7397 1329403 5793019 7250201 5843927 4671512 5093641 4921300 2207417 -1759999 -5057947
7388 -5057947 -8356136 -12749688 -15953101 -14274945 -8276384 -3072772 -2151720 -3823208
7380 -3823208 -5112247 -6144826 -8175990 -9656734 -7921592 -3995494 -2040095 -3495037
7372 -3495037 -4899033 -2823835 1597246 4870061 5828660 5890693 6048135 6173773 6696800
7363 6696800 8337205 9953821 8944362 4647557 -242967 -2566007 -1851001 116657
7355 116657 1750269 2806850 3939555 5925486 8680202 10489841 9145184 4604226
$$ packed form
7415F68867R09104P42026n64069o42215J008184K007440K76106k755149l797169
7406b146875k032177J89330Q45705K91150m08778q71922m63635J644016M282589
7397A329403M463616J457182j406274j172415M22129j72341k713883l967416l297948
7388e057947l298189m393552l203413J678156N998561N203612R21052j671488
7380c823208j289039j032579k031164j480744J735142L926098J955399j454942
7372c495037j403996K075198M421081L272815R58599O2033J57442J25638N23027
7363F696800J640405J616616j009459m296805m890524k323040P15006J967658
7355A16657J633612J056581J132705J985931K754716J809639j344657m540958
$$ plain form
7347 4604226 -377029 -3173074 -3952090 -4357574 -4586496 -3542502 -1421041 -38020 -148124
7338 -148124 -212938 1108348 2447918 1142750 -3161565 -7509563 -8559218 -5968839 -2513750
7329 -2513750 -1019759 -1619503 -2344904 -2082398 -1935503 -3235327 -5363511 -6926029 -8382048
7320 -8382048 -11366360 -15129455 -16074251 -12431059 -7608996 -6461987 -9020481 -10661675
7312 -10661675 -8613492 -5410679 -4622993 -5634617 -5044360 -1871570 1389794 2639946
7304 2639946 2504899 2237044 1532467 -208139 -1907189 -1744969 494290 3244374 5026277
7295 5026277 5546754 5222171 4575402 4069809 3791927 3244191 1937595 115200 -1503548
7286 -1503548 -2478465 -2750892 -2343671 -1484618 -690567 -130918 815710 2783183 5416970
$$ packed form
7347D604226m981255k796045p79016m05484k28922J043994K121461J383021j10104
7338a48124o4814J321286J339570j305168m304315m347998j049655K590379L455089
7329b513750J493991n99744p25401K62506J46895j299824k128184j562518j456019
7320h382048k984312l763095r44796L643192M822063J147009k558494j641194
7312a0661675K048183L202813P87686j011624N90257L172790L261364J250152
7304B639946j35047k67855p04577j740606j699050J62220K239259K750084J781903
7295E026277N20477l24583o46769n05593k77882n47736j306596j822395j618748
7286a503548r74917k72427M07221Q59053P94051N59649R46628J967473K633787
$$ plain form
7277 5416970 7574382 8121558 6189036 1539802 -4382198 -8552208 -8891475 -6486898 -4242101
7268 -4242101 -3659933 -4058186 -4452691 -4663105 -4652207 -4248345 -3656057 -3114174 -2245180 -927224
7258 -927224 -157593 -279856 852178 5233764 10464817 11525049 7621092 3895323 4604559
7249 4604559 7694665 8579908 6580573 4401655 3148921 1528433 -787702 -2353257
7241 -2353257 -2470923 -1923583 -1262137 -660379 -1175527 -3639299 -6387416 -6658620 -4422043
7232 -4422043 -2376841 -1976572 -2066336 -1860468 -2425152 -4198189 -5619525 -5572315 -4946327
7223 -4946327 -4372022 -2624479 899922 3983865 3974738 1157322 -2073541 -4325209 -5739289
7214 -5739289 -6422490 -6254304 -5683286 -5105853 -3980244 -1936717 22633 1005275 1993146
$$ packed form
7277E416970K157412N47176j932522m649234n922000m170010l39267K404577K244797
7268d242101N82168l98253l94505k10414J0898M03862N92288N41883Q68994J317956
7258i27224P69631j22263J132034M381586N231053J060232l903957l725769P09236
7249D604559L090106Q85243j999335k178918j252734j620488k316135j565555
7241b353257j17666N47340O61446O01758n15148k463772k748117k71204K236577
7232d422043K045202M00269q9764K05868n64684j773037j421336M7210O25988
7223d946327N74305J747543L524401L083943r127k817416l230863k251668j414080
7214e739289o83201J68186N71018N77433J125609K043527J959350R82642R87871
$$ plain form
7205 1993146 4085289 5669946 3956328 -577032 -3943117 -3778225 -2316557 -2570892 -3476640
7196 -3476640 -1430996 3987013 8570496 8497598 4831029 1615628 722957 456278 -1063308
7187 -1063308 -3143725 -3841267 -2572617 -325575 1735490 2661437 1506401 -1784857 -5593573
7178 -5593573 -8072129 -9134775 -9680120 -9231046 -6260583 -1044112 3797633 6336059 7231808
7169 7231808 7723923 7404932 5324213 2050903 -762682 -1992274 -1135085 2003957 6232583
7160 6232583 8668511 7503097 4630191 3609615 5079820 6107802 4548414 2269733
7152 2269733 2784485 6538899 10001492 9666019 6083962 3049874 2866437 3608043 2020772
7143 2020772 -1860906 -4940369 -5693428 -6025256 -7519575 -8358319 -6208502 -2476187 -785402
$$ packed form
7205A993146K092143J584657j713618m533360l366085J64892J461668k54335r05748
7196c476640K045644N418009M583483p2898l666569l215401q92671k66679j519586
7187a063308k080417o97542J268650K247042K061065R25947j155036l291258l808716
7178e593573k478556j062646n45345M49074K970463N216471M841745K538426Q95749
7169G231808M92115l18991k080719l273310k813585j229592Q57189L139042M228626
7160F232583K435928j165414k872906j020576J470205J027982j559388k278681
7152B269733N14752L754414L462593l35473l582057l034088j83437P41606j587271
7143B020772l881678l079463p53059l31828j494319q38744K149817L732315J690785
$$ plain form
7134 -785402 -1820427 -2591933 -1127056 763857 467186 -1772573 -3728315 -4314336 -3965127
7125 -3965127 -2551212 929786 5927481 9158512 7578756 2414020 -1453039 -996307
7117 -996307 1401713 1481549 -920484 -2033899 -138585 1795169 687431 -2282285 -4044660
7108 -4044660 -4121545 -4051537 -4007265 -3044132 -1797111 -1939116 -3387669 -4725941 -5886459
7099 -5886459 -7576911 -8567225 -6908377 -3800944 -2638204 -3730276 -3758778 -1500778 -85796
7090 -85796 -1610681 -3342219 -2218381 24529 -175724 -2356340 -3032627 -1240849 729508
7081 729508 1574244 2309424 3250148 2960487 991475 -957246 -1549313 -1413380 -1462732 -1578987
7071 -1578987 -1772374 -2641408 -3532245 -2160460 2167962 6220361 5755286 445144 -5705178
$$ packed form
7134g85402j035025p71506J464877J890913k96671k239759j955742n86021L49209
7125c965127J413915L480998M997695L231031j579756n164736l867059M56732
7117i96307K398020P9836k402033j113415J895314J933754j107738k969716j762375
7108d044660p6885P0008M4272R63133J247021j42005j448553j338272j160518
7099e886459j690452r90314J658848L107433J162740j092072k8502K258000J414982
7090h5796j524885j731538J123838K242910k00253k180616o76287J791778J970357
7081G29508Q44736P35180R40724k89661j969012j948721n92067J35933m9352j16255
7071a578987j93387q69034q90837J371785M328422M052399m65075n310142o150322
$$ plain form
7062 -5705178 -8799146 -8438205 -6421811 -3708241 -82445 3753718 5542713 3696217
7054 3696217 -725172 -5167086 -8181860 -9910619 -10494261 -9486425 -6931093 -3594482
7046 -3594482 262907 4963612 9683657 12102321 10789889 6842497 2251508 -2063793
7038 -2063793 -5470690 -6360857 -3565911 1682492 6837844 10478124 12270966 11637430 8663515
7029 8663515 5653578 5103371 6056806 5086803 1477864 -1133953 458172 4734165 7585915
7020 7585915 7197021 5008459 2950017 1685845 1181151 1251671 1395167 1204617 1070865
7011 1070865 1663184 2735093 3210076 2430884 613758 -1900134 -5048950 -8507804 -11353007
7002 -11353007 -12565654 -11555362 -8182471 -2887070 2883800 6980020 8087216 7027376
$$ packed form
7062e705178l093968L60941K016394K713570L625796L836163J788995j846496
7054C696217m421389m441914l014774j728759n83642J007836K555332L336611
7046c594482L857389M700705M720045K418664j312432l947392m590989m315301
7038b063793l406897q90167K794946N248403N155352L640280J792842o33536k973915
7029H663515l009937n50207R53435r70003l608939k611817J592125M275993K851750
7020G585915l88894k188562k058442j264172n04694P0520J43496j90550j33752
7011A070865N92319J071909M74983p79192j817126k513892l148816l458854k845203
7002a1353007j212647J010292L372891N295401N770870M096220J107196j059840
$$ plain form
6994 7027376 6008113 6386423 7563920 8266329 8281640 8219634 7862308 5815986 1288422
6985 1288422 -4226383 -7480067 -5822194 486583 7698069 10778982 7457908 314796
6977 314796 -6015531 -9534330 -11454318 -12543836 -11635020 -8735558 -6730043 -7593012 -8996137
6968 -8996137 -7644977 -4475891 -3005928 -3340794 -1979130 2002551 4746076 3339972
6960 3339972 317972 -151439 1851615 2806691 1001419 -1792787 -3287767 -3083920 -2310022
6951 -2310022 -2457153 -4273116 -6585476 -6860529 -4228168 -1121991 -356742 -1385975 -1329357
6942 -1329357 851993 3274530 3991363 2806790 147288 -3633859 -7119504 -7970003 -5461440
6933 -5461440 -1671602 922395 1990905 2458724 2157951 38463 -3505099 -6111226 -5926810
$$ packed form
6994G027376j019263L78310J177497P02409J5311o2006l57326k046322m527564
6985A288422n514805l253684J657873O308777P211486L080913l321074p143112
6977C14796o330327l518799j919988j089518R08816K899462K005515q62969j403125
6968h996137J351160L169086J469963l34866J361664L981681K743525j406104
6960C339972l022000m69411K003054R55076j805272k794206j494980K03847P73898
6951b310022j47131j815963k312360k75053K632361L106177P65249j029233N6618
6942a329357K181350K422537P16833j184573k659502l781147l485645q50499K508563
6933e461440L789838K593997J068510M67819l00773k119488l543562k606127J84416
$$ plain form
6924 -5926810 -3809924 -2273372 -2540617 -3474452 -3448084 -2248764 -519027 1601025 3836691
6915 3836691 4517570 2231956 -1042711 -1093081 2871385 6078829 4008763 -1483312 -4877136
6906 -4877136 -4719285 -4952042 -8347467 -12284775 -12566873 -8676294 -3290512 1390641 4725727
6897 4725727 6489712 6815001 6602196 6485237 6123878 5636467 6363039 8563289 9855705
6888 9855705 8326048 6034034 6361550 8282465 6876689 480261 -5951830 -6663746 -1972375
6879 -1972375 3019398 4865541 4211675 2838181 1478188 849997 2027976 4449399 5362423
6870 5362423 2817875 -1758592 -5229003 -6201333 -5582811 -4320375 -2209968 862842 3755020
6861 3755020 4876179 3793792 1663467 155180 -98664 -205990 -1952292 -5618196 -9070362
$$ packed form
6924e926810K116886J536552k67245r33835K6368J199320J729737K120052K235666
6915C836691O80879k285614l274667n0370L964466L207444k070066n492075l393824
6906d877136J57851k32757l395425l937308k82098L890579N385782M681153L335086
6897D725727J763985L25289k12805j16959l61359m87411P26572K200250J292416
6888I855705j529657k292014L27516J920915j405776o396428o432091p11916M691371
6879a972375M991773J846143o53866j373494j359993o28191J177979K421423R13024
6870E362423k544548m576467l470411r72330O18522J262436K110407L072810K892178
6861C755020J121159j082387k130325j508287k53844j07326j746302l665904l452166
$$ plain form
6852 -9070362 -9641344 -6932894 -3262514 -1313772 -1743878 -2959221 -2687250 81031 3969705
6843 3969705 6030058 4408807 270664 -3563548 -5627289 -6375546 -6011739 -3651788 576807
6834 576807 4305166 5305502 4135486 2916763 2198979 721641 -1988584 -4524433 -5435603
6825 -5435603 -4908953 -4168988 -4088744 -4743705 -5604912 -5868469 -5184459 -4242769 -4085292 -4747132
6815 -4747132 -5138015 -4319173 -2387212 -200724 1162775 909651 -661141 -1996740 -1901247
6806 -1901247 -1210649 -1700453 -3254487 -3499374 -756543 3888514 8177234 11148574 12999292
6797 12999292 13539281 12352148 10155426 8436071 7395550 5455038 1549232 -2849399
6789 -2849399 -5030535 -4185587 -2183583 -914583 15235 1936391 4360160 5351492 4521586
$$ packed form
6852i070362n70982K708450L670380J948742m30106j215343K71971K768281L888674
6843C969705K060353j621251m138143l834212k063741p48257L63807K359951M228595
6834E76807L728359J000336j170016j218723p17784j477338k710225k535849r11170
6825e435603N26650P39965Q0244o54961q61207k63557O84010R41690J57477o61840
6815d747132l90883Q18842J931961K186488J363499k53124j570792j335599R5493
6806a901247O90598m89804j554034k44887K742831M645057M288720K971340J850718
6797A2999292N39989j187133k196722j719355j040521j940512l905806m398631
6789b849399k181136Q44948K002004J269000R29818J921156K423769R91332q29906
$$ plain form
6780 4521586 3525809 2924444 866680 -3372766 -6512456 -4666288 1179076 5812418 5836069
6771 5836069 2699758 -257758 -1241815 -131496 2162686 3500008 1912885 -1673887
6763 -1673887 -4023914 -3721584 -2533862 -1735592 153625 4155801 7958140 8868831 7817642
6754 7817642 7647607 8725209 9045032 7833297 6267369 5012851 3625207 2370003 2405188
6745 2405188 3935289 5797300 6788701 6150295 3543475 206264 -974300 1250123 4151151
6736 4151151 4481596 3137191 3208195 4404294 3616955 975382 573236 3780632 6283434
6727 6283434 4312059 190162 -1416002 91976 1990416 3166007 4551746 5921472
6719 5921472 5911605 4757889 3784435 2383694 -1277658 -6223462 -8466308 -5987761 -1531428
$$ packed form
6780D521586r95777o01365k057764m239446l139690J846168N845364M633342K3651
6771E836069l136311k957516r84057J110319K294182J337322j587123l586772
6763a673887k350027L02330J187722P98270J889217M002176L802339R10691j051189
6754G817642j70035J077602L19823j211735j565928j254518j387644j255204L5185
6745B405188J530101J862011R91401o38406k606820l337211j180564K224423K901028
6736D151151L30445j344405P1004J196099p87339k641573m02146L207396K502802
6727F283434j971375m121897j606164J507978J898440J175591J385739J369726
6719E921472r867j153716r73454j400741l661352m945804k242846K478547M456333
$$ plain form
6710 -1531428 962317 859069 299143 752598 2024770 3809799 6035479 7484421 5973114
6701 5973114 1078822 -4258986 -6267683 -4295768 -1032379 1143908 2339200 3109859
6693 3109859 2406716 -498045 -3533517 -4051738 -2988593 -3852634 -7419220 -10493955 -10709893
6684 -10709893 -9366983 -8009336 -5402091 -483156 4253237 5624037 4521530 4594948
6676 4594948 6989234 9370015 9713822 8224147 5688106 2730924 832732 1404866 3355242
6667 3355242 3883999 2222451 437114 50574 132102 -512561 -1455703 -1983489 -2340889
6658 -2340889 -2423958 -980300 2411270 5815377 6801674 5081039 2392905 615428 707109
6649 707109 2506635 4666163 5450090 4193550 1443173 -2196123 -6020619 -8154702 -6742961
$$ packed form
6710a531428K493745j03248n59926M53455J272172J785029K225680J448942j511307
6701E973114m894292n337808k008697J971915L263389K176287J195292P70659
6693C109859p03143k904761l035472n18221J063145q64041l566586l074735k15938
6684a0709893J342910J357647K607245M918935M736393J370800j102507P3418
6676D594948K394286K380781L43807j489675k536041k957182j898192N72134J950376
6667C355242N28757j661548j785337l86540Q1528o44663r43142n27786l57400
6658b340889q3069J443658L391570L404107R86297j720635k688134j777477R1681
6649G07109J799526K159528P83927j256540k750377l639296l824496k134083J411741
$$ plain form
6640 -6742961 -3062673 -1305910 -3716658 -7597695 -8865504 -7109943 -5037346 -3966906
6632 -3966906 -2407377 954033 4944176 7146403 6268510 3012070 -454586 -1748901
6624 -1748901 88642 3831447 7197591 8617183 7847329 5743337 3993502 3996530 4975200
6615 4975200 4294324 1080131 -1599070 -314089 3605218 5272125 2857735 108615
6607 108615 832271 3381790 3203256 -491956 -3640980 -2900218 418216 2892178 3233885
6598 3233885 2361716 886138 -1147241 -2618729 -1905054 469186 1722144 304584 -1937022
6589 -1937022 -2126917 248490 3307508 5034713 4580738 2558921 1264984 3170454 7496943
6580 7496943 9676178 6437976 295404 -3619024 -4143988 -4252031 -5242029 -4922762 -2321487
$$ packed form
6640f742961L680288J756763k410748l881037j267809J755561K072597J070440
6632c966906J559529L361410L990143K202227q77893l256440l466656j294315
6624a748901J837543L742805L366144J419592p69854k103992j749835L028R78670
6615D975200o80876l214193k679201J284981L919307J666907k414390k749120
6607A08615P23656K549519j78534l695212l149024P40762L318434K473962L41707
6598C233885q72169j475578k033379j471488P13675K374240J252958j417560k241606
6589a937022j89895K375407L059018J727205m53975k021817j293937J905470M326489
6580G496943K179235l238202o142572l914428n24964j08043r89998L19267K601275
$$ plain form
6571 -2321487 -118704 -481877 -1818210 -1984972 -1812792 -2742846 -3463582 -2010394 574661
6562 574661 1700574 937819 -550363 -2817524 -6214707 -8833241 -8355229 -5949293 -5026565
6553 -5026565 -6347209 -7575510 -7623415 -8014285 -9425842 -10112334 -8760749 -6193328 -3228501
6544 -3228501 623767 5266318 9157730 11424372 12650166 12683102 10202796 5812085 3042231
6535 3042231 4316528 7719200 9573347 8658887 6233039 3545899 1349267 638768 1831528
6526 1831528 3827031 5302956 6160536 6555593 5739929 3360950 741107 -829349 -2045835
6517 -2045835 -4013631 -5633389 -4706481 -1291902 2073210 3591310 3943245 4513142 5317100
6508 5317100 5349054 4196958 2719102 2221350 3010157 3885144 3532194 2252371 1348560
$$ packed form
6571b321487K202783l63173j336333j66762J72180r30054p20736J453188K585055
6562E74661J125913p62755j488182k267161l397183k618534M78012K405936R22728
6553e026565j320644j228301m7905l90870j411557o86492J351585K567421K964827
6544c228501L852268M642551L891412K266642J225794L2936k480306m390711k769854
6535C042231J274297L402672J854147r14460k425848k687140k196632p10499J192760
6526A831528J995503J475925Q57580L95057q15664k378979k619843j570456j216486
6517b045835j967796j619758R26908L414579L365112J518100L51935N69897Q03958
6508E317100L1954j152096j477856m97752P88807Q74987l52950j279823r03811
$$ plain form
6499 1348560 877778 -465409 -2885985 -4719575 -4950629 -4649720 -4750881 -4384335 -3041097
6490 -3041097 -2346418 -3387082 -4022818 -1679615 2424898 4927935 5347424 6057208 7527316
6481 7527316 7338781 4667642 2235140 2163617 2697616 1129109 -2053177 -4132465 -3960160
6472 -3960160 -2776552 -2059073 -2291753 -3415668 -5078934 -6642684 -7885257 -9335738 -11096703
6463 -11096703 -11870418 -10188807 -6422053 -2752973 -1177007 -1935259 -3614264 -4268620 -2727671
6454 -2727671 487510 3283973 3277305 -522139 -6610018 -11458474 -12128117 -9333019 -7116625
6445 -7116625 -8222918 -10523442 -9806769 -5599581 -1776396 -1138738 -2105142 -2013688 -1229554
6436 -1229554 -1813324 -3766778 -5115775 -4957371 -4106685 -3027320 -1328603 561192 1273286
$$ packed form
6499A348560m70782j343187k420576j833590k31054L00909j01161L66546J343238
6490c041097O94679j040664o35736K343203M104513K503037M19489P09784J470108
6481G527316j88535k671139k432502p1523N33999j568507l182286k079288J72305
6472c960160J183608P17479k32680j123915j663266j563750j242573j450481j760965
6463a1096703p73715J681611L766754L669080J575966p58252j679005o54356J540949
6454b727671L215181K796463o668l799444o087879m848456o69643K795098K216394
6445g116625j106293k300524P16673M207188L823185O37658r66404R1454P84134
6436a229554n83770j953454j348997J58404Q50686J079365J698717J889795P12094
$$ plain form
6427 1273286 566624 -270961 -828734 -2586221 -6134836 -8822274 -7398438 -2790376 -4352
6418 -4352 -2315761 -7141105 -9273386 -7252941 -4396539 -3705325 -4389711 -4490796 -4388626
6409 -4388626 -5300779 -5968569 -4039834 -286408 1819687 1172262 583239 2208648 4409428
6400 4409428 4956189 4613930 4927331 4582049 1275792 -3897724 -7372409 -8268519 -9416425
6391 -9416425 -12580016 -15477187 -14990423 -11378046 -7587514 -5473783 -4256858 -2311537
6383 -2311537 734481 3801733 5619198 5855885 5028345 3623990 1955740 856397 1278224
6374 1278224 2518020 2260908 -139346 -1653027 987583 6529087 10403029 10544531 9249011
6365 9249011 8848362 8636213 7440458 6303265 6281652 5887459 3639778 1590656 2925486
$$ packed form
6427A273286p06662q37585n57773j757487l548615k687438J423836M608062K786024
6418d352k311409m825344k132281K020445K856402O91214o84386j01085J02170
6409d388626r12153o67790J928735L753426K106095o47425n89023J625409K200780
6400D409428N46761l42259L13401l45282l306257n173516l474685q96110j147906
6391i416425l163591k897171M86764L612377L790532K113731J216925J945321
6383b311537L046018L067252J817465K36687q27540j404355j668250j099343M21827
6374A278224J239796k57112k400254j513681K640610N541504L873942J41502j295520
6365I249011m00649k12149j195755j137193k1613l94193k247681k049122J334830
$$ plain form
6356 2925486 6670318 8296680 6003471 3134752 3004289 4032275 2212737 -3245145
6348 -3245145 -9087097 -12053006 -11616895 -8935842 -5156668 -1359824 1268947 2199364 1950395
6339 1950395 1274173 475159 -228098 -481605 -458470 -960064 -2067196 -2366103 -676059
6330 -676059 1750668 2147607 -331284 -3304249 -4032717 -2714587 -1889439 -3024972 -4836397
6321 -4836397 -5068143 -3052505 -151649 1772385 1907317 826266 -262193 -525156 35379
6312 35379 855440 1276243 755143 -1021142 -3948813 -7451059 -10562640 -11988668 -10644824
6303 -10644824 -7089479 -4236759 -5128620 -9295645 -12601798 -11791465 -8135666 -5273838
6295 -5273838 -4502042 -4023683 -2201432 587452 3222104 4932739 5040394 3625662 2613064
$$ packed form
6356B925486L744832J626362k293209k868719j30463J027986j819538n457882
6348c245145n841952k965909M36111K681053L779174L796844K628771R30417k48969
6339A950395o76222p99014p03257k53507K3135n01594j107132k98907J690044
6330f76059K426727L96939k478891k972965p28468J318130Q25148j135533j811425
6321d836397k31746K015638K900856J924034J34932j081051j088459k62963N60535
6312C5379Q20061M20803n21100j776285k927671l502246l111581j426028J343844
6303a0644824L555345K852720q91861m167025l306153Q10333L655799K861828
6295e273838P71796M78359J822251K788884K634652J710635J07655j414732j012598
$$ plain form
6286 2613064 3928677 6207894 5963258 2888090 1045126 3051030 5915983 5245702 1247924
6277 1247924 -2513627 -4394700 -5075883 -4227557 -1225719 1277773 -570360 -5221866 -5912970
6268 -5912970 272128 7496764 8514537 3845821 -198869 -547300 23975 -1294544 -3253440
6259 -3253440 -3274370 -1094135 1938842 5099833 8058076 9647239 8624519 5478484 2435266
6250 2435266 1380249 1987334 2118104 412368 -1561980 -659366 3833646 8682602 10340321
6241 10340321 9028649 7504363 6673007 4935604 1865000 -228591 499599 2783267
6233 2783267 4327721 4980414 6078856 7661763 8251940 7225856 5916934 6065344 7901397
6224 7901397 9900799 10087424 7708526 3903800 616814 -1068356 -1202160 -178708 1213176
$$ packed form
6286B613064J315613K279217k44636l075168j842964K005904K864953o70281l997778
6277A247924l761551j881073o81183Q48326L001838K503492j848133m651506o91104
6268e912970O185098P224636J017773m668716m044690l48431N71275j318519j958896
6259c253440k0930K180235L032977L160991K958243J589163j022720l146035l043218
6250B435266j055017O07085J30770j705736j974348R02614M493012M848956J657719
6241A0340321j311672j524286q31356j737403l070604k093591P28190K283668
6233B783267J544454O52693J098442J582907N90177j026084j308922J48410J836053
6224G901397J999402J86625k378898l804726l286986j685170j33804J023452J391884
$$ plain form
6215 1213176 1408000 -439228 -2473208 -1796002 1254064 2789375 524652 -3147570 -4969571
6206 -4969571 -5193154 -5556133 -5236549 -2511650 987736 1919358 707060 1042785 3544363
6197 3544363 4390693 1636176 -1501391 -2062739 -2065231 -4336155 -6814297 -5417651 -811825
6188 -811825 2274635 1986907 1297321 2562249 4015790 3129676 455226 -1796799 -2924170
6179 -2924170 -3556230 -3725030 -2969605 -1616253 -463248 424067 1511824 2683501 3210734
6170 3210734 2745559 1844456 1575999 2598677 4117555 3917472 561889 -4196384 -6586655
6161 -6586655 -5198990 -2894728 -3108922 -5402255 -6540592 -5388479 -4358420 -5478472
6153 -5478472 -7162711 -6479720 -3458454 -1170491 -1644076 -3447507 -3979228 -2829343 -1646011
$$ packed form
6215A213176J94824j847228k033980O77206L050066J535311k264723l672222j822001
6206d969571k23583l62979L19584K724899L499386R31622j212298L35725K501578
6197C544363Q46330k754517l137567n61348k492k270924k478142J396646M605826
6188h11825L086460k87728o89586J264928J453541q86114k674450k252025j127371
6179b924170o32060j68800P55425J353352J153005Q87315J087757J171677N27233
6170C210734m65175r01103k68457J022678J518878k00083l355583m758273k390271
6161f586655J387665K304262k14194k293333j138337J152113J030059j120052
6153e478472j684239O82991L021266K287963m73585j803431n31721J149885J183332
$$ plain form
6144 -1646011 -1382706 -1272960 -675632 -440117 -1515603 -3154173 -3794087 -3406256 -3606189
6135 -3606189 -5162988 -6541812 -5678489 -2587784 584465 1863525 1149884 -282699 -1374401
6126 -1374401 -2186405 -3540324 -5886070 -8389385 -9267573 -7446257 -3961924 -1274304 -882061
6117 -882061 -1923401 -2480853 -1898231 -1128947 -967393 -994783 -735762 -879457 -2270870 -4159966
6107 -4159966 -4795714 -3892970 -3235542 -4178266 -5533171 -5007426 -2365883 -95814 -692726
6098 -692726 -3884869 -6982187 -7860342 -7179282 -7218853 -8635175 -9371325 -7572901 -4676592
6089 -4676592 -3928516 -6052249 -8461726 -9299686 -9951362 -11994929 -13687229 -12143483 -8139761
6080 -8139761 -5845313 -7453517 -10410525 -10827455 -7888852 -3881400 -1274837 -997596 -2674586
$$ packed form
6144a646011K63305J09746N97328K35515j075486j638570o39914L87831j99933
6135c606189j556799j378824Q63323L090705L172249J279060p13641j432583j091702
6126a374401q12004j353919k345746k503315q78188J821316L484333K687620L92243
6117h82061j041340n57452N82622P69284J61554k7390K59021j43695j391413j889096
6107d159966o35748R02744O57428r42724j354905N25745K641543K270069n96912
6098f92726l192143l097318q78155O81060l9571j416322p36150J798424K896309
6089d676592P48076k123733k409477q37960o51676k043567j692300J543746M003722
6080h139761K294448j608204k957008m16930K938603M007452K606563K77241j676990
$$ plain form
6071 -2674586 -5257472 -7560680 -8798629 -8566648 -6495995 -2849362 407354 466065 -3400185
6062 -3400185 -8435820 -10847437 -9389963 -6006125 -3378263 -2528859 -2544859 -1947097 -242355
6053 -242355 1589782 2134841 1076792 -517726 -1391821 -1192286 -430270 125295 -5615
6044 -5615 -534079 -454358 885306 2857509 4314373 4971240 5104885 4303726 2127107 46123
6034 46123 692675 4264490 7448670 7370927 5276277 4574544 6199884 7862875 7428411
6025 7428411 5002700 1640190 -1991019 -4957870 -5737505 -3815746 -818656 1035743
6017 1035743 1214781 745068 200418 -1019734 -3172540 -4940722 -4577628 -1992270 1065843
6008 1065843 2895474 3255168 2857505 2334305 2102986 2429090 2922918 2561395 854198
$$ packed form
6071b674586k582886k303208j237949K31981K070653L646633L256716N8711l866250
6062c400185n035635k411617J457474L383838K627862Q49404j6000N97762J704742
6053b42355J832137N45059j058049j594518q74095J99535P62016N55565j30910
6044e615n28464P9721J339664J972203J456864O56867J33645q01159k176619k080984
6034D6123O46552L571815L184180p7743k094650p01733J625340J662991m34464
6025G428411k425711l362510l631209k966851p79635J921759K997090J854399
6017A035743J79038m69713n44650j220152k152806j768182L63094K585358L058113
6008A065843J829631L59694l97663n23200k31319L26104M93828l61523j707197
$$ plain form
5999 854198 -1608740 -4267881 -7187993 -9712492 -10014814 -7662864 -5301539 -5441635 -6560702
5990 -6560702 -5307548 -2030280 -562500 -2253440 -4113875 -4136033 -4508412 -7226359 -10069185
5981 -10069185 -10180917 -8830010 -8840058 -9391689 -7578174 -3931440 -2103894 -3340189 -5239337
5972 -5239337 -6216055 -7369202 -9148001 -9727473 -8098721 -5882470 -4555150 -3305839 -1139495
5963 -1139495 1073346 2158802 2278973 1523580 -1163774 -5830585 -9927744 -10959861 -9712712
5954 -9712712 -8947921 -9557517 -9799634 -8107138 -5150347 -2928295 -2658253 -3671741 -4024544
5945 -4024544 -2391571 437056 2352410 2312681 1272176 573993 282138 -410339 -1738194
5936 -1738194 -2899330 -2942442 -2080069 -2022177 -4210894 -7374731 -8189869 -5452413 -2035662
$$ packed form
5999H54198k462938k659141k920112k524499l02322K351950K361325j40096j119067
5990f560702J253154L277268J467780j690940j860435k2158l72379k717947k842826
5981a0069185j11732J350907j0048n51631J813515L646734J827546j236295j899148
5972e239337r76718j153147j778799n79472J628752K216251J327320J249311K166344
5963a139495K212841J085456J20171p55393k687354m666811m097159j032117J247149
5954i712712P64791o09596k42117J692496K956791K222052K70042j013488l52803
5945d024544J632973K828627J915354l9729j040505o98183k91855o92477j327855
5936a738194j161136m3112Q62373N7892k188717l163837q15138K737456L416751
$$ plain form
5927 -2035662 -892400 -783380 1216670 4301013 4802988 2048915 -868654 -2555486 -5011491
5918 -5011491 -8499005 -9418969 -6021038 -2188128 -2016963 -3879394 -3741916 -1647949 -520528
5909 -520528 -521264 633766 2716320 3005558 1190195 82444 973154 1908496 1313795 129551
5899 129551 -513089 -909954 -1200450 -704745 294837 350460 -875390 -2172654 -2945358 -3541689
5889 -3541689 -3260738 -806621 2676771 3885264 1707194 -1241969 -2404982 -1980896 -836922
5880 -836922 1267225 3721203 4189384 1895509 -537706 -746316 41054 -321166 -1011651
5871 -1011651 105521 2513717 3730539 3002697 1593797 202501 -1203787 -1670233 -266422
5862 -266422 1449602 839143 -1820257 -3463096 -2761930 -1848303 -2693846 -4339089 -5169139
$$ packed form
5927b035662J143262J09020K000050L084343N01975k754073k917569j686832k456005
5918e011491l487514r19964L397931L832910J71165j862431J37478K093967J127421
5909e20528p36J155030K082554K89238j815363j107751Q90710R35342n94701j184244
5899A29551o42640l96865k90496M95705R99582N5623j225850j297264p72704n96331
5889c541689K80951K454117L483392J208493k178070k949163j163013M24086J143974
5880h36922K104147K453978M68181k293875k433215k08610P87370l62220o90485
5871a011651J117172K408196J216822p27842j408900j391296j406288m66446J403811
5862b66422J716024o10459k659400j642839P01166R13627q45543j645243q30050
$$ plain form
5853 -5169139 -5874334 -8176562 -11716512 -14049760 -13450209 -10507133 -7032713 -4230836 -2054018
5844 -2054018 47114 1992565 2957841 2509145 1200154 -597064 -3580504 -7820773 -10808989
5835 -10808989 -9477773 -4607949 -947873 -1556840 -3803300 -3006341 1037099 3666863
5827 3666863 1532746 -3130010 -5406075 -3337253 811945 4106630 5924866 7073273
5819 7073273 7450029 6020646 2878142 -49210 -1072852 -853217 -1501592 -3730899 -5805786
5810 -5805786 -5581657 -2928419 254509 1927931 1377282 -712760 -2872150 -3573282 -2085103
5801 -2085103 895022 3553470 4231813 2679294 252822 -1144279 -608437 1084234 2482008
5792 2482008 3185568 4128334 5784115 6705198 4952119 1057722 -1711989 -996770 1516367
$$ packed form
5853e169139p05195k302228l539950k333248N99551K943076L474420K801877K176818
5844b054018K101132J945451R65276m48696j308991j797218k983440m240269k988216
5835a0808989J331216M869824L660076o08967k246460P96959M043440K629764
5827C666863k134117m662756k276065K068822M149198L294685J818236J148407
5819G073273L76756j429383l142504k927352j023642K19635o48375k229307k074887
5810e805786K24129K653238L182928J673422n50649k090042k159390p01132J488179
5801b085103K980125K658448O78343j552519k426472j397101N35842J692671J397774
5792B482008P03560R42766J655781R21083j753079l894397k769711P15219K513137
$$ plain form
5783 1516367 1911872 -1146823 -4824289 -5733264 -3859022 -1908978 -1670194 -2413516 -2690714
5774 -2690714 -2331898 -2190525 -2707240 -3310919 -3013932 -1422041 673991 1835416 1407648
5765 1407648 109876 -1258552 -3064984 -5727253 -7887217 -7549627 -5366649 -4815606 -7853413
5756 -7853413 -11858400 -12612619 -9448699 -5563625 -3647312 -3247386 -2672385 -1511147 -335744
5747 -335744 622352 1256674 989264 -330204 -1476407 -1025450 791797 2533859 3608449
5738 3608449 4518946 4962032 3357842 -730098 -4905920 -6126900 -4064959 -991434 1174626
5729 1174626 1984049 880332 -2966544 -8146715 -10542923 -7579340 -1819863 1878382
5721 1878382 2071894 1203426 904396 23618 -1972532 -2863614 -1008126 1445848 1292202
$$ packed form
5783A516367L95505l058695l677466r08975J874242J950044K38784p43322k77198
5774b690714L58816J41373n16715o03679K96987J591891K096032J161425m27768
5765A407648j297772j368428j806432k662269k159964L37590K182978N51043l037807
5756g853413m004987p54219L163920L885074J916313L99926N75001J161238J175403
5747c35744R58096O34322k67410j319468j146203M50957J817247J742062J074590
5738C608449R10497M43086j604190m087940m175822j220980K061941L073525K166060
5729A174626Q09423j103717l846876n180171k396208K963583N759477L698245
5721A878382J93512q68468k99030q80778j996150q91082J855488K453974j53646
$$ plain form
5712 1292202 -1084441 -2458698 -1601760 -764145 -2143438 -5090914 -7539822 -8584967 -8782431
5703 -8782431 -8980252 -9654712 -10818870 -12147679 -13496765 -15110759 -16761039 -17280992 -16090457
5694 -16090457 -14561560 -14133183 -13383266 -9300647 -1980639 4295809 6008430 4588172
5686 4588172 3984192 5472427 6916654 6402738 4503242 2975924 2853825 4076785 5883473
5677 5883473 7360498 8316394 9413569 10719924 10785408 8450362 5082240 3314880 3613927
5668 3613927 3902160 2931032 2120152 3130466 5289782 6835256 7466514 7940912 7842857
5659 7842857 5686841 1377354 -2897915 -4758769 -3827789 -1609785 61264 246637 -666300
5650 -666300 -1404088 -1158312 -581222 -802867 -1475292 -854951 1709260 4373144 4729421
$$ packed form
5712A292202k376643j374257Q56938Q37615j379293k947476k448908j045145j97464
5703h782431j97821o74460j164158j328809j349086j613994j650280n19953J190535
5694a6090457J528897M28377P49917M082619P320008O276448J712621j420258
5686D588172o03980J488235J444227n13916j899496j527318j22099J222960J806688
5677E883473J477025R55896J097175J306355O5484k335046l368122j767360K99047
5668C613927K88233r71128q10880J010314K159316J545474O31258M74398r8055
5659G842857k156016m309487m275269j860854R30980K218004J671049J85373r12937
5650f66300p37788K45776N77090k21645o72425O20341K564211K663884L56277
$$ plain form
5641 4729421 2473234 -755756 -3598722 -5873674 -7529284 -8111657 -7684093 -7262630 -7620056
5632 -7620056 -8113528 -7260900 -4372686 -471516 2253261 2169980 52106 -956137 1670579
5623 1670579 6553635 9270240 7262245 2835587 83622 -299578 -1307649 -4801091
5615 -4801091 -8393706 -8245511 -3862307 1241571 3370258 2040894 -448105 -1711501
5607 -1711501 -881334 1742716 5342952 8510097 9478200 7531525 4100009 1569805 839142
5598 839142 815793 445557 71938 113303 -448843 -2879958 -6446774 -8690496 -7898003 -4306668
5588 -4306668 865464 6171411 9626427 9306315 5233697 -176802 -4388395 -6933476
5580 -6933476 -8776619 -10156712 -9956481 -7117460 -2161185 2776604 5466396 5485074 4592298
$$ packed form
5641D729421k256187l228990k842966k274952j655610n82373M27564M21463l57426
5632g620056m93472Q52628K888214L901170K724777q3281k117874j008243K626716
5623A670579M883056K716605k007995m426658k751965l83200j008071l493442
5615d801091l592615J48195M383204N103878K128687j329364k488999j263396
5607a711501Q30167K624050L600236L167145R68103j946675l431516k530204p30663
5598H39142k3349l70236l73619M1365n62146k431115l566816k243722P92493L591335
5588d306668N172132N305947L455016l20112m072618n410499m211593k545081
5580f933476j843143j380093K00231K839021M956275M937789K689792J8678q92776
$$ plain form
5571 4592298 4768335 6010979 6768727 6316465 5460789 4732373 3428714 1304625 -128904
5562 -128904 601502 2559448 3252591 1656104 -759024 -2012527 -1729966 -1152371 -1624459
5553 -1624459 -3216283 -4711305 -5152623 -5195328 -5986416 -6724706 -5092657 -1010243 2008497
5544 2008497 1258413 -864089 199194 4523027 7311363 5793851 3300452 4517316
5536 4517316 9010058 12176080 11518941 9115233 7768299 7231691 5440681 1966810 -1411388
5527 -1411388 -3185727 -3697922 -3834908 -3229641 -886026 2671266 5173826 5107540 3559470
5518 3559470 2748890 3343706 4220486 4422944 4126583 3748232 3303016 2843163 2518456 1929804
5508 1929804 322673 -2250765 -4658983 -5740102 -5025481 -2682914 189186 1428429
$$ packed form
5571D592298J76037J242644P57748m52262q55676p28416j303659k124089j433529
5562a28904P30406J957946O93143j596487k415128j253503K82561N77595m72088
5553a624459j591824j495022m41318m2705p91088p38290J632049M082414L018740
5544B008497p50084k122502J063283M323833K788336j517512k493399J216864
5536D517316M492742L166022o57139k403708j346934n36608j791010l473871l378198
5527a411388j774339n12195j36986O05267K343615L557292K502560o6286j548070
5518C559470q10580N94816Q76780K02458k96361l78351m45216m59853l24707n88652
5508A929804j607131k573438k408218j081119P14621K342567K872100J239243
$$ plain form
5500 1428429 -484424 -4290844 -6966207 -7286145 -6903819 -7337600 -7609934 -5980179 -2622556
5491 -2622556 709182 2649037 2767025 1300510 -424444 -391305 1871913 4266620 4566028
5482 4566028 3011477 1315182 230646 -413650 -460609 -72808 -674726 -3193302 -6047534
5473 -6047534 -6950561 -6098757 -5406180 -5199217 -4256087 -2883822 -3094266 -5241362 -6971201
5464 -6971201 -6264635 -3515830 -150729 2678440 3681123 2230663 232385 557520 2704566
5455 2704566 2845217 -487085 -3750088 -3432821 -955152 60056 -973512 -2118884 -2745817
5446 -2745817 -3442844 -3400751 -1483995 677140 173255 -2654246 -4485433 -4120931 -3990593
5437 -3990593 -5702939 -7271705 -6417343 -4108768 -2818884 -3041103 -3492960 -3429482 -2817653
$$ packed form
5500A428429j912853l806420k675363l19938L82326m33781k72334J629755L357623
5491b622556L331738J939855J17988j466515j724954L3139K263218K394707K99408
5482D566028j554551j696295j084536o44296m6959L87801o01918k518576k854232
5473f047534r03027Q51804O92577K06963R43130J372265k10444k147096j729839
5464f971201P06566K748805L365101K829169J002683j450460j998278L25135K147046
5455B704566J40651l332302l263003L17267K477669J015208j033568j145372o26933
5446b745817o97027M2093J916756K161135n03885k827501j831187L64502J30338
5437c990593j712346j568766Q54362K308575J289884k22219m51857O3478O11829
$$ plain form
5428 -2817653 -1249339 1228666 2734171 1212512 -2223084 -3500637 -210656 5076718
5420 5076718 7444151 5114482 771574 -2748110 -6049232 -10813384 -15391350 -15939980
5412 -15939980 -12173169 -8651616 -8690185 -9885041 -8339333 -4845204 -3093579 -3288410 -2205110
5403 -2205110 464977 707452 -3303956 -7456214 -7134356 -3355042 -460055 23092 -65705
5394 -65705 438793 926831 1387815 2607403 3719255 2322248 -2064051 -6624894 -8344424
5385 -8344424 -7180387 -5326069 -4293556 -3590348 -1895346 954566 3231151 2935736 409502
5376 409502 -1536755 -1012943 260087 -871809 -4585066 -7678137 -7753650 -6032291 -5279639
5367 -5279639 -6371219 -7986140 -8727234 -8333337 -7251831 -6068719 -5264183 -4811986 -4095447
$$ packed form
5428b817653J568314K478005J505505j521659l435596j277553L289981N287374
5420E076718K367433k329669m342908l519684l301122m764152m577966n48630
5412a5939980L766811L521553l8569j194856J545708L494129J751625j94831J083300
5403b205110K670087K42475m011408m152258L21858L779314K894987M83147q8797
5394f5705N04498M88038M60984J219588J111852j397007m386299m560843j719530
5385h344424J164037J854318J032513P03208J695002K849912K276585k95415k526234
5376D09502j946257N23812J273030j131896l713257l093071p5513J721359P52652
5367e279639j091580j614921p41094L93897J081506J183112Q04536M52197P16539
$$ plain form
5358 -4095447 -2778105 -1598915 -1653880 -2943436 -4360432 -5240397 -6084487 -7273053 -7942694
5349 -7942694 -7240971 -6235502 -7004975 -9522244 -10993948 -9226977 -5305136 -1608074 1452395
5340 1452395 4615538 6703964 5434687 1582012 -693225 999611 4246592 5617247
5332 5617247 5157350 4807552 4417685 2558535 180126 -214384 879081 -219773 -4840743
5323 -4840743 -9169345 -8877642 -4429886 404181 3749945 6663756 9583694 10683885
5315 10683885 8739840 5734897 4968802 7162336 9756668 10127591 8570500 7688651 9273711
5306 9273711 12239040 13610456 11464651 6944490 3197199 2029193 2030619 907102 -698378
5297 -698378 388370 4948644 9034592 8606104 4951960 2676282 3168213 3547933 2134151
$$ packed form
5358d095447J317342J179190n4965j289556j416996q79965q44090j188566o69641
5349g942694P01723J005469p69473k517269j471704J766971L921841L697062L060469
5340A452395L163143K088426j269277l852675k275237J692836L246981J370655
5332E617247m59897l49798l89867j859150k378409l94510J093465j098854m620970
5323d840743m328602K91703M447756M834067L345764K913811K919938J100191
5315A0683885j944045l004943p66095K193534K594332L70923j557091q81849J585060
5306I273711K965329J371416k145805m520161l747291j168006J426j123517j605480
5297f98378J086748M560274M085948m28488l654144k275678M91931L79720j413782
$$ plain form
5288 2134151 1003106 1771121 2593399 1823257 1501620 3940909 7199934 7716267 5948994
5279 5948994 5447706 6959647 7396008 4850000 1107535 -1510240 -2667967 -2467582 -344733
5270 -344733 3052590 5232891 4678541 2621216 853114 -581503 -2401462 -4385730 -5891553
5261 -5891553 -6895255 -7570929 -7837150 -7814927 -7517483 -5913416 -2089315 2275501 3785114
5252 3785114 1616508 -1089817 -1236915 831884 3197347 5403315 7659519 8747630
5244 8747630 7119091 3292444 -709407 -3716646 -5757689 -6844489 -6959020 -6692547 -6612617
5235 -6612617 -6552303 -6499466 -7226608 -8850710 -9829995 -8850549 -6839650 -5676652 -5789016
5226 -5789016 -6505630 -7773629 -9620706 -10617219 -9044831 -5581414 -3061112 -3343099 -5699408
$$ packed form
5288B134151j131045P68015Q22278p70142l21637K439289L259025N16333j767273
5279E948994n01288J511941M36361k546008l742465k617775j157727K00385K122849
5270c44733L397323K180301n54350k057325j768102j434617j819959j984268j505823
5261e891553j003702o75674k66221K2223K97444J604067L824101M364816J509613
5252C785114k168606k706325j47098K068799K365463K205968K256204J088111
5244H747630j628539l826647m001851l007239k041043j086800j14531K66473P9930
5235f612617O0314N2837p27142j624102r79285R79446K010899J162998j12364
5226e789016p16614j267999j847077r96513J572388L463417K520302k81987k356309
$$ plain form
5217 -5699408 -8305431 -10017963 -10559719 -10166274 -9473297 -9100189 -9109850 -9054554 -8232911 -5824917
5207 -5824917 -1737986 2229343 3337508 1005423 -2113226 -3237733 -2588994 -2238713 -2968726
5198 -2968726 -3730996 -3322751 -1207045 2397802 5900590 6981477 5423570 4040484 5016239
5189 5016239 6781328 6699938 5191777 4146841 2586942 -2121206 -8937359 -13119306 -12412687
5180 -12412687 -9767812 -8612357 -8669886 -8191849 -7301779 -6723061 -5539930 -2960817 -761072
5171 -761072 -1261890 -3718005 -5134790 -4292310 -2825038 -2312019 -2134898 -706565 2270090
5162 2270090 5216568 5962028 3792796 587097 -704497 635766 2021850 752114
5154 752114 -2366578 -3850478 -1703799 2599186 6335815 8313931 8869043 8383084 7128306
$$ packed form
5217e699408k606023j712532n41756L93445O92977L73108r661N5296Q21643K407994
5207e824917M086931L967329J108165k332085l118649j124507O48739L50281p30013
5198b968726p62270M08245K115706L604847L502788J080887j557907j383086R75755
5189E016239J765089q1390j508161j044936j559899m708148o816153m181947P06619
5180a2412687K644875J155455n7529M78037Q90070N78718J183131K579113K199745
5171g61072n00818k456115j416785Q42480J467272N13019J77121J428333K976655
5162B270090K946478P45460k169232l205699j291594J340263J386084j269736
5154G52114l118692j483900K146679M302985L736629J978116N55112m85959j254778
$$ plain form
5145 7128306 6129045 6676221 8457366 9106574 6499173 1134261 -4464887 -8291916 -9862636
5136 -9862636 -9161966 -6242349 -2221640 862923 2076940 2410417 2946339 3526200 4034330
5127 4034330 5355307 7664752 9303628 9125900 8571549 9340653 10420415 10074432 9564158
5118 9564158 11405510 14314809 13853086 8967448 4265280 3995028 6671569 7867699 6048804
5109 6048804 3215046 1441981 1272026 2440808 3874515 3660727 1117958 -1586833 -1824182
5100 -1824182 -145768 396393 -1542461 -4032297 -4808438 -3969599 -2955410 -2229456 -1161881
5091 -1161881 451533 1905031 2634864 3053500 4023993 5754865 7547493 8651929 9003202
5082 9003202 8802046 7713305 5242055 2066808 246879 1372308 4595795 7055785
$$ packed form
5145G128306r99261N47176J781145O49208k607401n364912n599148l827029j570720
5136i862636P00670K919617M020709L084563J214017L33477N35922N79861N08130
5127D034330J320977K309445J638876j77728n54351P69104J079762l45983n10274
5118I564158J841352K909299m61723m885638m702168k70252K676541J196130j818895
5109F048804k833758j773065j69955J168782J433707k13788k542769k704791k37349
5100a824182J678414N42161j938854k489836p76141Q38839J014189P25954J067575
5091a161881J613414J453498P29833M18636R70493J730872J792628J104436L51273
5082I003202k01156j088741k471250l175247j819929J125429L223487K459990
$$ plain form
5074 7055785 6530449 3533285 587678 -456679 14358 568187 771690 1337613 2689966
5065 2689966 4473040 6402268 8421104 9869057 9725846 7993520 5669796 3208336
5057 3208336 483415 -1667773 -2030045 -1618087 -3078109 -6381395 -7988972 -6077701 -3564673
5048 -3564673 -3396992 -3931773 -2521599 -851969 -2054401 -4436927 -3416963 1053365 4333684
5039 4333684 4404245 4007428 4720219 4261304 1559915 -335731 877139 2794305 2057511
5030 2057511 -834287 -2958510 -2788901 -597482 2569924 4643421 3722023 953586 -371637
5021 -371637 371547 521728 -604888 -18870 3409797 6171572 5768394 4865869 6165300
5012 6165300 7215349 4949235 2042499 3364256 8137126 10923966 9391781 6324311
$$ packed form
5074G055785n25336k997164k945607j044357M71037N53829K03503N65923J352353
5065B689966J783074J929228K018836J447953j43211j732326k323724k461460
5057C208336k724921k151188l62272M11958j460022l303286j607577J911271K513028
5048c564673J67681n34781J410174J669630j202432k382526J019964M470328L280319
5039D333684P0561l96817P12791m58915k701389j895646J212870J917166p36794
5030B057511k891798k124223J69609K191419L167406K073497r21398k768437j325223
5021c71637P43184J50181j126616N86018L428667K761775m03178r02525J299431
5012F165300J050049k266114k906736J321757M772870K786840j532185l067470
$$ plain form
5004 6324311 4471773 3844859 4046462 5241576 6354276 5505984 2688066 -367461 -2706521
4995 -2706521 -4217559 -3976252 -1306774 2117378 4035622 4931398 6859249 9568754 10796864
4986 10796864 10112670 9479069 9897823 10135759 9043170 6962235 4684597 2826353 2181984
4977 2181984 3192695 5334528 7951395 10504173 11089410 7139077 -311499 -5529023
4969 -5529023 -4234402 1053136 4771178 5299096 4729967 3825313 1680144 -675674 -849826
4960 -849826 894213 1928944 1446414 1048687 1490189 2004433 2444592 3093566 3031052 1604584
4950 1604584 397468 637427 280647 -2611304 -5407083 -4331116 -832495 546550 -437505
4941 -437505 -28752 2387740 3467260 2649247 3742487 8328505 12867397 14271438 13781888
$$ packed form
5004F324311j852538o26914K01603J195114J112700q48292k817918l055527k339060
4995b706521j511038K41307K669478L424152J918244Q95776J927851K709505J228110
4986A0796864o84194o33601M18754K37936j092589k080935k277638j858244o44369
4977B181984J010711K141833K616867K552778N85237l950333p450576n217524
4969e529023J294621N287538L718042N27918n69129r04654k145169k355818j74152
4960h49826J744039J034731m82530l97727M41502N14244M40159O48974o2514j426468
4950A604584j207116K39959l56780k891951k795779J075967L498621J379045r84055
4941d37505M08753K416492J079520q18013J093240M586018M538892J404041m89550
$$ plain form
4932 13781888 13364377 12423011 10194584 7838894 6183317 4427024 2636274 2596454 4695103
4923 4695103 6506626 5766858 2801714 -535068 -2460571 -1867628 764298 3556659 5863910
4914 5863910 9107208 13288511 15622445 15245227 15437236 17478296 16887642 10878389 4658826
4905 4658826 3795318 5210769 3615654 1922676 5657168 11352226 11661907 8753168 10448715
4896 10448715 15403622 15303903 10593795 10108666 15095044 17739775 16194862 16554815 19082015
4887 19082015 17851142 15077366 19090294 26861468 27099939 22172118 25682024 36313216
4879 36313216 39548992 39051388 55038541 83929593 99153075 109428491 168058685 284322217
4871 284322217 366789577 315946524 156155230 14137842 -31309320 -18705456 -16694829
$$ packed form
4932A3781888m17511r41366k228427k355690j655577j756293j790750l9820K098649
4923D695103J811523p39768k965144l336782j925503N92943K631926K792361K307251
4914E863910L243298M181303K333934l77218J92009K041060n90654o009253o219563
4905D658826q63508J415451j595115j692978L734492N695058L09681k908739J695547
4896A0448715M954907r9719m710108m85129M986378K644731j544913L59953K527200
4887A9082015j230873k773776M012928P771174K38471m927821L509906J0631192
4879C6313216L235776m97604J5987153K8891052J5223482J0275416N8630194J16263532
4871B84322217Q2467360n0843053j59791294j42017388m5447162J2603864K010627
$$ plain form
4864 -16694829 -32135850 -35390258 -25786304 -25460864 -34608699 -35043954 -25901947 -22396334
4856 -22396334 -26387726 -25896904 -19266046 -16237499 -18050164 -16808873 -12404337 -12109280
4848 -12109280 -15148731 -13838483 -8601646 -7172587 -10208810 -11202935 -9274479 -9242811 -10435610
4839 -10435610 -7927148 -3790434 -4970166 -10563396 -12758318 -10119228 -8906958 -11262406
4831 -11262406 -12716271 -11700026 -11416846 -11872591 -9752528 -6639307 -7855106 -12580584
4823 -12580584 -14429083 -12455576 -12223286 -15037841 -15720365 -12788176 -11499427 -14230641
4815 -14230641 -16485339 -15500106 -14868596 -17226311 -19489795 -18904917 -17555131 -17567922 -17565377
4806 -17565377 -16898360 -17989978 -21506883 -24127275 -23787085 -22561486 -22055684 -20517104 -16771810
$$ packed form
4864a6694829j5441021l254408R603954L25440r147835m35255R142007L505613
4856b2396334l991392M90822O630858L028547j812665J241291M404536K95057
4848a2109280l039451J310248N236837J429059l036223r94125J928456L1668j192799
4839a0435610K508462M136714j179732n593230k194922K639090J212270k355448
4831a1262406j453865J016245K83180m55745K120063L113221j215799m725478
4823a2580584j848499J973507K32290k814555o82524K932189J288749k731214
4815a4230641k254698R85233O31510k357715k263484N84878J349786j2791K545
4806a7565377O67017j091618l516905k620392L40190J225599N05802J538580L745294
$$ plain form
4797 -16771810 -12739675 -10054392 -8231962 -7635712 -9917133 -14143917 -16898287 -17401394
4789 -17401394 -17971063 -18533397 -15999442 -10438871 -6285607 -5470179 -4800002 -2373575 -1076311
4780 -1076311 -2922464 -5180206 -5362181 -5286569 -6760102 -7677292 -6117090 -4445125 -5621499
4771 -5621499 -8708854 -11422781 -14005563 -17241238 -19492976 -18994183 -16736296 -14406851
4763 -14406851 -11896125 -9168301 -7836616 -8449875 -8938100 -8047921 -7445441 -8151678 -8094875
4754 -8094875 -5847021 -3642356 -3725046 -4597354 -3979592 -2813369 -3130019 -4304919 -4533876
4745 -4533876 -3899562 -3132595 -1586671 692538 1266409 -1202906 -3963155 -3901739 -2208258
4736 -2208258 -1982619 -3130686 -3270190 -2231483 -1967164 -2912134 -3811702 -4499394 -5744671
$$ packed form
4797a6771810M032135K685283J822430N96250k281421m226784k754370n03107
4789a7401394n69669n62334K533955N560571M153264Q15428O70177K426427J297264
4780a076311j846153k257742j81975P5612j473533r17190J560202J671965j176374
4771e621499l087355k713927k582782l235675k251738M98793K257887K329445
4763a4406851K510726K727824J331685o13259m88225Q90179O02480p06237N6803
4754h094875K247854K204665q2690q72308O17762J166223l16650j174900k28957
4745d533876O34314P66967J545924K279209N73871k469315k760249O1416J693481
4736b208258K25639j148067j39504J038707K64319r44970q99568o87692j245277
$$ plain form
4727 -5744671 -6858036 -6339156 -4602409 -3574834 -3951508 -5039848 -6704059 -9177364 -11484712
4718 -11484712 -12284100 -11880276 -11478237 -11063880 -10007045 -9061041 -9559120 -11030754 -11692902
4709 -11692902 -11070313 -10215771 -9466058 -7832182 -4881412 -1894280 -725314 -1984186 -4227517
4700 -4227517 -4878603 -2704885 600049 2526213 3332194 5534652 9546220 12356515 11564689
4691 11564689 8313303 4990710 2494844 1170316 1718705 3271190 3165749 766524
4683 766524 -1055162 -434732 388309 -811053 -2068497 -693330 1767673 2139369 1078496
4674 1078496 1494851 3121686 3381880 2648116 3690457 6170637 6625316 4347511 2537308
4665 2537308 2616622 2009038 -701164 -2619239 -1038152 2234418 3757216 3111826 2007009
$$ packed form
4727e744671j113365N18880J736747J027575l76674j088340j664211k473305k307348
4718a1484712p99388M03824M02039M14357J056835R46004m98079j471634o62148
4709a1692902O22589Q54542P49713J633876K950770K987132J168966j258872k243331
4700d227517o51086K173718L304934J926164Q05981K202458M011568K810295p91826
4691A1564689l251386l322593k495866j324528N48389J552485j05441k399225
4683G66524j821686O20430Q23041j199362j257444J375167K461003L71696j060873
4674A078496M16355J626835K60194p33764J042341K480180M54679k277805j810203
4665B537308P9314o07584k710202j918075J581087L272570J522798o45390j104817
$$ plain form
4656 2007009 823877 -1019869 -2482851 -1486983 2121528 6088539 8111099 7357993 4094178
4647 4094178 -512928 -4034354 -3795186 587210 6022956 8364954 6562400 3913390
4639 3913390 4339989 7683463 10017487 8829562 6140041 5386618 6800813 7768758 6900505
4630 6900505 5551653 5282616 5630852 5050924 3091132 1036836 567807 1719364 2261087
4621 2261087 -73401 -4534826 -7759022 -7780835 -6247388 -5778600 -6677970 -7470393 -7139709
4612 -7139709 -5347561 -1989096 1708823 3134953 1305936 -1463464 -2910706 -4170682
4604 -4170682 -7217784 -10638343 -11344989 -9561441 -8447813 -9028508 -9185596 -8064516 -7825975
4595 -7825975 -9789782 -11858052 -11442938 -8789718 -5872091 -3625924 -1516853 1409167
$$ packed form
4656B007009j183132j843746j462982R95868L608511L967011K022560p53106l263815
4647D094178m607106l521426K39168M382396N435746K341998j802554k649010
4639C913390M26599L343474K334024j187925k689521p53423J414195R67945q68253
4630F900505j348852k69037L48236n79928j959792k054296m69029J151557N41723
4621B261087k334488m461425l224196k1813J533447M68788q99370p92423L30684
4612g139709J792148L358465L697919J426130j829017k769400j447242j259976
4604d170682l047102l420559p06646J783548J113628n80695j57088J121080K38541
4595g825975j963807k068270M15114K653220K917627K246167K109071K926020
$$ plain form
4587 1409167 5756652 10702569 13358051 11088709 5154153 160263 -1045406 -228189
4579 -228189 -566151 -2420140 -3811201 -3815118 -3672170 -4852767 -7298041 -9735859 -11161198
4570 -11161198 -11731417 -12149612 -12448625 -12253950 -12419076 -14840159 -19458668 -22906059 -22083021
4561 -22083021 -18169860 -14968174 -13958030 -13357929 -11666753 -9503857 -7770879 -6414747
4553 -6414747 -5499638 -5464206 -5909134 -5986309 -6125566 -7314206 -8580280 -7613161 -4337107
4544 -4337107 -1475597 -879507 -1564267 -2118709 -2665800 -3333944 -2999772 -1020501 1367056
4535 1367056 2582061 2407432 1537793 856621 1496622 3829411 6129536 6399898 5796571
4526 5796571 7478695 11276553 12645551 8641141 2184328 -1821427 -2338935 -1741681 -1478612
$$ packed form
4587A409167M347485M945917K655482k269342n934556m993890j205669Q17217
4579b28189l37962j853989j391061l917J42948j180597k445274k437818j425339
4570a1161198n70219m18195k99013J94675j65126k421083m618509l447391Q23038
4561b2083021L913161L201686J010144O00101J691176K162896J732978J356132
4553f414747R15109L5432m44928p7175j39257j188640j266074R67119L276054
4544d337107K861510N96090o84760n54442n47091o68144L34172J979271K387557
4535A367056J215005j74629q69639o81172O40001K332789K300125K70362o03327
4526E796571J682124L797858J368998m004410o456813m005755n17508N97254K63069
$$ plain form
4517 -1478612 -1094708 -541803 -730815 -1942127 -3572876 -5354447 -7444415 -9517189 -10846580
4508 -10846580 -11091628 -10363882 -8959175 -7358383 -5746296 -3463016 -179050 2371913
4500 2371913 1683360 -2138180 -6370425 -9591858 -13026987 -16919873 -18587199 -16352170
4492 -16352170 -12971852 -12191540 -13432989 -12974112 -9616924 -6213901 -5584372 -7394740 -9525370
4483 -9525370 -10589498 -10314444 -8684424 -5746956 -2183329 337451 3318 -3247326 -7057373
4474 -7057373 -8963333 -9030968 -8799003 -8244453 -6145734 -3256483 -2105085 -3051638 -3584276
4465 -3584276 -2427575 -1023948 318071 3816459 9466922 12829016 10916480 6913184
4457 6913184 5075426 4048612 147202 -5064936 -6271482 -2685886 801404 1150206
$$ packed form
4517a478612L83904N52905j89012j211312j630749j781571k089968k072774j329391
4508a0846580k45048P27746J404707J600792J612087K283280L283966K550963
4500B371913o88553l821540m232245l221433l435129l892886j667326K235029
4492a6352170L380318P80312j241449M58877L357188L403023O29529j810368k130630
4483i525370j064128K75054J630020K937468L563627K520780l34133l250644l810047
4474g057373j905960o7635K31965N54550K098719K889251J151398r46553n32638
4465c584276J156701J403627J342019L498388N650463L362094j912536m003296
4457F913184j837758j026814l901410n212138j206546L585596L487290L48802
$$ plain form
4449 1150206 746735 2261530 4407747 4694178 2942224 267917 -2552671 -4198750 -3146445
4440 -3146445 -528314 44272 -2672482 -5375487 -4901149 -2809534 -2840526 -5469570 -7664580
4431 -7664580 -7266456 -5241024 -3700394 -3493971 -4018386 -4251501 -3567419 -1953803 400987
4422 400987 3526080 7139125 9903798 10317616 8613166 6711365 5835751 5223393 3800665
4413 3800665 2021008 997008 573501 -382452 -1845775 -2029441 397748 4059587 5833739
4404 5833739 4259246 1113449 -1026867 -1817218 -2394186 -2482012 -705779 2087264 2714941
4395 2714941 151216 -2535227 -2737384 -2282433 -3973163 -6254953 -5183051 -754788 2803205
4386 2803205 3160934 2417567 2685050 2852369 1531349 216039 1083963 3535762 5152839
$$ packed form
4449A150206m03471J514795K146217K86431j751954k674307k820588j646079J052305
4440c146445K618131N72586k716754k703005M74338K091615l0992k629044k195010
4431g664580L98124K025432J540630K06423n24415k33115O84082J613616K354790
4422D00987L125093L613045K764673M13818j704450j901801q75614o12358j422728
4413C800665j779657j024000m23507r55953j463323j83666K427189L661839J774152
4404E833739j574493l145797k140316p90351n76968q7826J776233K793043O27677
4395B714941k563725k686443k02157M54951j690730k281790J071902M428263L557993
4386B803205L57729p43367K67483J67319j321020j315310Q67924K451799J617077
$$ plain form
4377 5152839 4863474 3301058 1075304 -1444902 -3256399 -3340585 -2043848 -727976 -175814
4368 -175814 -110823 -20716 225143 316621 -424874 -2464866 -4983855 -5909463 -3947122 -617952
4358 -617952 457692 -3105592 -9766091 -15061148 -15799133 -13197820 -11205312 -11684209 -12387441
4349 -12387441 -10298740 -5764290 -2039824 -1458603 -3427914 -5821436 -6941982 -6154269
4341 -6154269 -3868924 -1339221 46948 -548014 -3288083 -7398155 -10820766 -11472980 -9624080
4332 -9624080 -7751890 -7213981 -6702120 -5163330 -4158610 -5217095 -6656632 -5821710 -3360158
4323 -3360158 -2373260 -3930082 -6208013 -7699440 -8505521 -8579280 -7362158 -5307982 -3498757
4314 -3498757 -1874565 -79578 516282 -1431979 -3724432 -2209570 3500284 8792071
$$ packed form
4377E152839k89365j562416k225754k520206j811497q4186J296737J315872N52162
4368a75814O4991R0107K45859R1478p41495k039992k518989r25608J962341L329170
4358f17952J075644l563284o660499n295057p37985K601313J992508m78897p03232
4349a2387441K088701M534450L724466N81221j969311k393522j120546P87713
4341f154269K285345K529703J386169n94962k740069m110072l422611o52214J848900
4332i624080J872190N37909N11861J538790J004720j058485j439537Q34922K461552
4323c360158R86898j556822k277931j491427q06081p3759J217122K054176J809225
4314c498757J624192J794987N95860j948261k292453J514862N709854N291787
$$ plain form
4306 8792071 9345826 5309239 -230568 -4373364 -5468572 -3673198 -1385278 -1222940 -3193280
4297 -3193280 -5524140 -7616987 -9619574 -10066674 -7628838 -4653979 -4554967 -5634318 -2604445
4288 -2604445 4686766 9432098 7129150 1811360 -189419 1465692 2852784 2396292
4280 2396292 1475242 631919 -729476 -1945857 -1609584 143843 1976116 2985995 2500642
4271 2500642 -78926 -3559173 -4974621 -3138749 -411644 560729 -222399 -1780367 -4029901
4262 -4029901 -6208550 -6281450 -4135089 -2682894 -3603618 -4893627 -5042039 -6291191 -10468312
4253 -10468312 -14554889 -14310003 -10226265 -6234331 -4251309 -3532607 -3907917 -6109283 -9658546
4244 -9658546 -13039336 -15113063 -14800265 -11385699 -6848084 -5086244 -6620008 -7162258 -3952176
$$ packed form
4306H792071N53755m036587n539807m142796j095208J795374K287920J62338j970340
4297c193280k330860k092847k002587m47100K437836K974859R9012j079351L029873
4288b604445P291211M745332k302948n317790k000779J655111J387092m56492
4280B396292r21050q43323j361395j216381L36273J753427J832273J009879m85353
4271B500642k579568l480247j415448J835872K727105R72373p83128j557968k249534
4262d029901k178649p2900K146361J452195r20724j290009j48412j249152m177121
4253a0468312m086577K44886M083738L991934J983022P18702l75310k201366l549263
4244i658546l380790k073727L12798L414566M537615J761840j533764n42250L210082
$$ plain form
4235 -3952176 65997 1435214 1635069 3395308 5234358 4281638 1485757 -650023 -2771690
4226 -2771690 -6577694 -10747597 -13359963 -15436645 -17801511 -18003086 -15049673 -13012305
4218 -13012305 -14454651 -14860706 -10052108 -4404216 -4036921 -6359868 -5217428 -2443762
4210 -2443762 -4367989 -9837769 -12244638 -11412673 -12876734 -17004875 -19644794 -21923080
4202 -21923080 -27936797 -34322615 -34461240 -31366147 -32848355 -36028169 -32692092 -27998586
4194 -27998586 -34157315 -46453863 -50607517 -56527389 -91854617 -147402701 -163177974 -99234892
4186 -99234892 2034985 60057337 50567212 20285325 13322633 22977500 23764041 14445394
4178 14445394 9083736 9247060 7435094 4952786 7835834 13037364 13335592 10048043
$$ packed form
4235c952176M018173J369217J99855J760239J839050r52720k795881k135780k121667
4226b771690l806004m169903k612366k076682k364866k01575K953413K037368
4218a3012305j442346m06055M808598N647892L67295k322947J142440K773666
4210b443762j924227n469780k406869Q31965j464061m128141k639919k278286
4202b1923080o013717o385818j38625L095093j482208l179814L336077M693506
4194b7998586o158729j2296548m153654n919872l5327228n5548084j5775273O3943082
4186i9234892J01269877N8022352r490125l0281887o962692R654867P86541r318647
4178A4445394n361658J63324j811966k482308K883048N201530K98228l287549
$$ plain form
4170 10048043 9008652 9354172 7023392 4570807 7183330 12401830 13141014 8634919
4162 8634919 4526699 4083418 6095410 9440218 13486316 15768897 14733214 12933068
4154 12933068 12861281 12250195 8364764 4007720 3787567 6803035 8435437 7390431 5767772
4145 5767772 4021569 1060302 -2113376 -3707795 -4707998 -6695645 -7794472 -5357975
4137 -5357975 -983252 1833746 3275300 5517017 7276397 5565188 1687559 -104058
4129 -104058 834752 1865491 3203146 7569681 13593289 15839670 12652106 8332607 6009523
4120 6009523 3867420 602279 -761195 2238734 6968238 9461125 9507040 8899789 7540410
4111 7540410 4625180 1514792 126936 -110921 -889579 -1751765 -883131 1473069 2800935
$$ packed form
4170A0048043j039391L45520k330780k452585K612523N218500P39184m506095
4162H634919m108220m43281K011992L344808M046098K282581j035683j800146
4154A2933068p1787o11086l885431m357044k20153L015468J632402j045006j622659
4145E767772j746203k961267l173678j594419j000203j987647j098827K436497
4137e357975M374723K816998J441554K241717J759380j711209l877629j791617
4129a04058R38810J030739J337655M366535O023608K246381l187564m319499k323084
4120F009523k142103l265141j363474K999929M729504K492887M5915o07251j359379
4111G540410k915230l110388j387856k37857p78658q62186Q68634K356200J327866
$$ plain form
4102 2800935 1502050 -1337051 -3429723 -3454045 -1747960 361813 1738784 2076215 1423692
4093 1423692 -266558 -2414458 -3409033 -2284997 -375810 99027 -1322192 -3476323 -5555254
4084 -5555254 -7166709 -7402829 -6242647 -5974925 -8240821 -10384994 -8432120 -3418752 -369242
4075 -369242 -472240 646119 4981153 7674854 4082584 -2833810 -6704261 -6356856 -5303453
4066 -5303453 -4716334 -2499170 1080897 2238029 -580302 -3814866 -3489538 -19749 3275282
4057 3275282 4298105 3306589 1579384 339138 -29653 -528525 -2443580 -5436804 -7884118
4048 -7884118 -9079308 -9467956 -8740919 -6080261 -2986788 -3174832 -7771275 -12614748 -12825213
4039 -12825213 -8987197 -6227434 -7542141 -10661998 -11937454 -10813083 -9028224 -7214571
$$ packed form
4102B800935j298885k839101k092672k4322J706085K109773J376971L37431o52523
4093A423692j690250k147900r94575J124036J909187M74837j421219k154131k078931
4084e555254j611455k36120J160182K67722k265896k144173J952874N013368L049510
4075c69242j02998J118359M335034K693701l592270o916394l870451L47405J053403
4066e303453N87119K217164L580067J157132k818331l234564L25328L469789L295031
4057C275282J022823r91516j727205j240246l68791m98872j915055k993224k447314
4048g884118j195190l88648P27037K660658L093473j88044m596443m843473k10465
4039a2825213L838016K759763j314707l119857j275456J124371J784859J813653
$$ plain form
4031 -7214571 -4500520 -946380 1695802 2017287 281269 -2793254 -7118678 -12067848
4023 -12067848 -15431311 -15209606 -12023661 -8226948 -4885126 -1354075 2167293 3851861
4015 3851861 2855110 770342 -873285 -2850079 -6128645 -8963944 -8665508 -5765046 -3777723
4006 -3777723 -4476586 -5757811 -5102598 -3100847 -1982382 -1991620 -1105736 1945236 5773827
3997 5773827 7660284 6173303 2528539 -292851 -168109 1883070 2497450 -184781 -3902175
3988 -3902175 -4650536 -1613423 1749334 2217819 1008510 1811529 5282594 7768636 6163851
3979 6163851 1974075 -1107056 -2181528 -3280173 -5137467 -5771273 -3973816 -1675151
3971 -1675151 -1314480 -2693858 -4094397 -4907843 -5201340 -4067199 -907439 2327161 2736452
$$ packed form
4031g214571K714051L554140K642182L21485j736018l074523m325424m949170
4023a2067848l363463K21705L185945L796713L341822L531051L521368J684568
4015C851861r96751k084768j643627j976794l278566k835299K98436K900462J987323
4006c777723o98863j281225O55213K001751J118465r238Q85884L050972L828591
3997E773827J886457j486981l644764k821390J24742K051179O14380k682231l717394
3988c902175p48361L037113L362757M68485j209309Q03019L471065K486042j604785
3979F163851m189776l081131j074472j098645j857294o33806J797457K298665
3971a675151L60671j379378j400539q13446k93497J134141L159760L234600M09291
$$ plain form
3962 2736452 276000 -2194891 -2687470 -1756355 -316036 1746627 4103188 5470169 5749658
3953 5749658 6757379 9473576 12228090 13084230 12570735 12428298 12853940 12730533 11662627
3944 11662627 9978769 7360206 3326812 -1181988 -4433993 -6101437 -7281755 -8175360
3936 -8175360 -7273645 -3480783 1981059 6474710 8243751 7447288 5397570 3225361 1264105
3927 1264105 -369570 -921093 481625 3132356 4542403 2965058 -380075 -2750443
3919 -2750443 -3283323 -3640941 -5123123 -6526540 -5731148 -2625117 621254 2062978 1842776
3910 1842776 1208980 407837 -1433831 -4278340 -6182067 -5260543 -2069678 1026341 2451953
3901 2451953 2186199 465542 -2335876 -4472958 -3822382 -1033454 496810 -732497 -1756387
$$ packed form
3962B736452k460452k470891m92579R31115J440319K062663K356561J366981K79489
3953E749658J007721K716197K754514Q56140n13495j42437M25642j23407j067906
3944A1662627j683858k618563m033394m508800l252005j667444j180318q93605
3936h175360R01715L792862N461842M493651J769041p96463k049718k172209j961256
3927A264105j633675n51523J402718K650731J410047j577345l345133k370368
3919b750443n32880l57618j482182j403417P95392L106031L246371J441724k20202
3910A842776o33796q01143j841668k844509j903727R21524L190865L096019J425612
3901B451953k65754j720657k801418k137082O50576K788928J530264j229307j023890
$$ plain form
3892 -1756387 698934 5199772 7441802 6110392 3998016 3539589 4074655 3944574 2816344
3883 2816344 1119099 -796153 -2047029 -1514325 325804 1344211 397981 -1314250 -2325949
3874 -2325949 -2969834 -4425145 -6835919 -9305821 -10858716 -10710488 -8558079 -5255605 -2262728
3865 -2262728 72639 2587989 5269505 6602522 5665327 3361441 620222 -3079474
3857 -3079474 -8101779 -12960855 -15786987 -16447123 -15778429 -13886165 -11010874 -9094190 -10122958
3848 -10122958 -12981214 -13969399 -10939833 -5590137 -1285705 303127 19522 -491515 -883911
3839 -883911 -2647904 -7169509 -12961482 -15932317 -13635383 -8433095 -4799210 -3975771 -3254796
3830 -3254796 -437996 3334000 5908835 7041996 7431716 6528708 3584122 201445 -669259
$$ packed form
3892a756387K455321M500838K242030j331410k112376m58427N35066j30081j128230
3883B816344j697245j915252j250876N32704J840129J018407r46230j712231j011699
3874b325949o43885j455311k410774k469902j552895J48228K152409L302474K992877
3865b262728K335367K515350K681516J333017r37195k303886k741219l699696
3857c079474n022305m859076k826132o60136O68694J892264K875291J916684j028768
3848a0122958k858256r88185L029566N349696M304432J588832k83605n11037l92396
3839h83911j763993m521605n791973k970835K296934N202288L633885Q23439P20975
3830c254796K816800L771996K574835J133161L89720r03008k944586l382677q70704
$$ plain form
3821 -669259 1155766 1961598 -1552893 -8046703 -13272807 -15357780 -16216530 -17495205 -17519577
3812 -17519577 -13905760 -7596041 -2025282 1010498 2337780 2657625 1656053 361490
3804 361490 1376984 5007165 7427172 5067020 -552682 -4679067 -5097276 -3694441 -2780678
3795 -2780678 -2378766 -1499893 -46147 1412327 2526932 3181095 3404465 3602872 4211545
3786 4211545 4998154 5260770 4593054 2955345 477419 -2086633 -3394354 -3034454 -2312456
3777 -2312456 -2281414 -1787413 802739 4452989 6105775 4525141 1582986 -588734 -1908799
3768 -1908799 -3233118 -4509738 -4828938 -3292278 448119 5356354 8748836 8555705 6095261
3759 6095261 4714363 5216612 4862644 1911349 -1246242 -1437201 624925 1524899 46647
$$ packed form
3821f69259J825025Q05832l514491o493810n226104k084973q58750j278675k4372
3812a7519577L613817O309719N570759L035780J327282L19845j001572j294563
3804C61490J015494L630181K420007k360152n619702m126385m18209J402835R13763
3795b780678M01912Q78873J453746J458474J114605O54163K23370J98407O08673
3786D211545P86609K62616o67716j637709k477926k564052j307721L59900P21998
3777b312456L1042M94001K590152L650250J652786j580634k942155k171720j320065
3768a908799j324319j276620l19200J536660L740397M908235L392482j93131k460444
3759F095261j380898N02249l53968k951295l157591j90959K062126Q99974j478252
$$ plain form
3750 46647 -1690302 -1802160 -899555 -245662 225093 787563 235105 -2945932 -8017653
3741 -8017653 -12070509 -13035588 -11649223 -9871848 -8297497 -6268539 -3980326 -2712164
3733 -2712164 -2629754 -2065990 -22595 1990993 2046790 700159 155967 1216735 2760931
3724 2760931 3814156 4444405 4883221 5324621 6159051 6741061 4708863 -1067453 -7325581
3715 -7325581 -9149681 -6109949 -2726621 -2255488 -3233626 -3359098 -3304456 -4336287 -5005399
3706 -5005399 -3258900 -5760 2408952 3983811 6360268 9166027 9968886 7671249
3698 7671249 3524855 -1043040 -5210551 -7412997 -5885151 -1434887 2266325 2341987 -417780
3689 -417780 -3107658 -4181985 -4533513 -5607445 -7274181 -7887523 -6427129 -4121860 -3182899
$$ packed form
3750D6647j736949j11858R02605O53893M70755N62470n52458l181037n071721
3741h017653m052856r65079J386365J777375J574351K028958K288213J268162
3733b712164Q2410N63764K043395K013588N5797j346631n44192J060768J544196
3724B760931J053225O30249M38816M41400Q34430N82010k032198n776316o258128
3715g325581j824100L039732L383328M71133r78138j25472N4642j031831o69112
3706e005399J746499L253140K414712J574859K376457K805759Q02859k297637
3698G671249m146394m567895m167511k202446J527846M450264L701212P5662k759767
3689d17780k689878j074327l51528j073932j666736o13342J460394K305269R38961
$$ plain form
3680 -3182899 -4064524 -5179896 -5501454 -5772892 -6320596 -5467318 -1807773 3104483 6167844
3671 6167844 6186573 4418612 2399600 811457 -99339 -647388 -1908685 -4408792 -7059682
3662 -7059682 -8622264 -9413609 -10138514 -10173857 -9085008 -8849108 -11775213 -16355169 -18013548
3653 -18013548 -14690824 -9406843 -6240804 -5566390 -4631209 -1833320 953233 435099 -4035316
3644 -4035316 -8894988 -9805386 -6698033 -3645112 -2992686 -2198806 1400889 5364559 5420578
3635 5420578 2319271 795229 2047717 2141831 -1176997 -4761876 -5204625 -3673364 -2836681
3626 -2836681 -2221127 57202 3198391 4680359 3935297 2265864 314439 -1677874 -2172316
3617 -2172316 147504 3545963 4571162 2283728 -952443 -2913212 -3703561 -4233069 -4366672
$$ packed form
3680c182899q81625j115372l21558k71438n47704Q53278L659545M912256L063361
3671F167844J8729j767961k019012j588143r10796n48049j261297k500107k650890
3662g059682j562582p91345p24905l5343J088849K35900k926105m579956j658379
3653a8013548L322724N283981L166039O74414R35181K797889K786553n18134m470415
3644d035316m859672r10398L107353L052921O52426P93880L599695L963670N6019
3635E420578l101307j524042J252488R4114l318828l584879m42749J531261Q36683
3626b836681O15554K278329L141189J481968p45062j669433j951425j992313m94442
3617b172316K319820L398459J025199k287434l236171j960769p90349n29508j33603
$$ plain form
3608 -4366672 -3344985 -962165 2203052 5084295 6534053 6077155 4365145 2567612
3600 2567612 1530040 1637277 2662799 3256396 1640772 -2175056 -5648949 -6286899 -4491895
3591 -4491895 -2898161 -3306396 -5083938 -6116815 -4647172 -809366 2914774 3507796 563874
3582 563874 -2958165 -3803221 -1524545 1955525 4645142 5448115 4161219 1860260 352745
3573 352745 59134 -576063 -2494911 -4256520 -4365798 -3909833 -4825526 -6664044 -7380722
3564 -7380722 -6589104 -5657698 -5047413 -3999092 -2767954 -2850353 -4784095 -7643846 -10704793
3555 -10704793 -13618675 -15079246 -13718031 -10670045 -8974903 -9800550 -11193025 -11030082
3547 -11030082 -9216205 -6546657 -3681106 -1956102 -2858152 -5569085 -7139502 -6321281
$$ packed form
3608d366672J021687K382820L165217K881243J449758m56898j712010j797533
3600B567612j037572J07237J025522N93597j615624l815828l473893o37950J795004
3591d491895J593734m08235j777542j032877J469643L837806L724140N93022k943922
3582E63874l522039q45056K278676L480070K689617Q02973j286896k300959j507515
3573C52745k93611o35197j918848j761609j09278M55965r15693j838518p16678
3564g380722P91618R31406O10285J048321J231138q2399j933742k859751l060947
3555a0704793k913882j460571J361215L047986J695142q25647j392475J62943
3547a1030082J813877K669548K865551J725004r02050k710933j570417Q18221
$$ plain form
3539 -6321281 -5261646 -6175571 -8397257 -10138494 -11009541 -11014395 -9205713 -5733055 -3553654
3530 -3553654 -5400139 -10022672 -13845695 -15436750 -15870826 -15565974 -13706615 -10585737 -7696581
3521 -7696581 -5313388 -2544348 46953 721155 22429 877867 3930720 5756163 3901922
3512 3901922 1220291 2225179 6630383 9679362 8369978 4436960 1155479 -9460
3504 -9460 940978 3442321 5592929 4738228 718071 -2960432 -3112202 -927906 6062
3495 6062 -1075305 -1347889 1159933 4796353 6762062 6385234 4706665 2403004 -186281
3486 -186281 -1908807 -1545139 402837 2026759 2182536 1340893 383915 -248589 -106786
3477 -106786 1244605 3134225 3759751 2223496 83742 -84795 2363035 5300699 6034929
$$ packed form
3539f321281J059635r13925k221686j741237q71047m854J808682L472658K179401
3530c553654j846485m622533l823023j591055m34076L04852J859359L120878K889156
3521g696581K383193K769040K591301O74202o98726Q55438L052853J825443j854241
3512C901922k681631J004888M405204L048979j309384l933018l281481j164939
3504i460R50438K501343K150608q54701m020157l678503j51770K184296R33968
3495F062j081367k72584K507822L636420J965709l76828j678569k303661k589285
3486a86281j722526L63668J947976J623922J55777q41643r56978o32504J41803
3477a06786J351391J889620O25526j536255k139754j68537K447830K937664P34230
$$ plain form
3468 6034929 3875631 337995 -2749274 -4784896 -6083186 -6743033 -6549748 -5825686 -5389818
3459 -5389818 -5213264 -4000492 -1130626 1471765 852132 -3269286 -7521203 -8425741 -6135093
3450 -6135093 -3651805 -2889384 -2915036 -2245993 -1420689 -2171512 -4717268 -7247018 -8195031
3441 -8195031 -7897015 -7522250 -7352227 -6955669 -6304948 -5518799 -3861973 -432062 3922925
3432 3922925 6625186 5979706 3053335 486363 115740 2100994 5389255 8232058 8966334
3423 8966334 7276503 4480577 2098205 594051 -164076 -227900 -200238 -1519440 -4690819
3414 -4690819 -7751964 -8043987 -5498258 -2845824 -2368466 -3577379 -4435494 -3869295 -2522219
3405 -2522219 -1702949 -2223714 -4055975 -6636579 -9173408 -10518313 -9332873 -5560925 -1800347
$$ packed form
3468F034929k159298l537636l087269k035622j298290o59847J93285P24062M35868
3459e389818J76554J212772K869866K602391o19633m121418m251917r04538K290648
3450f135093K483288P62421k5652O69043Q25304p50823k545756k529750r48013
3441h195031K98016L74765J70023L96558O50721P86149J656826L429911M354987
3432C922925K702261o45480k926371k566972l70623J985254L288261K842803P34276
3423H966334j689831k795926k382372j504154p58127o3824K7662j319202l171379
3414d690819l061145k92023K545729K652434M77358j208913q58115N66199J347076
3405b522219Q19270n20765j832261k580604k536829j344905J185440L771948L760578
$$ plain form
3396 -1800347 -1533533 -4983018 -8176567 -7616863 -4596794 -2969980 -3813821 -4912947 -4945997
3387 -4945997 -5082851 -6044292 -6538310 -5746405 -4864665 -4715193 -3982280 -1521545 1430491
3378 1430491 3228066 4398133 6191354 7910769 8056477 7251009 7483552 8720516 8745032
3369 8745032 6673955 4387947 3551651 2916941 -32822 -5475391 -10402320 -11400958 -7951417
3360 -7951417 -2936524 204128 814216 1010604 2268013 3274757 2206479 -79823 -1068657
3351 -1068657 -343276 -58675 -1310986 -2272780 -1174689 549982 -119207 -3831372 -8150854
3342 -8150854 -10481924 -10304531 -8623603 -6653635 -5437705 -5622672 -6865196 -8007371 -8355521
3333 -8355521 -8355368 -8591315 -8614316 -7418001 -4944276 -2592329 -2079904 -3815910 -6226859
$$ packed form
3396a800347K66814l449485l193549N59704L020069J626814q43841j099126l3050
3387d945997j36854r61441m94018P91905Q81740J49472P32913K460735K952036
3378A430491J797575J170067J793221J719415J45708q05468K32543J236964K4516
3369H745032k071077k286008q36296o34710k949763n442569m926929r98638L449541
3360g951417N014893L140652O10088J96388J257409J006744j068278k286302r88834
3351a068657P25381K84601j252311r61794J098091J724671o69189l712165m319482
3342h150854k331070J77393J680928J969968J215930j84967j242524j142175l48150
3333h355521J53k35947k3001J196315K473725K351947N12425j736006k410949
$$ plain form
3324 -6226859 -6812378 -4515501 -1229886 -100994 -1814115 -3580182 -2786465 -542824 169485
3315 169485 -846365 -713827 1892485 4459359 4215738 1816566 -321780 -1597980 -2956309
3306 -2956309 -4304201 -4621863 -3995597 -3268141 -2093705 370230 3059595 3699178 2075229
3297 2075229 377876 -37845 -30680 -385585 -472363 -1110 59363 -586425 -585576 982444
3287 982444 3208660 4982834 6227964 6553111 4757649 1075347 -2043132 -3017047 -3178902
3278 -3178902 -3984935 -4116142 -1689624 2113544 4221371 3650109 2028298 843318 407865
3269 407865 1047247 3014458 5263220 6144323 5337547 3765509 2059566 521534 -144539
3260 -144539 232919 354452 -746040 -1742738 -847198 1252137 2581697 3242234 4888374
$$ packed form
3324f226859n85519K296877L285615J128892j713121j766067P93717K243641P12309
3315A69485j015850J32538K606312K566874k43621k399172k138346j276200j358329
3306b956309j347892l17662O26266P27456J174436K463935K689365O39583j623949
3297B075229j697353m15721P165l54905q6778M71253O0473o45788Q49J568020
3287I82444K226216J774174J245130L25147j795462l682302l118479r73915j61855
3278c178902q06033j31207K426518L803168K107827n71262j621811j184980m35453
3269D07865O39382J967211K248762Q81103q06776j572038j705943j538032o66073
3260a44539L77458J21533j100492r96698Q95540K099335J329560O60537J646140
$$ plain form
3251 4888374 7303904 8432777 7815022 7034196 6439971 4471422 1025244 -1425119 -1333526
3242 -1333526 -237023 -99912 -755335 -1374662 -2363249 -4200972 -6144273 -7588072 -9177078
3233 -9177078 -11177833 -12184091 -10769401 -7260581 -3052655 383301 1365278 -822753
3225 -822753 -3695633 -3191736 931672 4086152 3240730 1278819 1926403 3127322 -155253
3216 -155253 -7943986 -14698700 -16662623 -15523430 -14064866 -12156648 -8842582 -5391300
3208 -5391300 -3848725 -4019204 -3654499 -965893 3733488 7953558 8486699 4530343 -435077
3199 -435077 -1857646 329961 1637506 -636580 -3611364 -3200383 -2659 1859278 473509
3190 473509 -2166121 -3813192 -4625816 -5682324 -6855850 -7127993 -6003195 -4018764 -2414933
$$ packed form
3251D888374K415530J128873o17755p80826n94225j968549l446178k450363R1593
3242a333526J096503J37111o55423o19327r88587j837723j943301j443799j589006
3233i177078k000755j006258J414690L508820M207926L435956R81977k188031
3225h22753k872880N03897M123408L154480q45422j961911O47584J200919l282575
3216a55253p788733o754714j963923J139193J458564J908218L314066L451282
3208e391300J542575j70479L64705K688606M699381M220070N33141l956356m965420
3199d35077j422569K187607J307545k274086k974784M10981L197724J861937j385769
3190D73509k639630j647071q12624j056508j173526k72143J124798J984431J603831
$$ plain form
3181 -2414933 -2357094 -3869265 -5739227 -7112157 -8521287 -10241304 -10506580 -7370850 -2099620
3172 -2099620 1594245 2137752 1691849 2324353 2938598 1613373 -1043626 -3139526 -4687050
3163 -4687050 -6979075 -9457636 -9759992 -6876111 -2218021 2374843 5688586 6430689 4001204
3154 4001204 314559 -1595609 -1402063 -1515284 -2698022 -2645991 -344077 1281939 -493982
3145 -493982 -3944076 -5710220 -5813234 -6430017 -7218869 -5891750 -2964935 -1872627 -3746569
3136 -3746569 -5577070 -4714372 -2265510 -588931 124842 1121191 2783616 4604605 6108522
3127 6108522 6687805 5752212 3794055 1978783 303131 -1990269 -3757848 -2263840 2618023
3118 2618023 6943333 7330163 5241306 4759649 7592987 12031494 15400198 15816354 13018931
$$ packed form
3181b414933N7839j512171j869962j372930j409130j720017k65276L135730N271230
3172b099620L693865N43507m45903O32504O14245j325225k656999k095900j547524
3163d687050k292025k478561l02356K883881M658090M592864L313743P42103k429485
3154D001204l686645j910168J93546j13221j182738N2031K301914J626016j775921
3145d93982l450094j766144j03014o16783p88852J327119K926815J092308j873942
3136c746569j830501Q62698K448862J676579P13773R96349J662425J820989J503917
3127F108522N79283r35593j958157j815272j675652k293400j767579J494008M881863
3118B618023M325310L86830k088857m81657K833338M438507L368704M16156k797423
$$ plain form
3109 13018931 9284461 8029051 9646312 10409752 7580670 3595306 2318961 2963758
3101 2963758 1481307 -2943374 -6833695 -7750245 -6654718 -4366184 214120 6549352
3093 6549352 10546121 8802360 2754634 -3506383 -7736452 -9840413 -9645015 -7261858
3085 -7261858 -4807504 -4918039 -7363722 -9150790 -8274237 -5717934 -3451433 -2155074 -1654261
3076 -1654261 -2105245 -3504102 -4937190 -5720795 -6825291 -9601196 -13004789 -13760471 -10133404
3067 -10133404 -4233692 624858 3641129 5850948 6807007 4737730 175515 -3437967
3059 -3437967 -3952155 -2975223 -2687752 -2515520 -1071297 635010 703501 -232709 27426
3050 27426 1614002 2700718 2757102 2841273 2890331 1687445 -350727 -1343466 -1326920 -2439770
$$ packed form
3109A3018931l734470j255410J617261P63440k829082l985364j276345O44797
3101B963758j482451m424681l890321r16550J095527K288534M580304O335232
3093F549352L996769j743761o047726o261017m230069k103961J95398K383157
3085g261858K454354j10535k445683j787068Q76553K556303K266501J296359N00813
3076a654261m50984j398857j433088p83605j104496k775905l403593p55682L627067
3067a0133404N899712M858550L016271K209819R56059k069277m562215l613482
3059c437967n14188R76932K87471J72232J444223J706307O8491r36210K60135
3050B7426J586576J086716N6384Q4171M9058j202886k038172r92739J6546j112850
$$ plain form
3040 -2439770 -4964809 -6284364 -5090791 -3714814 -4466592 -6197097 -6514147 -5147716 -2914042
3031 -2914042 504857 5042840 8148473 7235682 3512590 763221 738792 2051368 3198106
3022 3198106 4184687 5065039 5142471 4170767 2745258 1195219 -450993 -1290434 -26856
3013 -26856 2951499 5512216 6409287 6670218 7680072 9032429 9098983 6868029 2455762
3004 2455762 -3413590 -9465040 -13842057 -15085781 -13415358 -10605868 -8356364 -6920811
2996 -6920811 -5497919 -3813225 -2793817 -3244686 -4240791 -3822378 -1554593 532396 287098
2987 287098 -1837501 -3252628 -2271578 -8087 867458 -993250 -4041716 -5301921 -3723814
2978 -3723814 -1659571 -2081136 -4644098 -6119394 -5008815 -3735417 -5014550 -7742193
$$ packed form
3040b439770k525039j319555J193573J375977p51778j730505l17050J366431K233674
3031b914042L418899M537983L105633r12791l723092k749369k4429J312576J146738
3022C198106R86581Q80352P7432r71704j425509j550039j646212q39441J263578
3013b6856K978355K560717Q97071K60931J009854J352357O6554k230954m412267
3004B455762n869352o051450m377017j243724J670423K809490K249504J435553
2996f920811J422892J684694J019408m50869r96105M18413K267785K086989k45298
2987B87098k124599j415127R81050K263491Q75545j860708l048466j260205J578107
2978c723814K064243m21565k562962j475296J110579J273398j279133k727643
$$ plain form
2970 -7742193 -8435515 -5844954 -2165338 -58235 -225879 -1760546 -3291894 -3802928 -3645021
2961 -3645021 -4532890 -7144254 -9182501 -7747510 -3508887 -301593 -173314 -1113269 -667228
2952 -667228 392497 -259077 -2702016 -4767143 -5196708 -4899242 -5072775 -5634312 -5949971
2943 -5949971 -6073175 -6551407 -7363183 -7591941 -6329359 -3828036 -1458916 -232912 360495
2934 360495 1475822 3076030 3825616 2873176 800894 -1447807 -3531917 -5063156 -5074844
2925 -5074844 -3145900 -380981 1760533 3100423 4094571 4017935 1423265 -3256955 -7076183
2916 -7076183 -7684082 -6310408 -6274524 -8610102 -10619663 -9513381 -6348333 -4813580 -6369658
2907 -6369658 -8407795 -7949784 -5611183 -4370846 -5321636 -6569665 -6222145 -4603291 -3082742
$$ packed form
2970g742193o93322K590561L679616K107103j67644j534667j531348n11034J57907
2961c645021q87869k611364k038247J434991M238623L207294J28279r39955M46041
2952f67228J059725o51574k442939k065127m29565K97466j73533n61537l15659
2943e949971j23204m78232q11776k28758J262582K501323K369120J226004N93407
2934C60495J115327J600208P49586r52440k072282k248701k084110j531239j1688
2925e074844J928944K764919K141514J339890R94148p6636k594670m680220l819228
2916g076183o07899J373674L5884k335578k009561J106282L165048J534753j556078
2907f369658k038137M58011K338601J240337r50790j248029L47520J618854J520549
$$ plain form
2898 -3082742 -2363937 -2713471 -4390592 -6658768 -7507002 -5787612 -2954625 -1310234 -1056113
2889 -1056113 -617239 387581 369290 -1537102 -3619413 -3623204 -1750836 -264306 -343075
2880 -343075 -713611 112623 1328452 822412 -1482600 -2747864 -657569 3081006 4255003
2871 4255003 1271378 -2777903 -3975240 -2194332 -463122 -585238 -1342560 -1065796 -30519
2862 -30519 583122 656768 735466 544523 -604881 -2256175 -3103756 -2975640 -3231555 -4701429
2852 -4701429 -6303544 -6524021 -5564831 -5068471 -5982884 -7500823 -8029079 -6564256 -3222000
2843 -3222000 813475 3685856 3884623 1374899 -2363666 -5498279 -6984178 -6880011 -6050368
2834 -6050368 -5456121 -5241613 -4650016 -3342918 -2386358 -2901707 -3976070 -3443604 -1133462
$$ packed form
2898c082742P18805l49534j677121k268176q48234J719390K832987J644391K54121
2889a056113M38874J004820j8291j906392k082311l791J872368J486530p8769
2880c43075l70536Q26234J215829n06040k305012j265264K090295L738575J173997
2871D255003k983625m049281j197337J780908J731210j22116p57322K76764J035277
2862c0519O13641P3646P8698j90943j149404j651294q47581J28116k55915j469874
2852d701429j602115k20477R59190M96360r14413j517939n28256J464823L342256
2843c222000M035475K872381J98767k509724l738565l134613j485899J04167Q29643
2834f050368N94247K14508N91597J307098R56560n15349j074363N32466K310142
$$ plain form
2825 -1133462 241591 -1549900 -5240631 -7708288 -7733258 -6682058 -6071334 -6016810 -5891021
2816 -5891021 -5146604 -3559822 -1809246 -1520872 -3348802 -5241472 -4287551 -413754 3354899
2807 3354899 4531604 3382967 1245840 -1285511 -3595291 -4472977 -3793275 -3255937 -3863078
2798 -3863078 -3989264 -1763981 1789307 4190212 5367631 7575331 11318692 13680668
2790 13680668 11631241 5549803 -1357802 -6017525 -7181587 -5353994 -2176841 520254
2782 520254 1839683 1953693 1107057 -843401 -3550773 -5550695 -5317764 -2972700 -599380
2773 -599380 -594415 -3329480 -6328799 -6467396 -3630477 -1418066 -2987101 -6776747 -8206869
2764 -8206869 -5650868 -2576408 -2899636 -6181506 -8952812 -9261100 -7917993 -6216111 -4689466
$$ packed form
2825a133462J375053j791491l690731k467657k4970J051200O10724N4524J25789
2816e891021P44417J586782J750576K88374j827930j892670R53921L873797L768653
2807C354899J176705j148637k137127k531351k309780q77686O79702N37338o07141
2798c863078j26186K225283L553288K400905J177419K207700L743361K361976
2790A3680668k049427o081438o907605m659723j164062J827593L177153K697095
2782E20254J319429J14010q46636j950458k707372j999922K32931K345064K373320
2773e99380M965k735065k999319j38597K836919K212411j569035l789646j430122
2764h206869K556001L074460l23228l281870k771306l08288J343107J701882J526645
$$ plain form
2755 -4689466 -3939144 -4590651 -6042169 -6784702 -6283601 -5207988 -3769178 -1643697 104444
2746 104444 -752938 -4246493 -7014491 -6304386 -3710100 -2713765 -3586697 -3546427 -1749629
2737 -1749629 -931118 -2947351 -5416467 -5053187 -2730221 -2461855 -5634424 -8760917 -7802794
2728 -7802794 -3093827 1239122 1946052 -366959 -2619222 -2665837 -1182060 -672972 -2860709
2719 -2860709 -6927202 -10303227 -11191408 -10048843 -8417825 -6824643 -4654003 -2006907
2711 -2006907 -469523 -1204884 -3051376 -3800340 -3100391 -2536451 -2534588 -1028710 3460077
2702 3460077 8730170 10812338 8499019 4186515 494141 -1944263 -3275483 -3373708 -2817228
2693 -2817228 -2828469 -3057335 -1387032 2527078 5474344 4572743 1348338 -640358 -1067044
$$ packed form
2755d689466P50322o51507j451518p42533N01101J075613J438810K125481J748141
2746A04444q57382l493555k767998P10105K594286R96335q72932M0270J796798
2737a749629Q18511k016233k469116L63280K322966K68366l172569l126493R58123
2728g802794M708967M332949P06930k313011k252263m6615J483777N09088k187737
2719b860709m066493l376025q88181J142565J631018J593182K170640K647096
2711b006907J537384p35361j846492p48964O99949N63940J863J505878M488787
2702C460077N270093K082168k313319m312504l692374k438404j331220r8225N56480
2693b817228j1241k28866J670303L914110K947266r01601l224405j988696m26686
$$ plain form
2684 -1067044 -2612592 -5846079 -7639670 -5456571 -665051 3418518 4784348 3308723
2676 3308723 294371 -1547969 140035 4162720 6171095 3845469 85242 -598732
2668 -598732 2599416 6783902 9224427 9169690 6950877 3660545 1324964 1348947 2770823
2659 2770823 3432428 2591475 1200496 280921 386202 1841374 3948805 4890325 4187720
2650 4187720 4121419 6448472 8897522 7947197 4362585 2376566 3362386 4213331 2858659
2641 2858659 1419758 2036655 3142228 2548546 1381724 1896751 3502842 4029885 3282487
2632 3282487 2341849 880537 -1588078 -3119753 -1675268 734012 156053 -3173693 -4804857
2623 -4804857 -2693825 117634 648162 -44295 7305 60117 -1127642 -2291139 -2006702
$$ packed form
2684a067044j545548l233487j793591K183099M791520M083569J365830j475625
2676C308723l014352j842340J688004M022685K008375k325626l760227o83974
2668e98732L198148M184486K440525n4737k218813l290332k335581K3983J421876
2659B770823O61605q40953j390979r19575J05281J455172K107431R41520p02605
2650D187720o6301K327053K449050r50325l584612j986019R85820Q50945j354672
2641B858659j438901O16897J105573n93682j166822N15027J606091N27043p47398
2632C282487r40638j461312k468615j531675J444485K409280n77959l329746j631164
2623d804857K111032K811459N30528o92457N1600N2812j187759j163497K84437
$$ plain form
2614 -2006702 -1933607 -4333718 -7747561 -8543339 -6007295 -2661829 868 2716564 5353395
2605 5353395 6128179 4797315 3538555 3304234 2076879 -1384635 -4417121 -3526339 762505
2596 762505 4414081 4566230 1911762 -1018321 -2277624 -1542175 -123046 249160 -468989
2587 -468989 -432219 1243431 2625562 1571629 -905503 -2081184 -1699222 -2160797 -4508958
2578 -4508958 -6795185 -7152573 -6264808 -5661117 -5333569 -4349048 -2600174 -896133 -293772
2569 -293772 -1903306 -5972449 -10537760 -12700626 -12182595 -11773205 -13053540 -13828994 -11699723
2560 -11699723 -8051649 -5730816 -4355871 -1439166 2497018 3793671 1264427 -1459425
2552 -1459425 -623275 3285563 7521944 10978337 13762261 14648135 11920471 6469021 1660815
$$ packed form
2614b006702P3095k400111l413843p95778K536044L345466K662697K715696K636831
2605E353395P74784j330864j258760k34321j227355l461514l032486Q90782M288844
2596G62505L651576J52149k654468k930083j259303P35449J419129L72206p18149
2587d68989L6770J675650J382131j053933k477132j175681L81962m61575k348161
2578d508958k286227l57388Q87765O03691L27548R84521J748874J704041O02361
2569b93772j609534m069143m565311k162866N18031M09390j280335p75454K129271
2560a1699723L648074K320833J374945K916705L936184J296653k529244k723852
2552a459425Q36150L908838M236381L456393K783924Q85874k727664n451450m808206
$$ plain form
2543 1660815 -367903 -777210 -1851961 -3943794 -5419278 -5075936 -3639180 -2646158 -2518389
2534 -2518389 -2607944 -3026520 -4951323 -8108354 -9337391 -5884096 238708 3724632 2349582
2525 2349582 -586246 -1287084 -291785 -142377 -573279 539200 2425642 1517255 -3038316
2516 -3038316 -7186393 -6958466 -3402009 -507293 274267 1110475 3914140 7558852 9399298
2507 9399298 8216813 5044934 1879241 129076 -154671 -42351 -527099 -1302794 -1016200
2498 -1016200 972932 3424993 4337082 3080028 831509 -1031929 -2062830 -1996740 -114576
2489 -114576 3479281 6735461 7532466 6594152 6749654 8835842 10170926 8202686 4113987
2480 4113987 1236753 1028387 2401489 4160802 5942169 7033123 6518231 4970429 4108998
$$ packed form
2543A660815k028718m09307j074751k091833j475484L43342J436756R93022J27769
2534b518389q9555m18576j924803l157031j229037L453295O122804L485924j375050
2525B349582k935828p00838R95299J49408m30902J112479J886442r08387m555571
2516c038316m148077K27927L556457K894716P81560Q36208K803665L644712J840446
2507I399298j182485l171879l165693j750165k83747J12320m84748p75695K86594
2498a016200J989132K452061R12089j257054k248519j863438j030901O6090J882164
2489a14576L593857L256180P97005r38314J55502K086188J335084j968240m088699
2480D113987k877234k08366J373102J759313J781367J090954n14892j547802q61431
$$ plain form
2471 4108998 4174285 3314081 365861 -3226263 -5229831 -5198629 -4355775 -3966325 -4658136
2462 -4658136 -6291283 -7576624 -6810884 -3951244 -1067769 107756 18201 -210060 -667519
2453 -667519 -1647267 -2094018 -1068815 118069 -550041 -2547955 -3329942 -1983101 -93964
2444 -93964 1183254 2432679 3565074 2522420 -1923866 -7552122 -10528462 -9121344 -4590205
2435 -4590205 572073 4130428 4930198 3789576 3074046 4124818 5519204 4961477 2368625
2426 2368625 -154439 -1007943 -442832 607806 1695387 2620343 3000522 2438826 729346
2417 729346 -1951309 -4609113 -5679436 -4510453 -2215529 -214798 1577928 4026425
2409 4026425 6636439 7504549 5472611 1388645 -2636497 -4357850 -2399946 2324699
$$ packed form
2471D108998O5287q60204k948220l592124k003568L1202Q42854L89450o91811
2462d658136j633147j285341P65740K859640K883475J175525q9555k28261m57459
2453f67519r79748m46751J025203J186884o68110j997914p81987J346841J889137
2444i3964J277218J249425J132395j042654m446286n628256k976340J407118M531139
2435d590205N162278L558355P99770j140622p15530J050772J394386n57727k592852
2426B368625k523064q53504N65111J050638J087581R24956L80179n61696j709480
2417G29346k680655k657804j070323J168983K294924K000731J792726K448497
2409D026425K610014Q68110k031938m083966m025142j721353J957904M724645
$$ plain form
2401 2324699 6474952 7290029 5744015 4971252 5655034 5357775 2935752 845118 1430354
2392 1430354 3250797 3496781 2463914 2737334 4532494 4831525 1765190 -2400319 -3923654
2383 -3923654 -2041641 408302 339361 -2452318 -5470042 -6359769 -5211814 -3831912 -3114816
2374 -3114816 -2157354 -249564 1527371 1779348 1006167 855952 1489558 1215061 -998880
2365 -998880 -3871339 -5269238 -4603464 -3180086 -2508277 -2803821 -3309869 -3843857 -5341906
2356 -5341906 -8217229 -10658377 -9923655 -5574102 -123209 3919169 6107265 6571483 4614382
2347 4614382 470696 -3292241 -4449329 -4110031 -4729239 -6064509 -5764378 -3455443 -1344714
2338 -1344714 -650609 -167315 1108661 2326408 2361989 975983 -1878557 -5601852 -7702176
$$ packed form
2401B324699M150253Q15077j546014p72763O83782k97259k422023k090634N85236
2392A430354J820443K45984j032867K73420J795160K99031l066335m165509j523335
2383c923654J882013K449943o8941k791679l017724q89727J147955J379902P17096
2374c114816R57462J907790J776935K51977p73181j50215O33606k74497k213941
2365i98880k872459j397899O65774J423378O71809k95544n06048n33988j498049
2356e341906k875323k441148P34722M349553N450893M042378K188096M64218j957101
2347D614382m143686l762937j157088L39298o19208j335270L00131K308935K110729
2338a344714O94105M83294J275976J217747L5581j386006k854540l723295k100324
$$ plain form
2329 -7702176 -5921320 -2114789 -785389 -2821572 -4264266 -2786083 -1301726 -2374423
2321 -2374423 -2993238 795028 6811848 9290294 7115124 4578517 4338180 4563273 3700937
2312 3700937 3309703 4272497 4107031 800373 -3280401 -4126713 -1218760 2436306 4294985
2303 4294985 4084940 2273505 -1000739 -5082806 -8273009 -8924592 -6879634 -3701363 -1451504
2294 -1451504 -974913 -1389693 -1503047 -1323928 -1463328 -1465226 -2474 3118940 6243478
2285 6243478 7503368 6427311 3859099 1151513 -559585 -1288695 -2436561 -5038372
2277 -5038372 -7851721 -8507698 -6595760 -4068253 -2350038 -792563 1365396 3224236
2269 3224236 3509558 2362994 773107 -771768 -2143583 -3055545 -3514393 -3850792 -3666661
$$ packed form
2329g702176J780856L806531J329400k036183j442694J478183J484357j072697
2321b374423o18815L788266O016820K478446k175170k536607k40337K25093q62336
2312C700937l91234R62794j65466l306658m080774q46312K907953L655066J858679
2303D294985k10045j811435l274244m082067l190203o51583K044958L178271K249859
2294a451504M76591m14780j13354J79119j39400j898J462752L121414L124538
2285F243478J259890j076057k568212k707586j711098p29110j147866k601811
2277e038372k813349o55977J911938K527507J718215J557475K157959J858840
2269C224236K85322j146564j589887j544875j371815r11962m58848l36399J84131
$$ [...]
##END NTUPLES=NMR SPECTRUM
##END=
