##TITLE=31Pdec_DE-155_CCl4_TFAp
 CCl4,64 sc
 10.6.2026
##JCAMPDX= 6.0         $$ Bruker NMR JCAMP-DX V2.0
##DATA TYPE= NMR SPECTRUM
##DATA CLASS= NTUPLES
##ORIGIN= UXNMR, Bruker Analytische Messtechnik GmbH
##OWNER= root
$$ XWIN-NMR		Version 3.5
$$ Wed Jun 10 14:01:14 2026 Russian Standard Time (UT+4h)  she@DPX200
##.OBSERVE FREQUENCY= 81.013821
##.OBSERVE NUCLEUS= ^31P
##.ACQUISITION MODE= SIMULTANEOUS
##.ACQUISITION SCHEME= undefined
##.AVERAGES= 64
##.DIGITISER RES= 17
##SPECTROMETER/DATA SYSTEM= spect
##.PULSE SEQUENCE= zgpg30
##.SOLVENT NAME= CDCl3
##.SHIFT REFERENCE= (INTERNAL, CDCl3, 0, 197.392)
##AUDIT TRAIL= $$ (NUMBER, WHEN, WHO, WHERE, WHAT)
$$ ##TITLE= Audit trail, XWIN-NMR		Version 3.5
$$ ##JCAMPDX= 5.01
$$ ##ORIGIN= Bruker BioSpin GmbH
$$ ##OWNER= she
$$ F:/spectra/data/she/nmr/P31/2/pdata/1/auditp.txt
$$ ##AUDIT TRAIL=  $$ (NUMBER, WHEN, WHO, WHERE, WHAT)
(   1,<2026-06-10 14:00:23.18 +0400>,<she>,<DPX200>,
      <created by zg, POWCHK disabled, PULCHK disabled
       configuration hash MD5:
       00 E9 B6 7A A2 85 ED C7 34 08 36 98 17 FE 4E 26
       data hash MD5: 32K
       0D B4 94 E7 20 8C EF 2E 8E 46 A2 90 2E D1 2A 0B>)
(   2,<2026-06-10 14:00:25.71 +0400>,<she>,<DPX200>,
      <Start of raw data processing
       efp BC_mod = 2 LB = 1.5 FT_mod = 6 PKNL = 1 PHC0 = 1613.308 PHC1 = 51.50064 SI = 64K 
       data hash MD5: 64K
       8F C8 89 88 68 11 81 22 17 F4 49 09 AB 16 B2 57>)
$$ ##END=
$$ 
$$ hash MD5
$$ C0 AD B4 FE E0 21 B1 7B 30 9F C7 75 FF 87 FE AC
##$RELAX= 
##$RELAX= 
##$RELAX= 
##$RELAX= 
##$RELAX= 
##$RELAX= 
##$RELAX= 
##$RELAX= 
$$ Bruker specific parameters
$$ --------------------------
##$DU= <F:/spectra>
##$EXPNO= 2
##$NAME= <P31>
##$PROCNO= 1
##$TYPE= <nmr>
##$USER= <she>
##$AMP= (0..31)
100 100 100 100 100 100 100 100 100 100 100 100 100 100 100 100 100 100 
100 100 100 100 100 100 100 100 100 100 100 100 100 100 
##$AQSEQ= 0
##$AQ_mod= 1
##$AUNM= <au_zg>
##$AUTOPOS= <>
##$BF1= 81.014009
##$BF2= 200.13
##$BF3= 200.13
##$BF4= 200.13
##$BF5= 200.13
##$BF6= 200.13
##$BF7= 200.13
##$BF8= 200.13
##$BYTORDA= 1
##$CFDGTYP= 0
##$CFRGTYP= 5
##$CHEMSTR= <none>
##$CNST= (0..31)
1 1 145 1 1 1 1 1 1 1 1 1 1 1 1 1 1 1 1 1 1 1 1 1 1 1 1 1 1 1 1 1 
##$CPDPRG= <waltz16>
##$CPDPRG1= <>
##$CPDPRG2= <waltz16>
##$CPDPRG3= <>
##$CPDPRG4= <mlev>
##$CPDPRG5= <mlev>
##$CPDPRG6= <mlev>
##$CPDPRG7= <mlev>
##$CPDPRG8= <mlev>
##$CPDPRGB= <>
##$CPDPRGT= <>
##$D= (0..31)
0 1 0 0 0 0 0 0 0 0.06 0 0.03 2e-05 3e-06 0 0 0.0002 0 0 0 0 0 0 0 0 0 
0 0 0 0 0 0 
##$DATE= 1781085622
##$DBL= (0..7)
120 120 120 11 120 120 24 19 
##$DBP= (0..7)
150 150 150 150 150 150 150 150 
##$DBP07= 0
##$DBPNAM0= <>
##$DBPNAM1= <>
##$DBPNAM2= <>
##$DBPNAM3= <>
##$DBPNAM4= <>
##$DBPNAM5= <>
##$DBPNAM6= <>
##$DBPNAM7= <>
##$DBPOAL= (0..7)
0.5 0.5 0.5 0.5 0.5 0.5 0.5 0.5 
##$DBPOFFS= (0..7)
0 0 0 0 0 0 0 0 
##$DE= 6
##$DECBNUC= <off>
##$DECIM= 4
##$DECNUC= <off>
##$DECSTAT= 4
##$DIGMOD= 1
##$DIGTYP= 9
##$DL= (0..7)
0 0 52 120 120 21 21 25 
##$DP= (0..7)
$$ [...]
##$SUBNAM2= <"">
##$SUBNAM3= <"">
##$SUBNAM4= <"">
##$SUBNAM5= <"">
##$SUBNAM6= <"">
##$SUBNAM7= <"">
##$SUBNAM8= <"">
##$SUBNAM9= <"">
##$SW= 400.765351723535
##$SWIBOX= (0..15)
0 1 3 0 0 0 0 0 0 0 0 0 0 0 0 0 
##$SW_h= 32467.5324675325
##$TD= 32768
##$TD0= 1
##$TE= 0
##$TE2= 300
##$TE3= 300
##$TEG= 300
##$TL= (0..7)
0 120 53 12 22 120 120 120 
##$TP= (0..7)
150 150 150 150 150 150 150 150 
##$TP07= 0
##$TPNAME0= <>
##$TPNAME1= <>
##$TPNAME2= <>
##$TPNAME3= <>
##$TPNAME4= <>
##$TPNAME5= <>
##$TPNAME6= <>
##$TPNAME7= <>
##$TPOAL= (0..7)
0.5 0.5 0.5 0.5 0.5 0.5 0.5 0.5 
##$TPOFFS= (0..7)
0 0 0 0 0 0 0 0 
##$TUNHIN= 0
##$TUNHOUT= 0
##$TUNXOUT= 0
##$USERA1= <user>
##$USERA2= <user>
##$USERA3= <user>
##$USERA4= <user>
##$USERA5= <user>
##$V9= 5
##$VALIST= <valist>
##$VCLIST= <CCCCCCCCCCCCCCC>
##$VD= 0
##$VDLIST= <DDDDDDDDDDDDDDD>
##$VPLIST= <PPPPPPPPPPPPPPP>
##$VTLIST= <TTTTTTTTTTTTTTT>
##$WBST= 1024
##$WBSW= 4
##$XGAIN= (0..3)
0 0 0 0 
##$XL= 0
##$YL= 0
##$YMAX_a= 11084
##$YMIN_a= -2970
##$ZGOPTNS= <>
##$ZL1= 120
##$ZL2= 120
##$ZL3= 120
##$ZL4= 120
##$ABSF1= 0
##$ABSF2= 0
##$ABSG= 0
##$ABSL= 0
##$ALPHA= 0
##$AQORDER= 0
##$ASSFAC= 0
##$ASSFACI= 0
##$ASSFACX= 0
##$ASSWID= 0
##$AUNMP= <proc_1d>
##$AZFE= 0.1
##$AZFW= 0.5
##$BCFW= 0
##$BC_mod= 2
##$BYTORDP= 0
##$COROFFS= 0
##$CY= -3
##$DATMOD= 1
##$DC= 0
##$DFILT= <>
##$DTYPP= 0
##$F1P= 0
##$F2P= 0
##$FCOR= 1
##$FTSIZE= 65536
##$FT_mod= 6
##$GAMMA= 0
##$GB= 0
##$INTBC= 1
##$INTSCL= 9.790993e-09
##$ISEN= 30
##$LB= 1.5
##$LEV0= 0
##$LPBIN= 0
##$MAXI= 10000
##$MC2= 0
##$MEAN= 0
##$ME_mod= 0
##$MI= 50
##$NCOEF= 0
##$NC_proc= -8
##$NLEV= 6
##$NOISF1= 182.463
##$NOISF2= 159.3651
##$NSP= 0
##$NTH_PI= 0
##$NZP= 0
##$OFFSET= 197.3918
##$PC= 4
##$PHC0= 1613.308
##$PHC1= 51.50064
##$PH_mod= 1
##$PKNL= yes
##$PPARMOD= 0
##$PSCAL= 0
##$PSIGN= 0
##$REVERSE= no
##$SF= 81.014063255964
##$SI= 65536
##$SIGF1= 159.3651
##$SIGF2= -187.1042
##$SINO= 113.3802
##$SIOLD= 16384
##$SREGLST= <1H.CDCl3>
##$SSB= 0
##$STSI= 65536
##$STSR= 0
##$SW_p= 32467.5324675325
##$SYMM= 0
##$S_DEV= 0
##$TDeff= 32768
##$TDoff= 0
##$TI= <>
##$TILT= no
##$TM1= 0
##$TM2= 0
##$TOPLEV= 0
##$USERP1= <user>
##$USERP2= <user>
##$USERP3= <user>
##$USERP4= <user>
##$USERP5= <user>
##$WDW= 1
##$XDIM= 65536
##$YMAX_p= 252640633
##$YMIN_p= -172306185
$$ End of Bruker specific parameters
$$ ---------------------------------
##NTUPLES= NMR SPECTRUM
##VAR_NAME=  FREQUENCY,     SPECTRUM/REAL,   SPECTRUM/IMAG
##SYMBOL=    X,             R,               I
##VAR_TYPE=  INDEPENDENT,   DEPENDENT,       DEPENDENT
##VAR_FORM=  AFFN,          ASDF,            ASDF
##VAR_DIM=   65536,         65536,           65536
##UNITS=     HZ,            ARBITRARY UNITS, ARBITRARY UNITS
##FACTOR=    0.49542278885378, 1,            1
##FIRST=     15991.5117654749, 0,            0
##LAST=      -16476.0207020576, 0,           0
##MIN=       -16476.0207020576, -172306185,  0
##MAX=       15991.5117654749, 252640633,    0
$$ Real data points
##PAGE= N=1
##DATA TABLE= (X++(R..R)), XYDATA
$$ [...]
7469c144174L6333j243714n62975K739827M035243R3363n114383n077954J49025
7460h089409L907813K267398j102446j281524P75282R81113q49341j186997J086822
7451c491289L077533K591940Q25791l90389r10465q03513O24621K868709L519887
7442G912825J196416k310673m118004l277063r06382J266842J695496j03035k514109
7433a157687l104507j710810o40548j055246j249348J76262J639854J146012k25281
7424f181299M0581J799522K490703J154533l67161o06873n83000j693142l083438
7415g029574k624009K7368K634453K921955J166048m07513n46522k72236q40476
7406d970506j551845r08653O93986J207133j19822j737738k113133j401202k16918
$$ y = [-3144174, -3107841, -4351555, -4914530, -2174703, 1860540, 1953903, -3160480, -8238434, -8089409, -4181596, -1914198, -3016644, -4298168, -3522886, -2541773, -3391114, -4578111, -3491289, -413756, 2178184, 3003975, 2613586, 1703121, 899608, 1524229, 4392938, 7912825, 9109241, 6798568, 2680564, -596499, -1502881, -236039, 1459457, 1356422, -1157687, -4262194, -5973004, -6613552, -7668798, -8918146, -8741884, -7102030, -5956018, -6181299, -6140718, -4341196, -1850493, -695960, -1063121, -1669994, -2252994, -3946136, -7029574, -9653583, -9626215, -6991762, -4069807, -2903759, -3311272, -3857794, -4130030, -4970506, -6522351, -7431004, -6737018, -5529885, -5649707, -7387445, -9500578, -10901780, -11118698]
7397a1118698J578503L818680N109243M237763J748326p59553k178186k165110
7389B70968q74853Q32548J763845J591290R10593j11957j903813l954536m649479
7380f125394l330613j169986O07374J903431K615745K100816N92517n25949o48701
7371c980760m57783q1513R55179J457102o23380l918623l841479P63071M795093
7362d933093L797807K56246q67845K64562J12325j332338j100746N12019K67032
7353c024031j570628j116493J867463K496627j302167m728668l213626P62828
7345i828695J868693k47440j559042k19432J570408J670807O61757J12262L90021
7336e580661P13400K77104q75071j749584j587381j156994j775268k972171k753076
$$ y = [-11118698, -9540195, -5721515, -612272, 3625491, 5373817, 4614264, 2436078, 270968, -603885, 228663, 1992508, 3583798, 4494391, 4382434, 2478621, -1475915, -6125394, -9456007, -10625993, -10018619, -8115188, -5499443, -3398627, -2806110, -3332059, -3980760, -4438543, -4520056, -3564877, -2107775, -2731155, -6649778, -10491257, -9728186, -4933093, -1135286, -879040, -1746885, -1482323, -1369998, -2702336, -3803082, -3291063, -3024031, -4594659, -5711152, -3843689, -1347062, -2649229, -7377897, -10591523, -9828695, -7960002, -8207442, -9766484, -9985916, -8415508, -6744701, -6082944, -5970682, -5580661, -4867261, -4590157, -5465228, -7214812, -8802193, -9959187, -11734455, -14706626, -17459702]
7327a7459702o24331J404834J587985N81826N6935P10631K269119L838399L882984
7318c751320J845596J8568J157105L769167L167935j551591n320103m057013k14845
7309d936501J577981R97155L95107k70630k219510l658807j890559J480501K410610
7300f114653R31867P74496K581690K906584P87724k20614J437139K010122j197131
7291C897224m571113l349989J142470L710798K619109N26332n72047j256140k013750
7282A32894k263110k126288k301495k184875p59433Q57624O33677o81085k67896
7273h959987J947101K602075J93494k192832j404491J242670K436862J795102
7265b340006J456036K037380J994737P06705l45077J99231J905705L340611L293107
$$ y = [-17459702, -18084033, -16679199, -15091214, -14509388, -14452453, -13741822, -11472703, -7634304, -3751320, -1905724, -1887156, -730051, 3039116, 6207051, 4655460, -664643, -4721656, -4936501, -3358520, -2361365, -1966258, -2236888, -4456398, -8115205, -10005764, -8525263, -6114653, -5182786, -4408290, -1826600, 1079984, 1867708, 1647094, 3084233, 5094355, 3897224, -673889, -4023878, -2881408, 829390, 3448499, 3974831, 3402784, 2146644, 132894, -2130216, -4256504, -6557999, -8742874, -9502307, -8644683, -8011006, -8692091, -8959987, -7012886, -4410811, -4217317, -6410149, -7814640, -6571970, -4135108, -2340006, -883970, 1153410, 3148147, 3854852, 3509775, 3709006, 5614711, 8955322, 12248429]
7256A2248429J362718j390943k716877j534800L17583K66848j477653k474682
7248D600623j837087j187826j652916k295099k232372k056769k124498j554975
7240a0340919k32142J95154j051031j981125n05886K304547L602632K480146M93353
7231e035271p10834n05075J233022L771226M999476L127505r66827m360763n070035
7222c517576l526030j459033k99100l44007o98631l62835L71416N52139N95677
7213h687980J766526L280002K698260L20547k21429K123410L099182k22986l804209
7204C51323k566826J077322Q76392k922851m036966o51490K004039Q47465n75501
7195e597093N87787J521677j17765j196409J005657L072183J025181k565664k802061
$$ y = [12248429, 13611147, 12220204, 9503327, 7968527, 8286110, 8552958, 7075305, 4600623, 2763536, 1575710, -77206, -2372305, -4604677, -6661446, -8785944, -10340919, -10573061, -10377907, -11428938, -13410063, -13915949, -11611402, -8008770, -5528624, -5035271, -5746105, -6251180, -5018158, -1246932, 3752544, 6880049, 5913222, 1552459, -3517576, -7043606, -8502639, -8801739, -9145746, -9844377, -10207212, -9835796, -9283657, -8687980, -6921454, -3641452, -943192, -622645, -844074, 1279336, 4378518, 4155532, 351323, -2215503, -1138181, -261789, -3184640, -7221606, -7873096, -5869057, -5021592, -5597093, -5009306, -3487629, -3605394, -4801803, -3796146, -723963, 301218, -2264446, -5066507]
7186e066507n00745l8751j542671j333347J174989K860423K677612K727051L487295
7177D445349K782936L3179k475290l023491j855395O51363L753829M840394K100195
7168A1253069j674034k069638M69971J572923P3663r19152m60994j538640m756122
7159A951046n840291k357052J785182K055788k70399j104516J66887J295123J689545
7150f28687K293173K373313K09190l481280n705314m703942j445529J875529L369117
7141e844430K390669L61879l77264L73866L65766j160979j555425J061453L871280
7132e13185K673006k108007n801646n365878k155307R42494K541989K683826J890431
7123e212277R60826M79908K79604J13644L74793J210092J751290J440438J182208
$$ y = [-5066507, -5567252, -5606003, -7148674, -8482021, -7307032, -4446609, -1768997, 958054, 4445349, 7228285, 7261464, 4786174, 1762683, -92712, 558651, 4312480, 9152874, 11253069, 9579035, 7509397, 7979368, 9552291, 9625954, 8706802, 8245808, 6707168, 1951046, -3889245, -6246297, -4461115, -2405327, -2675726, -3780242, -3613355, -2318232, -628687, 1664486, 4037799, 4246989, 765709, -4939605, -9643547, -11089076, -9213547, -5844430, -3453761, -3091882, -3469146, -3095280, -2729514, -3890493, -5445918, -4384465, -513185, 2159821, 51814, -5749832, -11115710, -13271017, -12328523, -9786534, -7102708, -5212277, -4251451, -3771543, -3491939, -3378295, -3003502, -1793410, -42120, 1398318, 2580526]
7114B580526J734361J977094N91251j386116j732174k77618J002866Q56562j26716
7105E220036j022750j426644r90084J92099R28961L06418n91447n7129J521849
7096D081309K248648J697846J128014Q10413m59675k801198m433980m130270k624830
7087d483723r80619O36176J964046K302425J867654J690430J518286j26831k920099
7078A467745m061433k104877O49188J489140J106382J624616K308858M11882m004344
7069a112843p191985o460310l401486j084389P8405J759251M097706N030828L510751
7060d774072J436667J141641K112954J913469l5109j542561r35270O29806J224779
7051A172304Q63252N33397l9068j435338k328373r18090J731886K619516J258007
$$ y = [2580526, 4314887, 6291981, 6883232, 5497116, 3764942, 3487324, 4490190, 5346752, 5220036, 4197286, 2770642, 1780558, 1972657, 2901618, 3208036, 2616589, 2559460, 4081309, 6329957, 8027803, 9155817, 9966230, 9506555, 6705357, 2271377, -1858893, -4483723, -5464342, -4828166, -2864120, -561695, 1305959, 2996389, 4514675, 4387844, 1467745, -2593688, -4698565, -4049377, -2560237, -1453855, 170761, 2479619, 2891501, -1112843, -8304828, -14765138, -18166624, -19251013, -19172608, -17413357, -13315651, -8284823, -4774072, -3337405, -2195764, -82810, 1830659, 1795550, 252989, -682281, -52475, 1172304, 2035556, 2568953, 2529885, 1094547, -1233826, -2151916, -420030, 2199486, 3457493]
7042C457493K79232R76345J447901N38394L24354K305095L985991K444729p83594
7033A4975940j928666o70964J34993m79961q92449j029665k806110n546443n294695
7024c538020p69925L567167L191577l95653k244701o38577J921490L020053K395013
7015F508424M28300k281967l899793k703576J50240J510036L00991j347276j452269
7006b786890n65225j24223l27315n74331n50498j00535P03479R64964m4182j046858
6996d451614K0395K382729K533278p06094l715828k775078Q12006K872514K124546
6987i03146Q25609N16958K62751q14380j980308k435575k307915j617813j50301
6978h604120J235821J100033k47465p85348K10503J074964M82164n85910o89107
$$ y = [3457493, 3736725, 4713070, 6160971, 6699365, 7023719, 9328814, 13314805, 15759534, 14975940, 13047274, 12376310, 12511303, 12031342, 11138893, 10109228, 7303118, 1756675, -3538020, -4307945, -740778, 2450799, 2055146, -189555, -828132, 1093358, 4113411, 6508424, 6936724, 4654757, 754964, -1948612, -1798372, -288336, 12655, -1334621, -2786890, -3352115, -3476338, -3803653, -4377984, -4928482, -5029017, -4325538, -3360574, -3404756, -4451614, -4431219, -2048490, 484788, -221306, -3937134, -6712212, -5900206, -3027692, -903146, -77537, 439421, 702172, -112208, -2092516, -4528091, -6836006, -8453819, -8604120, -7368299, -6268266, -6515731, -7301079, -7090576, -6015612, -5533448, -6119358, -6808465]
6969f808465j18172o982n83229j376812j871008j069261J865443N325382N617095
6960I73991J572970k894497l311206m12844J467323Q69550N20248K046673L170428
6951D002636J736384n90690j152232o19298j488107l505003l904488k045811n35897
6942h102506q40057p33632J944125N233343N460996K552432K8193o5168O61666
6933F139392L39154l93114l79340k87442r33822j133979L11952J763098O47616
6924F073515k331401l702007k006595N29622J577476J447154J324136J045634
6916C957534J04767p85540p20232j81081l22333j374270k570178k929963j689410
6907f510706R33889K972433K153190j175489l974596m095052k391754n82485R44777
$$ y = [-6808465, -6926637, -6933619, -7516848, -8893660, -10764668, -11833929, -9968486, -4643104, 973991, 2546961, -347536, -3658742, -4071586, -2604263, -1734713, -1214465, 832208, 4002636, 5739020, 5148330, 3996098, 3376800, 1888693, -1616310, -5520798, -7566609, -8102506, -8942563, -9676195, -7732070, -2498727, 2962269, 5514701, 5542894, 5477726, 6139392, 6478546, 6085432, 5706092, 5418650, 4484828, 3350849, 3662801, 5425899, 6073515, 3742114, 40107, -1966488, -1436866, 140610, 1587764, 2911900, 3957534, 4062301, 3276761, 2556529, 2375448, 2053115, 678845, -1891333, -4821296, -6510706, -5576817, -2604384, -451194, -1626683, -5601279, -9696331, -12088085, -12670570, -11725793]
6898a1725793J943511J180402j382765k989438j191086K473350M310931L271641
6890d109247J528811P54111L61291m30326j103545j044001n48280j4593O05144
6881d000635J078010O93654p19991k261490k704683j497650P19636K347978K306497
6872d038674J580811K046748L243895K289020j661904n054642m346790r68932
6864f910468J001923O78387M24673J015626P67341m42332l57005J490966K518854
6855A87965J545987J091436L051220M995989L559730m74841l342032l394759k433885
6846D786810k442987l213578l315037j967308K71482J988257K219400J579830
6838i3131J519935K263529K461502J228969o23361j834521j969918j068625N47038
$$ y = [-11725793, -9782282, -8601880, -9984645, -12974083, -14165169, -11691819, -7380888, -4109247, -2580436, -1826325, -1465034, -1895360, -2998905, -4042906, -4591186, -4605779, -4000635, -2922625, -2228971, -2948962, -5210452, -7915135, -9412785, -8693149, -6345171, -4038674, -2457863, -411115, 2832780, 5121800, 3459896, -1594746, -5941536, -6910468, -5908545, -5230158, -4805485, -3789859, -3022518, -3464850, -3821855, -2330889, 187965, 1733952, 2825388, 5876608, 10872597, 14432327, 13957486, 10615454, 7220695, 4786810, 2343823, -869755, -4184792, -6152100, -5880618, -3892361, -1672961, -93131, 1426804, 3690333, 6151835, 7380804, 6757443, 4922922, 2953004, 1884379, 2431417]
6829B431417J631679Q60251r97945j564019l71942K07915j096266j920581R5989
6820g23502L011680K927206j88575k115469j30604L347826L861717J23505m897192
6811E216592p259913n598089j773308J248537J849504L36353k012434l624149
6803a1616907l002548l2294K995574L296248R90982r25889m80522J165655K104839
6794e504862K076989J366578m42754k808156l276106n09038L062269L930104J947306
6785a57670l5180j56003R09478J742541J570970L82267p85378n37890M81468m15076
6775B999527l500915m409122J44695O130242O347030L60552m726543m212470j399572
6766b266576j126968k497501j822447O25955J485872L02150J18892K229097M125708
$$ y = [2431417, 4063096, 4923347, 3925402, 2361383, 1989441, 2197356, 1101090, -819491, -723502, 2288178, 5215384, 5026809, 2911340, 2780736, 6128562, 9990279, 10113784, 5216592, -2043321, -7641410, -9414718, -8166181, -6316677, -5980324, -7992758, -11616907, -14619455, -14651749, -11656175, -8359927, -7368945, -8294834, -8775356, -7609701, -5504862, -3427873, -2061295, -2504049, -5312205, -8588311, -9097349, -6035080, -2104976, -157670, -192850, -348853, 560625, 2303166, 3874136, 4256403, 3471025, 2933135, 3414603, 2999527, -501388, -4910510, -4765815, 1364427, 7711457, 8072009, 3345466, -867004, -2266576, -3393544, -5891045, -7713492, -7087537, -5601665, -5299515, -5180623, -2951526, 1174182]
6757A174182L434353R80599j163782k422789l156598l104516k063718j158538
6749g480807j737566l196251l278137q72214K447850M255363L990241L043046
6741b828475K498149J956146Q55004k02440l50799J3777k62064j332761k166957
6732a820420k066086j382035o54975j0131L87148K52514j9644O41468K469080
6723b203081L863594K756443r39372m697907n588121l225238k59506M59954j033218
6714a0866452k302586j836463m99231O31520J967606L658207L941001J532784
6706c773614j411608j516548Q55754J736617p68750l614865k988555P37533L970258
6697f773778M423496K905367J365353P24115M14667q13472l296438n263073m247030
$$ y = [1174182, 4608535, 5589134, 4425352, 2002563, -1154035, -4258551, -6322269, -7480807, -9218373, -12414624, -15692761, -16564975, -14117125, -9861762, -5871521, -2828475, -330326, 1625820, 2480824, 2278384, 1927585, 1941362, 1679298, 346537, -1820420, -3886506, -5268541, -5923516, -5933647, -5546499, -5293985, -5313629, -4672161, -2203081, 1660513, 4416956, 3477584, -1220323, -6808444, -10033682, -10293188, -9833234, -10866452, -13169038, -15005501, -15504732, -14873212, -12905606, -9247399, -5306398, -3773614, -5185222, -6701770, -5846016, -4109399, -4878149, -8493014, -11481569, -10744036, -6773778, -2350282, 555085, 1920438, 2644553, 3059220, 2245748, -1050690, -6313763, -10560793]
6688a0560793m51022K517275J607571j853829l861506k658291j37658J591230
6680a3807023K927987N014304O709367N305125L98817m472603n266975k055524
6672e246525J101380J067093j026008k201471j880482j731484k098096j301410
6664a3317003J041512K632342J924940Q71663K015086M144838L592390l50389
6656B555379l998646m076870j736438j99427m1597P57005K591690K940038L52956
6647h55910k607981k664112o43892q4729j482283j507744J148845K923521Q79782
6638d894503k097353j428004J935186L074833J036471n2240J586054K207923q20341
6629E48026l945601k819062O58804J336491j092437j910728J114070M597369M803647
$$ y = [-10560793, -11011815, -8494540, -6886969, -8740798, -12602304, -15260595, -15398253, -13807023, -10879036, -5864732, 844635, 6149760, 6548577, 2075974, -3191001, -5246525, -4145145, -3078052, -4104060, -6305531, -8186013, -9917497, -12015593, -13317003, -12275491, -9643149, -7718209, -6846546, -4831460, -686622, 2905768, 2555379, -1443267, -5520137, -7256575, -7456002, -7497599, -6740594, -4148904, -1208866, -855910, -3463891, -6128003, -6771895, -6856624, -8338907, -9846651, -8697806, -5774285, -4894503, -6991856, -8419860, -6484674, -3409841, -2373370, -2425610, -839556, 1368367, 548026, -3397575, -6216637, -5557833, -4221342, -5313779, -7224507, -6110437, -1513068, 3290579]
6620C290579K397398L30294l53554p07759j571801k803684l862796l924330k223445
6611i429098O78891K724812K520793J139006P04164J507731J710841R1304k015350
6602c66906k364994q60697K76805l79679j494820j152983O3549N299j466330k120717
6592i861473r42316L26105L08283K97459J600113K692268J626196k42139l5051
6583d230555J931320K598881J320616J007345L097488M630792K399883k257345
6575A0498425n177298m487347j819118N91712J762719J387365l43124k041455
6567C71879j961733j48947J394946J219767J30472k28394L19146M48111p32959
6558H12288k535752l583965l310661k227673r57340M56951K033927L092547K750768
$$ y = [3290579, 5687977, 6018271, 5664717, 4956958, 3385157, 581473, -3281323, -7205653, -9429098, -8750207, -6025395, -3504602, -2365596, -1661432, -153701, 1557140, 1648444, -366906, -2731900, -3592597, -3315792, -3695471, -5190291, -6343274, -6279725, -6274426, -7740756, -9861473, -10803789, -10477684, -10169401, -9871942, -8271829, -5579561, -3953365, -4195504, -4230555, -2299235, 299646, 1620262, 2627607, 5725095, 10355887, 12755770, 10498425, 5321127, 833780, -985338, -393626, 1369093, 2756458, 2413334, 371879, -1589854, -1738801, -343855, 875912, 1006384, 777990, 1097136, 1545247, 812288, -1723464, -5307429, -8618090, -10845763, -11803103, -11346152, -9312225, -6219678, -3468910]
6549c468910J299538L21593Q47688J884702J621082j09826j592840j583179p32711
6540a512863q8736N91560J761804K302250Q18492j495265j649063P92794K488046
6531D009019J002276j372706r71906J498546J821639j387477m569353m334148
6523d304110j756152Q5037M88979Q12163J283884O48623j417597l444486l810190
6514a1413849k153150O81621L247374M374257M168448L741532L550536K900522
6506I097291J590559O89769O99186L93150j089681k366539j836679m67969m56436
6497F252651j872940k871350k768638k579973k585696j739844Q7865J364707J126402
6488e586816L57447M08504J238650J786782J197747m68804j906584j325329J200877
$$ y = [-3468910, -2169372, -1847779, -1000091, 884611, 2505693, 2395867, 803027, -780152, -1512863, -1601599, -1010039, 751765, 3054015, 3872507, 2377242, 728179, 1520973, 4009019, 5011295, 3638589, 2666683, 4165229, 5986868, 4599391, 30038, -4304110, -6060262, -5975225, -5486246, -4674083, -3390199, -2741576, -4159173, -7603659, -11413849, -13566999, -12885378, -9638004, -5263747, -1095299, 2646233, 6196769, 9097291, 10687850, 11377619, 12076805, 12469955, 11380274, 9013735, 7177056, 6709087, 6252651, 4379711, 1508361, -1260277, -3840250, -6425946, -8165790, -8077925, -6713218, -5586816, -5229369, -4820865, -3582215, -1795433, -597686, -1066490, -2973074, -4298403, -3097526]
6479c097526K795282J085681k037739k463281L29316K407213J177105r00433k56193
6470i60575K404313L206408M99824l207791m509716k622811M24778J986023R73697
6461a805850j497759l364003l443650j913949M62349K674142L463463K395311
6453c029946Q44491M34716N85844n24427k486310k589138o9727K026822Q72550
6444c935125k164167l471875j722160J436293M027803N088445M165547J541695
6436D966456j201815k324326j577922Q2846J781078K787561K288646M21572j175855
6427F048241j138465r1643M49650L2545r49860k215842k923595j427464K279912
6418F3479M974745L474768j009778m131372l736853j625613j23688M89988O40865
$$ y = [-3097526, -302244, 783437, -1254302, -3717583, -3388267, -981054, 196051, -704382, -960575, 1443738, 4650146, 5149970, 1942179, -2567537, -5190348, -4765570, -2779547, -1805850, -3303609, -6667612, -10111262, -12025211, -11562862, -8888720, -5425257, -3029946, -2185455, -1750739, -1164895, -1689322, -4175632, -6764770, -6834497, -4807675, -3935125, -6099292, -9571167, -11293327, -9857034, -5829231, -740786, 3424761, 4966456, 3764641, 1440315, -137607, -54761, 1726317, 4513878, 6802524, 7224096, 6048241, 4909776, 4818133, 5267783, 5300328, 4350468, 2134626, -788969, -2216433, 63479, 5038224, 8512992, 7503214, 3371842, -365011, -1990624, -2114312, -1624324, -983459]
6409i83459P85j436067k484226k170272r95463m3139L08044L11508L29495O49654
6399f513140J050341O31552r42814k343757k046874n74972L76272P46354J911831
6390g705207L640624L757864J585828o75575j183946q61320j066502r92999N20020
6381b981213K234893K071083M95775j26821P45858J132674j73187j649402j253535
6372D96125P58193K251238J820009J53010j049896r98174m32969m03878q21924
6363A771734p45937P8475Q44673J003333R51431R53190M38226q04687j670068
6354B820370j117135P8402J92350j045717k073590j646120m49964j12282r57067
6345d310753j273179P01303L942203M756604J033595m180415n499174j922727
$$ y = [-983459, -982674, -2418741, -4902967, -7073239, -8068702, -8111841, -7803797, -7492289, -7162794, -6513140, -5462799, -4831247, -5774061, -8117818, -10164692, -10739664, -10363392, -9617038, -7705207, -4064583, -306719, 1279109, 603534, -580412, -1441732, -2508234, -3501233, -2981213, -746320, 1324763, 1820538, 1693717, 2439575, 3572249, 3399062, 1749660, 496125, 1254318, 3505556, 5325565, 5478575, 4428679, 3430505, 2997536, 2593658, 1771734, 1025797, 1104272, 1948945, 2952278, 3903709, 4856899, 5295125, 4490438, 2820370, 1703235, 1781637, 1973987, 928270, -1145320, -2791440, -3241404, -3353686, -4310753, -5583932, -4882629, -940426, 3816178, 4849773, 669358, -4829816, -6752543]
6337f752543J670661R67352k249143l152928n20702K553186L489809K694211J478618
6328A78521L65921l09195m67386j110509k903001m138222k751741j49941K91383
6319a0994170j199086o73532K899527N155191K954565m22437l06406K198380K417802
6310B029834m85549k902896k716473j473609o67990K31738J561208K556562L124899
6301A257724L627244K920933o5480k882762j765297K142906L264959k42877l415488
6292D841862k028993J226654J672851j70193r05217q11714k635443n289231m442414
6283h541838L21087L863982K432935j504180l107434j045270K247444M089813
6275a243461L581211J426744q47881k070671k276849j860958m18116K157150M052805
$$ y = [-6752543, -5081882, -4114530, -6363673, -9516601, -10037303, -7484117, -3994308, -1300097, 178521, 544442, 235247, -232139, -1342648, -4245649, -8383871, -11135612, -11285553, -10994170, -12193256, -12866788, -9967261, -4812070, -1857505, -2279942, -2586348, -387968, 2029834, 1544285, -1358611, -4075084, -5548693, -6216683, -5984945, -4423737, -1867175, 1257724, 4884968, 7805901, 7740421, 4857659, 3092362, 5235268, 8500227, 8257350, 4841862, 2812869, 4039523, 5712374, 5542181, 4636964, 3825250, 1189807, -4099424, -8541838, -8220751, -4356769, -1923834, -3428014, -6535448, -7580718, -5333274, -1243461, 2337750, 3764494, 2916613, 845942, -1430907, -3291865, -3709981, -1552831, 2499974]
6266B499974L231809O43029o70461K3190J66554j848853l944530l345109m87327
6257c731724J713600J436163m64690j735538q44396J539956K981805J983191j13411
6248B764956j234178j747631l171397m348571k395749K102814M658696L135832
6240b35228Q27968J023441J923191J99305l108534m172615k271954k65344P8020
6231f001750k64082k79351j06477N17541K097877L418780K409518n17300k315893
6222a041137j144436J518422L042140K229914m61212l426097m365182k151024
6214e798612J278125K606183J117183p44018j080651o92006p56866n98833O53952
6205d015543J775748Q41636j641697k767541o76077L007186M734540K846576n82007
$$ y = [2499974, 5731783, 6374812, 5704351, 5727541, 5894095, 4045242, 100712, -3244397, -3731724, -2018124, -581961, -1046651, -2782189, -3626585, -2086629, 895176, 2878367, 2764956, 1530778, -216853, -3388250, -7736821, -10132570, -8029756, -3371060, -235228, 592740, 1616181, 3539372, 3738677, 630143, -3542472, -5814426, -6079770, -6001750, -6265832, -6545183, -6651660, -6134119, -4036242, -617462, 1792056, 1274756, -1041137, -2185573, -667151, 2374989, 4604903, 4143691, 717594, -3647588, -5798612, -4520487, -1914304, -797121, -1541139, -2621790, -3313796, -4070662, -4669495, -4015543, -2239795, -1398159, -3039856, -5807397, -6483474, -3476288, 1258252, 4104828, 3522821]
6196C522821k037166n25507J555535J692198J79281j115236j660560k238191k670663
6187c297488j669956P87905K657656K195614J58236j114647l96126J113055J193398
6178A627647o56901k251308j259369J574006L299439K917258K379548K648578
6170A0278898J605244k068393n541471n392119k615366p66756o44501m54861R784
6161e589541m71212r61978N50266K665362J898165j134572j889629O50890J989574
6152b292675l08056k249709L6127L861309M260734J325407j109158j540635j218704
6143G64640m51519J155395K090466O90524j402929j384339n7820n29424k677691
6134a802697l108995p70586J409921J244223N8041l29497j96148j59294L46180
$$ y = [3522821, 1485655, 960148, 2515683, 4207881, 4387162, 3271926, 1611366, -626825, -3297488, -4967444, -4179539, -1521883, 673731, 831967, -282680, -678806, 434249, 1627647, 970746, -1280562, -2539931, -965925, 2333514, 5250772, 7630320, 10278898, 11884142, 9815749, 4274278, -1117841, -3733207, -4499963, -5144464, -5599325, -5589541, -6060753, -7022731, -6472465, -3807103, -1908938, -3043510, -4933139, -4282249, -2292675, -2600731, -4850440, -4814313, -953004, 3307730, 4633137, 3523979, 1983344, 764640, 313121, 1468516, 3558982, 4249506, 2846577, 1462238, 1404418, 874994, -1802697, -4911692, -5682278, -4272357, -3028134, -2970093, -3299590, -3495738, -3655032, -3308852]
6125c308852J316832J305364j69317j408313j168904n20582n61896l22658J096769
6116c741557K029780L56728k830261m169464k426675K76620J869683K803386M107876
6107a723884M730135K709176j522332m873541n053231k989236j161630p34203
6099a0618746j336502k483927l507850k790553P41435N243290P088003M969116
6091b695734J256258j220803k004924k051117j856423j504579r22630O65068L668733
6082f666151N923951M197163q46843m132782k653491M54877R42747m46676n08973
6073c736178M26774k96814k083025j863624L6008K5591k268685k711043O84047
6064a1786949M336323M520300K357179Q68737L52582m09959r41018j47244J096650
$$ y = [-3308852, -1992020, -686656, -855973, -2264286, -3433190, -3953772, -4515668, -4838326, -3741557, -1711777, -1355049, -4185310, -8354774, -10781449, -10504829, -8635146, -5831760, -1723884, 3006251, 5715427, 4193095, -680446, -5733677, -8722913, -9884543, -10618746, -11955248, -14439175, -17947025, -20737578, -19996143, -14752853, -7664850, -2695734, -1439476, -2660279, -4665203, -6716320, -8572743, -10077322, -10999952, -10334884, -6666151, -742200, 3454963, 2608120, -1524662, -4178153, -3723276, -2780529, -3227205, -3736178, -3309404, -3606218, -5689243, -7552867, -7516859, -7491268, -9759953, -12470996, -11786949, -7450626, -2930326, -573147, 295590, 648172, 238213, -702805, -850049, 246601]
6055B46601J153652K43274k35618J66931J161427K558249L294933J549110k167640
6046G970919m103671k062455P96810J65784k899426l541252n29749K146059J672193
6037c84788K43088P00222J828943Q57951j663674k796548j927244j283580j832495
6028f258125j767363K9902J701939J322255P6660K43820J355339J194834N4817
6019b045922O65378L251990M018211N16643m099623m936200j744986J523307K439919
6010d11283K110275J818218J009026p24840k312010k809494k393917j218257P37728
6001d194554K331243K026851M62384j50751L44686j43489j739353j535959J570484
5992a028458M273011L588912J318138O71205R16029p75945l739978m357350j859080
$$ y = [246601, 1400253, 1643527, 1407909, 1574840, 2736267, 5294516, 8589449, 10138559, 7970919, 3867248, 1804793, 2601603, 2767387, -132039, -3673291, -4203040, -2056981, -384788, -141700, 558522, 2387465, 3245416, 1581742, -1214806, -3142050, -4425630, -6258125, -8025488, -7995586, -6293647, -4971392, -4894732, -4650912, -3295573, -2100739, -2045922, -1380544, 1871446, 5889657, 6406300, 2306677, -2629523, -4374509, -2851202, -411283, 1698992, 3517210, 4526236, 3801396, 1489386, -1320108, -3714025, -4932282, -4194554, -1863311, 163540, 625924, 475173, 819859, 676370, -1062983, -2598942, -1028458, 3244553, 6833465, 8151603, 8822808, 9738837, 8962892, 5222914, 865564, -993516]
5983i93516L67867p8756j438466r82741J032375K080321O21261k395299m434155
5974f221109l412536K78466L738878M427385K744707P59805p49162k179668k816431
5965c429665j296445J520780K796150J641147M73866J234849K352231J269148
5957F562061j470101k777805j174631J394905K085906L47138j872174k562622
5949E32677j714577q01007o58162p58760p06063j094844j905078j399055J507674
5940f997195M610484M540888J428682j007172m91824J048885P32203j394525l070535
5931f00109k799314p92448J681474K750446J199152j567793k379541l33881J794752
5922a047262J616394M82453O94572J485885P37566q74053r33476L46137M34093
$$ y = [-993516, -625649, -704405, -2142871, -3125612, -2093237, -12916, 608345, -1786954, -6221109, -9633645, -9355179, -5616301, -1188916, 1555791, 2315596, 1566434, -613234, -3429665, -4726110, -3205330, -409180, 1231967, 1705833, 2940682, 5292913, 6562061, 5091960, 2314155, 1139524, 2534429, 4620335, 4967473, 3095299, 532677, -1181900, -1982907, -2641069, -3399829, -4105892, -5200736, -7105814, -8504869, -6997195, -2386711, 2154177, 3582859, 2575687, 2083863, 3132748, 3864951, 2470426, -600109, -3399423, -4191871, -2510397, 240049, 1439201, -128592, -2508133, -2842014, -1047262, 569132, 1051585, 1746157, 3232042, 3969608, 3095555, 2162079, 2508216, 2942309]
5913B942309j070065j916514j332124j000797j323054n21660J381686J655846
5905a184373k56311r29499J341322K904973M64975k941344k316854J302182K446379
5896H31450l52701l002536k581720n93941J072867K594351L405527J596577j957699
5887A012175l050142j25265K875474K250363l38629j396412r85786j145991j667796
5878b572009j200955m64007o54466m74116J553607L471704K503693j57754j289080
5869G16617j112897k283558m186961l319609M15281K757859J563451k11300L98714
5860e262403K227173K868404K304691J547560N04892p91585j248228o87464m88858
5851I74182r55084o13891N63400K14206k394291m316713l072193k77000J087391
$$ y = [2942309, 1872244, -44270, -1376394, -2377191, -3700245, -4221905, -2840219, -1184373, -1440684, -2370183, -1028861, 1876112, 2341087, -600257, -2917111, -1614929, 831450, 478749, -2523787, -5105507, -5699448, -4626581, -2032230, 1373297, 2969874, 1012175, -2037967, -2163232, 712242, 2962605, 2623976, 1227564, 241778, -904213, -2572009, -3772964, -4236971, -4891437, -5365553, -3811946, -340242, 2163451, 2005697, 716617, -396280, -2679838, -6866799, -10186408, -9771127, -7013268, -5449817, -5661117, -5262403, -3035230, -166826, 2137865, 3685425, 4190317, 3398732, 2150504, 1463040, 974182, 19098, -594793, -31393, 182813, -2211478, -6528191, -9600384, -9877384, -8789993]
5842h789993O75725j71198j060006j847104j412814M50478J787478J331909O74987
5833h360538J412019K245190J362204l31986r27235n55075k13772M48605J534843
5824c385745J208020j401037l552970k357320Q79156K928657L396873L739632
5816A455266L413715J045764j898894k740648j973591k112425l044047k542337
5808h397197o36636O80784J460023L228964M988133M321945K185149J774169K674946
5799A2280280J301380k380077m024167k022718p6989p84211j829985j094863o92460
5790F76190k686940m906418m520055k421545p55356P96407K912886L730167J650751
5781e523913j199378j726344k67248P13203M74507k45963j416060k803080k678144
$$ y = [-8789993, -8114268, -8285466, -9345472, -11192576, -12605390, -12154912, -10367434, -9035525, -8360538, -6948519, -4703329, -3341125, -3673111, -4600346, -5155421, -5369193, -4920588, -3385745, -2177725, -3578762, -7131732, -9489052, -8609896, -5681239, -2284366, 1455266, 4868981, 5914745, 4015851, 1275203, -698388, -2810813, -5854860, -8397197, -9033833, -8353049, -6893026, -3664062, 1324071, 5646016, 7831165, 9605334, 12280280, 13581660, 11201583, 7177416, 5154698, 5077709, 4293498, 2463513, 1368650, 676190, -2010750, -6917168, -11437223, -13858768, -14614124, -13817717, -10904831, -7174664, -5523913, -6723291, -8449635, -8716883, -8003680, -7529173, -7775136, -9191196, -11994276, -14672420]
5772a4672420j82633K716933M089393M727837N410115M179726j46623m212453
5764A909875m064725j093898L20563l16760J63272K320198L157330J701665P08011
5755D805531J708362K586244J583616p892q97628k101477m040747m333164j192933
5746a890088K980915M084812J284230k510279m221747k997748j0611K370791J954200
5737A044475r27830k857739r20232L197798M564433J099053l345173l511863N39225
5728a117853L456874J757517j393898o69384L576252N328975J225876m557629
5720G606730n885896k667520j07572j132555l169231k859302p92176J75528o41240
5711i473234j191748L3728K027115K911591K347712J410196O28767n54026k050716
$$ y = [-14672420, -14855053, -12138120, -8048727, -3320890, 2089225, 6268951, 6122328, 1909875, -2154850, -3248748, -2928185, -3244945, -3081673, -761475, 2395855, 4097520, 4805531, 6513893, 9100137, 10683753, 10675861, 9778233, 7676756, 3636009, -697155, -1890088, 1090827, 5175639, 6459869, 3949590, -272157, -3269905, -3280516, -909725, 1044475, 116645, -2741094, -3661326, -463528, 4100905, 5199958, 1854785, -1657078, -1117853, 2339021, 4096538, 2702640, 2033256, 5609508, 10938483, 12164359, 7606730, 1720834, -946686, -1054258, -2186813, -5356044, -8215346, -9007522, -8831994, -9473234, -10664982, -10631254, -8604139, -5692548, -3344836, -1934640, -1305873, -1859899, -3910615]
5702c910615k205345N4723K871430L100256L44036k411970k599019q12649Q45820
5693d723333J441920J269378P82708N70134J109904J663714Q34246r79128j496604
5684D72939m334J177856K24476j251448q18040R62677J628858L88717j539759
5675A241942k890395k675828j20212L486325M548702J458274k369432k605809
5667G3567K77755K475639K493243J688422M94226j589852k887455j077469K017097
5658C965173J813360k016333m382847k097229J786726K888118J037654j353220
5650A641402l107560l876151k746947m1097J648900P30628q94852p89192M38116
5641f996753O92748k39371j132734j527800j350284O0359K324138L046100R63933
$$ y = [-3910615, -6115960, -6061237, -3189807, -89551, 254485, -2157485, -4756504, -5569153, -4723333, -3281413, -2012035, -1229327, -659193, 450711, 2114425, 2948671, 1969543, 472939, 468605, 1646461, 1870937, 619489, -198551, 764126, 2392984, 2781701, 1241942, -1648453, -4324281, -4444493, -958168, 3590534, 5048808, 2679376, 73567, 351322, 2826961, 5320204, 7008626, 7502852, 5913000, 3025545, 1948076, 3965173, 5778533, 3762200, -620647, -2717876, -931150, 1956968, 2994622, 1641402, -1466158, -5342309, -8089256, -8130353, -6481453, -5750825, -6645677, -7434869, -6996753, -6304005, -6543376, -7676110, -9203910, -10554194, -10493835, -8169697, -5123597, -4159664]
5632d159664j294795k94376L280398N392598L825084K13439k762513m014852l912849
5623c727530l310709k798730j839709P62981M435175O117640L817466k21649k155054
5614A079881j536929j147687k291572l140547k053208J29032J905219K954263
5606d101548L151610J835890o11519k191293j812277r94359j453546k281406j534414
5597i992862K94779Q73658j04686l73279Q98857J308865p70370k779952j523247
5588a2168237J379574J397427j813225l479726j039399J867236J335094o50280
5580a3171536R1471K905561L788239K272715J568182K295942J521629j275831
5572c628k557285p87753O53059q66498k853850j996359O95689K246089K148177
$$ y = [-4159664, -5454459, -5748835, -2468437, 2924161, 6749245, 6962684, 4200171, 185319, -3727530, -7038239, -9836969, -11676678, -10913697, -6478522, -360882, 3456584, 3234935, 1079881, -457048, -1604735, -3896307, -7036854, -9090062, -8961030, -7055811, -4101548, -949938, 885952, 274433, -1916860, -3729137, -4723496, -6177042, -8458448, -9992862, -9698083, -8824425, -8929111, -9302390, -8403533, -7094668, -7865038, -10644990, -12168237, -10788663, -9391236, -11204461, -14684187, -15723586, -13856350, -12521256, -13171536, -13080065, -10174504, -6386265, -4113550, -2545368, -249426, 1272203, -3628, -2560913, -3348666, -2695607, -3562105, -6415955, -8412314, -7716625, -5470536, -3322359]
5563c322359J250255q07471l517151l697190J45080L930407K919038j158024k488717
5554f746132L34556K959926K199016k26401j469414j220502n46575m6895j8658
5545d781079j63141R59724L738355N243379K356930l027031n527675l290071J23394
5536d367215J323886P27797l04682j884394l409415k666028N89164L141699K635515
5527d213673O84379l66552q94419j832106j939255k29896J238529K53908j644031
5518h943116j338805J142155L120029L315712K428343P19217j822939l559900
5510d939304k596546P6353J579252J138807N22090P22177R06912O26514M33635
5501a530110K67637k46667q6645J683161K951053P31253l333057l852562M54084
$$ y = [-3322359, -2072104, -2879575, -6396726, -10093916, -9948836, -6018429, -3099391, -4257415, -6746132, -6411576, -3451650, -1252634, -1479035, -2948449, -4168951, -4715526, -4762421, -4781079, -4944220, -3984496, -246141, 4997238, 7354168, 4327137, -1200538, -4490609, -4367215, -3043329, -2315532, -2620214, -4504608, -7914023, -10580051, -9990887, -6849188, -4213673, -3529294, -3895846, -4790265, -6622371, -8561626, -8791522, -7552993, -7299085, -8943116, -10281921, -9139766, -6019737, -2704025, -275682, 443535, -1379404, -4939304, -7535850, -7459497, -5880245, -4741438, -4219348, -3497171, -2590259, -1963745, -1530110, -1262473, -1509140, -1595785, 87376, 3038429, 3769682, 436625, -3415937, -2961853]
5492b961853M038388K319659j607610j875367J432697L171716J297990q58786
5484D956834o12502L42048l87337k054733k695720k313555j903878j129525O69177
5475e129191K264134J736101m16414j457428o8867J784598J533646m25483j163036
5466a341940P28294K792063J703009j810510l104711K75221M551757M156421q01926
5457G147678m603532l520487j8340J789365J607329J517286J647231N28675j513830
5448D581375k481404j790434o85686R4806P00248O14032p45010k067024j407997
5439c187094N71487J221742j40022j616754k230867k909276l445973k019400R59464
5430a2796693K092724K08511r58617J850318O116221P052620M385869J845671
$$ y = [-2961853, 1076535, 3396194, 1788584, -86783, 1345914, 4517630, 5815620, 4956834, 4344332, 4686380, 4299043, 2244310, -451410, -2764965, -4668843, -5798368, -5129191, -2865057, -1128956, -1545370, -3002798, -3071665, -1287067, 246579, -178904, -1341940, -613646, 2178417, 3881426, 2070916, -1033795, -758574, 3793183, 7949604, 7147678, 2544146, -976341, -994681, 794684, 2402013, 3919299, 5566530, 6095205, 4581375, 2099971, 309537, -376149, -281343, 418905, 1032937, 287927, -1779097, -3187094, -2615607, -1393865, -1533887, -3150641, -5381508, -8290784, -11736757, -13756157, -12796693, -10703969, -10495458, -11454075, -9603757, -3487536, 3565084, 7950953, 9796624]
5422I796624J112192K82208j762557l184347k321570k82668Q22238M77782m16504
5413D523398j079703j366770j452997j465640j197140m15965L37931J13527q91117
5404b894476j414865j351198j956974k784354j064600L546027O304026L188922
5396A572508k463262l747416Q0985K725740L17865l356843l256243k97051J243730
5387g179987M86707J35863J388403K378291J536596l17012j656457k060197j780420
5378g068213q74175N21229J739331K062951J599732J303434J692933J662519l77785
5369B261956l657895m863643k332380J002155J309327n84914p01168J442697J945357
5360d178508p37499k641053m30176L150360L616924J600320R33722J794792Q28327
$$ y = [9796624, 10908816, 11191024, 9428467, 6244120, 3922550, 3639882, 4462120, 4939902, 4523398, 3443695, 2076925, 623928, -841712, -2038852, -2454817, -2116886, -2003359, -2894476, -4309341, -5660539, -7617513, -10401867, -11466467, -7920440, -1616414, 1572508, -890754, -4638170, -4557185, -1831445, -1513580, -4870423, -8126666, -8423717, -7179987, -6693280, -6557417, -5169014, -2790723, -1254127, -1571139, -3227596, -5287793, -7068213, -7942388, -7421159, -5681828, -3618877, -2019145, -715711, 977222, 2639741, 2261956, -1395939, -6259582, -8591962, -7589807, -6280480, -6865394, -7566562, -6123865, -4178508, -4916007, -7557060, -7987236, -4836876, -1219952, 380368, 1314090, 3108882, 3937209]
5351C937209k312515l664314j319120J318534Q42977j053550o97884J775291L062541
5342A889169J840733k2717j112242k178002l501954l230741n0461M017488N379958
5333C031231K899854j169062l838810l774309j530171J067636J920396O08571
5325g84664n86805P46676L454787L827078R37962j571080o78001J461777P89636
5316G597366k540059m617890l611840j693675r74086p81550N7988R81025J100507
5307d482214P49203L01097p12494k064714k199395n41699J130420J081668n387
5298f743515m82900j83492J97806Q95350K316530L328161K341989j01968j564238
5289C723o80220J341787K405243J766877L49753n20914l73794K09634N07103N55664
$$ y = [3937209, 1624694, -2039620, -3358740, -2040206, -1197229, -2250779, -2948663, -1173372, 1889169, 3729902, 3707185, 2594943, 416941, -3085013, -6315754, -6366215, -2348727, 3031231, 5931085, 4762023, 923213, -2851096, -4381267, -3313631, -1393235, -784664, -1371469, -624793, 2829994, 6657072, 7595034, 6023954, 5345953, 6807730, 7597366, 5057307, 439417, -3172423, -4866098, -5840184, -6621734, -6563746, -5582721, -4482214, -3733011, -3431914, -4144408, -6209122, -8408517, -8950216, -7819796, -6738128, -6743515, -7226415, -7409907, -7212101, -6316751, -4000221, -672060, 1669929, 1567961, 3723, -676497, 665290, 3070533, 4837410, 5187163, 4666249, 4292455, 4502089, 5009192, 5564856]
5279E564856Q05141J109824P69335m40905j973110l194839l678498l060693j563868
5270e662757l79288l90807q19254m26037M00484M34086j2657L07181Q63543p9149
5260e764655j969081k016043M27961K463866J922190K52063m67504o16177j075801
5251f843181q47763P48926J680448n6241k836563l407026j327773J201304K834210
5242h853659L687694L413062J583078m21041o22706N52170Q55932k97024j219937
5233a322431q83029k40912k68433n42836l31938K52537O06395K77929o82047j310411
5223d445176k88686K109480L507102K242768j14849p44830N07739J040481p66662
5214C047367l345781l848570j384680J891794K771768M37016k256702k034323
$$ y = [5564856, 6369997, 7479821, 8249156, 7808251, 5835141, 2640302, -1038196, -4098889, -5662757, -6042045, -6432852, -7252106, -7678143, -7277659, -6843573, -6856230, -6549049, -5685506, -5764655, -7733736, -9749779, -9321818, -6857952, -4935762, -4683699, -5151203, -5767380, -6843181, -7690944, -6942018, -5261570, -5317811, -8154374, -11561400, -12889173, -11687869, -8853659, -5165965, -1752903, -169825, -590866, -1213572, -661402, 194530, -102494, -1322431, -2205460, -2446372, -2714805, -3257641, -3589579, -3337042, -2730647, -2452718, -3134765, -4445176, -4733862, -2624382, 882720, 3125488, 3010639, 2265809, 2773548, 3814029, 3047367, -298414, -4146984, -5531664, -3639870, -868102, -431086, -2687788, -4722111]
5206d722111N32742J947317R09202l18330k74964n28748j875275j993561L35214
5197e988514K007302J56234k862798l064738j053385k12430n89130M70271K683345
5188h453843K924694P26594j020857j018577q05975q04081M51467K482453K560104
5179b958021K36454j697441j750956j447415j594593q58242O89090O51891j330528
5170a0059761k128401q3030K089581J657166o9694n57464o6361n9581O1243J604705
5160g611597L418444K872524l98662l529855l228220Q75861N220933N191085L98352
5151C208865l832582k640146J681069K648214j184524m375490k719178J274603
5143e939169K878148J227394j451293l479257m136891l013809j077315j87654
$$ y = [-4722111, -4189369, -2242052, -1332850, -1651180, -1926144, -2454892, -4330167, -6323728, -5988514, -3981212, -3824978, -6687776, -9752514, -10805899, -11018329, -11607459, -11137188, -8453843, -5529149, -4802555, -5823412, -6841989, -7647964, -8452045, -8000578, -5518125, -2958021, -2721567, -4419008, -6169964, -7617379, -9211972, -10070214, -9381124, -8729233, -10059761, -12188162, -12271192, -10181611, -8524445, -8594139, -9151603, -9217964, -9277545, -9216302, -7611597, -4193153, -1320629, -1719291, -5249146, -8477366, -7601505, -2380572, 2810513, 3208865, -623717, -3263863, -1582794, 1065420, -119104, -4494594, -7213772, -5939169, -3061021, -1833627, -3284920, -6764177, -10901068, -13914877, -14992192, -15179846]
5135a5179846j34686J214642L681838M104241J552531m38712Q52404L244708L387177
5126B284297J380555r24360l015203m330441l081586L83517K142669m1623l002774
5117h204949l105455j665985j450706j030382K263540O073611N413457M94667
5109a212202l048557j855843J589878L453607K822686Q93761r10716j230080M44497
5100I47031K707159L570760K685182Q86284j433989l783299m742931l737921k288459
5091e190183j566025n49885J202283J423347j137611l299781j677579J656731
5083i138703K159803o559o32555J483947L178182K617450J418219M09054j907247
5074d18409n188007n908973k468733J693201K511605M05011j236911p83645N83305
$$ y = [-15179846, -15314532, -14099890, -10418052, -6313811, -4761280, -5199992, -4347588, -1102880, 2284297, 3664852, 2740492, -274711, -4605152, -7686738, -7303221, -5160552, -5202175, -8204949, -11310404, -12976389, -14427095, -15457477, -13193937, -7120326, -1706869, -1212202, -4260759, -6116602, -4526724, -1073117, 1749569, 2643330, 1732614, 502534, 947031, 3654190, 7224950, 9910132, 10796416, 9362427, 5579128, 836197, -2901724, -5190183, -6756208, -7306093, -6103810, -4680463, -5818074, -9117855, -10795434, -9138703, -6978900, -6985459, -7618014, -6134067, -2955885, -338435, 1079784, 1488838, -418409, -5606416, -11515389, -13984122, -12290921, -9779316, -9374305, -10611216, -11394861, -10811556]
5065a0811556J373787J402523J192583R57302M21449n31684j311605j360534j290687
5056i958422j849682j678226J432860O086130P178841K561207l029518l862310
5048c119120p09568J238643N4336j595069j692907j039546l72722O98232J590039
5039d947682R28067q42298j812975j532085r65835o0718J798294L491133L310465
5030f33634J808560O47851l41430j805268k062568L66197K731817J189067k810809
5021i10217m121648j522623J259266K011055K206399K431742J238404n28924Q5879
5012B149333K184487R80594m071429o805312l188935K437840L851607J379891
5004a081924m90577m83227p10734j634240j520738j85868M79918k80173j076151
$$ y = [-10811556, -9437769, -8035246, -6842663, -5885361, -5463912, -5995596, -7307201, -8667735, -9958422, -11808104, -13486330, -12053470, -5967340, 1211501, 3772708, 743190, -3119120, -3828688, -2590045, -2535709, -4130778, -5823685, -6863231, -7235953, -6537721, -4947682, -4019615, -4861913, -6674888, -8206973, -9172808, -9233526, -7435232, -3944099, -633634, 1174926, 1822777, 1481347, -323921, -2386489, -2020292, 711525, 1900592, -910217, -5031865, -6554488, -5295222, -3284167, -1077768, 1353974, 2592378, 2063454, 2149333, 4333820, 5314414, 1242985, -5562327, -8751262, -6313422, -2461815, -1081924, -1572501, -2055728, -2766462, -4400702, -5921440, -6107308, -5627390, -5907563, -6983714]
4995f983714p88658p2928p2169p82409j145422m64317N78661Q22023N40081J158651
4985g210201K536850K536020N88839p34521K14708J272463M74968o1112J814286
4976A432300L312495Q20765l390380m303885k176675j214719j698460l96960J891024
4967e724495Q31950k970145l638921L44409L369923J663580j635891k695343j994287
4958a2449220p43509J557045L516624J851065k453627l859806o57969K262850
4950a0976547J421475n95688r85070r45013j340784m26620J417165J007027j194226
4941a2618281q20783J942385J495559k821653m226784j16685K932392O52041j662027
4932a5243836O00740K846537J67351l452888k616199J03559J00528p12779Q88853
$$ y = [-6983714, -7772372, -7845300, -7917469, -8699878, -9845300, -10309617, -9730956, -8908933, -8368852, -7210201, -4673351, -2137331, -1548492, -2283013, -2068305, -795842, -320874, -381986, 1432300, 4744795, 5565560, 2175180, -2128705, -4305380, -5520099, -7218559, -7615519, -5724495, -4892545, -7862690, -11501611, -11157202, -7787279, -6123699, -7759590, -10454933, -12449220, -13192729, -11635684, -8119060, -6267995, -8721622, -12581428, -13239397, -10976547, -9555072, -10150760, -11135830, -12080843, -13421627, -13848247, -12431082, -11424055, -12618281, -13439064, -11496679, -10001120, -12822773, -17049557, -17166242, -14233850, -13581809, -15243836, -14643096, -11796559, -11629208, -15082096, -17698295, -17594736, -17494208, -18206987, -17318134]
4923a7318134K159687J12843j689314K59177K235976L17240j829295J04563K845001
4914a2802256K079501N40711J698892K397181k58205k158149m25404r1259m063278
4905a3082266n773012j276250J609544k899084o577877j546730M600319K290271
4897b2655085k527491l33178L405074o92947o645024m036058J629909k27169m037243
4888c6119212L73953N287452j490961j0861701p116348J577110k507723j1893403
4880f2750833p881986N64155p604945j9950564r729332N025104j5866411m6873312
4872a65068124p238061J08846254J86077130J30023434k14049p1206909m7957213
4865A33262462r233613j2159310k7886595j8416079K68018L46523q732979o964890
$$ y = [-17318134, -15158447, -15045604, -16734918, -16475741, -14239765, -13922525, -15751820, -15647257, -12802256, -10722755, -10182044, -8483152, -6085971, -6344176, -8502325, -8927729, -9018988, -13082266, -18855278, -20131528, -18521984, -21421068, -27998945, -29545675, -24945356, -22655085, -25182576, -25515754, -22110680, -22803627, -29448651, -33484709, -31854800, -32081969, -36119212, -35745259, -30457807, -31948768, -42810469, -49926817, -48349707, -50857430, -62750833, -70632819, -70068664, -77673609, -97624173, -107353505, -102328401, -118194812, -165068124, -172306185, -63459931, 122617199, 252640633, 252426584, 181219675, 133262462, 124028849, 111869539, 83982944, 65566865, 65834883, 66181406, 57448427, 50483537]
4857E0483537r08776l877375q138417l219273J585403l976760j0059675n089837
4849A6798827K907534K356306j080041K072646N982083J653316m915730l706774
4841B2068167J479295J729183q21573m7709Q38622l020913o362344l091974J385616
4832A4156370j48134l371865j259108K387981J009120j443735J496478N193826
4824A8020933J835276m653612n094240p38113O72975o79773O85535L095543R95418
4815A4139942l029987k264553J237917K18655m039031l947592M81187K232253
4807E028791L64494M97216L065277K826973j38850l45899J976400Q42014l677917
4798A0438499m592594l81287K357362P11493k84460K047913L154781K76220k351846
$$ y = [50483537, 49574761, 45697386, 37558969, 34339696, 35925099, 31948339, 21888664, 16798827, 19706361, 22062667, 20982626, 23055272, 29037355, 30690671, 25774941, 22068167, 23547462, 25276645, 24455072, 24407363, 25245985, 22225072, 15862728, 12770754, 14156370, 14008236, 10636371, 9377263, 11765244, 12774364, 11330629, 12827107, 18020933, 19856209, 15202597, 10108357, 9370244, 10043219, 9363446, 10048981, 13144524, 14139942, 11109955, 8845402, 10083319, 10301974, 6262943, 2315351, 2796538, 5028791, 5393285, 5890501, 8955778, 11782751, 11643901, 11298002, 13274402, 14116416, 10438499, 5845905, 5464618, 7821980, 8533473, 8249013, 10296926, 13451707, 13727927, 11376081]
4789A1376081j405074j1885j238072k612744j220915J320046K553892K937442
4781A1698771K942791J094392k433157m547805l786008k205079j350830n27650
4773H85425J7605j117671k694176j793528P23587J108397l14699P43387M318457
4764A876784M866721M00327l660287k861083J15272J100617N46875J85101r90248
4755A580079l146294l003284N90326K986282N94332k606612q57079M257413O219887
4746F615050L107231q52386k288410k174254k252941k174039j063417P52369K280589
4737A949792K593498J177086j192547k548520j865389k41331R13195J494170J593709
4728C873663O10719j179273j981006r98403L1113n78824j864643j788603p4083
$$ y = [11376081, 9971007, 9959122, 8721050, 6108306, 4887391, 6207437, 8761329, 11698771, 14641562, 15735954, 13302797, 8754992, 4968984, 2763905, 1413075, 885425, 903030, -214641, -2908817, -4702345, -3978758, -2870361, -3185060, -2441673, 1876784, 6743505, 7143832, 3483545, 622462, 737734, 1838351, 2385226, 2570327, 1580079, -1566215, -4569499, -3979173, -992891, -398559, -3005171, -3862250, 395163, 6615050, 9722281, 8869895, 6581485, 4407231, 2154290, -19749, -1083166, -330797, 1949792, 4543290, 5720376, 4527829, 1979309, 113920, -127411, 785784, 2279954, 3873663, 4484382, 3305109, 1324103, 325700, 356813, -222011, -2086654, -3875257, -3949340]
4719c949340J921267K892908K118674j65151k049038j481749O51970J250815l09312
4710H81044j056525N98868K041967R21103o97669J90932K421279K663986P68721
4701H733706o53614q63819j468279k710306k774650r85833J106539K088714J836848
4692D309306M12867j797988k959441j399837J440959K269966O31296k79521J541497
4683D169104L743934K994524k92742k669192k222256m75707K02374n00034j145409
4674C804596q58836l40322n33764j083878q68791J43742N90004k88465j169285
4665f04999j40404K554495M215781K542911j551090m440016l350458O25953L501397
4656C353570K631142n16998k408028j682566k09261n4650q82900j034293j20604
$$ y = [-3949340, -2028073, 864835, 2983509, 2818358, 769320, -712429, -60459, 1190356, 881044, -175481, 423387, 2465354, 3386457, 2688788, 2879720, 5300999, 7964985, 8733706, 8080092, 7216273, 5747994, 3037688, 263038, -722795, 383744, 2472458, 4309306, 4722173, 2924185, -35256, -1435093, 5866, 2275832, 2907128, 2627607, 4169104, 7913038, 10907562, 10614820, 7945628, 5723372, 5247665, 5450039, 4950005, 3804596, 2945760, 2605438, 2071674, 987796, 119005, 262747, 852751, 564286, -604999, -745403, 1809092, 6024873, 8567784, 7016694, 2576678, -773780, -147827, 3353570, 5984712, 5467714, 3059686, 1377120, 1167859, 1113209, 230309, -803984, -924588]
4647i24588N78998M3678j071641j241099M5101J625045K028717J068500m48442
4638A704269k061394l497969l510825r54049K454507K894891m95372l589349k501883
4629i557174J230638L486020L533841L426212K962946J04825l807511m376101
4621b996304q22645K339761K156333J265904K426554L296276O68366l201359l269566
4612A863320O55054L350225J234945l404242n779400l806350O34690L992785M109549
4603B850576J914480J82318L24204J157990J133615K64907q87228k301096l339687
4594A300079k472920J34036J605067J8951k502346k640460l94869J691180K543297
4585g17985L055168L434314K854186J415881N7288j138137k366582k530742p49619
$$ y = [-924588, -345590, -301912, -1373553, -2614652, -2569551, -944506, 1084211, 2152711, 1704269, -357125, -3855094, -7365919, -8319968, -5865461, -2970570, -3465942, -7055291, -9557174, -8326536, -4840516, -1306675, 2119537, 5082483, 5187308, 1379797, -2996304, -3818949, -1479188, 677145, 1943049, 4369603, 7665879, 8334245, 5132886, 1863320, 2518374, 5868599, 7103544, 3699302, -2080098, -5886448, -5251758, -1258973, 2850576, 4765056, 4947374, 5271578, 6429568, 7563183, 7828090, 6940862, 4639766, 1300079, -1172841, -1038805, 566262, 585213, -1917133, -4557593, -4952462, -3261282, -717985, 2337183, 5771497, 8625683, 10041564, 10098852, 8960715, 6594133, 4063391, 3313772]
4576C313772J208756Q65477r82847j320701J48017O05341q24260j360915N68674
4567B221314K202752O83249k164199k322867O87854L616019M241270L375267K187580
4558A4728239M80759j499248k057192n68943P32009l57738k386591k044549P39342
4549G766088K431400J274861j36145M54345Q12965j802844m813677l334046J615242
4540D268189L354114p73339n146388m098290N2493J334590p30665j368109J502682
4531a604723M560280M558880K493149J172920J432046K025252J595992j26792
4523A6107004k100534k767259j845030p86498n55876j22674J371631K335115P48262
4514A2384141k554634m879224n098325l871029j504102J702836L798059K921347
$$ y = [3313772, 4522528, 5388005, 4405158, 3084457, 3232474, 3837815, 3013555, 1652640, 2221314, 4424066, 5107315, 2943116, 620249, 1308103, 4924122, 9165392, 12540659, 14728239, 15208998, 13709750, 11652558, 11083615, 11815624, 11457886, 9071295, 7026746, 7766088, 10197488, 11472349, 11336204, 11790549, 12603514, 10800670, 5986993, 2652947, 4268189, 7622303, 6848964, 1702576, -2395714, -2343221, -1008631, -1739296, -3107405, -1604723, 2955557, 7514437, 10007586, 11180506, 12612552, 14637804, 16233796, 16107004, 14006470, 11239211, 9394181, 8607683, 8051807, 7929133, 9300764, 11635879, 12384141, 9829507, 4950283, -148042, -4019071, -5523173, -3820337, -22278, 2899069]
4506B899069M32755n71604L21259Q19298J79642K24619J683453K687336J897278
4497A0573105M98254m867J59766K6693r07622k875365n290959o017581l569905
4488g408481k3594J100031k2095J96251K737528M005352J444273k284043l098793
4479c353571q94037J340685J876333J320788O30890J49510m1816j24556l19815
4470E84411j98441P00108J490957Q77950n21184r56951o67425j456593k890009
4461c037177k226335R85153L686324L973074L437144L258637J846602j261403
4453A0662019k981230j328236Q24756J08357k193230l046019k844134l431953
4445d229670l473539p21868K785885L037415P96873Q53756M367655O853689M839779
$$ y = [2899069, 3331824, 2760220, 3081479, 3900777, 4080419, 4305038, 5988491, 8675827, 10573105, 11071359, 11066492, 11226258, 11252951, 10345329, 7469964, 2179005, -3838576, -7408481, -7432075, -6332044, -6354139, -6157888, -3420360, 584992, 2029265, -254778, -3353571, -4247608, -2906923, -1030590, 290198, 921088, 1070598, 1028782, 904226, 584411, 385970, 1086078, 2577035, 3454985, 2933801, 1976850, 1309425, -147168, -3037177, -5263512, -4278359, -592035, 3381039, 6818183, 10076820, 11923422, 10662019, 7680789, 6352553, 7177309, 7285666, 5092436, 2046417, -797717, -4229670, -7703209, -8425077, -5639192, -2601777, -1804904, -951148, 3416507, 10270196, 15109975]
4436A5109975L62145k668105l185698k453513j546783r37761o77947l4171J395910
4427E364052K028679l098l323281m208043j657023J136401J392447K26681J07458
4418A064273J093559J416191L24239j246708j946101j020021J016319K282274
4410B984025J419825j34044M22064K991246L946537J032482l139384m424639k517962
4401B580150o86319q27640j284116n176K143609K658185J064908m55547l83180
4392D804874j65614j794067m078794l689958p9904L156079L002948Q20968l92023
4383A584509m11272q85354j656763j183975J15430K09768r08659r79043P20159
4374c395200K063285J296203p51439k353237k717570j645701N27720K196955J822813
$$ y = [15109975, 15472120, 12804015, 9618317, 7164804, 5618021, 4680260, 4002313, 3968142, 5364052, 7392731, 7389633, 4066352, -141691, -1798714, -662313, 730134, 956815, 1064273, 2157832, 3574023, 3898262, 2651554, 705453, -314568, 701751, 2984025, 4403850, 4269806, 4691870, 7683116, 11629653, 12662135, 9522751, 5098112, 2580150, 1893831, 1066191, -217925, -223101, 1920508, 4578693, 5643601, 5188054, 4804874, 4639260, 2845193, -1233601, -4923559, -5003463, -1847384, 1155564, 1976532, 1584509, 1173237, 287883, -1368880, -2552855, -2437425, -2227657, -3136316, -4115359, -3395200, -1331915, -35712, -787151, -3140388, -5857958, -7503659, -6975939, -4778984, -2956171]
4365b956171L81972K39864J376604J453200L7067m63277R17379J876876R61436
4356C824950J44455R40879J107013j576850m692712m137502k93003K496591K075687
4347a10492O55082P08455J740963J947556Q66353n68545j226038n13294R82307
4338D482347J502371j3781k122791k343511m69013J132255Q34795k08930j31654
4329B662088Q61753J043143q6423r49427q9617J663998K089122M82238j328016
4320F348859j433698m10609k17848j060676j104235M64034J904647J419228k20311
4311E689391q68109n012P84937J8124j999512l573375l155217p62246J742317
4302b128702K255639P33739o41251j3580J968980K993371J676817j036461k795069
$$ y = [-2956171, -2574199, -2334335, -957731, 495469, 532536, 69259, 986638, 2863514, 3824950, 3969405, 4910284, 6017297, 4440447, -252265, -4389767, -4682770, -2186179, -110492, 544590, 1253045, 2994008, 4941564, 5807917, 5239372, 4013334, 3500040, 4482347, 5984718, 5970937, 3848146, 1504635, 1035622, 2167877, 3002672, 2793742, 2662088, 3523841, 4566984, 4480561, 3531134, 3441517, 5105515, 7194637, 7676875, 6348859, 4915161, 4504552, 4286704, 3226028, 2121793, 2585827, 4490474, 5909702, 5689391, 4821282, 4816270, 5601207, 5619331, 3619819, 46444, -3108773, -3871019, -2128702, 126937, 860676, 219425, 205845, 2174825, 5168196, 6845013, 5808552, 3013483]
4293C013483k086501J61226J521604R86401P1420J24390p9209k044838m042763
4284b374787k965624N52608K366151Q12632j076253p71781p1475j278942k639710
4275g447181r83526K913859N024728L381435j5989k214863k121655o12632N90526
4266a485298N22566K65390J503599L240475K268747j751111m519666k800317P29162
4257b026453J442392o48198j942830j220773m71890n94826k71071R26547J729317
4248c077785J651336J459904J257353O57661M12908J218526J634690Q6922j945811
4239C355704j925227m67831l2791m08918M39543J845184J303957n68598q13670
4230B727353K42328n86886k904339k461043J341334L425316Q04922k842342l144091
$$ y = [3013483, 926982, 1088208, 2609812, 3596213, 3667633, 3792023, 3712814, 1667976, -2374787, -5340411, -4787803, -2421652, -1609020, -2685273, -3457054, -3528529, -4807471, -7447181, -8430707, -5516848, -492120, 2889315, 2873326, 658463, -1463192, -2075824, -1485298, -962732, -697342, 806257, 4046732, 6315479, 4564368, 44702, -2755615, -2026453, -584061, -1232259, -3175089, -4395862, -4867752, -5462578, -5733649, -4807102, -3077785, -1426449, 33455, 1290808, 1948469, 2361377, 3579903, 5214593, 5301515, 3355704, 1430477, 962646, 929855, 520937, 960480, 2805664, 4109621, 3541023, 2727353, 2969681, 2382795, -521544, -2982587, -1641253, 1784063, 2588985, -253357, -3397448]
4221c397448q58558J233709K801813M029176L257536J04432k464885k361974j387962
4212I55839j234785k87285K376486L726836J362755k056536k791152j324853j43611
4203E83694M85349R36995p8831k560077l563842k084494j360552k581322j557026
4194a1780106L548957P011905M202194m11164j015662O9037q76854J4467N025368
4185E788142L872726j2113440k8939128k2683201N105931K4610473J7064516j428292
4177h722273o045912L233384R203228N962269J939058J270735j66395k398238
4169D275856m92474L850870L136130k500763m681414j063279J299504q46411j747383
4160A230636J672021L636862K58475l021596j012585K258279J101814k052000
$$ y = [-3397448, -4256006, -3022297, -220484, 3808692, 7066228, 7170660, 4705775, 2343801, 955839, -278946, -566231, 1810255, 5537091, 6899846, 4843310, 2052158, 727305, 583694, 1069043, 2006038, 1927207, -632870, -4196712, -6281206, -7641758, -10223080, -11780106, -8231149, -1219244, 2982950, 2571786, 1556124, 1625161, 748307, 762774, 5788142, 9660868, -2452572, -31391700, -54074901, -48968970, -24358497, -7293981, -8722273, -14768185, -11534801, -2331573, 3630696, 5569754, 6840489, 6674094, 4275856, 3783382, 7634252, 10770382, 8269619, 3588205, 2524926, 3824430, 2978019, 1230636, 2902657, 6539519, 6797994, 3776398, 2763813, 5022092, 6123906, 4071906]
4152D071906j869237K88671k39903k353871j335146K324015L533526Q86331k042925
4143C263367l001524k874392j643159J771498N401556N285169J486968j552855
4135H136628j609099j173762k176622k671834q54587J429767J787649R75227Q98642
4126D742009J269797Q73244K56895M11817J59860k221276n365813n622514j808888
4117g304869K965979M963974L796635J806183N13441r02533l467545n894564n505770
4108i029069j877561J755681K043405k49105j380800J20424J639047O88811j348858
4099g638025j484343O02570K823431M018797M370074L195585m20341m506623n059337
4090d098212j412912K111512J955145J67902P25162L072291L124460o3230k655421
$$ y = [4071906, 2202669, 2491340, 2251437, -102434, -1437580, 886435, 4419961, 5306292, 3263367, 261843, -2612549, -4255708, -2484210, 2917346, 8202515, 9689483, 8136628, 6527529, 5353767, 3177145, 505311, -349276, 1080491, 2868140, 3843367, 4742009, 6011806, 6885050, 7141945, 7553762, 7713622, 5492346, 126533, -5495981, -7304869, -4338890, 625084, 4421719, 6227902, 6741343, 5838810, 2371265, -3523299, -9029069, -10906630, -9150949, -7107544, -7356649, -8737449, -8617025, -6977978, -6289167, -7638025, -9122368, -8519798, -5696367, -1677570, 2692504, 5888089, 5467748, 961125, -4098212, -5511124, -3399612, -1444467, -1276565, -551403, 2520888, 5645348, 5582118, 2926697]
4081B926697j702698R79247J988392O41097j606234l716957n009317m306746j372568
4072a1179087J871749L351253L095117K092336L94816j765147k537920o76217
4064e353100J853550K150210N35221l40316N0466k39148j559313j710850J06955
4055d506325J573505R15769l73944k40829P12765O53254m94847j379866j372683
4046d513201p79667J76779J312967K212363K826873L365162L129423J037072k063879
4037F703892l514566k257330k15020P38572R79928J112767L81886j065768j040025
4028A824336J109890K320978K40455k489857j979978P52407J513713l76412j610517
4019A305015p77085k30469j483622k730454k146205m19183J144193K212454K250947
$$ y = [2926697, 1223999, 2203246, 4191638, 4832735, 3226501, -490456, -5499773, -9806519, -11179087, -9307338, -5956085, -2860968, -768632, -373816, -2138963, -4676883, -5353100, -3499550, -1349340, -814119, -1154435, -1103969, -1343117, -2902430, -4613280, -4506325, -2932820, -2017051, -2390995, -2631824, -1919059, -1265805, -1760652, -3140518, -4513201, -5292868, -5116089, -3803122, -1590759, 1236114, 4601276, 7730699, 8767771, 6703892, 3189326, 931996, 716976, 1455548, 2435476, 3548243, 3930129, 2864361, 1824336, 2934226, 5255204, 5495659, 3005802, 1025824, 1778231, 3291944, 2915532, 1305015, 527930, 297461, -1186161, -3916615, -6062820, -6482003, -5337810, -3125356, -874409]
4010h74409O07961j356753j146810R39877J789367M38466k68583J380350K669026
4001D178492N07203l776742o253418n177734j839527J640910L419220K502379
3993d799217Q6389j162463n54537j95453j089175j128473R67082K541055Q10705
3984d524087k444712l330043j317561J044048K518203L731799M260432K851359
3976B789438L69939p77371l15842l02370j429706j871075l33462K031001L341922
3967C502474K862942R18285j498736l017087l082690k482330j701370j46278J548943
3958c095847P23169l085815n398907k216828L435643N047186J832738p73711J60540
3949c371832J444162J19115j915948k035195j122406q24044l38379J086115J703175
$$ y = [-874409, -266448, -1623201, -2770011, -1830134, -40767, 397699, 129116, 1509466, 4178492, 4685695, 908953, -5344465, -10522199, -12361726, -10720816, -7301596, -4799217, -4712828, -5875291, -6429828, -6625281, -7714456, -8842929, -7875847, -5334792, -4524087, -6968799, -10298842, -11616403, -10572355, -8054152, -4322353, -61921, 2789438, 3159377, 2382006, 2066164, 1763794, 334088, -1536987, -1870449, 160552, 3502474, 6365416, 7283701, 5784965, 2767878, -314812, -2797142, -4498512, -4644790, -3095847, -2372678, -5458493, -10857400, -13074228, -9638585, -4591399, -2758661, -3532372, -3371832, -1927670, -1808555, -3724503, -5759698, -6882104, -7706148, -8044527, -6958412, -5255237]
3940e255237L18364j029778k98575J249796J666964J562622J900256J294783j250247
3931A58948l351782k443284Q7007J286786J154486J354111J482162M02706n06523
3922c75383N21865J803177O59548j640622j856746n19978p57455k078519q60814
3913e104927K667887L619404J26138l327951k607396M46680J865576J255215M81286
3904e78088l09079j901676l287111k901909j322430j71505N26377J634698K604954
3895e705769K120277M19540q40991o54271O31088K051178K546283J609610J70113
3886B347058k97588q1781r25940k672798k630097N0971J838824n30665m529854
3877g431870m446430Q20108N901895N769257J793938p15898M93174K397266J513443
$$ y = [-5255237, -4936873, -5966651, -6265226, -5015430, -3348466, -1785844, 114412, 1409195, 158948, -3192834, -5636118, -5549111, -4262325, -3107839, -1753728, -271566, 131140, -375383, 146482, 1949659, 2609207, 968585, -888161, -1408139, -2165594, -4244113, -5104927, -2437040, 1182364, 1308502, -2019449, -4626845, -4180165, -2314589, -1059374, -578088, -887167, -2788843, -6075954, -8977863, -10300293, -10471798, -9945421, -8310723, -5705769, -3585492, -3165952, -4006943, -4661214, -4030126, -1978948, 567335, 2176945, 2347058, 2049470, 1967689, 1041749, -1631049, -4261146, -4210175, -2371351, -2902016, -7431870, -11878300, -11058192, -5156297, 612960, 2406898, 1691000, 2184174, 4581440, 6094883]
3868F094883j165115j831745L18737J657523m70052l504637l351166l81549J730335
3859i02786K009335K654901L654645J971258k480743m954127k673595P13244Q83318
3850H75450p57999n81350N75185o84978l615380l834120j21909L746960M188883
3841b09258J397856k173746l876105j899219K617239N203902L049162o53344j091540
3832B364947P11667k78486m442124o446448l685947j24192K70553j130575j435281
3823a4195886q65740m74727Q41550L578267N111081L520442J285893J665247L628692
3814D094819L886195K103580N97581J95817k44972j033599j295611r31887o50644
3805F721279o30946q67106j773144k864345k388279k0011J902181J748118J069959
$$ y = [6094883, 4929768, 3098023, 3416760, 5074283, 4604231, 1099594, -2251572, -2633121, -902786, 1106549, 3761450, 7416095, 9387353, 6906610, 1952483, -721112, -7868, 875450, 117451, -463899, 111286, -573692, -4189072, -8023192, -8145101, -4398141, -209258, 1188598, -985148, -4861253, -6760472, -4143233, 1060669, 4109831, 3456487, 2364947, 3076614, 2798128, -1643996, -8090444, -11776391, -11900583, -11630030, -12760605, -14195886, -15061626, -15536353, -14694803, -11116536, -6005455, -2485013, -1199120, 466127, 4094819, 7981014, 10084594, 10682175, 10877992, 10633020, 9599421, 8303810, 7371923, 6721279, 6090333, 5223227, 3450083, 585738, -1802541, -1822552, 79629, 1827747, 2897706]
3796B897706J508880J723280K46709j121860l44037O87065q55914l355932k993835
3787a607938k09816R98624j96489m75489J462959K585900O17970k637215m484967
3778c946461m327726k293772J506508M931201M582587N38059k729430k083580
3770c822614L17133O55962j440724l355130k954483j2501L911283N822555L698347
3761B819828m03141k080788m27016P85448r67905l187375k556104J91242K160194
3752c665617K398628J468973o03019l087307l422967l61200L410192M498105L087096
3743C722884J521905M76068o69022j346071p41904Q0307k15628p65305k15823
3734A847411N53135Q8943q25355q05692o23252j378780j773863m75547P34156
$$ y = [2897706, 4406586, 6129866, 6376575, 5254715, 4910678, 5597743, 4741829, 1385897, -1607938, -1817754, -819130, -1015619, -1491108, -28149, 2557751, 3175721, 538506, -3946461, -8274187, -10567959, -9061451, -4130250, 452337, 990396, -1739034, -3822614, -3505481, -2849519, -4290243, -7645373, -10599856, -10612357, -6701074, -878519, 2819828, 2416687, 335899, -91117, 694331, -273574, -3460949, -6017053, -5825811, -3665617, -1266989, 201984, -401035, -3488342, -6911309, -7272509, -3862317, 635788, 3722884, 5244789, 5720857, 5051835, 3705764, 2963860, 3044167, 2828539, 2063234, 1847411, 2400546, 2489489, 1664134, 858442, 235190, -1143590, -2917453, -3393000, -2658844]
3725b658844j58006j344955k03797J603078Q87679r13779p244K465615J813739
3716A483486j662300k414437R25386K790232j34543l377362k019232J823756L141395
3707E56381J352673q17680k182745k582519p30240L088669M866898J791171k871678
3698B470930l948333j400091R48550J735981K495190L112107J709887j209168
3690E915053k709601j683447J72691J449112J939055R94164j603126l562963k489446
3681a578508o5476l2876k089029k011369J557376M750700M324052J961413P00617
3672G516900M01679o38500k045771k166691j140073q13581k151439m165089n001973
3663a0204538l476359l13415J881082J102662j442520k697858j751655m88353
$$ y = [-2658844, -2816850, -4161805, -4365602, -2762524, -1874845, -2788624, -2795868, -330253, 1483486, -178814, -2593251, -1667865, 1122367, 987824, -2389538, -4408770, -2585014, 556381, 1909054, 1091374, -1091371, -3673890, -4404130, -1315461, 3551437, 5342608, 2470930, -1477403, -2877494, -1928944, -192963, 2302227, 5414334, 7124221, 5915053, 3205452, 1522005, 1694696, 3143808, 5082863, 6077027, 4473901, 910938, -1578508, -1643984, -1676860, -3765889, -5777258, -4219882, 530818, 4854870, 6816283, 7516900, 7918579, 7280079, 5234308, 3067617, 1927544, 1113963, -1037476, -5202565, -10204538, -13680897, -13994312, -12113230, -11010568, -12453088, -15150946, -16902601, -17390954]
3655a7390954l9144Q85639L115599M836241L955644J098305j273828j667148m77874
3646f957520Q11206O76713r86078k075514n36330K355168L090642Q09777j447676
3637d259612j268751J62892J046475J897428L269097L339708P77478k121994k457966
3628C84755j255082j449675k559424j393368K132240L971339J767824j604759
3620f150k040334N47303K794222K262860m09134k929572l532112j988119N61638
3611d739398K480567K555696M97482k719690m857406l884700l50934K549958K357678
3602f110747J19199j235950m86317J131412J935676J127350j152122l503064l671871
3593a1846434j018772J932812K221877K92889p71124N42919K830589M400221M935703
$$ y = [-17390954, -17430098, -16544459, -13428860, -8592619, -4636975, -3538670, -4812498, -6479646, -6957520, -6146314, -5469601, -6455679, -8531193, -9067523, -6712355, -3621713, -2811936, -4259612, -5528363, -5365471, -4318996, -2421568, 847529, 4187237, 4964715, 2842721, 384755, -870327, -2320002, -4879426, -6272794, -4140554, -169215, 1598609, -6150, -2046484, -1499181, 1295041, 3557901, 3148767, 219195, -3312917, -5301036, -4739398, -2258831, 296865, 794347, -1925343, -6782749, -10667449, -11018383, -8468425, -6110747, -5991548, -7227498, -7713815, -6582403, -4646727, -3519377, -4671499, -8174563, -11846434, -12865206, -10932394, -8710517, -8417628, -9188752, -8645833, -5815244, -1415023, 3520680]
3584C520680M370572K416990j46628j611402j446349p76529m17321O14P35285
3575F645912J422684J980104K307922J289827j679535m327846l521564j1476J934113
3566F040141M84820j423909j099320l5695o45021k083796k188426j219433o87723
3557b858362l12964Q76443J966250J591805N37166K9695j004283l667501n494628
3548h336379l141822J884735M296699K109058j078087j611399j33598Q05998M99346
3539d705449j36071l58083J06046R58476R79910m49193j505028m1979K525590
3530b625781K661762L32768o56315R95716J696566q90308l509735k529174M7072
3521d477429Q3402j715363j210952K090771M285391L317861J546893J244952J275875
$$ y = [3520680, 7891252, 10308242, 10161614, 8550212, 7103863, 6327334, 5910013, 5910627, 6645912, 8068596, 10048700, 12356622, 13646449, 11966914, 7639068, 4117504, 4106028, 6040141, 6524961, 5101052, 4001732, 3966037, 3321016, 1237220, -951206, -2170639, -2858362, -3171326, -2294883, -328633, 1263172, 1800338, 1830033, 825750, -2841751, -8336379, -11478201, -9593466, -5296767, -3187709, -4265796, -5877195, -6010793, -5204795, -4705449, -4841520, -5199603, -5093557, -4135081, -3155171, -3604364, -5109392, -5151371, -2625781, 35981, 368749, -287566, 708150, 2404716, 1514408, -1995327, -4524501, -4477429, -4394027, -6109390, -7320342, -5229571, -944180, 2373681, 3920574, 5165526, 6441401]
3512F441401k45389k679262l843486k656841J12969K514949K643078N85913j087588
3503A785744m21173J003215M44785j499184j858287l95399l0346j708083k772444
3494e451172j717895o67629j118061r73858J363793L317072K109048k44654P065
3485c376291K172203K376977J2575j575121q29072j43479j363631k767683k083863
3476g577385K21119K215429K950230K403880R47754n8925Q35288K580297K105079
3467F622766j208537l794725k624442L45524J017518r64431k219487j048595L05830
3458c568579m57368k153564k126202k79050R51975K93246o25931O5915J477165
3449f422393J226576o86591j371487P54142L167970K601550p6112j102206L68615
$$ y = [6441401, 6196012, 3516750, -326736, -2983577, -2870608, -355659, 2287419, 2873332, 1785744, 1364571, 2367786, 2812571, 1313387, -544900, -940299, -970645, -2678728, -5451172, -7169067, -7836696, -8954757, -9928615, -8564822, -5247750, -3138702, -3383356, -3376291, -1204088, 1172889, 1185464, -389657, -1218729, -1362208, -2725839, -5493522, -7577385, -7356266, -5140837, -2190607, 213273, 1161027, 1102102, 1937390, 4517687, 6622766, 5414229, 1619504, -1004938, -659414, 358104, -606327, -2825814, -3874409, -3568579, -4025947, -6179511, -8305713, -8584763, -7632788, -7339542, -7965473, -7899558, -6422393, -5195817, -5882408, -7253895, -6499753, -3331783, -730233, -806345, -1908551, -1539936]
3440a539936R65930j372594l665663k015407K557091N266743L709746K27182j710847
3431B422245j166062N42836J808317J678119K07596j318041j377573m0842Q41257
3422C597852k31329k553659l927625l005925o23268J255424J793259K020728K885042
3413A210499L318121J727027q84430j564128J87777J235403m18649k337617j787616
3404F86387p52148k814278o382635n948042m46307M445714M106014Q89229l69967
3395f586033P44663J272570K57832q29397j617326k886412l631388j751163K055972
3386a2970682M298086L351353J410446Q46392J153602Q85281L84534O59818J048344
3377A067174J04187j873621k996350k227400k76657J745669L199541L445551J951518
$$ y = [-1539936, -574006, -1946600, -5612263, -7627670, -5070579, 196164, 3905910, 4133092, 2422245, 1256183, 1799019, 3607336, 5285455, 5493051, 4175010, 2797437, 2756595, 3597852, 3366523, 812864, -3114761, -6120686, -6743954, -5488530, -3695271, -1674543, 1210499, 4528620, 6255647, 5371217, 3807089, 3994866, 5230269, 4811620, 2474003, 686387, -65761, -2880039, -9262674, -15210716, -15657023, -11211309, -7105295, -6216066, -6586033, -5841370, -4568800, -4310968, -5140365, -6757691, -9644103, -13275491, -15026654, -12970682, -8672596, -5321243, -3910797, -3064405, -1910803, -1025522, -640988, 18830, 1067174, 1171361, -702260, -3698610, -5926010, -6202667, -4456998, -1257457, 2188094, 4139612]
3368D139612o12697k465751k605961j835140j209117l62482J424542L116092K660972
3359B250070J3674k413534l103016l369708m453080m560334j522486K662324L501920
3350a0994170N10752j607488K53067L042775K392425p94285k184585p04349P56590
3341i329268P59122J136138K679619K931945J48833l475741m789288l730836k143314
3332a5812790l77563K211527M473162M129791J289097j119618j085105O8567m3766
3323f266698j397107j658712N03979L277187L480364L62098l069724l147742K75257
3314g641098L605324L539673M24624k677546l335084j644349M50359J144015N03641
3305e630441L24188J646624K860023J781130o79442j358913K45667R81026n78466
$$ y = [4139612, 3526915, 1061164, -1544797, -3379937, -4589054, -4951536, -3526994, -410902, 2250070, 2263744, -149790, -3252806, -6622514, -11075594, -15635928, -17158414, -14496090, -10994170, -10483418, -12090906, -11837839, -8795064, -6402639, -7196924, -9381509, -10085858, -9329268, -8570146, -7434008, -4754389, -1822444, -1673611, -5149352, -9938640, -13669476, -15812790, -16190353, -13978826, -9505664, -5375873, -4086776, -5206394, -6291499, -6222932, -6266698, -7663805, -9322517, -8818538, -5541351, -2060987, -1698889, -4768613, -7916355, -7641098, -4035774, -496101, -71477, -2749023, -6084107, -7728456, -7278097, -6134082, -5630441, -5306253, -3659629, -799606, 981524, 302082, -1056831, -811164, 169862, -408604]
3296d08604j173902J727730M580734K312552l479680o133165l491456m76706r92641
3287g535138k569096j662171L65233M28528n05301O86007L584034M814467L431612
3278A038175J812672J488222J556871J281498J119657Q78607l93347k321234l391263
3269C069858l292551k736260j319238J486071L526616J877319k021629l150055
3261b559869r7657K494022P47687k854976l513157p36129K251718L410892K962519
3252B105050J366153o60320j504817p87571n94049j980632k313527O40185M069453
3243C39925L715820O18518l86862J784203L191072J192661k474508n313033o367093
3234c699297m508510P61408N851621N495436L30022k912148r55577J511112l8454
$$ y = [-408604, -1582506, 145224, 4725958, 7038510, 3558830, -2574335, -6065791, -6542497, -7535138, -10104234, -11766405, -11401172, -10972644, -11477945, -10791938, -7207904, -2393437, 1038175, 2850847, 4339069, 5895940, 7177438, 8297095, 9175702, 8782355, 6461121, 3069858, -222693, -2958953, -4278191, -2792120, 734496, 2611815, 590186, -2559869, -2657526, -163504, 584183, -2270793, -5783950, -6520079, -4268361, -857469, 2105050, 3471203, 2810883, 1306066, 518495, -75554, -2056186, -4369713, -3729528, 339925, 4055745, 4674263, 4287401, 6071604, 9262676, 10455337, 7980829, 2667796, -3699297, -8207807, -7446399, -1594778, 3900658, 4230680, 1318532, 362955, 1874067, 1835613]
3225A835613k710184j712767J320964J360879j531523k787336r98737O55539K97002
3216d270550l48208J39490Q50624J017658J125405J194903Q23859P44830J465792
3207B743803J104356j928115m849411l358384J588503M394952K769320N02617
3199B967641J079498K891737K815098Q30856j258589k767258l564031k966489
3191B8463j065980P82472J878604K463849J795206r49860l494839k237653J837346
3182A037608L562191J429346p3029J629954K588011m91053l860802k885127l0201
3173B906898l88535k748741k190764Q03221J411886m82240j43766K864369L167004
3164E199332r97397m019827j699325K323782K808785O04766k57234O82694J005689
$$ y = [1835613, -874571, -2587338, -1266374, 94505, -1437018, -4224354, -5223091, -4567552, -4270550, -4618758, -4479268, -3628644, -2610986, -1485581, -290678, 533181, 1278011, 2743803, 3848159, 1920044, -2929367, -6287751, -4699248, -304296, 2465024, 2967641, 4047139, 6938876, 9753974, 10584830, 9326241, 6558983, 2994952, 28463, -1037517, -255045, 1623559, 4087408, 5882614, 4932754, 1437915, -799738, 1037608, 4599799, 6029145, 5956116, 7586070, 10174081, 9683028, 5822226, 2937099, 2906898, 2518363, -230378, -2421142, -1617921, -206035, -688275, -832041, 2032328, 5199332, 4201935, 182108, -1517217, 806565, 3615350, 4220116, 3962882, 4645576, 5651265]
3155E651265K36407k07052j54744k90528o1963J022768J475773O3950j473608
3146F262268q33365R91168J171246o61874k458248l229463l578129l379389j921038
3137g636824j10915L37279o9255P75053K671086K799558J93873k216004j568407
3128d824556J071179K667938K427287J903495J838915J271617j36555r74761k36841
3119E007718P69158N8219k085022l281937k191330k6155J506496K285978K760958
3110D804083K257000R7038k365436k904068j453500n9283K16940L02977P71853
3101A667604P28302j83795p31046j59065M72763K03492k39291J5364M58498N04630
3091B737456O89065J169499P17968j151000k652397k174183p90614m03445q02052
$$ y = [5651265, 5887672, 5680620, 5525876, 5235348, 5173385, 6196153, 7671926, 7735876, 6262268, 5428903, 6420071, 7591317, 6929443, 4471195, 1241732, -2336397, -5715786, -7636824, -7747739, -7410460, -7479715, -6704662, -4033576, -1234018, -1040145, -3256149, -4824556, -3753377, -1085439, 1341848, 3245343, 5084258, 6355875, 6219320, 5244559, 5007718, 5776876, 5835095, 3750073, 468136, -1723194, -1749349, -242853, 2043125, 4804083, 7061083, 7158121, 4792685, 1888617, 435117, 375834, 592774, 895751, 1667604, 2395906, 2212111, 1481065, 1322000, 1794763, 1998255, 1758964, 1774328, 2232826, 2737456, 3426521, 4596020, 5313988, 4162988, 1510591, -663592, -1454206, -1857651, -2659703]
3082b659703p17944m80839j186894k185177j856518k82264J046678J533587J466361
3073e322713O22866r14146j578556l85154R12116L59530p91444l50066N63058
3064f884509m69877k002170n25351K791928K778023j296628l711355j066798K452440
3055g934297K167779K89388J340185M038780L582286j20814k407956j368813M7970
3046c65492k13716l52790J234711K963616K893203J507927Q356j584568l008909
3037C082338k849041r11810M60362n45172k376135k403435q47491j53197j045215
3028g588796j560967k89714J365793J137241j010241k847085k576389o69999J016868
3019a3023289J300932N60349n851M01227J534682K375957K186043J434822J286411
$$ y = [-2659703, -3377647, -3858486, -5045380, -7230557, -9087075, -9369339, -8322661, -6789074, -5322713, -4699847, -5613993, -7192549, -7577703, -6665587, -6306057, -7097501, -7447567, -6884509, -7354386, -9356556, -9881907, -7089979, -4311956, -5608584, -9319939, -10386737, -7934297, -5766518, -5477130, -4136945, -98165, 3484121, 3363307, 955351, -413462, -365492, -579208, -931998, 302713, 3266329, 6159532, 7667459, 7675815, 6091247, 3082338, 233297, -678513, -218151, -763323, -3139458, -5542893, -6390384, -6543581, -7588796, -9149763, -9439477, -8073684, -6936443, -7946684, -10793769, -13370158, -14040157, -13023289, -11722357, -11162008, -11167859, -10766632, -9231950, -6855993, -4669950, -3235128, -1948717]
3010a948717J893206J910885M09639j484218j983573j037959J15489J181583K580182
3001A636517L341366J891322o64950r77555J610545L418428J657167j333165j703579
2992H876096K34175J132952j17881j633092k123567j893330q37033J132763K002894
2983F773977k57487l368557k535680K389067N505182K615745l044477n503253
2975B574517l718633j320457n66035k74409O24689Q81430o90889k662093k351850
2966g503730P62475M046132M480659K069999l44362q40689o21821j374694k060159
2957a386190p81191J159270N02218k498235l530058m65027L230336L444554Q65376
2948E41053j229768k180531l548379m997641m253025j050659J820778K027062
$$ y = [-1948717, -55511, 1855374, 2265013, 780795, -1202778, -2240737, -2125248, -943665, 1636517, 4977883, 6869205, 6204255, 5226700, 6837245, 10255673, 11912840, 10579675, 8876096, 9110271, 10243223, 10125342, 8492250, 6368683, 4475353, 3638320, 4771083, 6773977, 6516490, 3147933, 612253, 3001320, 8506502, 11122247, 8077770, 2574517, -1144116, -2464573, -3030608, -3305017, -2680328, -1798898, -2489787, -5151880, -7503730, -6741255, -2695123, 1785536, 3855535, 3511173, 2670484, 2048663, 673969, -1386190, -2167381, -1008111, -505893, -3004128, -6534186, -6999213, -3768877, -324323, 541053, -688715, -2869246, -6417625, -11415266, -15668291, -16718950, -14898172, -12871110]
2940a2871110L66743n81995O02482K770131L228264P18620k355447k091621J846086
2931h367847N253058M702648J678567l46747n93281k65439N53312K026629K297686
2922F938586k21485l313786l334099m62708J879119K139281J457351J27904k417643
2913B792520m345765k930356J77301J18893l535999n326088k080606K297799L110175
2904i722126J476254J008124J641139J113749j06626J57672J500949J656913M25312
2895h48640n37418q34773j166522j193897n55313o92424k483846l432886p80191
2886a2525910L695288N740331M562585K734004J046902j809170m538026l417664
2878d511660J532560N208849M270523J380353L23530N72808l74828k254713k974411
$$ y = [-12871110, -12504367, -13086362, -12483880, -9713749, -6485485, -5766865, -8122312, -10213933, -8367847, -3114789, 1587859, 3266426, 2919679, 2326398, 2060959, 2614271, 4640900, 6938586, 6717101, 3403315, 69216, -393492, 1485627, 3624908, 5082259, 5210163, 2792520, -1553245, -4483601, -4306300, -4187407, -7723406, -13049494, -15130100, -12832301, -9722126, -8245872, -7237748, -5596609, -4482860, -4589486, -4431814, -2930865, -1273952, -848640, -1386058, -2220831, -3387353, -4581250, -5136563, -5828987, -8312833, -11745719, -12525910, -8830622, -3090291, 1472294, 4206298, 5253200, 3444030, -1093996, -4511660, -2979100, 2229749, 6500272, 7880625, 8204155, 8776963, 8402135, 6147422, 3173011]
2869C173011k313577j601202j076969k66337J89550l94047q71261M6668J068904
2860b045260j36233l090011m637658k988092L71501K916808L492699K312581K10107
2851c593558j589114k034558j056198O17615K194386K893901K090956L26302o57494
2842h07762o0059O99468K36561l85228M98766J836405J075211j550536k879397
2833a336571j477417L83997M74940l38390m39220m63366j644334k876007k052152
2824i768520N62702K685374L178187K666563J515213l72533j856336j209536J083287
2815a515599K429088J634556J67895p14683j623106k666296k100148N83452K453235
2806a351606P96748k485105l158004n24456K079365K413472J785074J912309K333887
$$ y = [3173011, 859434, -741768, -1818737, -2085074, -1895524, -2289571, -3160832, -3114164, -2045260, -2181493, -5271504, -9909162, -12897254, -12525753, -9608945, -6116246, -3803665, -3593558, -5182672, -7217230, -8273428, -7655813, -5461427, -2567526, -476570, -150268, -807762, -867821, -168353, 68208, -317020, 181746, 2018151, 3093362, 1542826, -1336571, -2813988, -2429991, -1955051, -2293441, -2732661, -3196027, -4840361, -7716368, -9768520, -9205818, -6520444, -3342257, -675694, 839519, 466986, -1389350, -2598886, -1515599, 913489, 2548045, 2715940, 2001257, 378151, -2288145, -4388293, -3804841, -1351606, -554858, -3039963, -6197967, -6722423, -4643058, -2229586, -444512, 1467797, 3801684]
2797C801684K068079J370934M74738j306230l709406m641605k861885n3470J432914
2788c424247J577797J783547K226646J975603Q63993m76433j728272k536199j939179
2779a676744K12487K133679K107358P82817k48676j117904k716901l972614k835815
2770g332313J63586K016466J269941l14778o45384K51668J319702K113513K489859
2761A332260K102952R80362l41607j442643j885474j006253O99072Q74009j712542
2752c99864m228248k926962R49923K130614j074163l999438k336009J854750L632431
2743f396966K136993Q05428J950534M064689M256206J490781k498353m679629
2735A129683l665376j377439m77422m24792J297282L955039L476362r19012m129658
$$ y = [3801684, 5869763, 7240697, 7715435, 6409205, 2699799, -1941806, -4803691, -4857161, -3424247, -1846450, -62903, 2163743, 4139346, 5003339, 4526906, 2798634, 262435, -1676744, -1464257, 669422, 2776780, 3559597, 3310921, 2193017, -523884, -4496498, -7332313, -7168727, -5152261, -3882320, -4197098, -4842482, -4590814, -3271112, -1157599, 1332260, 3435212, 4415574, 4073967, 2631324, 745850, -260403, 438669, 1312678, -399864, -4628112, -7555074, -6605151, -4474537, -5548700, -9548138, -11884147, -10029397, -6396966, -4259973, -3454545, -1504011, 2560678, 6816884, 8307665, 5809312, 1129683, -2535693, -3913132, -4390554, -4815346, -3518064, 436975, 3913337, 2994325, -1135333]
2726a135333k047642K550532M452174L132399J412359l8024k005502k805758m89853
2717C025352K322363J362566k111431k667814P14248L136515J706361p17993j410274
2708E359893j935055l772402m635529k571596J02592M97183l21609R1790J184236
2699f000497J073018K79491K78294K17383j340010k823997j426648K234959M428845
2690c079162L095858j45067k521763k590343o37739J549687J854206K81073o79210
2681b872460M57770J866313J411619K1720m73890r36159k957194m738715k986595
2672a1207591J519615M321500L570651K063456K121000K208475L92767j991117
2664B998756k475270j125092J56666N10630L46300j93494j167685j900503j616733
$$ y = [-1135333, -3182975, -632443, 3819731, 6952130, 8364489, 8326465, 6320963, 3515205, 3025352, 5347715, 6710281, 4598850, 1931036, 2645284, 5781799, 7488160, 6770167, 5359893, 3424838, -347564, -4983093, -7554689, -7452097, -6954914, -7276523, -7184733, -6000497, -4927479, -4647988, -4369694, -4152311, -5492321, -8316318, -9742966, -7508007, -3079162, 16696, -128371, -2650134, -5240477, -5878216, -4328529, -2474323, -2193250, -2872460, -2414690, -548377, 863242, 884962, 411072, -525087, -3482281, -8220996, -11207591, -9687976, -5366476, -1795825, 267631, 2388631, 4597106, 4989873, 2998756, 523486, -601606, -444940, 65690, 411990, 218496, -949189, -2849692, -4466425]
2655d466425p07138l37069r65211j764337j302126J125590M201514N073731K479868
2646C338397r78238j623953L00729R54219j257305l153144j740832J130464J821861
2637a207802N44740M67802K112926K369245m64483l816319m328577j958771R06195
2628e375044K723349L443215L018862J251975j024948k148121j434651j4836N06534
2619I46335j80452q75472k36823J661470L054667K035837j282594m402558m780111
2610d059701k473771J08154J079949Q85762R34213J381588J228685J38864r99454
2601a775711j323264q14863K22017J456729K055329J094594r49552k217140j766268
2592d018129q29317q16329j181670o33557N34610J083875J074057J397293J504530
$$ y = [-4466425, -5173563, -5510632, -6475843, -8240180, -9542306, -8416716, -4215202, 858529, 3338397, 2360159, 736206, 1036935, 1991154, 733849, -2419295, -4160127, -3029663, -1207802, -663062, -195260, 1917666, 4286911, 3822428, 6109, -4322468, -6281239, -5375044, -2651695, 791520, 3810382, 5062357, 4037409, 1889288, 454637, 439801, 946335, 765883, -109589, -346412, 1315058, 4369725, 6405562, 5122968, 720410, -4059701, -6533472, -6425318, -5345369, -4459607, -3525394, -2143806, -915121, -776257, -1775711, -3098975, -3913838, -3691821, -2235092, -179763, 914831, -34721, -2251861, -4018129, -4847446, -5663775, -6845445, -7479002, -6944392, -5860517, -4786460, -3389167, -1884637]
2583a884637Q1783j878134j459890J734137M143839K969738J18264q30850J82313
2574C176563M14770p72065j016058Q42750K658480K251590N99394J58655J323636
2565I637715K150417J057603j375890l160137k844097r02180O45844M10764o85763
2556D934276p66495J23439j9063j953225l672620l090729p49152J476052K963603
2547g53914L900196L471704Q74520k301503l121596j073390J096111P78335j758907
2538A111556m276854m680477k133651K099044M674644L108357q14767k774307
2530c686455j638813o80604j899930k506568L06913M014041M064436Q35824j064389
2521b255545O8175R97531o81975k754350k135286O03581K647540K841060K100819
$$ y = [-1884637, -1802854, -3680988, -5140878, -3406741, 737098, 3706836, 3825100, 2994250, 3176563, 3591333, 2819268, 1803210, 2645960, 5304440, 7556030, 8155424, 8314079, 9637715, 11788132, 12845735, 11469845, 8309708, 5465611, 4563431, 5209275, 5620039, 4934276, 4167781, 4291220, 4272157, 2318932, -1353688, -4444417, -5193569, -3717517, -753914, 3146282, 6617986, 7492506, 5191003, 2069407, 996017, 2092128, 2870463, 1111556, -3165298, -7845775, -9979426, -7880382, -3205738, -97381, -912148, -3686455, -5325268, -6005872, -7905802, -10412370, -10105457, -6091416, -2026980, -1191156, -2255545, -2187370, -1189839, -1871814, -4626164, -6761450, -6157869, -3510329, -669269, 1431550]
2512A431550J297670N89763R5324j49055m54762r87436j556501k080025k321775
2503d135247j307815J431802M086053M087844J691058k80110p08038j428555l221899
2494B15093l708179j217816K008651L003289K157506J431180O19115j401819l330351
2485b23331k855831n47019R23589Q80735R07747J477371J464066Q56520Q73961
2476C757808J266092M25318j554340k736950k570872k486144k919590k592319
2468i410997j253222k49550K50227J550416L130470K410071p50310k628744q51505
2459g803144J876261J829863l74533j453147o88280k22206r90652j459533m61491
2450i746862J088613J750856J246808K27477n75841p56773m26324M3787O93033
$$ y = [1431550, 2729220, 3318983, 3414307, 3265252, 2810490, 1823054, 266553, -1813472, -4135247, -5443062, -4011260, 74793, 4162637, 5853695, 5573585, 4865547, 3436992, 215093, -3493086, -4710902, -2702251, 301038, 2458544, 3889724, 4508839, 3107020, -223331, -3079162, -3626181, -2702592, -1821857, -914110, 563261, 2027327, 2883847, 3757808, 5023900, 5449218, 3894878, 1157928, -1412944, -3899088, -6818678, -9410997, -10664219, -10913769, -10663542, -9113126, -5982656, -3572585, -4322895, -6951639, -7803144, -5926883, -4097020, -4471553, -5924700, -6612980, -6835186, -7825838, -9285371, -9746862, -8658249, -6907393, -5660585, -5433108, -6008949, -6765722, -7192046, -7148259, -6455226]
2441f455226J750445K487358J488443j147701l066476k300811J75176J707389
2433e361403J155404k42912p18528K35561J577719J667909P586j691621j103725
2424d474010J674858L871176L383691J084307r20213j822614j852875r59625P48847
2415G33542K227684K529709J879111P12191j271637l844165n108353l280804P86522
2406d636200M069691M151621J048019k946980m747987k967543L98723J929755
2398c700901Q51734m66667m60840l21400q96922n58113J650664L300962J942625
2389A341142p64354j446305n6654Q04125M99230P60355K020649K746305K308513
2380H213006J466322J73736j992069l449014k145032L99801L26140k617950m183403
$$ y = [-6455226, -4704781, -2217423, -728980, -1876681, -4943157, -7243968, -7068792, -5361403, -4205999, -4448911, -5167439, -4931878, -3354159, -1686250, -1678664, -3370285, -4474010, -2799152, 1072024, 4455715, 5540022, 4619809, 2797195, 944320, -15305, 733542, 2961226, 5490935, 7370046, 8082237, 6810600, 2966435, -2141918, -5422722, -4636200, -566509, 3585112, 4633131, 1686151, -3061836, -6029379, -5630656, -3700901, -2849167, -3315834, -3776674, -4098074, -4994996, -5553109, -3902445, -601483, 1341142, 576788, -869517, -926171, -122046, 377184, 1137539, 3158188, 5904493, 8213006, 9679328, 9853064, 7860995, 4411981, 2266949, 2666750, 2992890, 374940, -3808463]
2371c808463j983573R82389J221765j98848k79683Q52496Q03185p04287j537776
2362d652795p26872L63674M77727K80k82942l94994o17349p31398l44114M86703
2352f422080J282128J676981J793609J943782J944764J246780J32901J2020J490092
2343E100977K752362J392161k203109m799325l993661p85007J837823J864119
2335A166340l58792k656363k717933j97487K728504L647851K497338R52471j03734
2326D958195r71991j506429j078444j61981k6806o13832n02357P22022J784833
2317B603210J683397O88387p35032k258046k932195k041503o51023j75579K79712
2308c538672K364592M516642L284001p86884k795477p00474J343987l53501k972436
$$ y = [-3808463, -5792036, -4809647, -3587882, -3786730, -4066413, -3213917, -2410732, -3115019, -4652795, -5379667, -5015993, -4538266, -4537986, -4820928, -5215922, -5833271, -6564669, -6908783, -6422080, -5139952, -3462971, -1669362, 274420, 2219184, 3465964, 3598865, 3610885, 5100977, 7853339, 9245500, 7042391, 2243066, -1750595, -2535602, -697779, 1166340, 807548, -1848815, -4566748, -4764235, -2035731, 1612120, 4109458, 5061929, 4958195, 3986204, 2479775, 1401331, 1239350, 1212544, 598712, 96355, 818377, 2603210, 4286607, 4974994, 4239962, 1981916, -950279, -2991782, -3642805, -3818384, -3538672, -1174080, 3342562, 6626563, 5839679, 3044202, 2343728, 3687715, 3334214, 361778]
2299C61778j819794J922555K935428k06240l505629l730356j787560M83133K830273
2290b516412M637206L912795L15412l136205l501598j571471j96158j72662J5540
2281b213553Q37820N28476j872292m005364k579829K064262N623900M753471R36933
2272D073824j708785j383998K62258J196017J112214N11803l48093j064526j124090
2263A526624p88428p95109j100671j146092j101588j314332j053519J52062N90936
$$ y = [361778, -1458016, 464539, 3399967, 3193727, -311902, -4042258, -5829818, -5346685, -2516412, 2120794, 6033589, 6349001, 3212796, -288802, -1860273, -2056431, -2229093, -2213553, -1375733, -847257, -2719549, -6724913, -9304742, -7240480, -1616580, 3136891, 4073824, 2365039, 981041, 1243299, 2439316, 3551530, 4063333, 3715240, 2650714, 1526624, 738196, -56913, -1157584, -2303676, -3405264, -4719596, -5773115, -5621053, -5030117]
$$ [...]
##END NTUPLES=NMR SPECTRUM
##END=
