##TITLE=31Pdec_DE-154_d6_TFA2
 DMSOd6d6,64 sc
 3.6.2026
##JCAMPDX= 6.0         $$ Bruker NMR JCAMP-DX V2.0
##DATA TYPE= NMR SPECTRUM
##DATA CLASS= NTUPLES
##ORIGIN= UXNMR, Bruker Analytische Messtechnik GmbH
##OWNER= root
$$ XWIN-NMR		Version 3.5
$$ Wed Jun  3 15:58:16 2026 Russian Standard Time (UT+4h)  she@DPX200
##.OBSERVE FREQUENCY= 81.013821
##.OBSERVE NUCLEUS= ^31P
##.ACQUISITION MODE= SIMULTANEOUS
##.ACQUISITION SCHEME= undefined
##.AVERAGES= 64
##.DIGITISER RES= 17
##SPECTROMETER/DATA SYSTEM= spect
##.PULSE SEQUENCE= zgpg30
##.SOLVENT NAME= CDCl3
##.SHIFT REFERENCE= (INTERNAL, CDCl3, 0, 197.392)
##AUDIT TRAIL= $$ (NUMBER, WHEN, WHO, WHERE, WHAT)
$$ ##TITLE= Audit trail, XWIN-NMR		Version 3.5
$$ ##JCAMPDX= 5.01
$$ ##ORIGIN= Bruker BioSpin GmbH
$$ ##OWNER= she
$$ F:/spectra/data/she/nmr/P31/2/pdata/1/auditp.txt
$$ ##AUDIT TRAIL=  $$ (NUMBER, WHEN, WHO, WHERE, WHAT)
(   1,<2026-06-03 15:56:59.07 +0400>,<she>,<DPX200>,
      <continue with go, POWCHK disabled, PULCHK disabled
       configuration hash MD5:
       00 E9 B6 7A A2 85 ED C7 34 08 36 98 17 FE 4E 26
       data hash MD5: 32K
       32 8D 64 B9 4A 25 4E 69 83 10 FC 38 3C 97 54 7F>)
(   2,<2026-06-03 15:57:04.60 +0400>,<she>,<DPX200>,
      <Start of raw data processing
       efp BC_mod = 2 LB = 1.5 FT_mod = 6 PKNL = 1 PHC0 = 1346.371 PHC1 = -221.8995 SI = 64K 
       data hash MD5: 64K
       2F 73 5E 2E 56 4E BD E2 DF C1 DA 16 9E D1 D9 E3>)
(   3,<2026-06-03 15:57:28.71 +0400>,<she>,<DPX200>,
      <pk PHC0 = -8.056472 PHC1 = 0 
       data hash MD5: 64K
       EB 81 D9 AC 1D F1 77 D8 51 44 63 CF 18 DF CB F0>)
(   4,<2026-06-03 15:57:32.98 +0400>,<she>,<DPX200>,
      <abs ABSG = 5 
       data hash MD5: 64K
       1D BF EC 67 BB C0 38 CE B9 93 CA 7E 77 46 A8 94>)
$$ ##END=
$$ 
$$ hash MD5
$$ 1C 60 4D 57 87 7E 93 90 BF 21 65 62 31 72 59 E2
##$RELAX= 
##$RELAX= 
##$RELAX= 
##$RELAX= 
##$RELAX= 
##$RELAX= 
##$RELAX= 
##$RELAX= 
$$ Bruker specific parameters
$$ --------------------------
##$DU= <F:/spectra>
##$EXPNO= 2
##$NAME= <P31>
##$PROCNO= 1
##$TYPE= <nmr>
##$USER= <she>
##$AMP= (0..31)
100 100 100 100 100 100 100 100 100 100 100 100 100 100 100 100 100 100 
100 100 100 100 100 100 100 100 100 100 100 100 100 100 
##$AQSEQ= 0
##$AQ_mod= 1
##$AUNM= <au_zg>
##$AUTOPOS= <>
##$BF1= 81.014009
##$BF2= 200.13
##$BF3= 200.13
##$BF4= 200.13
##$BF5= 200.13
##$BF6= 200.13
##$BF7= 200.13
##$BF8= 200.13
##$BYTORDA= 1
##$CFDGTYP= 0
##$CFRGTYP= 5
##$CHEMSTR= <none>
##$CNST= (0..31)
1 1 145 1 1 1 1 1 1 1 1 1 1 1 1 1 1 1 1 1 1 1 1 1 1 1 1 1 1 1 1 1 
##$CPDPRG= <waltz16>
##$CPDPRG1= <>
##$CPDPRG2= <waltz16>
##$CPDPRG3= <>
##$CPDPRG4= <mlev>
##$CPDPRG5= <mlev>
##$CPDPRG6= <mlev>
##$CPDPRG7= <mlev>
##$CPDPRG8= <mlev>
##$CPDPRGB= <>
##$CPDPRGT= <>
##$D= (0..31)
0 1 0 0 0 0 0 0 0 0.06 0 0.03 2e-05 3e-06 0 0 0.0002 0 0 0 0 0 0 0 0 0 
0 0 0 0 0 0 
##$DATE= 1780487736
##$DBL= (0..7)
120 120 120 11 120 120 24 19 
##$DBP= (0..7)
150 150 150 150 150 150 150 150 
##$DBP07= 0
##$DBPNAM0= <>
##$DBPNAM1= <>
$$ [...]
##$SUBNAM3= <"">
##$SUBNAM4= <"">
##$SUBNAM5= <"">
##$SUBNAM6= <"">
##$SUBNAM7= <"">
##$SUBNAM8= <"">
##$SUBNAM9= <"">
##$SW= 400.765351723535
##$SWIBOX= (0..15)
0 1 3 0 0 0 0 0 0 0 0 0 0 0 0 0 
##$SW_h= 32467.5324675325
##$TD= 32768
##$TD0= 1
##$TE= 0
##$TE2= 300
##$TE3= 300
##$TEG= 300
##$TL= (0..7)
0 120 53 12 22 120 120 120 
##$TP= (0..7)
150 150 150 150 150 150 150 150 
##$TP07= 0
##$TPNAME0= <>
##$TPNAME1= <>
##$TPNAME2= <>
##$TPNAME3= <>
##$TPNAME4= <>
##$TPNAME5= <>
##$TPNAME6= <>
##$TPNAME7= <>
##$TPOAL= (0..7)
0.5 0.5 0.5 0.5 0.5 0.5 0.5 0.5 
##$TPOFFS= (0..7)
0 0 0 0 0 0 0 0 
##$TUNHIN= 0
##$TUNHOUT= 0
##$TUNXOUT= 0
##$USERA1= <user>
##$USERA2= <user>
##$USERA3= <user>
##$USERA4= <user>
##$USERA5= <user>
##$V9= 5
##$VALIST= <valist>
##$VCLIST= <CCCCCCCCCCCCCCC>
##$VD= 0
##$VDLIST= <DDDDDDDDDDDDDDD>
##$VPLIST= <PPPPPPPPPPPPPPP>
##$VTLIST= <TTTTTTTTTTTTTTT>
##$WBST= 1024
##$WBSW= 4
##$XGAIN= (0..3)
0 0 0 0 
##$XL= 0
##$YL= 0
##$YMAX_a= 5335
##$YMIN_a= -10400
##$ZGOPTNS= <>
##$ZL1= 120
##$ZL2= 120
##$ZL3= 120
##$ZL4= 120
##$ABSF1= 197.3918
##$ABSF2= -203.3724
##$ABSG= 5
##$ABSL= 3
##$ALPHA= 0
##$AQORDER= 0
##$ASSFAC= 0
##$ASSFACI= 0
##$ASSFACX= 0
##$ASSWID= 0
##$AUNMP= <proc_1d>
##$AZFE= 0.1
##$AZFW= 0.5
##$BCFW= 0
##$BC_mod= 2
##$BYTORDP= 0
##$COROFFS= 0
##$CY= -3
##$DATMOD= 1
##$DC= 0
##$DFILT= <>
##$DTYPP= 0
##$F1P= 0
##$F2P= 0
##$FCOR= 1
##$FTSIZE= 65536
##$FT_mod= 6
##$GAMMA= 0
##$GB= 0
##$INTBC= 1
##$INTSCL= 9.790993e-09
##$ISEN= 30
##$LB= 1.5
##$LEV0= 0
##$LPBIN= 0
##$MAXI= 10000
##$MC2= 0
##$MEAN= 0
##$ME_mod= 0
##$MI= 50
##$NCOEF= 0
##$NC_proc= -8
##$NLEV= 6
##$NOISF1= 182.463
##$NOISF2= 159.3651
##$NSP= 0
##$NTH_PI= 0
##$NZP= 0
##$OFFSET= 197.3918
##$PC= 4
##$PHC0= 1338.314
##$PHC1= -221.8995
##$PH_mod= 1
##$PKNL= yes
##$PPARMOD= 0
##$PSCAL= 0
##$PSIGN= 0
##$REVERSE= no
##$SF= 81.014063255964
##$SI= 65536
##$SIGF1= 159.3651
##$SIGF2= -187.1042
##$SINO= 113.3802
##$SIOLD= 16384
##$SREGLST= <1H.CDCl3>
##$SSB= 0
##$STSI= 65536
##$STSR= 0
##$SW_p= 32467.5324675325
##$SYMM= 0
##$S_DEV= 0
##$TDeff= 32768
##$TDoff= 0
##$TI= <>
##$TILT= no
##$TM1= 0
##$TM2= 0
##$TOPLEV= 0
##$USERP1= <user>
##$USERP2= <user>
##$USERP3= <user>
##$USERP4= <user>
##$USERP5= <user>
##$WDW= 1
##$XDIM= 65536
##$YMAX_p= 117430836
##$YMIN_p= -286939175
$$ End of Bruker specific parameters
$$ ---------------------------------
##NTUPLES= NMR SPECTRUM
##VAR_NAME=  FREQUENCY,     SPECTRUM/REAL,   SPECTRUM/IMAG
##SYMBOL=    X,             R,               I
##VAR_TYPE=  INDEPENDENT,   DEPENDENT,       DEPENDENT
##VAR_FORM=  AFFN,          ASDF,            ASDF
##VAR_DIM=   65536,         65536,           65536
##UNITS=     HZ,            ARBITRARY UNITS, ARBITRARY UNITS
##FACTOR=    0.49542278885378, 1,            1
##FIRST=     15991.5117654749, 0,            0
##LAST=      -16476.0207020576, 0,           0
##MIN=       -16476.0207020576, -286939175,  0
##MAX=       15991.5117654749, 117430836,    0
$$ Real data points
##PAGE= N=1
##DATA TABLE= (X++(R..R)), XYDATA
$$ [...]
##PAGE= N=2
##DATA TABLE= (X++(I..I)), XYDATA
7475B686199n071905l508098O50394K696569J075337j445707k075306q50798P02526
$$ 2686199 -2385706 -5893804 -5243410 -2546841 -1471504 -2917211 -4992517 -5843315 -5140789
7466e140789J601380J581180P07037l92703o70309K04680J186858J031401K8583
$$ -5140789 -3539409 -1958229 -1251192 -1643895 -2314204 -2109524 -922666 108735 137318
7457A37318l01887M37515N27545j428711l838721l667394o63988J838231J063706
$$ 137318 -164569 272946 800491 -628220 -4466941 -8134335 -8798323 -6960092 -5896386
7448e896386j831723l593008k865862j109382k17967m09560m24732O28183J776976
$$ -5896386 -7728109 -11321117 -14186979 -15296361 -15514328 -15923888 -16348620 -15720437 -13943461
7439a3943461J224260n37872j43582M085901Q296227P126033J177433l446115
$$ -13943461 -12719201 -13257073 -13400655 -9314754 -1018527 6107506 7284939 3838824
7431C838824l437320j677444j070319l2518K939873M854268K733748q58518j581723
$$ 3838824 401504 -1275940 -2346259 -2378777 561096 5415364 8149112 7290594 5708871
7422E708871j43838m86673k907793l965042k293424J25041J942015L346552L412903
$$ 5708871 5565033 5078360 2170567 -1794475 -4087899 -3962858 -2020843 1325709 4738612
7413D738612Q56753k627299l766417k412519j172828p99857J4177P74169k50784
$$ 4738612 5595365 2968066 -798351 -3210870 -4383698 -5183555 -5169378 -4395209 -4645993
7404d645993j679784j52995L712957N401229L370858R43377J72081j013742l665398
$$ -4645993 -6325777 -6478772 -2765815 2635414 6006272 6949649 7121730 6107988 2442590
7395B442590m871223k689469K68819J117262Q44780J358502J864033J121940J56751
$$ 2442590 -2428633 -5118102 -4849283 -3732021 -2887241 -1528739 335294 1457234 1613985
7386A613985j50159j173951l406236m144343j397997K419249L678357K233382
$$ 1613985 1463826 289875 -3116361 -7260704 -8658701 -6239452 -2561095 -327713
7378c27713L59105p35769r22791o3359Q19684j67210k276718k053951R55344K279407
$$ -327713 31392 -704377 -1627168 -1690527 -870843 -1038053 -3314771 -5368722 -4413378 -2133971
7368b133971n97441l500984j849919K079155L150232J493492J035733K252297
$$ -2133971 -2731412 -6232396 -8082315 -6003160 -2852928 -1359436 -323703 1928594
7360A928594K346350J223327J305572K063027N71096k531458l283565j042555
$$ 1928594 4274944 5498271 6803843 8866870 9437966 6906508 3622943 2580388
7352B580388N44092L4334K34076K253694K806783r1186l231144l050958q67162
$$ 2580388 3124480 3158814 3392890 5646584 8453367 8362181 5131037 2080079 1212917
7343A212917j60418j320365k142953j653406o47000L32200J205033J328420J20960
$$ 1212917 1052499 -267866 -2410819 -4064225 -4711225 -4379025 -3173992 -1845572 -1724612
7334a724612j635260k316604j140199J053966K365283J460481n89030q30812J872848
$$ -1724612 -3359872 -5676476 -6816675 -5762709 -3397426 -1936945 -2525975 -3356787 -1483939
7325a483939M640028M020198O74354j933118k606004k892134k983159j182196
$$ -1483939 3156089 7176287 7850641 5917523 3311519 419385 -2563774 -3745970
7317c745970J962584L054626Q97484j394135j214483j41974n14061j289009j92192
$$ -3745970 -1783386 1271240 2168724 774589 -439894 -581868 -1095929 -2384938 -2577130
7308b577130K141999L068244J619590j049202l644971n054216m026379q05116
$$ -2577130 -435131 2633113 4252703 3203501 -441470 -5495686 -9522065 -10327181
7300a0327181J985983K240449J210054J400662K674987K848843J451724K28186
$$ -10327181 -8341198 -6100749 -4890695 -3490033 -815046 2033797 3485521 3713707
7292C713707l9001o24071k171703l103634j919028L58206J455689Q60821J49039
$$ 3713707 3674706 3050635 878932 -2224702 -4143730 -3785524 -2329835 -1469014 -1319975
7283a319975L98352O61123k55037j506992j233573L99132J108871O9285n21698
$$ -1319975 -921623 -260500 -515537 -2022529 -3256102 -2856970 -1748099 -1678814 -2200512
7274b200512J010077K661307J657345q88512j434415M86430J825149J292430J218980
$$ -2200512 -1190435 1470872 3128217 2239705 805290 1291720 3116869 4409299 5628279
7265E628279K844013L390210K95926m305841o229212m695975k403184j191388
$$ 5628279 8472292 11862502 12158428 7852587 1623375 -3072600 -5475784 -6667172
7257f667172l59147R83227K232789K461141J868459J453842J696654J820278N70274
$$ -6667172 -7026319 -6043092 -3810303 -1349162 519297 1973139 3669793 5490071 6060345
7248F060345j878853l315926j999078N67301J149618q21412k418229j332748J200933
$$ 6060345 4181492 865566 -1133512 -566211 583407 -238005 -2656234 -3988982 -2788049
7239b788049K475865J476207r08527l028826l019809j93505L178303L571078P13413
$$ -2788049 -312184 1164023 255496 -2773330 -5793139 -5986644 -2808341 762737 1476150
7230A476150j848346j699433l79293J01080L90972J242742R90327j289945k754619
$$ 1476150 -372196 -2071629 -2450922 -2349842 -1958870 -716128 274199 -1015746 -3770365
7221c770365o76943K571262K452915r88369l334554k214935L08112J708536J724015
$$ -3770365 -4447308 -1876046 576869 -411500 -3746054 -5960989 -5652877 -3944341 -2220326
7212b220326P63951j043512k461109j703506P33255K274941J988355J620677K196213
$$ -2220326 -1456375 -2499887 -4960996 -6664502 -5931247 -3656306 -1667951 -47274 2148939
7203B148939K224730N66593j251957j283743o0323M30772m38233j589869j936440
$$ 2148939 4373669 4940262 3688305 2404562 2344239 2775011 2336778 746909 -1189531
7194a189531j176797N69223K784680M370533M328802K868526J410315J083309
$$ -1189531 -2366328 -1797105 987575 5358108 9686910 12555436 13965751 15049060
7186A5049060J223345m5618l188586n872135n477079k678893p42135j141995k028154
$$ 15049060 16272405 16226787 13038201 7166066 1688987 -989906 -1732041 -2874036 -4902190
7177d902190j607224o14027k48997j08958K06199j73158j133741n77945J962332
$$ -4902190 -6509414 -7123441 -7372438 -7481396 -7275197 -7448355 -8582096 -9160041 -7197709
7168g197709L297169J139055j736805j441968J042417J894807P49283M09107J328201
$$ -7197709 -3900540 -2761485 -4498290 -5940258 -4897841 -3003034 -2253751 -1844644 -516443
7159e16443J174339l82347j049058k66250P8479m41512l22782K06488o16095j920248
$$ -516443 657896 275549 -773509 -1039759 -961280 -1402792 -1725574 -1519086 -2135181 -4055429
7149d055429q66660J951655K723477J004773P78511L284668M316184J298435k172290
$$ -4055429 -4922089 -2970434 -246957 757816 1536327 4820995 9137179 10435614 8263324
7140H263324k276742p46210p71359j364453k51891J117939J91676j765915j962529
$$ 8263324 5986582 5240372 4469013 3104560 2852669 3970608 4162284 2396369 433840
7131D33840j060816j379384k065408p04270J673496J839207j81608j272163m96556
$$ 433840 -626976 -2006360 -4071768 -4776038 -3102542 -1263335 -1444943 -2717106 -3213662
7122c213662j89119j732484l742804m619227l932361j391775K670205N958224
$$ -3213662 -3402781 -5135265 -8878069 -13497296 -17429657 -18821432 -16151227 -10193003
7114a0193003O193708M295187K970093K563015J166780j468350l192752k703565
$$ -10193003 -3999295 295892 3265985 5829000 6995780 5527430 2334678 -368887
7106c68887q63924J177793K640823K201331o95263l713372l738125j187894O10761
$$ -368887 -1232811 -55018 2585805 4787136 4091873 378501 -3359624 -4547518 -3936757
7097c936757L90752K39459J623773L230331L494367K477065M51033k656586n478978
$$ -3936757 -3546005 -3306546 -1682773 1547558 5041925 7518990 7970023 5313437 -165541
7088a65541n489759k319326J241570K495359J305452j024272k990596k570130
$$ -165541 -5655300 -7974626 -6733056 -4237697 -2932245 -3956517 -6947113 -9517243
7080i517243J489143O854465Q631267M845379r36925l825597k788687m89984L29876
$$ -9517243 -8028100 -1173635 7457632 12303011 11366086 7540489 4751802 4261818 4591694
7071D591694r55373k898948l200379j065581J231755P65315j852260k965799j096922
$$ 4591694 3636321 737373 -2463006 -3528587 -2296832 -1531517 -3383777 -6349576 -7446498
7062g446498J096173J302031J096627K804674N150402M899237J589640k082638
$$ -7446498 -6350325 -5048294 -3951667 -1146993 4003409 8902646 10492286 8409648
7054H409648m067429m734524m833589l826935j156949J918129K952007J064670
$$ 8409648 4342219 -392305 -5225894 -9052829 -10209778 -8291649 -5339642 -4274972
7046d274972j435888j233404J816740M055024K800511K50191K75505K461012K692841
$$ -4274972 -5710860 -6944264 -5127524 -1072500 1728011 1978202 2253707 4714719 7407560
7037G407560l88035l231090k749838m67349N82989L06065N32964J560057K108629
$$ 7407560 7019525 3788435 1038597 571248 1154237 1460302 1993266 3553323 5661952
7028E661952J556333L23677j100930k235954k614717k473334k268112j341752
$$ 5661952 7218285 7541962 6441032 4205078 1590361 -882973 -3151085 -4492837
7020d492837R61819K808109J493667j834055k742416k00657J394491p16111k834865
$$ -4492837 -3531018 -722909 770758 -1063297 -3805713 -4006370 -2611879 -3327990 -6162855
7011f162855p70056L151808L828125J313062l69522m57749j658810l831400l389701
$$ -6162855 -6932911 -3781103 47022 1360084 990562 532813 -1125997 -4957397 -8347098
7002h347098K96125L117559K296970r9007j308414j609865k035789j823816l48077
$$ -8347098 -8050973 -4933414 -2636444 -2735451 -4043865 -5653730 -7689519 -9513335 -9861412
6993i861412J080845J274090Q01057K10138r11101j825275m57165K978498N016202
$$ -9861412 -8780567 -7506477 -6705420 -6495282 -7406383 -9231658 -9688823 -6710325 -1694123
6984a694123L698450J524086J150541R47884j733588n005230m463058j58719K636639
$$ -1694123 2004327 3528413 4678954 5626838 3893250 -1111980 -5575038 -5733757 -3097118
6975c097118M75990l695498m630106j322596K387068K731590r9949k849050k872246
$$ -3097118 -2621128 -6316626 -10946732 -12269328 -9882260 -7150670 -7250619 -10099669 -12971915
6966a2971915n45011J669743K053760J159134O07030J019664J584655J293417
$$ -12971915 -13516926 -11847183 -9793423 -8634289 -8027259 -7007595 -5422940 -4129523
6958d129523L8056j463583k406239k437269j652704k83757J406861K907563L489791
$$ -4129523 -4091467 -5555050 -7961289 -10398558 -12051262 -12335019 -10928158 -8020595 -4530804
6949d530804K762540J067041p93544j975580j844248n00222Q54040J031916O03708
$$ -4530804 -1768264 -701223 -1494767 -3470347 -5314595 -5814817 -4960777 -3928861 -3325153
6940c325153J276423L055121L662319J796740q06373k061177k364410k645725
$$ -3325153 -2048730 1006391 4668710 6465450 5659077 3597900 1233490 -1412235
6932a412235j612250J922186N393446N014294J451254r00330l28087N23506j58051
$$ -1412235 -3024485 -1102299 4291147 9305441 10756695 9856365 9528278 10051784 9893733
6923I893733q55004o95243j531964l845441m607766k140386M59053J21671j141358
$$ 9893733 9038729 8343486 6811522 2966081 -1641685 -3782071 -3323018 -3201347 -4342705
6914d342705N5430K346974J803450j334697k838190r47329J602149K201849J332803
$$ -4342705 -4287275 -1940301 -136851 -1471548 -4309738 -5257067 -3654918 -1453069 -120266
6905a20266L72691m06541r37239r54243r09429j146424m29113K106450M024821
$$ -120266 252425 -154116 -1091355 -2045598 -2955027 -4101451 -4530564 -2424114 1600707
6896A600707K041373k509870m436236j768760J615097J872141Q6825p96648o03548
$$ 1600707 3642080 1132210 -3304026 -5072786 -3457689 -1585548 -1498723 -2295371 -2898919
6887b898919o89468p22522J33035P34206j52978r34751N63182K948245K829333
$$ -2898919 -3588387 -4310909 -4177874 -3443668 -3596646 -4531397 -3968215 -1019970 1809363
6878A809363J08759j863306j655419j588462l028285l414076m71859L244340L423248
$$ 1809363 1918122 54816 -1600603 -3189065 -6217350 -9631426 -10103285 -6858945 -3435697
6869c435697L92314j141091J127473L886678L094498n43929l128649k873214j299071
$$ -3435697 -3043383 -4184474 -3057001 829677 3924175 3380246 251597 -2621617 -3920688
6860c920688n470R60086J473334P50856p90922j287688j15760J098223J306386
$$ -3920688 -3926158 -2966072 -1492738 -741882 -1532804 -2820492 -2936252 -1838029 -531643
6851e31643J803219L524607M615720L004902j31545k085035k653144l587627m739978
$$ -531643 1271576 4796183 9411903 12416805 12285260 10200225 7547081 3959454 -780524
6842g80524l996211j131142J348083J847151J459508J267192N30504j121115k050884
$$ -780524 -4776735 -5907877 -4559794 -2712643 -1253135 14057 544561 -576554 -2627438
6833b627438r48050Q71824J292614M16904J10068J093604J854063N77948k265607
$$ -2627438 -3575488 -2703664 -1411050 -994146 -884078 209526 2063589 2641537 375930
6824C75930l632597j109801L194141L867562q63775n490894l859383K119607N050073
$$ 375930 -3256667 -4366468 -1172327 2695235 1831460 -3659434 -7518817 -5399210 -349137
6815c49137K714365L32648J232701J803325j097923l824160k155906R12107j43535
$$ -349137 2365228 2697876 3930577 5733902 4635979 811819 -1344087 -431980 -575515
6806e75515m109534n169828k420631k92081p3470J829474O135671P884776M071674
$$ -575515 -4685049 -9854877 -12275508 -12567589 -12641059 -10811585 -4675914 3208862 7280536
6797G280536j176212k387380J04564J990884J050563j551221l778419l998704
$$ 7280536 6104324 3716944 3821508 5812392 6862955 5311734 1533315 -2465389
6789b465389j584546J688053K588338M67354j577645j106524L98553N32577j87333
$$ -2465389 -4049935 -2361882 226456 693810 -883835 -1990359 -1591806 -1059229 -1246562
6780a246562P2349J014162J118050N83216O69868J066897M43583r57520j512680
$$ -1246562 -1174213 -160051 957999 1541215 2211083 3277980 3721563 2764043 1251363
6771A251363o54713P17944J860142K504026J994972j13301k656992l545183k097653
$$ 1251363 596650 1314594 3174736 5678762 7673734 7560433 4903441 1358258 -739395
6762g39395J66326J221292O04656k40108J69274R96976k65565l604211m677888
$$ -739395 -573069 648223 1252879 1012771 1182045 2179021 1913456 -1690755 -6368643
6753f368643k03419N990461O700578J328002k938035j441569J806475J356902
$$ -6368643 -6572062 -581601 6118977 7446979 4508944 3067375 4873850 6230752
6745F230752j491967k319093j119495o44873l76867J766291L841724K255411j555640
$$ 6230752 4738785 2419692 1300197 655324 278457 2044748 5886472 8141883 6586243
6736F586243k994921j988949k323466l696100j642208L676894N938927K349996
$$ 6586243 3591322 1602373 -721093 -4417193 -6059401 -2382507 3556420 5906416
6728E906416j764070j417152R36536R00258m71972K63045K422627K884434J578764
$$ 5906416 4142346 2725194 3661730 4561988 4090016 4353061 6775688 9660122 11238886
6719A1238886N81964k42543k351432m780928n186227l460950j085372J703032
$$ 11238886 11820850 11578307 9226875 4445947 -740280 -4201230 -5286602 -3583570
6711c583570M897849O441883M425170M82608k101752k589716k279293j348657
$$ -3583570 1314279 7756162 12181332 12663940 10562188 7972472 5693179 4344522
6703D344522N10715J654162K39874k400848l409021k618085k014148j933441j144908
$$ 4344522 4855237 6509399 6749273 4348425 939404 -1678681 -3692829 -5626270 -6771178
6694f771178L2131J00359n91914l02770J162521K752267M316256N467094M038601
$$ -6771178 -6739047 -6638688 -7230602 -7533372 -6370851 -3618584 697672 6164766 10203367
6685A0203367m37266l549153j261343K971706K160505l617426o966966m146931
$$ 10203367 9766101 6216948 4955605 7927311 10087816 6470390 -496576 -4643507
6677d643507L19384J733684J327333J368198M48664k171411k940301K34207K971118
$$ -4643507 -4324123 -2590439 -1263106 105092 553756 -1617655 -4557956 -4323749 -1352631
6668a352631O39216l777236l827400O99260M071657L380962J320577M04691l10613
$$ -1352631 -713415 -4490651 -8318051 -7618791 -3547134 -166172 1154405 1559096 1248483
6659A248483j830037k827016k125586n66784P99292K064194L170936L244795J851994
$$ 1248483 -581554 -3408570 -5534156 -6100940 -5301648 -3237454 -66518 3178277 5030271
6650E030271n28738l261439n278744m697678q91390L452954M708374K606105j1874
$$ 5030271 4501533 1240094 -4038650 -8736328 -9627718 -6174764 -1466390 1139715 1127841
6641A127841j294847j598512r44347J381913M087760M000850M15871l244831l754369
$$ 1127841 -167006 -1765518 -2709865 -1327952 2759808 6760658 7176529 3931698 177329
6632A77329j924260m67691r6941J37791K88109j40874j79930J542080L742438
$$ 177329 -1746931 -2214622 -2311563 -2173772 -1885663 -2026537 -2206467 -664387 3078051
6623C078051L098162j083493m805108l818286Q17177L716213J800088k101196
$$ 3078051 6176213 5092720 287612 -3530674 -2713497 1002716 2802804 701608
6615G01608l309276j159471J236476J947840K008217K147800R74968j976170l937910
$$ 701608 -2607668 -3767139 -2530663 -582823 1425394 3573194 4548162 2571992 -1365918
6606a365918k194514J730972L771276K560521N75802J66762P04994K21892j747873
$$ -1365918 -3560432 -1829460 1941816 4502337 5078139 5244901 5949895 6171787 4423914
6597D423914l751537m013452j997236J153399L573718M230763L323348J384587
$$ 4423914 672377 -3341075 -5338311 -4184912 -611194 3619569 6942917 8327504
6589H327504r62176k389948j734107J2785N07097l71549j45095J804622K358542
$$ 8327504 7365328 4975380 3241273 3254058 3761155 3389606 3244511 5049133 7407675
6580G407675m38565l561738l488453j923299k656043m586047l264668J144238
$$ 7407675 6969110 3407372 -81081 -2004380 -4660423 -9246470 -12511138 -11366900
6572a1366900L219746O53473k062063o11475K942125M075429K540860J529444
$$ -11366900 -8147154 -7493681 -9555744 -10167219 -7225094 -3149665 -608805 920639
6564I20639K096992J963359o76402m618115o999269o010697k481494P71118J705193
$$ 920639 3017631 4980990 4304588 -313527 -7312796 -13323493 -15804987 -15033869 -13328676
6555a3328676J022722M14596k31492j659866k164084P53065N391688O505272K342946
$$ -13328676 -12305954 -11891358 -12122850 -13782716 -15946800 -15193735 -9802047 -3296775 -953829
6546i53829k599174l826800k389799j631185j617369k36649K334529L844487L577666
$$ -953829 -3553003 -7379803 -9769602 -11400787 -13018156 -13254805 -10920276 -7075789 -3498123
6537c498123K859885K580297K339207J440791o40707l628474n332014l286953
$$ -3498123 -638238 1942059 4281266 5722057 5081350 1452876 -3879138 -7166091
6529g166091J189599L319800J202448j160452J97804L366130M132391K474069
$$ -7166091 -5976492 -2656692 -1454244 -2614696 -2416892 949238 5081629 7555698
6521G555698J103005j17688l132355o379006n984896k191778M52837p7067q69975
$$ 7555698 8658703 8541015 5408660 -970346 -6955242 -9147020 -8694183 -8771250 -9641225
6512i641225N00823K476089L014184K785027K855825K277967J47567k178768k784108
$$ -9641225 -9140402 -6664313 -3650129 -865102 1990723 4268690 4416257 2237489 -546619
6503e46619j491752O67637K684482L613768L169235K607464L034725K946049J71076
$$ -546619 -2038371 -1370734 1313748 4927516 8096751 10704215 13738940 16684989 16856065
6494A6856065l776375m845318k590218j225661l012292m571182k362844J639761
$$ 16856065 13079690 8234372 5644154 4418493 1406201 -3164981 -5527825 -3888064
6486c888064L144804J869543R81299J764547K456392J799853O83788K08356K96632
$$ -3888064 -743260 1126283 2107582 3872129 6328521 8128374 8812162 9020518 9317150
6477I317150K27094r11482l648247o484982n949687n58391N936975P804914L947662
$$ 9317150 9544244 8632762 4984515 -1500467 -7450154 -8008545 -2071570 5733344 9681006
6468I681006r09282k089320j35028Q05853j529595m904407n309364j655135K742461
$$ 9681006 8771724 6682404 6547376 7353229 5823634 919227 -4390137 -6045272 -3302811
6459c302811L700885Q59116k114842j978273P89354L534011M591270L846618J718459
$$ -3302811 398074 1257190 -857652 -2835925 -2046571 1487440 6078710 9925328 11643787
6450A1643787p60543j936995j391225r93469k269699l471008j630062K582762
$$ 11643787 10883244 8946249 7555024 6561555 4291856 820848 -809214 1773548
6442A773548M671970J916104k903004m906623k936759j77454M22940o14248r99854
$$ 1773548 6445518 8361622 5458618 551995 -2384764 -2562218 -2139278 -2753526 -3753380
6433c753380j9172R79139P10827o41288j982396k235888p94256J789557L447203
$$ -3753380 -3772552 -2793413 -2082586 -2723874 -4706270 -6942158 -7736414 -5946857 -2499654
6424b499654K349285m64246j691666J17298K587838K879896J366833J73969l59505
$$ -2499654 -150369 -614615 -2306281 -2188983 398855 3278751 4645584 4819553 4460048
6415D460048j263649k092456j415005K60790Q64388n5445j180978k191239l622917
$$ 4460048 3196399 1103943 -311062 -50272 814116 758671 -422307 -2613546 -6236463
6406f236463m101093j393728L171330N162584L177902Q24091R31957J663151P61126
$$ -6236463 -10337556 -11731284 -8559954 -3397370 -219468 604623 1536580 3199731 3960857
6397C960857j86784P89399J493101j191325n357302n798965j197162M002761N067634
$$ 3960857 3774073 4563472 6056573 4865248 -492054 -6291019 -7488181 -3485420 1582214
6388A582214J794658k212360l212909m57768L059449L637024J380481q0571P34493
$$ 1582214 3376872 1164512 -2048397 -2506165 553284 4190308 5570789 5490218 6224711
6379F224711Q16532j900131m266271k738646M58308O87759j572883j788788J031622
$$ 6224711 7041243 5141112 874841 -1863805 -1405497 -717738 -2290621 -4079409 -3047787
6370c047787L164544K575016J331318R29104O1201j644259k050400l85032J065699
$$ -3047787 116757 2691773 4023091 4952195 5013396 3369137 1318737 933705 1999404
6361A999404P68696j4084m29028j633326l530444l629161j280839M48725m69650
$$ 1999404 2768100 2754016 2324988 691662 -2838782 -6467943 -7748782 -7300057 -7769707
6352g769707j735198q28635Q02753Q05850L11249J648985L822013L993054K076806
$$ -7769707 -9504905 -10333540 -9530787 -8724937 -8413688 -6764703 -2942690 1050364 3127170
6343C127170L65751m13269j368659k447321k311467r80718Q6024M15152P19011
$$ 3127170 3492921 3079652 1710993 -736328 -3047795 -4028513 -3942489 -3527337 -2808326
6334b808326R81956O55443M78909J702505L488788L364055N95606k662927l821438
$$ -2808326 -1826370 -1170927 -692018 1010487 4499275 7863330 8458936 5796009 1974571
6325A974571k066991J542894M565991M315142O37730k767929k166337J189014
$$ 1974571 -92420 1450474 6016465 10331607 10969337 8201408 6035071 7224085
6317G224085K450031j98075l286069l370544j517530n61168n42919K68007J527057
$$ 7224085 9674116 9476041 6189972 2819428 1301898 740730 197811 465818 1992875
6308A992875J339035N8866K25577K235693L143203J154897j266032j018147P45276
$$ 1992875 3331910 3390776 3616353 5852046 8995249 10150146 8884114 7865967 8611243
6299H611243K63779k978518n171007l507084M7902J666370L85226j719498k650894
$$ 8611243 8875022 5896504 725497 -2781587 -2733685 -1067315 -682089 -2401587 -5052481
6290e052481j969034p1856K203218L659235L763895L198915K490929J099643r60591
$$ -5052481 -7021515 -7093371 -4890153 -1230918 2532977 5731892 8222821 9322464 8361873
6281H361873k008779j050614N4088r01446k840722k926163r09307R47297J651736
$$ 8361873 6353094 5302480 5356568 4455122 1614400 -1311763 -2221070 -1273773 377963
6272C77963J897558J166920j611194m301473k925393J936130M485562J657343
$$ 377963 2275521 3442441 1831247 -2470226 -5395619 -3459489 1026073 2683416
6264B683416k314679k237936P18830J770417k09817k360381k989078k828966k019752
$$ 2683416 368737 -1869199 -1150369 620048 410231 -1950150 -4939228 -7768194 -9787946
6255i787946K06705K941762M047106L376050K790000K895941K451794J227910
$$ -9787946 -9581241 -6639479 -2592373 783677 3573677 6469618 8921412 10149322
6247A0149322Q04844J865883K884449K324721N00250j422900k920310m020593
$$ 10149322 10954166 12820049 15704498 18029219 18529469 17106569 14186259 10165666
6239A0165666m715593m875936m233514k600235n46686Q30435J414820K217665
$$ 10165666 5450073 574137 -3659377 -6259612 -6806298 -5975863 -4561043 -2343378
6231b343378L179799K459860n64576l282958l047167j020298k32288q22446k80679
$$ -2343378 836421 3296281 2731705 -551253 -3598420 -4618718 -4851006 -5673452 -5954131
6222e954131J880145K868187P16512k763772m169903k218168J310972L337345
$$ -5954131 -4073986 -1205799 -489287 -3253059 -7422962 -9641130 -8330158 -4992813
6214d992813K171453o30769j570244O16944L058177K455686n38428k651617k542247
$$ -4992813 -2821360 -3452129 -5022373 -4405429 -1347252 1108434 570006 -2081611 -4623858
6205d623858j593878j004246o72830m86564l15305P03835K588423L198810J151129
$$ -4623858 -6217736 -7221982 -7894812 -8381376 -8696681 -7992846 -5404423 -2205613 -1054484
6196a054484j192699q87302P37370M09479r58271M75202M216007N076178J320935
$$ -1054484 -2247183 -3134485 -2397115 -1987636 -2945907 -2470705 1745302 6821480 8142415
6187H142415k288256j890854N7458j04348j211327l61062J455980J274944n58211
$$ 8142415 5854159 3963305 4020763 3916415 2705088 2344026 3800006 5074950 4516739
6178D516739j269309m39314r6300q37288j190555m71279M22310P70251M80122
$$ 4516739 3247430 2808116 2711816 1874528 683973 212694 635004 1405255 1885377
6169A885377o39122k148024k391774o34772J172254Q87252m93566l69455J278106
$$ 1885377 1246255 -901769 -3293543 -3928315 -2756061 -1868809 -2362375 -2731830 -1453724
6160a453724J830438J35055j710020j319615Q41072K155317J007076j380443k373974
$$ -1453724 376714 511769 -1198251 -2517866 -1676794 478523 1485599 105156 -2268818
6151b268818j183575L0243p84839k345544j908226J81029P66090j006661k191088
$$ -2268818 -3452393 -3422150 -4206989 -6552533 -8460759 -8279730 -7513640 -8520301 -10711389
6142a0711389p70901J452231K412672K920487L956722L975670J760437p46216
$$ -10711389 -11482290 -10030059 -7617387 -4696900 -740178 3235492 4995929 4249713
6134D249713j473249j547287k488033k759838p67223J207852K50275k053567k153532
$$ 4249713 2776464 1229177 -1258856 -4018694 -4785917 -3578065 -3327790 -5381357 -7534889
6125g534889m58948O041n96178L33170K167250J678078q19292j512824K59726
$$ -7534889 -7993837 -7987796 -8583974 -8250804 -6083554 -4405476 -5224768 -6737592 -6477866
6116f477866R87383l92372n76619J568478K230958p20759l474647k311118M87709
$$ -6477866 -5490483 -5882855 -6459474 -4890996 -2660038 -3380797 -6855444 -9166562 -8678853
6107h678853R39984j53950K49876J333420J39015k249671j662855K205090M666012
$$ -8678853 -7738869 -7892819 -7642943 -6309523 -6170508 -8420179 -10083034 -7877944 -3211932
6098c211932K810495n55168j405753R5184Q51894m28978k105454k458903j661021
$$ -3211932 -401437 -956605 -2362358 -2267174 -1415280 -1844258 -3949712 -6408615 -8069636
6089h069636p08960J35968J037154J536731J035964J94164M85667J880264K353962
$$ -8069636 -8778596 -8642628 -7605474 -6068743 -5032779 -4838615 -4352948 -2472684 -118722
6080a18722P42959j240005j385261k25862J01836o62826r70430m88734m12454
$$ -118722 624237 -615768 -2001029 -2226891 -2125055 -2787881 -3758311 -4247045 -4659499
6071d659499q60013o85299l2621k34866p97643M19791L223193M494827K864070
$$ -4659499 -5519512 -6204811 -6237432 -6472298 -7269941 -6850150 -3626957 867870 3731940
6062C731940Q03645L65017k9090k221348m559067m310810j737265R63306K949022
$$ 3731940 4535585 4900602 4871512 2650164 -1908903 -6219713 -7956978 -6993672 -4044650
6053d044650M314425M117621J711792j225677k622051k763161k755512j891833
$$ -4044650 269775 4387396 6099188 4873511 2251460 -511701 -3267213 -5159046
6045e159046N81190K671942K041390L6484l09968N28473n82068l571845m413312
$$ -5159046 -4577856 -1905914 135476 171960 -138008 390465 -191603 -3763448 -8176760
6036h176760j124497L157976M531119K780946Q4532k017986k726984j385570J383861
$$ -8176760 -9301257 -6143281 -1612162 1168784 1253316 -764670 -3491654 -4877224 -3493363
6027c493363L505839L753911K896121J837111M28821j123863j785491j584059
$$ -3493363 12476 3766387 6662508 8499619 8928440 7804577 6019086 4435027
6019D435027j765147k019285k31014L379872M809398J643293k594151k936153
$$ 4435027 2669880 650595 419581 3799453 8608851 10252144 7657993 4721840
6011D721840r6919R54576j205077k593135n29743J988859R25653k716083m437309
$$ 4721840 4624921 5579497 4374420 1781285 1251542 3240401 4166054 1449971 -2987338
6002b987338k376909J006144K939134L382375L557357L507413K484994Q03054
$$ -2987338 -5364247 -4358103 -1418969 1963406 5520763 9028176 11513170 12316224
5994A2316224j67729J23829N56653j18688j459555j867093q16094M29015O76154
$$ 12316224 12148495 12272324 12828977 12710289 11250734 9383641 8567547 8996562 9672716
5985I672716L43663K58138q5514j478950k825086k267220o62560j190817m131049
$$ 9672716 10016379 10274517 10189003 8710053 5884967 3617747 2955187 1764370 -2366679
5976b366679m783685M60676P678047Q954908K377694n244994o809163k805616
$$ -2366679 -7150364 -6689688 988359 9943267 12320961 7075967 266804 -2538812
5968b538812J198501K141942J477511J143594Q83690l41173k501012m466417m706778
$$ -2538812 -1340311 801631 2279142 3422736 4306426 3965253 1464241 -3002176 -7708954
5959g708954k377207J191012K936835J461437r83913j571556p42225p50654j586638
$$ -7708954 -10086161 -8895149 -5958314 -4496877 -5480790 -7052346 -7794571 -8545225 -10131863
5950a0131863j321481J63631J126448J465338K741614M412533L796504P24512
$$ -10131863 -11453344 -11289713 -10163265 -8697927 -5956313 -1543780 2252724 2977236
5942B977236j507930j266874r38111k213240k781144n19065K344242K680618J427372
$$ 2977236 1469306 202432 -735679 -2948919 -5730063 -6249128 -3904886 -1224268 203104
5933B03104J433931K451264K118793M42432n24619m53626o31129r55287n11526
$$ 203104 1637035 4088299 6207092 6649524 6124905 5671279 5040150 4084863 3573337
5924C573337k93715j743723l316181k332216K55769J010784l17057o02100R76200
$$ 3573337 3279622 1535899 -1780282 -4112498 -3856729 -2845945 -3163002 -3765102 -2788902
5915b788902J643472K56600p44710r916N41964J4644M92260K291061J844465k241866
$$ -2788902 -1145430 -888830 -1633540 -1643456 -1101492 -1086848 -594588 1696473 3540938 1299072
5905A299072n216298k697407K151866L076246Q8449j189614J415835L854582K666467
$$ 1299072 -3917226 -6614633 -4462767 -1386521 -1298072 -2487686 -1071851 2782731 5449198
5896E449198l63856j973680j974871j928958k073404j795321j419333j669869
$$ 5449198 5085342 3111662 1136791 -792167 -2865571 -4660892 -6080225 -7750094
5888g750094k334351k530931j507859J029123M032807M740945J542859k436124
$$ -7750094 -10084445 -12615376 -14123235 -13094112 -9061305 -4320360 -2777501 -5213625
5880e213625j647865M490473R416820P156306J2131m588142l397247J24844J869036
$$ -5213625 -6861490 -2371017 7045803 14202109 14214240 9626098 6228851 6353695 8222731
5871H222731J501532J55634k249309n153448n791504k525598J829496K908487
$$ 8222731 9724263 9879897 7630588 2477140 -3314364 -5839962 -4010466 -1101979
5863a101979K69274k557123k959927j604835m9200J265290K076739J765495P59222
$$ -1101979 -832705 -3389828 -6349755 -7954590 -8003790 -6738500 -4661761 -2896266 -2137044
5854b137044O04300J646996K242652J121325r90477k712369l192646j554020K285955
$$ -2137044 -1532744 114252 2356904 3478229 2487752 -224617 -3417263 -4971283 -2685328
5845b685328N363255L446497k949528p430596n437074l11658J778981L07969o97242
$$ -2685328 2677927 6124424 3174896 -4255700 -9692774 -10004432 -8225451 -7917482 -8614724
5836h614724r6733l61223j519494m03869L107589M649505K189745n84065l48935
$$ -8614724 -8711457 -9072680 -10592174 -10996043 -7888454 -3238949 -1049204 -1633269 -1982204
5827a982204P45140o16807l120021l199024o92809J598074K288664K113593J663024
$$ -1982204 -1237064 -1853871 -4973892 -8172916 -8865725 -7267651 -4978987 -2865394 -1202370
5818a202370J210703J441180J963767Q45989j976950l082669l42051K982247K564835
$$ -1202370 8333 1449513 3413280 4259269 2282319 -800350 -1142401 1839846 4404681
5809D404681n56408k003175q35750L14313O87567J775919K626501L09789m126325
$$ 4404681 3848273 1845098 1009348 1323661 2011228 3787147 6413648 6723437 2597112
5800B597112n461383j806138K326844K584418J92218j574437k228271k343501
$$ 2597112 -2864271 -4670409 -2343565 240853 433071 -1141366 -3369637 -5713138
5792e713138p10508K976678N316759L086015j748281m381617l210264m58886J726488
$$ -5713138 -6423646 -3446968 1869791 4955806 3207525 -1174092 -4384356 -4843242 -3116754
5783c116754K533500J185304j996963m075257k614823K83721P46530o18436L80155
$$ -3116754 -583254 602050 -1394913 -5470170 -8084993 -7801272 -7054742 -7673178 -7293023
5774g293023M040566N064819K71808o153986q096244n097361j228587J167850
$$ -7293023 -3252457 1812362 2084170 -4069816 -12166060 -17263421 -18492008 -17324158
5766a7324158K726287L511646K535828Q43423J209431L671214M515640J445099
$$ -17324158 -14597871 -11086225 -8550397 -7706974 -6497543 -2826329 1689311 3134410
5758C134410k735728l820194j820963k90654r70128j959713j316513J92029R67755
$$ 3134410 398682 -3421512 -5242475 -5533129 -6503257 -8462970 -9779483 -9587454 -8619699
5749h619699J130374J544394J686117M73473j382594j864037n52902P13378N87439
$$ -8619699 -7489325 -5944931 -4258814 -3785341 -5167935 -7031972 -7584874 -6871496 -6284057
5740f284057O0717O59850J995569K350917J121015m37732o77820R28227L399631
$$ -6284057 -6223340 -5563490 -3567921 -1217004 -95989 -533721 -1211541 -283314 3116317
5731C116317M735516L328102k46084l270807l629013k085930r20171r43989j285291
$$ 3116317 7851833 11179935 10933851 7663044 4034031 1948101 1027930 83941 -1201350
5722a201350j523699j981625j944212o4056K686948K970567l84101l927366l872134
$$ -1201350 -2725049 -4706674 -6650886 -6714942 -4027994 -1057427 -1441528 -5368894 -9241028
5713i241028j082882R06527J368623K281017L377346J697682k839612n512546
$$ -9241028 -10323910 -9417383 -8048760 -5767743 -2390397 -692715 -3532327 -9044873
5705i044873k938741J915354L916579K623429J418218J425329N57544j618141
$$ -9044873 -11983614 -10068260 -6151681 -3528252 -2110034 -684705 -127161 -1745302
5697a745302k336187j96869K075326J427708j225051k557193j213224J209489
$$ -1745302 -4081489 -4278358 -2203032 -775324 -2000375 -4557568 -5770792 -4561303
5689d561303K571965K039520K74664r27328P4708K663854L917045J927520j516240
$$ -4561303 -1989338 50182 324846 -602482 -527774 2136080 6053125 7980645 6464405
5680F464405k975803j595280K42082L50696p45214j192858m75323K85267K39712
$$ 6464405 3488602 1893322 2135404 2486100 1740886 548028 72705 357972 597684
5671E97684m7925J72910J65652j455414l971058m274209q14336L379797L958902
$$ 597684 549759 722669 888321 -567093 -4538151 -8812360 -9626696 -6246899 -2287997
5662b287997J080403q34997M83407K135886R22550j650459j784720J054984L746242
$$ -2287997 -1207594 -2042591 -1559184 576702 1499252 -151207 -1935927 -880943 2865299
5653B865299L675621R65503k632485m883336l931790l33723K365005J344993j666752
$$ 2865299 6540920 7506423 4873938 -9398 -3941188 -4274911 -1909906 -564913 -2231665
5644b231665k503867K3774L181797M333061L325057J077459j475204k885430k252616
$$ -2231665 -4735532 -4711758 -1529961 2803100 6128157 7205616 5730412 2844982 592366
5635E92366j036105j304583k138278p33841K665868M404658K820431M00483q73131
$$ 592366 -443739 -1748322 -3886600 -4620441 -1954573 2450085 5270516 5670999 4797868
5626D797868k469560n252651o238855k995201J509163K610788P60038K94080K298137
$$ 4797868 2328308 -2924343 -9163198 -12158399 -10649236 -8038448 -7278410 -6984330 -4686193
5617d686193L249059J158658j130409l91020K362410L816973K937104J431087
$$ -4686193 -1437134 -278476 -1408885 -1799905 562505 4379478 7316582 8747669
5609H747669O36371j40815k127117m885670o036069l463418J831773N675806M657813
$$ 8747669 9384040 9243225 7116108 2230438 -3805631 -7269049 -5437276 238530 4896343
5600D896343j6712l827957m062702k161465p29250j28118O64243J223783j09040
$$ 4896343 4879631 1051674 -3011028 -5172493 -5901743 -6029861 -5365618 -4141835 -4250875
5591d250875l166666m958480k891978J745139M830804M043673J326823O2675P92395
$$ -4250875 -7417541 -12376021 -15267999 -13522860 -8692056 -4648383 -3321560 -3258885 -2466490
5582b466490J163124k55165j973496j956882l78729J125137J813057K131195K382807
$$ -2466490 -1303366 -1558531 -3532027 -5488909 -5867638 -4742501 -2929444 -798249 1584558
5573A584558K366880J903028P81609j160392l029753l014426q76169Q52088O7276
$$ 1584558 3951438 5854466 6636075 5475683 2445930 -568496 -1444665 -592577 -525301
5564e25301j488477m87068K844343M758848L319214O27545j059675k248254l593456
$$ -525301 -2013778 -2500846 343497 5102345 8421559 9049104 7989429 5741175 2147719
5555B147719l429693o15030K374343K375779K33841o24524N34291J258329M09249
$$ 2147719 -1281974 -1897004 477339 2853118 3086959 2462435 2996726 4255055 4664304
5546D664304m11568m36826j194295l036918l436662r16285J858996J538336j161878
$$ 4664304 4252736 3815910 2621615 -415303 -3851965 -4768250 -2909254 -1370918 -2532796
5537b532796k826892k109171l74304J369047L117322L878883K196870j003844
$$ -2532796 -5359688 -7468859 -7843163 -6474116 -3356794 522089 2718959 1715115
5529A715115k865002k495132j882607k224211k034113j21033K068249K755733
$$ 1715115 -1149887 -3645019 -5527626 -7751837 -9785950 -9906983 -7838734 -5083001
5521e083001K419770K342543K420637K190263K213190K517061J528714j152151
$$ -5083001 -2663231 -320688 2099949 4290212 6503402 9020463 10549177 9397026
5513I397026k773041j104553J391795N06005l377131n533093l530623n9282J583645
$$ 9397026 6623985 5519432 6911227 7417232 4040101 -1492992 -5023615 -5082897 -3499252
5504c499252J492754J210038O23696j058734k973111l294847j570277Q63579K283482
$$ -3499252 -2006498 -796460 -172764 -1231498 -4204609 -7499456 -9069733 -8206154 -5922672
5495e922672J880258L81414m49783J41838N66611r96330l460705l838005j454014
$$ -5922672 -4042414 -3661000 -4110783 -3968945 -3402334 -4398664 -7859369 -11697374 -13151388
5486a3151388J094828J629067P38068j74640p51458o14625J093481L695522M664908
$$ -13151388 -12056560 -10427493 -9689425 -9864065 -10615523 -11230148 -10136667 -6441145 -1776237
5477a776237K855883J95610j116142j042344j38068J855406M023787L590640j66322
$$ -1776237 1079646 1275256 159114 -883230 -1021298 834108 4857895 8448535 8282213
5468H282213l536447k927573r3800L81860k376408m802690m065301r00588K468594
$$ 8282213 4745766 1818193 1724393 2106253 -270155 -5072845 -9138146 -10038734 -7570140
5459g570140M406080L862302R45901k165983k982218j564541P7689J118989K321999
$$ -7570140 -3164060 698242 1644143 -521840 -3504058 -5068599 -4990910 -3871921 -1549922
5450a549922L569604L455679J649456m70587j963384l170099l996654l340463
$$ -1549922 2019682 5475361 7124817 6654230 4690846 1520747 -2475907 -5816370
5442e816370j076601R32052Q72942p51710j609675m6335K963729M367325K243872
$$ -5816370 -6892971 -5960919 -5087977 -5839687 -7449362 -7495697 -4531968 -164643 2079229
5433B079229j401811k517520k60755J698230M86891j772759j493170Q22777J875946
$$ 2079229 677418 -1840102 -2100857 -402627 84264 -1688495 -3181665 -2358888 -482942
5424d82942R50802K22059L84965j05607j378823j471851L5999J008167K70039
$$ -482942 467860 689919 1074884 969277 -409546 -1881397 -1845398 -837231 -567192
5415e67192p51923q30348o92809r82154q69995K81002J826622K979263L200831
$$ -567192 -1319115 -2149463 -2842272 -3824426 -4694421 -4413419 -2586797 392466 3593297
5406C593297J567703j884294m492274l619598q04498J04814j192410j464641O9282
$$ 3593297 5161000 3276706 -1215568 -4835166 -5639664 -5534850 -6727260 -8191901 -8122619
5397h122619O18871l51938M58550L768080N036315J611585k224578j657926J244882
$$ -8122619 -7503748 -7855686 -7397136 -3629056 1407259 3018844 794266 -863660 381222
5388C81222J482772p05042j122535R38753K119923J040749j46491j73701k05766
$$ 381222 1863994 1158952 36417 975170 3095093 4135842 3989351 3815650 3609884
5379C609884p22944p62116o42795j849592l683918l409696n12620K104461J950665
$$ 3609884 2886940 2124824 1482029 -367563 -4051481 -7461177 -7973797 -5869336 -3918671
5370c918671m75672l254319m619906k915188J904824O220827N536036N09533k822694
$$ -3918671 -4394343 -7648662 -12268568 -15183756 -13278932 -7058105 -1522069 -1012536 -3835230
5361c835230m52792M652485O880409M847097J643324L8243M9446L83070m3915
$$ -3835230 -4288022 364463 7244872 12091969 13735293 13773536 13822982 14206052 14162137
5352A4162137j744861m043075m971332l329179p60382k44677k280321m033016
$$ 14162137 12417276 8374201 3402869 73690 -686692 -931369 -3211690 -7244706
5344g244706k988555k05661J353281R82403Q43879K230662L384913K556065J446328
$$ -7244706 -10233261 -10438922 -9085641 -8103238 -7259359 -5028697 -1643784 912281 2358609
5335B358609K808154N276894M176925j546957o566501n684579o78875K360511
$$ 2358609 5166763 10443657 14620582 13073625 6507124 822545 143670 2504181
5327B504181R97972j571736j892355j61407J676625K778284L056991K083707o2980
$$ 2504181 3502153 1930417 38062 -123345 1553280 4331564 7388555 9472262 9409282
5318I409282j934306k016783n30841P13168L4518k591877n242626n408566k372931
$$ 9409282 7474976 5458193 4927352 5640520 5675038 3083161 -2159465 -7568031 -9940962
5309i940962J778795M115848L703481K000347Q50292Q01145J037790K92428j727946
$$ -9940962 -8162167 -4046319 -342838 1657509 2507801 3308946 4346736 4639164 2911218
5300B911218l294775k010077J835110M413716K488983k360834n437683m425124
$$ 2911218 -383557 -2393634 -558524 3855192 6344175 3983341 -1454342 -5879466
5292e879466j363813O81456R42331N62240N95404J234778K075247K422821J723670
$$ -5879466 -7243279 -6561823 -5619492 -5057252 -4461848 -3227070 -1151823 1270998 2994668
5283B994668K895k131036l642627l343397j019945J481804J724831j47222j344557
$$ 2994668 2997563 866527 -2776100 -6119497 -7139442 -5657638 -3932807 -4080029 -5424586
5274e424586l72468J037501J243577J393284K548788K640613m07132m384342n421562
$$ -5424586 -5797054 -4759553 -3515976 -2122692 426096 3066709 2659577 -1724765 -7146327
5265g146327l642242k195308j634304J43285K620064K389671q84837k933900j038964
$$ -7146327 -10788569 -12983877 -14618181 -14474896 -11854832 -9465161 -10349998 -13283898 -14322862
5256a4322862K309111L797202L506037K627037P89027j652867k147492J11988
$$ -14322862 -12013751 -8216549 -4710512 -2083475 -1294448 -2947315 -5094807 -4982819
5248d982819J783328J77776k302838k053832L2470Q06713N46768J687133L346876
$$ -4982819 -3199491 -3021715 -5324553 -7378385 -7345915 -6539202 -5992434 -4305301 -958425
5239i58425K348998o46960j330594J157231K395033j34919k688758j251571J824740
$$ -958425 1390573 743613 -586981 570250 2965283 2830364 141606 -1109965 714775
5230G14775J448160k101051l476712m06763K958820K270226r34681k013149k5799
$$ 714775 2162935 61884 -3414828 -3821591 -862771 1407455 472774 -1540375 -1566174
5221a566174J484123M8705k503743l260770k164405r28680L02587K707554N659269
$$ -1566174 -82051 -33346 -2537089 -5797859 -7962264 -8890944 -8588357 -5880803 -221534
5212b21534O395940L618241k68360j731682j34422J844379J453517j290596m022658
$$ -221534 6174406 9792647 9524287 7792605 7658183 9502562 10956079 9665483 5642825
5203E642825m719653l529799j883987m35870J128347K394863K006514n2118j574592
$$ 5642825 923172 -2606627 -4490614 -4926484 -3798137 -1403274 603240 551122 -1023470
5194a023470j025067R1135l03333j343662q55615M20441k83531k618895k743045
$$ -1023470 -2048537 -1957402 -2260735 -3604397 -4460012 -4039571 -4323102 -6941997 -9685042
5185i685042O24510L462909K260936m55214O9498L347121M174476M18127l767578
$$ -9685042 -9060532 -5597623 -3336687 -3791901 -3722403 -375282 3799194 4217321 449743
5176D49743l895978j173149L13j293647j675779P05503K886335J522725j661592
$$ 449743 -3446235 -4619384 -4619071 -5912718 -7588497 -6882994 -3996659 -2473934 -4135526
5167d135526k016282J161595L457316J798050j339065k167437j088748r31860
$$ -4135526 -6151808 -4990213 -1532897 265153 -1073912 -3241349 -4330097 -5261957
5159e261957j836593j593721j838R09789P24154J073844K048740J740444P6019
$$ -5261957 -7098550 -8692271 -8694109 -7784320 -7060166 -5986322 -3937582 -2197138 -2121119
5150b121119l41848J511561L067639K060464j20334p74228M37273J846045K176265
$$ -2121119 -2462967 -951406 2116233 4176697 4056363 3282135 3719408 5565453 7741718
5141G741718J163210q23679k622138k940370j886444o63023L28849J421955J993697
$$ 7741718 8904928 8081249 5459111 2518741 632297 -30726 298123 1720078 3713775
5132C713775J192898J55453O39939J558553L10526k303901k671072n93216j67720
$$ 3713775 4906673 5062126 5702065 7260618 7571144 5267243 2596171 2002955 1835235
5123A835235k746376m057525j285601J763621P17692k080046j342021K740488
$$ 1835235 -911141 -4968666 -6254267 -4490646 -3772954 -5853000 -7195021 -4454533
5115d454533N011555K982674o46420k582829k229534n64871J154890J638859P79663
$$ -4454533 557022 3539696 2893276 310447 -1919087 -2483958 -1329068 309791 1089454
5106A089454J72404P36123J076906l3294j381430j557081j291141j227866L5389
$$ 1089454 1261858 1997981 3074887 3041593 1660163 103082 -1188059 -2415925 -2380536
5097b380536K729368L501825O1011m054617l666349O74898L767473L005612M57102
$$ -2380536 348832 3850657 3911668 -142949 -3809298 -3134400 633073 3638685 4095787
5088D095787j240344j071246J221057M233831M293163j62815m844968m630626
$$ 4095787 2855443 1784197 3005254 7239085 11532248 11369433 6524465 1893839
5080A893839r72445N75840j075163k122171j235226j014871j848194q18117J982136
$$ 1893839 921394 1497234 422071 -1700100 -2935326 -3950197 -5798391 -6616508 -4634372
5071d634372K344680p34151k554952l40987K146491J146889q49016L55268L712046
$$ -4634372 -2289692 -3023843 -5578795 -5919782 -3773291 -2626402 -3475418 -3120150 591896
5062E91896N015724L177431K17033k819338n771022o720780l644881J640198M588922
$$ 591896 5607620 8785051 9002084 6182746 411724 -6309056 -9953937 -8313739 -3724817
5053c724817L296741L73883q32702N5988J082242Q83942m3304p35668j382577
$$ -3724817 -428076 -54193 -886895 -830907 251335 1135277 1091973 356305 -1026272
5044a026272k531861l057808j080946K211515K388957k135113o307143m484575
$$ -1026272 -3558133 -6615941 -7696887 -5485372 -3096415 -5231528 -11538671 -16023246
5036a6023246J400945M322337K028913p16154j25172J719917J633709K18780n71506
$$ -16023246 -14622301 -10299964 -8271051 -8987205 -9112377 -7392460 -5758751 -5539971 -6111477
5027f111477r43995j548202j282410M83317J954927J626563Q20447J343426K528395
$$ -6111477 -7055472 -8603674 -9886084 -9402767 -7447840 -5821277 -5000830 -3657404 -1129009
5018a129009K577636J187448p17565k231658k388959q01692P94990K0813k314072
$$ -1129009 1448627 2636075 1918510 -313148 -2702107 -3503799 -2708809 -2687996 -5002068
5009e002068k696164k84689J475330L01239j187837L22971L613222M819159K791509
$$ -5002068 -7698232 -7982921 -6507591 -6206352 -7394189 -7071218 -3457996 1361163 4152672
5000D152672j15202j564886j386021o81646k32166J60672Q16574N89503k263565
$$ 4152672 4037470 2472584 1086563 404917 172751 333423 1149997 1739500 -524065
4991e24065o225497o084729L06797P174880P523969K922879N85412J816452R23374
$$ -524065 -6749562 -12834291 -12527494 -5352614 2171355 5094234 5679646 7496098 8419472
4982H419472l825180o529669l674234K6151l965r60784J051506L599822K712083
$$ 8419472 4594292 -1935377 -5609611 -5583460 -5587425 -6548209 -5496703 -1896881 815202
4973H15202J45858k16506P63524J29934j112046m19450P90121k28805j998142
$$ 815202 961060 744554 1508078 1638012 525966 106516 896637 667832 -1330310
4964a330310j442825K30878k41977k034470j654868R63486K714724K406959J315447
$$ -1330310 -2773135 -2542257 -2784234 -4818704 -6473572 -5510086 -2795362 -388403 927044
4955I27044J53599o43496L43268K636178K347510k153562n986590m146018O33666
$$ 927044 1080643 437147 780415 3416593 5764103 3610541 -2376049 -6522067 -5888401
4946e888401J923075q66754k892364k034537o41387j93934J40941L04808k95447
$$ -5888401 -3965326 -4832080 -7724444 -9758981 -10400368 -10594302 -10453361 -10148553 -10444000
4937a0444000o2418K475887M790899L490475j3917j710020j293694j343666j874871
$$ -10444000 -10506418 -8030531 -3239632 250843 236926 -1473094 -2766788 -4110454 -5985325
4928e985325j005902M02243J37551o58894N23694K264718J292588j472415k387644
$$ -5985325 -6991227 -6588984 -6451433 -7110327 -6586633 -4321915 -3029327 -4501742 -6889386
4919f889386j303223r35085j429062r60446k55239j055077j720744Q5088K144953
$$ -6889386 -8192609 -9127694 -10556756 -11517202 -11772441 -12827518 -14548262 -14463174 -12318221
4910a2318221Q15339k467478l466151j843425j22485J307503K580175J375020
$$ -12318221 -11502882 -13970360 -17436511 -19279936 -19402421 -18094918 -15514743 -14139723
4902a4139723k366578l221935J365143M869928J783974k332296n68792K381064
$$ -14139723 -16506301 -19728236 -18363093 -13493165 -11709191 -14041487 -14610279 -12229215
4894a2229215j074407o312523m227000J523869Q16968l997229k775478K439211
$$ -12229215 -13303622 -19616145 -23843145 -22319276 -21502308 -25499537 -28275015 -25835804
4886b5835804R61471n570233o007896j757573m070754j0291207p248761J584619
$$ -25835804 -24874333 -30444566 -36452462 -38210035 -42280789 -52571996 -59820757 -58236138
4878e8236138n0460r048165p365705k131703j9598321m5829826k2794982O3594298
$$ -58236138 -58286598 -67334763 -74700468 -76832171 -96430492 -142260318 -165055300 -101461002
4870a01461002J35476978J12529353K0998253m1532986l3909412n031552l363851
$$ -101461002 34015976 146545329 167543582 126010596 92101184 87069632 83705781
4863H3705781j5404753j1352358R93028n05531j0548569j0689719l165317k030037
$$ 83705781 68301028 56948670 57941698 57436167 46887598 36197879 33032562 31002525
4855C1002525o000368m585205L20924J68545k315249M20078M447876J457482m886774
$$ 31002525 25002157 20416952 20737876 20906421 18591172 19011250 23459126 24916608 20029834
4846B0029834n229994q64852O41928J10609K917240N919890K299544m654910n951799
$$ 20029834 14799840 13934988 14576916 14687525 17604765 23524655 25824199 21169289 15217490
4837A5217490j845859Q6279j124932p7044L077780K869814n64439j789176m29666
$$ 15217490 13371631 13457910 12332978 12255934 15333714 18203528 17639089 15849913 15420247
4828A5420247r93195l201645k489623M71033N49585j864310j319923K235910L130577
$$ 15420247 14427052 11225407 8735784 9206817 9756402 7892092 6572169 8808079 11938656
4819A1938656O96755O53247M233118N292739Q91878l708028l901544k144711j924288
$$ 11938656 12635411 13288658 17521776 22814515 23706393 19998365 16096821 13952110 12027822
4810A2027822j940454k90533J040853k8963j559436p98365J636866L373709L339026
$$ 12027822 10087368 9796835 10837688 10808725 9249289 8450924 10087790 13461499 16800525
4801A6800525J567639j209760k812033j538426O63932M81398j263735q03670J640406
$$ 16800525 18368164 17158404 14346371 12807945 13471877 13953275 12689540 11885870 13526276
4792A3526276J495023k313861m794018k706385K21434n86456l473772l667315
$$ 13526276 15021299 12707438 7913420 5207035 5428469 4842013 1368241 -2299074
4784b299074m18408K974928M210082L480380J454783j026785k233580j242835
$$ -2299074 -2717482 257446 4467528 7947908 9402691 8375906 6142326 4899491
4776D899491K98238K39222r59246j102055L74405J733670J393952k85838j579724
$$ 4899491 5197729 5436951 4477705 3375650 3750055 5483725 6877677 6591839 5012115
4767E012115j026704J180208L050812K664561M27975j357723j326400l98863j52064
$$ 5012115 3985411 5165619 8216431 10880992 11308967 9951244 8624844 8225981 8073917
4758H073917j012679k295358k910770j954547K24583J707488J228436L92897J655533
$$ 8073917 7061238 4765880 1855110 -99437 125146 1832634 3061070 3453967 5109500
4749E109500M206969M459730J217084k284356k775294j096669k15565r36600j642211
$$ 5109500 9316469 13776199 14993283 12708927 9933633 8836964 8621399 7684799 6042588
4740F042588j176465m6021P01050L27873j366155l413445l752944j199435K862505
$$ 6042588 4866123 4820102 5521152 5849025 4482870 1069425 -2683519 -3882954 -1020449
4731a020449N694499N875257M010701J308536j365625l107147k959662j017717
$$ -1020449 4674050 10549307 14560008 15868544 14502919 11395772 8436110 7418393
4723G418393R82918J001327j171174l471398l607036j418083J123741K106897
$$ 7418393 8401311 9402638 8231464 4760066 1153030 -265053 858688 2965585
4715B965585J362932J03387l88619K70847J081131K85187k347804m133601k342384
$$ 2965585 4328517 4431904 4043285 4314132 5395263 5680450 3332646 -800955 -3143339
4706c143339J354572K041972j595406m546996k095262L382799N788913L782872
$$ -3143339 -1788767 253205 -1342201 -5889197 -7984459 -4601660 1187253 4970125
4698D970125J594305J884090K417022Q12788j508126k193213j662816j470802
$$ 4970125 6564430 8448520 10865542 11678330 10170204 7976991 6314175 4843373
4690D843373j203054L09493K024080J569246j229740l706828l506515j236641
$$ 4843373 3640319 3949812 5973892 7543138 6313398 2606570 -899945 -2136586
4682b136586M04252k80133k086582k437855q33864L24268p07085k012259o28714
$$ -2136586 -1732334 -2012467 -4099049 -6536904 -7370768 -7046500 -7753585 -9765844 -10394558
4673a0394558K802113M802373M143151K907362K202751N78315k020215k642254
$$ -10394558 -7592445 -2790072 1353079 4260441 6463192 7041507 5021292 2379038
4665B379038j44435J882664L81527j877543m94862L120305L528707j98690k941680
$$ 2379038 2234603 4117267 4498794 2621251 2126389 5246694 8775401 8576711 5635031
4656E635031j338285J667651K082293N88179Q6001O40949M65451o2818P54365
$$ 5635031 4296746 5964397 8046690 8634869 8720870 9361819 9827270 9764452 10518817
4647A0518817J941887N58686l341137n896047m701188k015753j012307j223689
$$ 10518817 12460704 13019390 9678253 3782206 -918982 -2934735 -3947042 -5170731
4639e170731j64658K063198K762014R74428q85862m94625J292785K029028J045368
$$ -5170731 -5335389 -3272191 -510177 464251 -421611 -916236 376549 2405577 3450945
4630C450945j45141j65375P52699J460882J165919m5233j400841k092496j975133
$$ 3450945 3305804 3140429 3893128 5354010 6519929 6474696 5073855 2981359 1006226
4621A006226j543911j169628p67562l93976n61275j457194k279841j966889m52375
$$ 1006226 -537685 -1707313 -2474875 -2868851 -3430126 -4887320 -7167161 -9134050 -9586425
4612i586425J216322J948865J609532J083391J362755K316744K571792J165845
$$ -9586425 -8370103 -6421238 -4811706 -3728315 -2365560 -48816 2522976 3688821
4604C688821r59395k014131j641460q49044J25188J880172L410760K166548j865458
$$ 3688821 2729426 715295 -926165 -1775209 -1650021 230151 3640911 5807459 3942001
4595C942001m442516k066965K720641M144566P74159k923398k976829o87585L91274
$$ 3942001 -500515 -2567480 153161 4297727 5071886 2148488 -828341 -1515926 -1124652
4586a124652l80109r21344k90239K85576j8611k83028K93836Q19460J87653p54744
$$ -1124652 -1504761 -2426105 -2716344 -2430768 -2449379 -2732407 -2438571 -1619111 -1431458 -2186202
4576b186202k1900K577618M734338M451613K385999M01405j066483k578892l480252
$$ -2186202 -2208102 369516 5103854 9555467 11941466 12342871 11276388 8697496 5217244
4567E217244k444590j80389Q95531K54740L0598J167794J465907o89855l065179
$$ 5217244 2772654 2592265 3487796 3742536 3773134 4940928 6406835 5716980 2651801
4558B651801k657009l32146N16392j014167k467427j800825L49264K036319J836541
$$ 2651801 -5208 -337354 179038 -835129 -3302556 -5103381 -4754117 -2717798 -881257
4549h81257k35688k107781r92583K862631N288979L394554j47245j122779k22978
$$ -881257 -1116945 -3224726 -4217309 -1354678 3934301 7328855 7181610 6058831 5835853
4540E835853j210761l905844m239856j345771Q29265J52275o56729M06938J017860
$$ 5835853 4625092 719248 -3520608 -4866379 -4037114 -3884839 -4541568 -4134630 -3116770
4531c116770o44975j940703k88614K068330J834689J42639J5068Q61646P0037
$$ -3116770 -3761745 -5702448 -5991062 -3922732 -2088043 -1945404 -1930336 -1068690 -998653
4522i98653j707286j582029K68223R51534J23730L56660J986290K047045m93693
$$ -998653 -2705939 -4287968 -4019745 -3068211 -2944481 -2587821 -601531 1445514 951821
4513I51821k392304r49924J876359K425197K61649j987047k267145o83106J491230
$$ 951821 -1440483 -2390407 -514048 1911149 2172798 185751 -2081394 -2764500 -1273270
4504a273270K671706J592654j241367l047367j297281K957078N493498L409022
$$ -1273270 1398436 2991090 1749723 -1297644 -2594925 362153 5855651 9264673
4496I264673j430790m403890l416307q73978J20975j20949O24577K091348J662472
$$ 9264673 7833883 3429993 13686 -860292 -739317 -860266 -235689 1855659 3518131
4487C518131r06828k231223l04102K106429J494210j185921k361230j389117q80369
$$ 3518131 2611303 380080 75978 2182407 3676617 2490696 129466 -1259651 -2140020
4478b140020k009637k787830j410063J263168L270858L688040K653318Q47165
$$ -2140020 -4149657 -6937487 -8347550 -7084382 -3813524 -125484 2527834 3374999
4470C374999o08161r31112m78091J49992J157827K414996K370623J64214k162109
$$ 3374999 2766838 1835726 1357635 1507627 2665454 5080450 7451073 7615287 5453178
4461E453178k119693o55299n81586j712805j216961J105518J957762j7927j866722
$$ 5453178 3333485 2678186 2096600 383795 -833166 272352 2230114 2212187 345465
4452C45465j139047M86697N99787j87819m11351o25110j252911n38719J970446
$$ 345465 -793582 -306885 292902 105083 -306268 -931378 -2184289 -2723008 -752562
4443g52562K728224p87242m579704k717739L638659P093544M089520r04888k446243
$$ -752562 1975662 1188420 -3391284 -6109023 -2470364 4623180 8712700 7807812 5361569
4434E361569p44707Q12303Q58284N6689j175639k179610j487318O79788J291048
$$ 5361569 4616862 5429165 6287449 6344138 5168499 2988889 1501571 2181359 3472407
4425C472407j461314m679568m173817j60133L350108M017967L006747J741882
$$ 3472407 2011093 -2668475 -6842292 -7002425 -3652317 365650 3372397 5114279
4417E114279J35160j386385j052516J537582L819851L058886k60565l088834l253279
$$ 5114279 5249439 3863054 2810538 4348120 8167971 11226857 10966292 7877458 4624179
4408D624179j367232K30966k22232k355823l982431l219606m37294K194485K976505
$$ 4624179 3256947 3487913 3265681 909858 -3072573 -6292179 -6729473 -4534988 -1558483
4399a558483K017700N59805k56410j4429Q39185J425666J416775J225118Q21735
$$ -1558483 459217 1019022 762612 748183 1587368 3013034 4429809 5654927 6476662
4390F476662n75596k584361k834254j71337K373477Q58080l484242m922517r59146
$$ 6476662 5901066 3316705 482451 311114 2684591 3542671 58429 -4864088 -5823234
4381e823234L997168M621535J392935j343842j654403r90095l52195P63060J797810
$$ -5823234 -1826066 2795469 4188404 2844562 1190159 200064 -152131 610929 2408739
4372B408739R45590j666026l176168j551953J757705L742756L129579R05470j373272
$$ 2408739 3354329 1688303 -1487865 -3039818 -1282113 2460643 5590222 6495692 5122420
4363E122420k839366l438412l515271l168367j935836N32772L510869N366423
$$ 5122420 2283054 -1155358 -4670629 -7838996 -9774832 -9242060 -5731191 -364768
4355c64768M914196K580703K37077m74451p8107q56320l413539m613344j328955
$$ -364768 4549428 7130131 7367208 6892757 6814650 5958330 2544791 -2068553 -3397508
4346c397508M114618N701512J831432k149513j697895N30603k87143l078149l099885
$$ -3397508 717110 6418622 8250054 6100541 4402646 4933249 4646106 1567957 -1531928
4337a531928l53852L19507k395478l770192o65812L289741L099376o01418l198772
$$ -1531928 -1885780 -1566273 -3961751 -7731943 -8397755 -5108014 -2008638 -2610056 -5808828
4328e808828k414841J27342K216894L117374K892625J877744Q62768N15756N54623
$$ -5808828 -8223669 -8096327 -5879433 -2762059 130566 2008310 2871078 3386834 3941457
4319C941457J13097j173562k652806l026896j515207R22730K200926J666358R82225
$$ 3941457 4054554 2880992 228186 -2798710 -4313917 -3391187 -1190261 476097 1458322
4310A458322J342284J302851p11126l206760l511225j764734j88947O80030J837146
$$ 1458322 2800606 4103457 3392331 185571 -3325654 -5090388 -5279335 -4599305 -2762159
4301b762159K651445J483410p87891j461373k61172N56429J99688k25293j006387
$$ -2762159 -110714 1372696 584805 -876568 -1137740 -581311 -381623 -606916 -1613303
4292a613303l337020n570736m608775j361058J09961n21098P23893M617031O527540
$$ -1613303 -4950323 -10521059 -15129834 -16490892 -16380931 -16902029 -16178136 -11561105 -5033565
4283e033565L930933M95776j34935O37362O50175J059293K550891K417994n76575
$$ -5033565 -1102632 -606856 -741791 -104429 545746 1605039 4155930 6573924 5997349
4274E997349k853436j519577R63139J401078Q06429Q73764J83318j874351k176494
$$ 5997349 3143913 1624336 2587475 3988553 4794982 5668746 5852064 3977713 1801219
4265A801219N72657K266594K19837j701907j82251J058835j585806l810070p45526
$$ 1801219 2373876 4640470 4860307 3158400 2976149 4034984 2449178 -1360892 -2106418
4256b106418L141534Q47726m571434m413754J374131M826877L333221J719084
$$ -2106418 1035116 1882842 -2688592 -7102346 -5728215 -901338 2431883 4150967
4248D150967J528950p98700m278397k904347K857346M531300q48290n291876k465140
$$ 4150967 5679917 4881217 602820 -2301527 555819 5087119 4238829 -1053047 -3518187
4239c518187K983304M119183K072809J488208J890054K75546k099388j803350
$$ -3518187 -534883 3584300 5657109 7145317 9035371 9310917 7211529 5408179
4231E408179P21266K244994J734937L42156j437718l200047l215780n98612K587079
$$ 5408179 6129445 8374439 10109376 10451532 9013814 5813767 2597987 1999375 4586454
4222D586454L527151J662621j546083m042464l893827r43891J953168J822265
$$ 4586454 8113605 9776226 8230143 4187679 293852 -650039 1303129 3125394
4214C125394m56320j728654j332081r95741j034709m08731N66454J349032L168297
$$ 3125394 2669074 940420 -391661 -1387402 -2422111 -2830842 -2264388 -915356 2252941
4205B252941N834636N517343P72734l016430j492678J051934l47726j540675K317742
$$ 2252941 8087577 13604920 14377654 11361224 9868546 10920480 10572754 9032079 11349821
4196A1349821N088720P586m701882J907844J1422757R155216N801227K5329628
$$ 11349821 16438541 16446127 11744245 13652089 25074846 34230062 40031289 65360917
4188F5360917N6454735N1984435m625844o3577025o8452508k8577126J768173
$$ 65360917 121815652 173800087 169174243 105597218 37144710 8567584 10335757
4181A0335757j22940q577882k723533N046092J042719m413580N87814P321965
$$ 10335757 10212817 1634935 -1088598 3957494 5000213 586633 1174447 8496412
4173H496412L993803l077849k561913J825344L38276m530590l944025Q87902K010905
$$ 8496412 12490215 9412366 6850453 8675797 9014073 4483483 539458 1427360 3438265
4164C438265r54588j907234J10961Q53979l16763m82714J83525n83352j558247
$$ 3438265 2483677 576443 687404 1541383 1224620 741906 925431 342079 -1216168
4155a216168p8037K353995K445312J039037J200988K398601J742244p08868k506282
$$ -1216168 -1294205 1059790 3505102 4544139 5745127 8143728 9885972 9177104 6670822
4146F670822l023234l049092k028389M28037K115903J002720j275059j944064
$$ 6670822 3647588 598496 -1429893 -1001856 1114047 2116767 841708 -1102356
4138a102356j278308j153498j371369n95758P01702J154524J000034J324825K176626
$$ -1102356 -2380664 -3534162 -4905531 -5501289 -4799587 -3645063 -2645029 -1320204 856422
4129H56422L109883L877372L392320M38416l402740m508995k309163m00639j093976
$$ 856422 3966305 7843677 11235997 11674413 8271673 3762678 1453515 1052876 -41100
4120d1100k415999k272210j667208j562307n02401J923984K994384J171532q56673
$$ -41100 -2457099 -4729309 -6396517 -7958824 -8461225 -6537241 -3542857 -2371325 -3227998
4111c227998l05846J720854K901280K894645J462114k580395p614806q649530
$$ -3227998 -3533844 -1812990 1088290 3982935 5445049 2864654 -4750152 -13399682
4103a3399682m051753J084608K022963Q18466J514738L040060K100862j21207
$$ -13399682 -17451435 -16366827 -14343864 -13525398 -12010660 -8970600 -6869738 -6990945
4095f990945J29619K645511L886308K747127J073916k61198j503377j592854J83699
$$ -6990945 -6861326 -4215815 -329507 2417620 3491536 3230338 1726961 134107 317806
4086C17806J396015n16005l587119l777289j011626J332719K030372K793759L891801
$$ 317806 1713821 1197816 -2389303 -6166592 -7178218 -5845499 -3815127 -1021368 2870433
4077B870433L243646K89035k643372l432706k220006l42368P13996k14020k456249
$$ 2870433 6114079 6403114 3759742 327036 -1892970 -2235338 -1521342 -1735362 -4191611
4068d191611l204419p95452K613636L739794K483915J388778J842178K977513
$$ -4191611 -7396030 -8191482 -5577846 -1838052 645863 2034641 3876819 6854332
4060F854332L472712K625973N84807j191201j133895k15740j156661l882630m820011
$$ 6854332 10327044 12953017 13537824 12346623 11212728 10996988 9840327 5957697 1137686
4051A137686k393095K98232O57644O65531K552247M055472K106341j658645l397803
$$ 1137686 -1255409 -957177 -299533 365998 2918245 6973717 9080058 7421413 4023610
4042D023610k806082k217896j987829q52587P42453J407631J392629J307892K94157
$$ 4023610 1217528 -1000368 -2988197 -3840784 -3098331 -1690700 -298071 1009821 1303978
4033A303978j600094j910092J60738J301130o52535k580981j393809L91406n87202
$$ 1303978 -296116 -2206208 -2045470 -744340 -1396875 -3977856 -5371665 -4980259 -5567461
4024e567461k028935j39876L081680L199297J083526N52147R29811p96126k707069
$$ -5567461 -7596396 -7736272 -4654592 -1455295 -371769 180378 1110189 314063 -2393006
4015b393006o91407L179093L161227k42245j181123J165096J683393r12980k116921
$$ -2393006 -3084413 94680 3255907 3013662 1832539 2997635 4681028 3768048 1651127
4006A651127n14106n4104j668900j111092K290814K969766j353340n019883l257855
$$ 1651127 1137021 1082917 -585983 -1697075 593739 3563505 2210165 -2809718 -6067573
3997f067573R96058K965703K529165J126948j704294m826763m428395m14170J844950
$$ -6067573 -5071515 -2105812 423353 1550301 -153993 -4980756 -9409151 -9823321 -7978371
3988g978371J0807j012048K318820N604868L828338m12272j871632r31837p87935
$$ -7978371 -7967564 -8979612 -6660792 -1055924 2772414 2360142 488510 -443327 -1231262
3979a231262p49850J168114K595350M05202k771976k152566J106602J758251q83198
$$ -1231262 -1981112 -812998 1782352 2187554 -584422 -2736988 -1630386 127865 -755333
3970g55333k209107J85844L624120N096536M457034K611248J83023j745701k381318
$$ -755333 -2964440 -2778596 845524 5942060 10399094 13010342 13193365 11447664 9066346
3961I066346k568986l217944l305212j712645K38536N50287m22505j025135r88994
$$ 9066346 6497360 3279416 -25796 -1738441 -1499905 -949618 -1372123 -2397258 -3386252
3952c386252q59072l04217Q37271J426757Q26731J0519n82291j752441k722942
$$ -3386252 -4245324 -4549541 -3712270 -2285513 -1458782 -1448263 -2030554 -3782995 -6505937
3943f505937j147907K109437K445573j352282l930955j167573L276029L919196
$$ -6505937 -7653844 -5544407 -3098834 -4451116 -8382071 -9549644 -6273615 -2354419
3935b354419J831930J441149K566962J995783K82372K93477Q64863j285743m522476
$$ -2354419 -522489 918660 3485622 5481405 5763777 6057254 6922117 5636374 1113898
3926A113898m040205j52440J955617Q46569M01207J961209J728543j964354m868122
$$ 1113898 -2926307 -3078747 -1123130 -276561 124646 2085855 3814398 1850044 -3018078
3917c018078l225331P67240K801018K041465M29770m21474L17247K425152L431798
$$ -3018078 -6243409 -5476169 -2675151 -633686 -203916 -625390 -308143 2117009 5548807
3908E548807Q02963l548727m499809q32396K692249K236805K7438j2314J638669
$$ 5548807 6351770 2803043 -1696766 -2529162 163087 2399892 2427330 2415016 4053685
3899D053685J756455p6650j014563P72420L804604N059001K822772j677212m954267
$$ 4053685 5810140 5733490 4718927 5491347 9295951 14354952 17177724 15500512 10546245
3890A0546245m588923k145438j338941l150836m709205l487373n14818J489416
$$ 10546245 5957322 3811884 2472943 -677893 -5387098 -8874471 -9389289 -7899873
3882g899873J405608J52359q02161o02390L36385O29379j95173o43848N38271
$$ -7899873 -6494265 -6341906 -7144067 -7746457 -7410072 -6780693 -6975866 -7619714 -7081443
3873g081443K097507K237451J698152K109151K366067K78932k702499k623954
$$ -7081443 -4983936 -2746485 -1048333 1060818 3426885 3705817 1003318 -1620636
3865a620636P78850L241864K276762K16242l89280k98688n77596j3631J923775
$$ -1620636 -841786 2400078 4676840 4893082 4503802 4205114 3627518 3613887 5537662
3856E537662K945160J524327l09593m29210J1776n70027r20526J95479O44504
$$ 5537662 8482822 10007149 9697556 9268346 9280122 8710095 7789569 7985048 8629552
3847H629552j691175m391098l641425m21103Q91864o75177j785349p01973L59219
$$ 8629552 6938377 2547279 -1094146 -1515249 -623385 -1298562 -3083911 -3785884 -3426665
3838c426665k37688p07559N79188J903654J062100p72903p18848J450592L051107
$$ -3426665 -3664353 -4371912 -3792724 -1889070 -826970 -1599873 -2318721 -868129 2182978
3829B182978K266719K24704q66817k20835J245165K070918J254863j091008l528561
$$ 2182978 4449697 4674401 3807584 3586749 4831914 6902832 8157695 7066687 3538126
3820C538126m267467k869594o19746J083170K001374K253387J375560n27520j678000
$$ 3538126 -729341 -3598935 -4218681 -3135511 -1134137 1119250 2494810 1967290 289290
3811B89290o92342P60746n3629k277735k027657J396183L526492J349224j510843
$$ 289290 -403052 357694 304065 -1973670 -4001327 -2605144 921348 2270572 759729
3802G59729j0621M389830N742484K350751j513126k587934k302841k418362j814896
$$ 759729 749108 5138938 10881422 13232173 11719047 9131113 6828272 4409910 2595014
3793B595014O3421O03605j913448m481168l143552R89721K883027K85415l429959
$$ 2595014 2658435 3262040 1348592 -3132576 -6276128 -5286407 -2403380 -2117965 -5547924
3784e547924l560207M52319M573274M712897J201056j827489j657984j31806j55633
$$ -5547924 -9108131 -8655812 -4082538 630359 1831415 3926 -1654058 -1785864 -1941497
3775a941497r00152L60467K613416J772785k301853m063149N4677O000109P454571
$$ -1941497 -2841649 -2481182 132234 1905019 -396834 -4459983 -4405306 1594803 9049374
3766I049374M056369N57327l74100m62542j576446k947740l219868k566300j788024
$$ 9049374 13105743 13663070 13288970 12826428 11249982 8302242 5082374 2516074 728050
3757G28050r95727r1273L89433l36245k163130l514951k495114M75818J920305
$$ 728050 -267677 -358950 30483 -305762 -2468892 -5983843 -8478957 -8003139 -6082834
3748f082834o53569m205858k941271L322731P316667L586835l592111n637577
$$ -6082834 -6736403 -10942261 -13883532 -10560801 -3244134 342701 -3249410 -8886987
3740h886987r57017M028447M560480L003138L289451M518470L285814k87788k595651
$$ -8886987 -9844004 -5815557 -1255077 1748061 5037512 9555982 12841796 12554008 9958357
3731I958357j933234p29849j766395m290103n236457l258631l7441K142467K576494
$$ 9958357 8025123 7295274 5528879 1238776 -3997681 -7256312 -7293753 -5151286 -2574792
3722b574792J558773o57010k955944k824701R02445N142082N098674L58857l957732
$$ -2574792 -1016019 -1673029 -4628973 -7453674 -6551229 -1409147 3689527 4048384 90652
3713I0652l384869O69848L583146L504760K316223J769163J468234P62880K83666
$$ 90652 -3294217 -2624369 958777 4463537 6779760 8548923 10017157 10780037 11063703
3704A1063703O19451Q25798n42171l238540n011874l866989n05429K046543J648034
$$ 11063703 11683154 12508952 11966781 8728241 3716367 -150622 -656051 1390492 3038526
3695C038526o31138k107402j811552r96294p07658n19961J22185Q57576J196230
$$ 3038526 2407388 299986 -1511566 -2507860 -3215518 -3735479 -3613294 -2755718 -1559488
3686a559488J161865Q41774L97700N24040J587843K484185J924112N69001k3554
$$ -1559488 -397623 444151 841851 1365891 2953734 5437919 7362031 7931032 7907478
3677G907478j53767j225407k576946k147441l91046l9394j424046j863676p10894
$$ 7907478 7753711 6528304 3951358 1803917 1412871 1373477 -50569 -1914245 -2625139
3668b625139p17741k558915k555868J152539M375772K786905j291627k454539
$$ -2625139 -3342880 -5901795 -8457663 -7305124 -2929352 -142447 -1434074 -3888613
3660c888613k3571K266190K484151J799100Q22024q62883k171660j554357r3356
$$ -3888613 -3912184 -1645994 838157 2637257 3459281 2596398 424738 -1129619 -1222975
3651a222975J7290o36547K1148J265532O88589r59332m85601K134277L246828
$$ -1222975 -1205685 -1842232 -1821084 -555552 133037 -826295 -1311896 822381 4069209
3642D069209J229794j368484k311000k443312k743516k154176j3070K178158K937223
$$ 4069209 5299003 3930519 1619519 -823793 -3567309 -5721485 -5734555 -3556397 -619174
3633f19174K518421J524340J05350q17547o8757J357506R39616j630812l847060
$$ -619174 1899247 3423587 3528937 2711390 2642633 4000139 4939755 3308943 -538117
3624e38117l972461k502980K12251M394201Q050645P459267K200729l282027m954731
$$ -538117 -4510578 -7013558 -6801307 -2407106 5643539 13102806 15303535 12021508 7066777
3615G066777l422357j434356j47731K15673j052215l363676l936245j265897K243207
$$ 7066777 3644420 2210064 2062333 2278006 1225791 -2137885 -6074130 -7340027 -5096820
3606e096820L358637K034272K49050j262367k576142k487747J31856L551393M445123
$$ -5096820 -1738183 296089 545139 -717228 -3293370 -5781117 -5649261 -2097868 2347255
3597B347255J971544j338633k807199k181969r46593l97716p48858j399405j711926
$$ 2347255 4318799 2980166 172967 -2009002 -2955595 -3353311 -4102169 -5501574 -7213500
3588g213500j512700p70311P14163K570737L394923K290910M65154k49249n4601
$$ -7213500 -8726200 -9496511 -8782348 -6211611 -2816688 -525778 -60624 -309873 -364474
3579c64474n17874j606826j701119n06638N53247J042912J928739K880823K048942
$$ -364474 -882348 -2489174 -4190293 -4696931 -4143684 -3100772 -1172033 1708790 3757732
3570C757732o52324k806911k957179k071037q20613J363482L486047K952999Q6428
$$ 3757732 3105408 298497 -2658682 -4729719 -5550332 -4186850 -700803 2252196 2338624
3561B338624j076107J175127L097766J369832j505250j406117Q58222J531342
$$ 2338624 1262517 2437644 5535410 6905242 5399992 3993875 4852097 6383439
3553F383439J43088p97264p82591j411098k392882j849952k63889k3866j042801
$$ 6383439 6526527 5729263 4946672 3535574 1142692 -707260 -971149 -995015 -2037816
3544b037816p09510J458871K744790J476074p92776k017013j817182m66437J522969
$$ -2037816 -2747326 -1288455 1456335 2932409 2139633 122620 -1694562 -2160999 -638030
3535f38030K451120R03039j457598j489933O53561J582924J34121q06643O99723
$$ -638030 1813090 2716129 1258531 -231402 422159 2005083 2139204 1332561 2032284
3526B032284K309094J165285j862084m029359m385686l276225n56593K966297
$$ 2032284 4341378 5506663 3644579 -384780 -4770466 -8046691 -8603284 -5636987
3518e636987M345649J890501j644448k406835q80856n76434k020139k023053P39840
$$ -5636987 -1291338 599163 -1045285 -3452120 -4332976 -4909410 -6929549 -8952602 -8212762
3509h212762L416467L630708K859918K991090K738115O08876j150236L34227K967417
$$ -8212762 -4796295 -1165587 1694331 4685421 7423536 8032412 6882176 7216403 10183820
3500A0183820J892676k772907n225831k356030J633299J578959j477093l056608
$$ 10183820 12076496 9303589 4077758 1721728 3355027 4933986 3456893 400285
3492D00285k238287j518734j458099j63391K334669L441638K035173l14792k236477
$$ 400285 -1838002 -3356736 -4814835 -4978226 -2643557 798081 2833254 2518462 281985
3483B81985l302693k208251J701458N083472L550399j301303k962284L98695K951293
$$ 281985 -3020708 -5228959 -3527501 1555971 5106370 3805067 842783 1241478 4192771
3474D192771L96258l528166l707168j587952j215258j703591M4791K258119Q59601
$$ 4192771 4589029 1060863 -2646305 -4234257 -5449515 -7153106 -7108315 -4850196 -3990595
3465c990595k635987k824415N23309K048161L1885q07355K259536M913268K486272
$$ -3990595 -6626582 -9450997 -8927688 -6879527 -6847642 -7654997 -5395461 -482193 2004079
3456B004079k935063n827136m393849j007055K041253L975059M321835L050360
$$ 2004079 -930984 -6758120 -11151969 -12159024 -10117771 -6142712 -1820877 1229483
3448A229483J162831m41166j696193k142315q26754J463074K052440M9679j876926
$$ 1229483 2392314 1951148 254955 -1887360 -2714114 -1251040 801400 851079 -1025847
3439a025847j227527P27378J234071L46896L76242J869860K649049R78292j993157
$$ -1025847 -2253374 -1525996 -291925 54971 431213 2301073 4950122 5928414 3935257
3430C935257l425993j765380J545313L246451J699865r93623j499346K29997Q94475
$$ 3935257 509264 -1256116 289197 3535648 5235513 4241890 2742544 2972541 3867016
3421C867016j181752l399161k707280J4167J666302J580845J710174K700652K661184
$$ 3867016 2685264 -713897 -3421177 -3407010 -1740708 -159863 1550311 4250963 6912147
3412F912147M75976k007722k593220k085338l029534n420471n827355j963033
$$ 6912147 7388123 5380401 2787181 701843 -2327691 -7748162 -13575517 -15538550
3404a5538550L281684M585895R36225k751469j871712K089834M095226K403259
$$ -15538550 -12256866 -7670971 -6734746 -9486215 -11357927 -9268093 -5172867 -2769608
3396b769608L5957k10753P73482P68852k50829m61637J014262K853374K892295
$$ -2769608 -2733651 -2944404 -2170922 -1402070 -1652899 -2114536 -1100274 1753100 4645395
3387D645395N25275k166220k366807j05070J468809N10473p30997K37281J566928
$$ 4645395 5170670 3004450 637643 532573 2001382 2511855 1780858 2018139 3585067
3378C585067l9604l175541l150626M84703K872879J461853l87867K51392Q25302
$$ 3585067 3545463 369922 -2780704 -2296001 576878 2038731 1650864 1902256 2727558
3369B727558j643019m491484l341169M93954J845422j84382j196782J155350L622212
$$ 2727558 1084539 -3406945 -6748114 -6254160 -4408738 -4593120 -5789902 -4634552 -1012340
3360a012340K760837Q9161p11452O00234Q86154j474394m191528m092173j099791
$$ -1012340 1748497 1837658 1126206 1726440 2612594 1138200 -3053328 -7145501 -8245292
3351h245292J958130L049704K966298L100022K757173N27192k491289l401737
$$ -8245292 -6287162 -3237458 -271160 2828862 5586035 6113227 3621938 220201
3343B20201j672797o1811n33726j685705j571774p68959p17727r06596K6743J659437
$$ 220201 -1452596 -1514407 -2048133 -3733838 -5305612 -6074571 -6792298 -7698894 -7672151 -6012714
3333f012714K417815K025176J495918J368429J404619J268804L74269j720500
$$ -6012714 -3594899 -1569723 -73805 1294624 2699243 3968047 4342316 2621816
3325B621816l608907k507062J841835N540000N032627J648166q10315j441843
$$ 2621816 -987091 -3494153 -1652318 3887682 8920309 10568475 9758160 8316317
3317H316317k176944l433234l377210j507243J32301m2008j175595j549457m35945
$$ 8316317 6139373 2706139 -671071 -2178314 -2046013 -2088021 -3263616 -4813073 -5249018
3308e249018J808123M015176M674587L450640J730930M26790j511784m555409
$$ -5249018 -3440895 574281 5248868 8699508 10430438 10857228 9345444 4790035
3300D790035o215567l999719M54784L291368L473648K629905J117344j491734
$$ 4790035 -1425532 -5425251 -4970467 -1679099 1794549 4424454 5541798 4050064
3292D050064k827553L4933M355541L509684l219308q279418o362193j968791j962598
$$ 4050064 1222511 1257444 5612985 9122669 5903361 -2376057 -8738250 -10707041 -12669639
3283a2669639n035222m613166L86909M347538L925730K010613J660207J551488
$$ -12669639 -17704861 -22318027 -21931118 -17583580 -13657850 -11647237 -9987030 -8435542
3275h435542j09245j464395j90673K012416J798284m56214j272906L23722J318147
$$ -8435542 -8544787 -10009182 -10199855 -8187439 -6389155 -6845369 -8118275 -7794553 -6476406
3266f476406l47662k345486j513638J158898J949809J34980q62208J138762L419093
$$ -6476406 -6824068 -9169554 -10683192 -9524294 -7574485 -7439505 -8301713 -7162951 -3743858
3257c743858K318818j055066k225228O5525K040618O12741k003963j598183J928500
$$ -3743858 -1425040 -2480106 -4705334 -4639809 -2599191 -1986450 -3990413 -5588596 -3660096
3248c660096M546938L715317J277758O7946o3948j016378k585281k457594j95466
$$ -3660096 886842 4602159 5879917 5947863 5883915 4867537 2282256 -175338 -370804
3239c70804J355362J43481j616982o01903K177490K480226n78326k809719j217717
$$ -370804 984558 1128039 -488943 -1090846 1086644 3566870 2988544 178825 -1038892
3230a038892J562622J588830o73117k276860k907079l899220l887600l47056M924911
$$ -1038892 523730 2112560 1439443 -837417 -3744496 -7643716 -11531316 -11878372 -6953461
3221f953461O729561L535167o22994k178773j765392p78094J233214L646777L509340
$$ -6953461 -223900 3311267 2688273 509500 -1255892 -2033986 -800772 2846005 6355345
3212F355345N6152l046415k875269j276454o94783K73356L134501M782222J750866
$$ 6355345 6411497 3365082 489813 -786641 -1481424 -1208068 1926433 6708655 8459521
3203H459521l119485l938311n29288J738882N79770n99081M05479P59307j975657
$$ 8459521 5340036 1401725 872437 2611319 3191089 2592008 2997487 3756794 1781137
3194A781137n144975m942574j961020L10402M97294J23654O81322K072039L180652
$$ 1781137 -3363838 -8306412 -10267432 -9957030 -9459736 -9336082 -8654760 -6582721 -3402069
3185c402069K728560N30852j430877p89131J693034K492891K13396k283808k094945
$$ -3402069 -673509 -142657 -1573534 -2362665 -669631 1823260 2036656 -247152 -2342097
3176b342097j56981J093443J560390K305847K435688L79979k739089m121361l222793
$$ -2342097 -2499078 -1405635 154755 2460602 4896290 5276269 2537180 -1584181 -4806974
3167d806974j895774r41272N57648K364415K536854N78421j348462j516678r10988
$$ -4806974 -6702748 -7644020 -7086372 -4721957 -2185103 -1606682 -2955144 -4471822 -5382810
3158e382810j106459j583319p64170J342207L085305L279531K186653O29102r16640
$$ -5382810 -6489269 -8072588 -8836758 -7494551 -4409246 -1129715 1056938 1686040 769400
3149G69400k236350k945079k518571r51426O86896R84921j01156r68136n05908
$$ 769400 -1466950 -4412029 -6930600 -7882026 -7195130 -6210209 -6311365 -7279501 -7785409
3140g785409L08441O5478o79167l00162J133404J878169J099169m72849k265884
$$ -7785409 -7476968 -7411490 -8090657 -8390819 -7257415 -5379246 -4280077 -4752926 -7018810
3131g018810m009437m211244j297903L086129M818072K591192k57502p42441j27252
$$ -7018810 -11028247 -15239491 -16537394 -13451265 -8633193 -6042001 -6299503 -7041944 -7169196
3122g169196o32726j203891J98582K325152K454163J090088R30643J914808J356710
$$ -7169196 -7801922 -9005813 -8807231 -6482079 -4027916 -2937828 -2007185 -92377 1264333
3113A264333j032463k246348p76658J266967J850362J580638J345937M50922j342510
$$ 1264333 231870 -2014478 -2791136 -1524169 326193 1906831 3252768 3703690 2361180
3104B361180k600695k645561k752921l422352k988756o60107J603513K214543
$$ 2361180 -239515 -2885076 -5637997 -9060349 -12049105 -12709212 -11105699 -8891156
3096h891156K479403L736445M375968K445048p38827k449621k417854j998511
$$ -8891156 -6411753 -2675308 1700660 4145708 3406881 957260 -1460594 -3459105
3088c459105j059529J090152K861595J960218p00816j872817n62306J179199J848664
$$ -3459105 -4518634 -3428482 -566887 1393331 692515 -1180302 -1742608 -563409 1285255
3079A285255J876560J464063J66226j030311k92886J693565J868500o77034l023202
$$ 1285255 3161815 4625878 4792104 3761793 3468907 5162472 7030972 6353938 3330736
3070C330736k619321p89501m10650j897753l146762k308829N46498L571519M310399
$$ 3330736 711415 -78086 -488736 -2386489 -5533251 -7842080 -7295582 -3724063 586336
3061E86336J927193j292366k068217j02548J695040J257886l42634j173111q12812
$$ 586336 2513529 1221163 -847054 -949602 745438 2003324 1660690 487579 -325233
3052c25233L85092K137075L194430J787044j351873k623709j88860K979755K907286
$$ -325233 59859 2196934 5391364 7178408 5826535 3202826 3013966 5993721 8901007
3043H901007j50236k748554l168573k447812j334575N77703K475595K062999j094049
$$ 8901007 8750771 6002217 2833644 385832 -948743 -371040 2104555 4167554 3073505
3034C073505l990827l533962l67092K102716J932233M21672m13642o79148j762355
$$ 3073505 -917322 -4451284 -4818376 -2715660 -783427 -361755 -775397 -1454545 -3216900
3025c216900l381752l335770p47195K116611K664181J389604O04867P05048J58045
$$ -3216900 -6598652 -9934422 -10681617 -8565006 -5900825 -4511221 -3906354 -3201306 -3043261
3016c043261j080664r65689J191570L158952K813700Q34782o59177m26258J720737
$$ -3043261 -4123925 -5089614 -3898044 -739092 2074608 2909390 2250213 1823955 3544692
3007C544692M967037O722120M148066j916419o583678o269630k677071K10047
$$ 3544692 8511729 15233849 19381915 17465496 10881818 4612188 1935117 2145164
2999B145164J034306Q19178r9951j874159l007312j509705J969721M464209M096189
$$ 2145164 3179470 3998648 3898697 2024538 -982774 -2492479 -522758 3941451 8037640
2990H037640J483285j770976m191207m518939k575928R3126J778108K339477K294322
$$ 8037640 9520925 7749949 3558742 -960197 -3536125 -3442999 -1664891 674586 2968908
2981B968908J299556q27197k674262k727939j423365J0199J539265L169455L244729
$$ 2968908 4268464 3441267 767005 -1960934 -3384299 -3374100 -1834835 1334620 4579349
2972D579349N35378l014970m354390l259694j522190N90818L652795N811240M382402
$$ 4579349 5114727 2099757 -2254633 -5514327 -7036517 -6445699 -2792904 3018336 7400738
2963G400738P07418p80402R97961K331562Q44988j111575j111264p24347k080312
$$ 7400738 8108156 7327754 8325715 10657277 11502265 10390690 9279426 8555079 6474767
2954F474767l555865k385040N17128J844520Q37075k90755l20780m60480j614229
$$ 6474767 2918902 533862 1050990 2895510 3732585 3441830 3121050 2660570 1046341
2945A046341k651609k182030n23030R47622J578121J855269K280530K392963J339289
$$ 1046341 -1605268 -3787298 -4310328 -3362706 -1784585 70684 2351214 4744177 6083466
2936F083466n88105j762023j223599j23616p4995p71836p47474Q2338N31226M66732
$$ 6083466 5495361 3733338 2509739 2386123 2311128 1539292 791818 874156 1405382 1872114
2926A872114Q58978J536090J203670o0056p17360n52534r36723j722354q59817
$$ 1872114 2731092 4267182 5470852 5410796 4693436 4140902 3204179 1481825 622008
2917F22008J647282K429150n89784m706449n906953l808188q77748J370673K856178
$$ 622008 2269290 4698440 4108656 -597793 -6504746 -10312934 -11190682 -9820009 -6963831
2908f963831L151730J973009N71041L27281P24251O59210O45843J466737J766596
$$ -6963831 -3812101 -1839092 -1268051 -940770 -216519 442691 1088534 2555271 4321867
2899D321867k90079l517640m568078k298686R78551K750785K840050K454914K368440
$$ 4321867 4031788 514148 -4053930 -6352616 -5374065 -2623280 216770 2671684 5040124
2890E040124K386438J614125n92991l185627l825105j844509M44722Q93882M31694
$$ 5040124 7426562 9040687 8447696 5262069 1436964 -407545 37177 931059 1362753
2881A362753Q49437J424839N74192o08492L4743J507120R42559j302286k049222
$$ 1362753 2212190 3637029 4211221 3602729 3637472 5144592 6087151 4784865 2735643
2872B735643q68993n86767j421611J36525M401670N710299N39402n798890n761468
$$ 2735643 1866650 1279883 -141728 -5203 4396467 10106766 10646168 4847278 -914190
2863i14190k17133L141923Q31453k709016k736571j67552J839696K825504L717697
$$ -914190 -1131323 2010600 2842053 133037 -2603534 -2771086 -931390 1894114 5611811
2854E611811L630151J206157k360278m343379l850641k274453r74600q4364Q03807
$$ 5611811 9241962 10448119 8087841 3744462 -106179 -2380632 -3355232 -3439596 -2635789
2845b635789J927817K874327K228584j030043m932964n272471p96953M134678
$$ -2635789 -707972 2166355 4394939 3364896 -1568068 -6840539 -7637492 -3502814
2837c502814M664354J717336o7388M43185Q395k583943m054471k226067L11791
$$ -3502814 1161540 2878876 2811488 3254673 3263068 679125 -3375346 -5601413 -5289622
2828e289622Q51168R78669K746481L894512J614225j449983o18280K603512J926259
$$ -5289622 -4438454 -3459785 -713304 3181208 4795433 3345450 2727170 5330682 7256941
2819G256941l660942p407201m502440J175712L388942K166637J753754L040444
$$ 7256941 3595999 -3811202 -8313642 -7137930 -3748988 -1582351 171403 3211847
2811C211847K994573M05247k148471k057770N83057L884963N478412L544773j000587
$$ 3211847 6206420 6611667 4463196 2405426 2988483 6873446 12351858 15896631 14896044
2802A4896044m068106k823875R6526j63060l622805n217839k062847K599124M130608
$$ 14896044 10827938 8004063 8100589 7937529 4314724 -903115 -2965962 -366838 3763770
2793C763770K170320m33760j969843k631935k419609r45169R81126J650740O19494
$$ 3763770 5934090 5500330 3530487 898552 -1521057 -2466226 -1485100 165640 785134
2784G85134p34502j081297n93978k25567l28388n52345p18563j090374j628530
$$ 785134 50632 -1030665 -1624643 -1850210 -2178598 -2730943 -3449506 -4539880 -6168410
2775f168410j544200k16325J605911K284605J189330n17276j264866o70262M64006
$$ -6168410 -7712610 -7928935 -6323024 -4038419 -2849089 -3366365 -4631231 -5301493 -4837487
2766d837487J091339P16850K0340O02189K868993M303327J902580l158204n802731
$$ -4837487 -3746148 -3029298 -3008958 -2406769 462224 4765551 6668131 3509927 -2292804
2757b292804l345407R56976K592312J517071M71186L460r96475j467041N44753
$$ -2292804 -5638211 -4681235 -2088923 -571852 -100666 -97206 -1093681 -2560722 -2015969
2748b015969L318331K915601l84501j785061O55047K911297J411142j648281k476013
$$ -2015969 1302362 4217963 3833462 2048401 2703448 5614745 7025887 5377606 2901593
2739B901593j670266k172400l636422l002373L58536L670873M579160L123428
$$ 2901593 1231327 -941073 -4577495 -7579868 -7221332 -3550459 1028701 4152129
2731D152129L01013k656716l839433k163610N50633J331261O1917m67539J211691
$$ 4152129 4453142 1796426 -2043007 -4206617 -3655984 -2324723 -2262806 -2730345 -1518654
2722a518654L224702L237194J369644p47475k203746k915427k673427j356559
$$ -1518654 1706048 4943242 6312886 5565411 3361665 446238 -2227189 -3583748
2714c583748M20062J721194K067908J416665q0353j795789k604776j816586n3482
$$ -3583748 -3163686 -1442492 625416 2042081 1961728 165939 -2438837 -4255423 -4308905
2705d308905J244078J343328J090160J929481L821788M553620K026526k707864
$$ -4308905 -3064827 -1721499 -631339 1298142 5119930 9673550 11700076 8992212
2697H992212n888718n183885k297348l97546l3958O00163J866893J582123j393588
$$ 8992212 3103494 -2080391 -4377739 -4775285 -4809243 -4209080 -2342187 -760064 -2153652
2688b153652m310873l204550J952072O425974N701987M45429m384147n045323
$$ -2153652 -6464525 -9669075 -7717003 -1291029 4410958 4856387 472240 -4573083
2680d573083k536001l64339j21854n32420j35204R58989K096452L034581L197923
$$ -4573083 -7109084 -7473423 -7595277 -8127697 -8262901 -7303912 -5207460 -2172879 1025044
2671A025044J643186j153584k890113k134197k43140P76088J052353J739450K308777
$$ 1025044 2668230 1514646 -1375467 -3509664 -3752804 -2976716 -1924363 -184913 2123864
2662B123864J319633o49342j318162M983J672133K372196K274789J238245j451023
$$ 2123864 3443497 2794155 1475993 1480976 3153109 5525305 7800094 9038339 7587316
2653G587316m627695n217731k313674R90988J831361J509751K618424M054867
$$ 7587316 2959621 -2258110 -4571784 -3580796 -1749435 -239684 2378740 6433607
2645F433607K481207j818616m311315k271513J570475K935969J255991p89986
$$ 6433607 8914814 7096198 2784883 513370 2083845 5019814 6275805 5485819
2637E485819j353591j051948j331721k721967m222631l621580M19130N570340
$$ 5485819 4132228 3080280 1748559 -973408 -5196039 -8817619 -8398489 -2828149
2629b828149O872584K567122k605167k742835J464638L758533J066069k701618
$$ -2828149 4044435 6611557 4006390 1263555 2728193 6486726 7552795 4851177
2621D851177k950079o90024K88093l76168j00265J408135J599102j70436j074681
$$ 4851177 1901098 1211074 1499167 1122999 1022734 2430869 4029971 3859535 2784854
2612B784854P88203L260864L107716K57338k648912l688151l021438j651397l88284
$$ 2784854 3573057 6833921 9941637 10198975 7550063 3861912 840474 -810923 -1199207
2603a199207J85804o0788m80520k34257O11488R47036j35737j919577k264631
$$ -1199207 -1013403 -1074191 -1554711 -1788968 -1177480 -230444 -366181 -2285758 -4550389
2594d550389j2504K811195K624965j020140l986659k601082J194106K428910J11217
$$ -4550389 -4562893 -1751698 873267 -146873 -4133532 -6734614 -5540508 -3111598 -3000381
2585c000381j746623l79366K077693K570391J425169M37141m87252j869731k049540
$$ -3000381 -4747004 -5126370 -3048677 -478286 946883 1384024 896772 -972959 -3022499
2576c022499N42187L806445M160207J710311j17905j5289l91925k816697n029024
$$ -3022499 -2480312 1326133 5486340 7196651 7078746 7063457 6671532 3854835 -1174189
2567a174189m167078q20525J937787K263929Q17591p53761j339718q95132l14176
$$ -1174189 -5341267 -6161792 -4224005 -1960076 -1142485 -1896246 -3235964 -4131096 -4445272
2558d445272m81251j169605j450511j162917r13474n45937R15954L297090M772545
$$ -4445272 -4926523 -6096128 -7546639 -8709556 -9623030 -10168967 -9253013 -5955923 -1183378
2549a183378M240992K818313J860928R11016q01820k022214q74401J791117K804418
$$ -1183378 3057614 5875927 7736855 8647871 7846051 5823837 4949436 6740553 9544971
2540I544971Q57498j734247k338998j319992o74746p74441l71383Q33288J703981
$$ 9544971 10402469 8668222 6329224 5009232 4334486 3560045 3188662 4021950 5725931
2531E725931J759891J807994J996603J070643j387602l475249l185946j176185
$$ 5725931 7485822 9293816 11290419 12361062 10973460 7498211 4312265 3136080
2523C136080J03065o14041k574414m423643m988204l322262K12776L194242L258179
$$ 3136080 3239145 2625104 50690 -4372953 -9361157 -12683419 -12470643 -9276401 -6018222
2514f018222R66865r80506j158978k78019J000325K740497M080514L387629P41276
$$ -6018222 -5051357 -6031863 -7190841 -7468860 -6468535 -3728038 352476 3740105 4481381
2505D481381j869925l344159m175697m034171j682975J690534K436954l90435
$$ 4481381 2611456 -732703 -4908400 -8942571 -10625546 -8935012 -6498058 -6888493
2497f888493k990350k320445n58390r57957k096107l67398L546825N145164K599902
$$ -6888493 -9878843 -12199288 -12757678 -13715635 -15811742 -16179140 -12632315 -7487151 -4887249
2488d887249r86716j962974J61780L409203N259474M141985J208756j17482J409802
$$ -4887249 -5873965 -7836939 -7675159 -4265956 993518 5135503 6344259 6226777 7636579
2479G636579K325249o73156n031021n565308k163002N24219N90310P71933K316788
$$ 7636579 9961828 9288672 4257651 -1307657 -3470659 -2946440 -2356130 -1584197 732591
2470G32591K440054k97749k912707k756289j286016n41493L70992K427261L697916
$$ 732591 3172645 2874896 -37811 -2794100 -4080116 -4621609 -4250617 -1823356 1874560
2461A874560K390734K44979r8831J034190J666367J254473K40038j235909k134954
$$ 1874560 4265294 4510273 4411442 5445632 7111999 8366472 8606510 7370601 5235647
2452E235647o45510K383834L125000L17816k155270j152932Q39448L97254r07269
$$ 5235647 4590137 6973971 10098971 10416787 8261517 7108585 7948033 8345287 7438018
2443G438018l0211J249797n97388l576021k417791K547395N128168K424428j582157
$$ 7438018 7407807 8657604 8060216 4484195 2066404 4613799 9741967 12166395 10584238
2434A0584238k905068k650169l119544l488494k244793n54985l79170j491568
$$ 10584238 7679170 5029001 1909457 -1579037 -3823830 -4378815 -4757985 -6249553
2426f249553k430429k468502j240634J440912M147927M431575K084934k40273
$$ -6249553 -8679982 -11148484 -12389118 -10948206 -6800279 -2368704 -283770 -524043
2418e24043n39874O39924K263583L853628L880896P55981l309531l476750N85457
$$ -524043 -1063917 -423993 1839590 5693218 9574114 10330095 7020564 3543814 4129271
2409D129271K948848q3164l912040k574957J736554K052155k260311m443684q85550
$$ 4129271 7078119 6994955 3082915 507958 2244512 4296667 2036356 -2407328 -3292878
2400c292878L582892L430544M58301P2824K630955L271546l36118m348286m109168
$$ -3292878 290014 3720558 4178859 4251683 6882638 10154184 9818066 5469780 1360612
2391A360612l70413K066278P38659j853039k249984n63486M86014j32790o04362
$$ 1360612 990199 3056477 3795136 1942097 -307887 -871373 -385359 -518149 -1122511
2382a122511N48748K141159K139261N05431r00639n90544J169524K716642K319300
$$ -1122511 -573763 1567396 3706657 4212088 3311449 2720905 3890429 6607071 8926371
2373H926371j04242k328257j959911M28347J711231L21493j745590k052116j057616
$$ 8926371 8822129 6493872 4533961 4962308 6673539 6995032 5249442 3197326 2139710
2364B139710p48307j428673j852236j553455j103416p02839j91483K52239Q99993
$$ 2139710 1391403 -37270 -1889506 -3442961 -4546377 -5249216 -5440699 -5188460 -4288467
2355d288467K809611N559934O116264K571412k130649l378187j154800L73394
$$ -4288467 -1478856 4081078 10197342 12768754 10638105 7259918 6105118 6478512
2347F478512o63415j727378q69313K76476J03517j76863L16403l19440l025250
$$ 6478512 5815097 4087719 3218406 3494882 3598399 3421536 3737939 3418499 393249
2338C93249m552662j743255L044836M804640K879284J008925J058147J007869
$$ 393249 -4159413 -5902668 -2857832 1946808 4826092 5835017 6893164 7901033
2330G901033m70964j537838n91753J101517J800935J714494J485199N89458j108547
$$ 7901033 7430069 5892231 5300478 6401995 8202930 9917424 11402623 11992081 10883534
2321A0883534k263603k193349k264827l470904m432866l626616j849863m70234
$$ 10883534 8619931 6426582 4161755 690851 -3742015 -7368631 -9218494 -9688728
2313i688728J056099L505067N198341L854863L29094k274126k779623k562643
$$ -9688728 -8632629 -5127562 70779 3925642 4254736 1980610 -799013 -3361656
2305c361656k317180j167696P17901J501870N32881n34697m34317r501k72922
$$ -3361656 -5678836 -6846532 -6128631 -4626761 -4093880 -4628577 -5062894 -5072395 -5345317
2296e345317p17541o36649l50858r8644N73662J386442J171215J35832J78850
$$ -5345317 -6062858 -6699507 -7050365 -7149009 -6575347 -5188905 -4017690 -3881858 -3703008
2287c703008J669094K191254K60725j929942j719983J4965O59683M0624l7307
$$ -3703008 -2033914 157340 418065 -1511877 -3231860 -3216895 -2557212 -2516588 -2553895
2278b553895Q17125J623001K489140L953809M647432K945066M43770J34386J203735
$$ -2553895 -1736770 -113769 2375371 6329180 10976612 13921678 14365448 14499834 15703569
2269A5703569k51242m611994p093528m541096j47944J206214o12912k120872j493453
$$ 15703569 15452327 10840333 3746805 -794291 -942235 263979 -348933 -2469805 -3963258
2260c963258L44392K302131L779193L730688J780553l84667r90859p32439j161922
$$ -3963258 -3618866 -1316735 2462458 6193146 7973699 7589032 6598173 5865734 4703812
$$ [...]
##END NTUPLES=NMR SPECTRUM
##END=
