##TITLE=31Pdec_DE-154_TFA_CCl4
 CCl4,24 sc
 4.6.2026
##JCAMPDX= 6.0         $$ Bruker NMR JCAMP-DX V2.0
##DATA TYPE= NMR SPECTRUM
##DATA CLASS= NTUPLES
##ORIGIN= UXNMR, Bruker Analytische Messtechnik GmbH
##OWNER= root
$$ XWIN-NMR		Version 3.5
$$ Thu Jun  4 14:31:13 2026 Russian Standard Time (UT+4h)  she@DPX200
##.OBSERVE FREQUENCY= 81.013821
##.OBSERVE NUCLEUS= ^31P
##.ACQUISITION MODE= SIMULTANEOUS
##.ACQUISITION SCHEME= undefined
##.AVERAGES= 64
##.DIGITISER RES= 17
##SPECTROMETER/DATA SYSTEM= spect
##.PULSE SEQUENCE= zgpg30
##.SOLVENT NAME= CDCl3
##.SHIFT REFERENCE= (INTERNAL, CDCl3, 0, 197.392)
##AUDIT TRAIL= $$ (NUMBER, WHEN, WHO, WHERE, WHAT)
$$ ##TITLE= Audit trail, XWIN-NMR		Version 3.5
$$ ##JCAMPDX= 5.01
$$ ##ORIGIN= Bruker BioSpin GmbH
$$ ##OWNER= she
$$ F:/spectra/data/she/nmr/P31/2/pdata/1/auditp.txt
$$ ##AUDIT TRAIL=  $$ (NUMBER, WHEN, WHO, WHERE, WHAT)
(   1,<2026-06-04 14:29:54.93 +0400>,<she>,<DPX200>,
      <created by zg, POWCHK disabled, PULCHK disabled
       configuration hash MD5:
       00 E9 B6 7A A2 85 ED C7 34 08 36 98 17 FE 4E 26
       data hash MD5: 32K
       FB D9 5E F0 57 18 28 56 2E F7 16 72 A8 E9 DC 17>)
(   2,<2026-06-04 14:29:57.56 +0400>,<she>,<DPX200>,
      <Start of raw data processing
       efp BC_mod = 2 LB = 1.5 FT_mod = 6 PKNL = 1 PHC0 = 1342.788 PHC1 = -221.8995 SI = 64K 
       data hash MD5: 64K
       10 79 D3 06 54 B8 4E FE 8E 13 EF 8B 29 FE 25 C8>)
(   3,<2026-06-04 14:30:18.10 +0400>,<she>,<DPX200>,
      <pk PHC0 = 36.14363 PHC1 = 0 
       data hash MD5: 64K
       78 EF A9 30 A4 AE 4A 58 D5 5B 9B 99 C5 C7 47 E6>)
(   4,<2026-06-04 14:30:36.23 +0400>,<she>,<DPX200>,
      <abs ABSG = 5 
       data hash MD5: 64K
       B9 43 7A 54 7A F5 19 FE 77 44 25 71 38 E5 61 8E>)
$$ ##END=
$$ 
$$ hash MD5
$$ AC 5E F2 54 7C 50 36 72 B9 CA 20 4B 39 B8 D5 6B
##$RELAX= 
##$RELAX= 
##$RELAX= 
##$RELAX= 
##$RELAX= 
##$RELAX= 
##$RELAX= 
##$RELAX= 
$$ Bruker specific parameters
$$ --------------------------
##$DU= <F:/spectra>
##$EXPNO= 2
##$NAME= <P31>
##$PROCNO= 1
##$TYPE= <nmr>
##$USER= <she>
##$AMP= (0..31)
100 100 100 100 100 100 100 100 100 100 100 100 100 100 100 100 100 100 
100 100 100 100 100 100 100 100 100 100 100 100 100 100 
##$AQSEQ= 0
##$AQ_mod= 1
##$AUNM= <au_zg>
##$AUTOPOS= <>
##$BF1= 81.014009
##$BF2= 200.13
##$BF3= 200.13
##$BF4= 200.13
##$BF5= 200.13
##$BF6= 200.13
##$BF7= 200.13
##$BF8= 200.13
##$BYTORDA= 1
##$CFDGTYP= 0
##$CFRGTYP= 5
##$CHEMSTR= <none>
##$CNST= (0..31)
1 1 145 1 1 1 1 1 1 1 1 1 1 1 1 1 1 1 1 1 1 1 1 1 1 1 1 1 1 1 1 1 
##$CPDPRG= <waltz16>
##$CPDPRG1= <>
##$CPDPRG2= <waltz16>
##$CPDPRG3= <>
##$CPDPRG4= <mlev>
##$CPDPRG5= <mlev>
##$CPDPRG6= <mlev>
##$CPDPRG7= <mlev>
##$CPDPRG8= <mlev>
##$CPDPRGB= <>
##$CPDPRGT= <>
##$D= (0..31)
0 1 0 0 0 0 0 0 0 0.06 0 0.03 2e-05 3e-06 0 0 0.0002 0 0 0 0 0 0 0 0 0 
0 0 0 0 0 0 
##$DATE= 1780568994
##$DBL= (0..7)
120 120 120 11 120 120 24 19 
##$DBP= (0..7)
150 150 150 150 150 150 150 150 
##$DBP07= 0
##$DBPNAM0= <>
##$DBPNAM1= <>
$$ [...]
##$SUBNAM3= <"">
##$SUBNAM4= <"">
##$SUBNAM5= <"">
##$SUBNAM6= <"">
##$SUBNAM7= <"">
##$SUBNAM8= <"">
##$SUBNAM9= <"">
##$SW= 400.765351723535
##$SWIBOX= (0..15)
0 1 3 0 0 0 0 0 0 0 0 0 0 0 0 0 
##$SW_h= 32467.5324675325
##$TD= 32768
##$TD0= 1
##$TE= 0
##$TE2= 300
##$TE3= 300
##$TEG= 300
##$TL= (0..7)
0 120 53 12 22 120 120 120 
##$TP= (0..7)
150 150 150 150 150 150 150 150 
##$TP07= 0
##$TPNAME0= <>
##$TPNAME1= <>
##$TPNAME2= <>
##$TPNAME3= <>
##$TPNAME4= <>
##$TPNAME5= <>
##$TPNAME6= <>
##$TPNAME7= <>
##$TPOAL= (0..7)
0.5 0.5 0.5 0.5 0.5 0.5 0.5 0.5 
##$TPOFFS= (0..7)
0 0 0 0 0 0 0 0 
##$TUNHIN= 0
##$TUNHOUT= 0
##$TUNXOUT= 0
##$USERA1= <user>
##$USERA2= <user>
##$USERA3= <user>
##$USERA4= <user>
##$USERA5= <user>
##$V9= 5
##$VALIST= <valist>
##$VCLIST= <CCCCCCCCCCCCCCC>
##$VD= 0
##$VDLIST= <DDDDDDDDDDDDDDD>
##$VPLIST= <PPPPPPPPPPPPPPP>
##$VTLIST= <TTTTTTTTTTTTTTT>
##$WBST= 1024
##$WBSW= 4
##$XGAIN= (0..3)
0 0 0 0 
##$XL= 0
##$YL= 0
##$YMAX_a= 16209
##$YMIN_a= -3115
##$ZGOPTNS= <>
##$ZL1= 120
##$ZL2= 120
##$ZL3= 120
##$ZL4= 120
##$ABSF1= 197.3918
##$ABSF2= -203.3724
##$ABSG= 5
##$ABSL= 3
##$ALPHA= 0
##$AQORDER= 0
##$ASSFAC= 0
##$ASSFACI= 0
##$ASSFACX= 0
##$ASSWID= 0
##$AUNMP= <proc_1d>
##$AZFE= 0.1
##$AZFW= 0.5
##$BCFW= 0
##$BC_mod= 2
##$BYTORDP= 0
##$COROFFS= 0
##$CY= -3
##$DATMOD= 1
##$DC= 0
##$DFILT= <>
##$DTYPP= 0
##$F1P= 0
##$F2P= 0
##$FCOR= 1
##$FTSIZE= 65536
##$FT_mod= 6
##$GAMMA= 0
##$GB= 0
##$INTBC= 1
##$INTSCL= 9.790993e-09
##$ISEN= 30
##$LB= 1.5
##$LEV0= 0
##$LPBIN= 0
##$MAXI= 10000
##$MC2= 0
##$MEAN= 0
##$ME_mod= 0
##$MI= 50
##$NCOEF= 0
##$NC_proc= -8
##$NLEV= 6
##$NOISF1= 182.463
##$NOISF2= 159.3651
##$NSP= 0
##$NTH_PI= 0
##$NZP= 0
##$OFFSET= 197.3918
##$PC= 4
##$PHC0= 1378.932
##$PHC1= -221.8995
##$PH_mod= 1
##$PKNL= yes
##$PPARMOD= 0
##$PSCAL= 0
##$PSIGN= 0
##$REVERSE= no
##$SF= 81.014063255964
##$SI= 65536
##$SIGF1= 159.3651
##$SIGF2= -187.1042
##$SINO= 113.3802
##$SIOLD= 16384
##$SREGLST= <1H.CDCl3>
##$SSB= 0
##$STSI= 65536
##$STSR= 0
##$SW_p= 32467.5324675325
##$SYMM= 0
##$S_DEV= 0
##$TDeff= 32768
##$TDoff= 0
##$TI= <>
##$TILT= no
##$TM1= 0
##$TM2= 0
##$TOPLEV= 0
##$USERP1= <user>
##$USERP2= <user>
##$USERP3= <user>
##$USERP4= <user>
##$USERP5= <user>
##$WDW= 1
##$XDIM= 65536
##$YMAX_p= 405892577
##$YMIN_p= -189008834
$$ End of Bruker specific parameters
$$ ---------------------------------
##NTUPLES= NMR SPECTRUM
##VAR_NAME=  FREQUENCY,     SPECTRUM/REAL,   SPECTRUM/IMAG
##SYMBOL=    X,             R,               I
##VAR_TYPE=  INDEPENDENT,   DEPENDENT,       DEPENDENT
##VAR_FORM=  AFFN,          ASDF,            ASDF
##VAR_DIM=   65536,         65536,           65536
##UNITS=     HZ,            ARBITRARY UNITS, ARBITRARY UNITS
##FACTOR=    0.49542278885378, 1,            1
##FIRST=     15991.5117654749, 0,            0
##LAST=      -16476.0207020576, 0,           0
##MIN=       -16476.0207020576, -189008834,  0
##MAX=       15991.5117654749, 405892577,    0
$$ Real data points
##PAGE= N=1
##DATA TABLE= (X++(R..R)), XYDATA
$$ [...]
##PAGE= N=2
##DATA TABLE= (X++(I..I)), XYDATA
9665 -944104 -1215530 -590200 859883 2127490 2057650 935876 571962 2081883 4452138
9656 4452138 6270681 7831254 10013520 11932536 11679183 9091366 5854680 2970209
9648 2970209 186866 -1977760 -2071762 -273417 1231594 1675725 3295714 7648008 12191464
9639 12191464 13028023 10040800 6760311 5511289 5217588 4195243 2588470 1019348
9631 1019348 -1138534 -4499084 -7844141 -9217695 -8331823 -6507856 -4539434 -2079968
9623 -2079968 743834 2641838 2922128 2894899 4268156 6581334 7598111 6325011 4231441
9614 4231441 2860872 1616452 -757797 -3496134 -4552009 -3793106 -3362385 -4368192 -5276798
9605 -5276798 -4778545 -4365610 -6032487 -8575877 -8670773 -5456983 -1744343 -185178 -283322
9596 -283322 -175777 325561 -41550 -1767228 -4133838 -6510530 -8626621 -9658155 -8444178
9587 -8444178 -5082913 -1408570 751460 1322309 1420743 1347822 -76778 -3825654 -8703411
9578 -8703411 -11722680 -10631795 -5759015 661160 6293597 9527414 9654157 7635498
9570 7635498 6239351 7634062 10546625 11441334 9115537 6349161 5869389 6581315 5887582
9561 5887582 4302610 4719228 7299707 8332417 5346297 839432 -993248 383844
9553 383844 1835922 930684 -1768099 -4362489 -5542085 -4710900 -2016420 1074242 2499120
9544 2499120 1696290 199197 -368082 -32326 410914 1085027 2650888 4534927 4839615
9535 4839615 2648214 -128051 -65594 4255954 10311127 13639153 11884661 6622311 1355600
9526 1355600 -1575639 -2001788 -1024108 -91801 -243416 -995568 -316041 3014695 7231349
9517 7231349 9264627 8626097 7908760 8981467 10521443 10352026 8596703 7026427 6505484
9508 6505484 6746684 7636083 8901216 9057308 6780604 3327354 1671865 2863938 4900259
9499 4900259 5786673 6167864 7889626 10961780 13137390 12325555 8857559 5352287 4277440
9490 4277440 5414435 6138273 4715339 2580082 2244421 3689065 4576872 3734922 2330860
9481 2330860 1402628 488047 -518795 -365356 1343010 2756995 2268274 952275 801559
9472 801559 1685360 1876578 744687 -802662 -1834778 -1707026 348063 4032645 6895090
9463 6895090 6407550 3069151 -91865 -854484 777818 3794178 6762426 7581588 5059631
9454 5059631 1075261 -838044 510592 3113358 5007557 6234211 7168226 7258596 6376418
9445 6376418 5316097 3889324 685528 -3796644 -5872882 -2700714 3648088 8151524
9437 8151524 8082894 4637830 258251 -3608823 -6367247 -7762434 -7902999 -6901430 -4567901
9428 -4567901 -1133063 2203393 4280289 5026714 4757330 3219528 401419 -2453693 -3884736
9419 -3884736 -3735755 -2567859 -355582 2757974 5058613 4503459 1446040 -1353118 -1705777
9410 -1705777 37466 1996629 2658466 1695403 -108683 -1482539 -1693241 -871258 771137
9401 771137 3065206 4714752 3576038 -437433 -4083635 -4344260 -2095459 -12719 1896376
9392 1896376 5434834 9483289 10155947 6629608 3198209 3592309 6137324 6961555 5717878
9383 5717878 5186042 6513077 7846499 7433493 5668255 3808773 2457495 1782800 1966796
9374 1966796 2798429 3399883 2768494 619664 -2058576 -3358885 -2127984 506861 2205599
9365 2205599 2366560 2937948 5682912 9669195 12207701 11378698 7077687 794380 -4786858
9356 -4786858 -7192910 -6318750 -4387936 -3120732 -2179275 -1046692 -511861 -860693 -430388
9347 -430388 2059417 5191205 6942591 7701381 8855858 9746312 8914792 7461372 7892433
9338 7892433 9904231 10570486 8923504 7156450 6696638 6284426 5053828 4493430 5690699
9329 5690699 7163902 7315891 6974713 7620184 8884373 9685657 10228904 10990849 11226668
9320 11226668 10468376 10096936 11218020 12137451 10378310 6504515 3553513 3029348 3740393
9311 3740393 4462810 5383416 6536685 6979984 6392599 5890406 6298001 6807710 6311338
9302 6311338 5196240 4835508 5715084 6875641 7203506 6868679 7288877 9532247 12737029
9293 12737029 14486462 13020835 8758862 3466133 -1429290 -5263686 -7678435 -8598116
9285 -8598116 -8243830 -6481539 -2698692 2878553 8325614 11462769 11787184 10181893 7409105
9276 7409105 4076456 1440197 553313 656639 -30789 -1648467 -2211949 -357396 2521730
9267 2521730 3723330 2418330 842339 2211056 7261862 12895091 15032664 13170131
9259 13170131 10919117 11205410 12471334 11409042 8146441 6009392 6451316 7058074 5218594
9250 5218594 1492559 -1570510 -2157061 -393 3763088 6813886 7447399 6800788 7461740
9241 7461740 9361891 9434722 6271462 2401211 388396 -540150 -1741860 -1821017 724101
9232 724101 3654166 3729779 2148133 3061243 6871667 9216901 7465568 4374236 3552579
9223 3552579 4472916 4367804 2810776 1719185 2009006 2676077 2788091 2525180 2252091
9214 2252091 1802887 761000 -1199686 -4001885 -6738514 -8119325 -7855808 -6930597 -6003217
9205 -6003217 -4504487 -2080315 132470 886344 667345 717561 775116 -469571 -2703559
9196 -2703559 -3645268 -2113671 8512 163679 -1326253 -1633763 654277 3440432 3731534
9187 3731534 1446912 -593057 -199158 2011365 4227057 5785692 6878435 6984015 5230749
9178 5230749 2103099 -676209 -2185483 -3099214 -4221196 -5326573 -5822662 -5508914 -4157704
9169 -4157704 -1270205 3049518 7530723 10525387 11027622 9047837 5909197 4084615
9161 4084615 5223112 7799873 8172171 4847176 409924 -1782709 -1422467 -362807 710084
9152 710084 2526625 4668061 5118730 3034828 504735 651239 4504018 10102501 14310260
9143 14310260 15384298 13986582 11706421 8991706 5565902 2775067 3402009 7823285
9135 7823285 12189070 12648026 10170236 8564768 8595536 7482318 4403925 2667991 4578068
9126 4578068 7125026 5645997 198026 -4601910 -5550657 -4054275 -3090984 -3228464 -2884010
9117 -2884010 -1372209 -123089 -657426 -2257280 -2631436 -1003137 508014 -496520 -3446190
9108 -3446190 -5627236 -5896042 -5689335 -6141293 -6331270 -5361916 -4281937 -4489921 -5699498
9099 -5699498 -6979535 -8337544 -9485252 -8552760 -4528929 -2143 1457015 411221
9091 411221 1006168 4771912 7962237 6573462 1693065 -2126839 -2234725 434357 3846204
9082 3846204 6631812 7707026 6516266 4368819 3983477 6658367 10571510 12604280
9074 12604280 11432152 8330359 5438918 4034147 4420943 6607984 10347028 14580236
9066 14580236 17458134 17375811 14082771 8821820 3576760 104012 -942902 -507041 -535262
9057 -535262 -2320059 -5375625 -8195925 -9835432 -10251370 -9466835 -7393437 -4643763 -2600757
9048 -2600757 -2080713 -2346485 -1923745 -201106 2028185 3392279 3125276 1631104 -17940
9039 -17940 -1234965 -2372328 -3755090 -4727339 -4423979 -3193381 -2200015 -1668930 -751179
9030 -751179 696663 1648852 1817917 2556268 4780648 7210268 8006505 7221281 6184826
9021 6184826 5317453 4229052 3303410 3169799 2897962 915401 -2140656 -3768180 -3383472
9012 -3383472 -3418148 -5432506 -7335209 -6395307 -3318256 -851094 701905 3733757 8963749
9003 8963749 13325732 13350342 9234197 4486603 2332240 3160715 4835916 4881476 2801698
8994 2801698 572841 362006 1749764 2161180 291341 -2112538 -2587215 -894343 1556762
8985 1556762 4298043 8025250 12258760 14520540 12807701 8086684 3336912 350177
8977 350177 -1622571 -3837711 -5566264 -4757787 -1308138 1575517 538008 -3754572 -7086240
8968 -7086240 -6630894 -3965621 -2316402 -2219227 -1591633 600919 2830119 3461067 3013580
8959 3013580 3002697 3546322 3311375 1558853 -706034 -1845319 -1375085 -245886 636434
8950 636434 1726306 4120952 7575625 10024517 9545563 6298304 2146669 -979320 -1974395
8941 -1974395 -914202 601710 598496 -556827 103122 3809217 6789989 4349037 -2169365
8932 -2169365 -5968010 -3133217 2849710 6371010 6373349 5486539 5234052 5298665 5890333
8923 5890333 7461808 8757497 8144104 6615041 6756022 8742015 9886753 8399096 5378044
8914 5378044 2868272 1984865 3015294 5173316 6142674 4203457 1013145 -203258 551157
8905 551157 -6024 -3034190 -5383541 -4274295 -1065104 1709380 4185419 7335897 9674501
8896 9674501 9089027 6509725 4577369 3643916 2142890 93323 -1109020 -2021623 -4646500
8887 -4646500 -8089152 -8186009 -2912989 4446438 9134391 9830378 8241118 5988719 4137681
8878 4137681 4265839 7235571 11165687 12849759 11491882 9395585 8597269 8426182 7197578
8869 7197578 4908591 2829680 1224066 -704285 -2594441 -2616928 -315135 1883870 1629706
8860 1629706 -114064 -979519 -1424426 -3926551 -7846085 -8826459 -5042514 -716810 -474475
8851 -474475 -2724758 -2443954 965364 2915544 546584 -3715512 -6350624 -6963977 -6929307
8842 -6929307 -6779271 -6637051 -6872775 -6731639 -4497950 -615367 1572298 78864 -2714025
8833 -2714025 -3328789 -1648157 78555 941025 1513371 1627865 771398 -62006 510805
8824 510805 1816647 2191959 1961240 2812469 4525544 5020417 3779792 2673833 2997190
8815 2997190 4047145 5125046 6593292 8209674 8651089 7689034 6885780 7108112 7170460
8806 7170460 6013208 4491303 3830951 3864950 3899236 3790273 3118957 1013239 -1970838
8797 -1970838 -3571645 -2874323 -1807493 -1867096 -1339742 1759249 5624692 6662074 4793203
8788 4793203 3546874 4758753 6120488 4791839 1112533 -2361698 -3831934 -3311565
8780 -3311565 -2034933 -1576893 -2490709 -3395883 -2546405 -457571 529214 -424507 -1525279
8771 -1525279 -1132783 196153 1425510 2939373 5170806 6747748 5920017 3245217 1315929
8762 1315929 2022889 5022104 8455498 10375267 10075261 8812734 8517637 9153905 8510850
8753 8510850 5543534 2453190 1860295 3168442 3752957 2795853 1529385 180494 -2538088
8744 -2538088 -6487946 -9135484 -8602719 -6028870 -3919047 -3389004 -3761607 -3740923 -2425772
8735 -2425772 -258971 742422 -931193 -3730061 -4329308 -2008113 196073 -335745 -2403408
8726 -2403408 -3119081 -1690614 581311 2593137 3864944 3865860 2823859 2264501 2916072
8717 2916072 3049296 866022 -2461998 -4452644 -5137168 -6397811 -7847647 -6661303 -2244016
8708 -2244016 1901093 2580564 1134810 1537370 5629813 11734820 16915550 19138315 17940806
8699 17940806 14434660 10591232 7786916 6100651 5067228 4391765 3789417 3140829 3104742
8690 3104742 4422578 6220726 6419955 4647395 3394651 5045030 8627604 10710358
8682 10710358 8974256 4086346 -1205678 -3890644 -2353801 2555180 8181803 12217897
8674 12217897 13828807 12843648 9419895 5169328 2850693 3443991 4664954 3805439 1036591
8665 1036591 -1462261 -2499503 -2450955 -2081351 -2603242 -5600088 -10532529 -13361982 -10507734
8656 -10507734 -3777335 1454484 2840459 2877618 3990111 5172801 4668825 3003333 1590813
8647 1590813 613162 87884 1110121 4130782 7491265 9371407 9891204 9906749 9371387
8638 9371387 8520998 8915415 11190323 13219212 12749468 10611936 9011316 7967097 6272992
8629 6272992 4944304 6271655 9572790 11276562 9895721 7982364 8136551 9683167
8621 9683167 10603843 10508819 10199467 10094772 10460426 11531577 12154181 10110008 5259748
8612 5259748 565627 -1714888 -3028007 -5597415 -8247190 -8016943 -4953893 -2158672
8604 -2158672 -1213572 -573570 1013452 2298870 1890695 532415 -475712 -1359338 -2654616
8595 -2654616 -3196714 -1277436 2663392 6119221 7258952 6455164 5091666 3866553 2513838
8586 2513838 529267 -2136620 -4829804 -6575711 -6937641 -6479244 -6186931 -6405779 -6336776
8577 -6336776 -4579701 -546243 4259819 6890717 5925800 3662952 4009376 7860639 11953004
8568 11953004 12953522 11193241 9202592 8061111 7140296 6544189 7374551 9486111 11088598
8559 11088598 11182835 10704242 10495593 9696526 7273888 4059095 2052216 2281350 4183779
8550 4183779 6452084 7667475 6796669 4122834 1368386 127326 537470 2029240 4486624
8541 4486624 7549595 9558852 8880731 6165612 3729663 2563734 1544540 -15534
8533 -15534 -872111 -9510 1220047 779389 -1158778 -2833753 -3867822 -5455416 -7493919
8524 -7493919 -7893438 -5799915 -3506980 -3429059 -4620864 -4446930 -2762587 -1869513 -2546320
8515 -2546320 -2894491 -1735102 -543955 -775907 -1604954 -1972134 -2625490 -3853274 -3215915
8506 -3215915 1354043 7373680 10081017 8407978 5405418 3031148 459580 -1866721
8498 -1866721 -967252 3654000 7382233 6125576 2103014 620284 2828362 5284480
8490 5284480 5711722 5414501 5862214 6181118 5021779 2694059 534486 -325830 847670
8481 847670 3873197 6901987 7557861 5240657 1375836 -2410616 -5205357 -6492809 -6641937
8472 -6641937 -7274819 -9245167 -10683444 -9273198 -6078438 -4397693 -4917852 -5230574 -4630759
8463 -4630759 -5674877 -9340228 -12101112 -10517193 -6247998 -3593003 -3831470 -4887671
8455 -4887671 -5203271 -4857295 -3616010 -901831 2360356 4334621 4797280 5014382 5146073
8446 5146073 3831564 492843 -3760223 -7545644 -9774742 -9057360 -4838985 632282
8438 632282 3806871 3961242 3685917 4500842 4432672 1539424 -2273698 -3367776 -1238832
8429 -1238832 1150999 1697622 1616036 3005637 5595268 7129141 6409033 4846771 4723359
8420 4723359 6400551 7864904 7208059 5006311 3491955 3536498 3574561 2038922 -123492
8411 -123492 -500025 1589449 4147799 4887383 3514552 1250825 -864994 -2344230 -2736739
8402 -2736739 -2029489 -1258657 -1400414 -1667909 -380329 2179638 3489436 2233482 298470
8393 298470 -154194 -5251 -1369622 -3613850 -3986328 -1927303 142390 702863 990298
8384 990298 2056554 2620488 1307595 -1152497 -3506663 -5739909 -7623988 -7533174 -4740082
8375 -4740082 -1267353 528420 706257 258763 -1167835 -3674237 -5128766 -3824963 -1718107
8366 -1718107 -1742604 -2960707 -1954896 1505610 3942578 3405904 1694604 863871 805469
8357 805469 999515 1578065 1866180 846546 -233181 1042063 3690901 3503111 -715049
8348 -715049 -4695174 -4697222 -2592995 -2191084 -3378916 -3216479 -761951 2517205 5653097
8339 5653097 8335505 9254192 7307177 3850176 1221922 -297427 -1760437 -2785343
8331 -2785343 -2251834 -1124667 -1700633 -4111140 -6120874 -6486367 -6131359 -5765834 -4693192
8322 -4693192 -2649768 -924709 -736676 -1641780 -2119556 -1042904 1428405 3775352 4417474
8313 4417474 3800428 4206242 6445361 8171533 7199875 4974753 4228378 4374165 2471280
8304 2471280 -1503196 -3722394 -1595056 2896190 5956135 5981620 3918640 1527506 286005
8295 286005 573253 1212996 942741 381992 1028266 2533813 3134765 2809157 3438445 5296269
8285 5296269 6041703 4294872 1819040 793396 1047703 1485020 2288977 4025102 6108813
8276 6108813 7736422 8999419 9773503 8987970 6354767 3329134 994349 -1382770 -4161460
8267 -4161460 -5462508 -3551295 231059 3056499 4189111 4966817 6027938 6678730 6635331
8258 6635331 6459234 6221915 5072049 2146440 -2737411 -8595925 -12838506 -12742281 -8770721
8249 -8770721 -5154325 -5409413 -8199196 -9291307 -6608343 -1532828 3677808 7428654
8241 7428654 8356959 5842447 1185210 -3221446 -5739993 -5553678 -2219366 2924407 6257188
8232 6257188 5500147 3063354 2945762 4918425 5047106 1836441 -1731872 -2833715 -1937534
8223 -1937534 -200417 2766267 6568673 8386514 6218596 1963831 -875212 -1081518
8215 -1081518 461792 3130524 6465144 8815428 8336605 5082586 828079 -2634053
8207 -2634053 -4161844 -3403480 -1465953 -357636 -625236 -691327 540357 2163817 3685164
8198 3685164 6819496 12608340 18441654 20713523 19402673 17331687 15796990 13939447
8190 13939447 11917012 11335789 12202077 12491527 11519132 11017108 11808583 11875815 9152927
8181 9152927 4336899 -384610 -3734231 -5300751 -4819660 -2941549 -1381696 -979852 -725141
8172 -725141 311080 1479873 2043200 2495103 3016842 2393335 388156 -405291 2407237
8163 2407237 7117814 9698902 9071282 7969554 8540993 9744392 9800501 8887086 8187850
8154 8187850 7954282 7785724 7645534 7506065 6963995 6178863 6281170 7817817 9487770
8145 9487770 9436844 7423710 4979689 3770614 4282261 5648280 6356974 5651035 4505310
8136 4505310 4510608 5610783 6058590 5055990 4087238 4748957 6538577 7964872 8626971
8127 8626971 8681247 7334185 3867038 -291071 -2438813 -1586063 828141 2928232 3610140
8118 3610140 2198134 -1098759 -4327929 -5286037 -4089369 -2506692 -806260 2328119
8110 2328119 6317751 7925052 5402749 1189731 -1215336 -1213314 -238672 1164196 3203286
8101 3203286 5207903 6450347 7612297 9341102 10392328 9479265 7973585 8125229 9219870
8092 9219870 8344968 4846283 1247246 -484149 -903442 -830501 258799 2629050 5211944
8083 5211944 7091674 8317180 8716435 7926455 7059929 7882478 9521934 8695345 4573574
8074 4573574 795120 790828 3465754 5668259 6751754 8099354 9896396 11267972 12443263
8065 12443263 13898977 14048123 10587770 4077488 -1983986 -4592704 -3209295 916979
8057 916979 5418615 7564057 6561524 4664856 4165723 4323177 3512416 2933859 4802805
8048 4802805 7728040 7908591 4976976 2615907 2717714 3027227 1876833 1141720 2353602
8039 2353602 3639865 3325295 3314996 5582830 7977813 7242995 4237836 2315558 1956865
8030 1956865 1101714 7908 1370706 5238714 7823941 6684622 3933966 2667384
8022 2667384 2777222 2263429 764257 -448506 -980072 -1761670 -3143760 -3958777 -2766251
8013 -2766251 590353 4766473 7937741 9074399 8455196 7089023 5803085 4841982 3875741
8004 3875741 2233375 -256674 -2399239 -2477362 -486572 1487647 1928687 1821330 2793827
7995 2793827 4460784 5203883 4744733 4159027 3952504 3981402 4754462 6769057 8928894
7986 8928894 9833625 10386810 12606361 15814359 16886204 14952363 12969106 13317342 14431332
7977 14431332 13510567 10354605 6610901 3261407 1041725 1486162 4818238 7974793
7969 7974793 7582625 4443031 2475860 3319919 4467129 3123507 -313824 -3506079 -5229072
7960 -5229072 -6030838 -6690327 -6954586 -5680154 -2089688 2973856 7488532 10414272 12670499
7951 12670499 15065981 16140425 13666552 7987994 2184829 -1240591 -2435080 -2778391
7943 -2778391 -2902966 -2725620 -2298559 -1857590 -1599058 -1718960 -2090734 -1919541 -592768
7934 -592768 1140000 1929330 1864091 2474017 4366612 6229373 6855479 6845431 7190543 7104656
7924 7104656 4643987 -706451 -6951578 -11029697 -10925225 -6838369 -1050146 3473638
7916 3473638 4990416 3831054 1600638 -55789 -111231 1392841 3136505 3605867 2949850
7907 2949850 2950565 4461630 5770584 4593927 1078890 -2424806 -4182342 -4273654 -3199872
7898 -3199872 -1079466 1251792 2042058 834269 -151508 1590934 5490785 8486986 9009753
7889 9009753 8760741 9865353 11690228 11885443 9899826 7870087 7895480 9623384 10961346
7880 10961346 10359773 7947784 5061113 3142777 2710162 3063885 3280496 3479160 4555246
7871 4555246 6739853 9288293 11604731 13499094 14129203 12300377 8676319 6109305
7863 6109305 6270943 7106788 5403626 1105298 -2821140 -4319388 -3962848 -2821279 -799139
7854 -799139 2252396 5410553 7508111 8080900 7142594 5136823 3319643 2841355 3105783
7845 3105783 2411237 556564 -764338 -660187 -336622 -806141 -1126593 -270352 941435
7836 941435 1656148 3458083 8574895 15844514 20671476 19678524 14187794 8536622 5783049
7827 5783049 5561270 5516386 4072287 1659171 -349721 -1145877 -528432 1729047 5274394
7818 5274394 8231904 8551790 6675441 5232788 5423849 5465421 3799759 2050162 2800212
7809 2800212 5570589 7321578 6613349 5081016 4525383 4455841 3356367 1094082 -1031030
7800 -1031030 -2109058 -2552774 -3113729 -3553083 -2961673 -1506631 -913813 -2195793 -3590554
7791 -3590554 -2484439 765101 3033491 2807811 1912074 1831550 1017018 -2032378 -5205952
7782 -5205952 -5128762 -1799058 1787294 3691269 4136093 3513157 2178661 1655209 3033718
7773 3033718 4412605 2914398 -771823 -2894574 -1853376 198783 1281299 1715228
7765 1715228 1607205 -85814 -2415297 -1866094 2769307 7817364 9568962 9203921 10058781
7756 10058781 12112814 12483460 10158757 7073684 5039151 4280826 4643783 5759980 6162138
7747 6162138 4486987 1644803 -51668 142271 1045205 1916109 3096906 4110695 3233075
7738 3233075 -91328 -3691037 -4508452 -1575473 3119580 6389248 6649260 5422216 5609519
7729 5609519 7751683 8850168 5891896 -241027 -5645505 -7592747 -6539416 -4490078
7721 -4490078 -2889106 -2020996 -1260859 59559 1308232 736453 -2010459 -4590467 -4701682
7712 -4701682 -3169932 -2402854 -2624697 -2066489 -499846 124133 -1159771 -2965001 -3869576
7703 -3869576 -3854050 -2902031 -603709 1922240 2124031 -553242 -3364938 -3948329 -3480347
7694 -3480347 -4381285 -6396350 -6990268 -4759239 -774627 2795246 4158648 2960585 1143226
7685 1143226 1612654 4621165 6761106 5328583 2385044 2164577 5360184 8645906 9501526
7676 9501526 8723478 7937916 7362149 6856030 6794767 6704575 5068838 1920484 -64308
7667 -64308 1333686 4944243 7888852 9075254 9438458 9701297 9724895 9487866 8884720
7658 8884720 6856539 2559772 -2524885 -5300506 -4226199 -566597 3567745 6944577
7650 6944577 8817623 8651186 7122750 6036101 6244330 6687111 6266345 5446894 4971362
7641 4971362 4230535 2331670 -100478 -1641703 -1909352 -1349278 -11758 1837087 2668892
7632 2668892 1317755 -719651 -782631 1218187 2815017 2864310 2838808 3557403 3361403
7623 3361403 1086191 -1503739 -2352729 -2381641 -3687521 -5705610 -5840914 -3502473 -1035882
7614 -1035882 -435735 -1130533 -1531001 -1212559 -875191 -1158203 -2094752 -3204869 -3857622
7605 -3857622 -3783905 -3062774 -1511758 1077146 3687413 4348692 2670521 842674 773494
7596 773494 1594896 1764035 2076297 3904563 5586213 4107539 323682 -1198774 1472740
7587 1472740 4797666 4936877 2829096 1810453 2518704 2993890 2457317 2163214 2988989
7578 2988989 4462836 6005283 7300553 7620172 6502384 5060061 5028801 6404744 7399121
7569 7399121 6861249 5445035 4171781 3126425 2030138 1037995 382130 15504 150878
7560 150878 1387728 3508444 4641533 2718665 -1995259 -6598710 -8374994 -7471449 -6000859
7551 -6000859 -4889156 -3066197 -55388 2479372 3122084 3144190 4515693 6502735 6816364
7542 6816364 5676864 5683431 7284534 7554762 4681211 749303 -1647506 -2827408 -3890125
7533 -3890125 -3879656 -2034907 -631012 -1935770 -3805554 -2314896 1905301 4131118 2466989
7524 2466989 111274 -240231 -117445 -1416883 -2498557 -1219349 635341 -559558 -4941686
7515 -4941686 -9001289 -10190746 -8962188 -6450564 -2925893 888620 3302442 3616139
7507 3616139 3106863 3073346 3137619 2494458 1686245 1761010 2355857 2116135 848097 -137298
7497 -137298 1807 628226 1072482 1798852 3137667 3911603 2883236 1164218 1428185
7488 1428185 4362015 7352074 7509434 4996409 2414298 1538652 1613692 634205 -2350699
7479 -2350699 -6132350 -8323066 -7785758 -6076809 -5678679 -6734237 -6797788 -4311171 -835697
7470 -835697 1233931 1806164 2435364 3629385 4670612 5434784 6317188 6482187 4208482
7461 4208482 -514215 -5095255 -6522781 -3672117 2247329 8266484 11025636 9396735
7453 9396735 6016670 4686622 6019007 7245582 6501244 5194715 5265840 6092603 5702655
7444 5702655 3775659 1789405 890571 1053669 1933021 3269930 4565094 5300457 5494334
7435 5494334 5458497 5188659 4524439 3644173 2797779 1727260 -4254 -2051732 -3195972
7426 -3195972 -2570750 -792932 640321 1277736 2354091 4638258 6268266 4598800 408645
7417 408645 -2128058 -944794 889509 -45200 -1977239 -758721 3110925 4640649 1532361
7408 1532361 -3078094 -5872287 -7056960 -7240538 -5000531 -496395 2054840 -781909
7400 -781909 -6693202 -10938352 -12604803 -13978801 -15475043 -15311047 -13345702 -11248502 -9117384
7391 -9117384 -5641851 -1660537 118758 -523216 -598788 1658656 4714656 6916504 8649761
7382 8649761 10155906 10271311 9028004 8801824 10838167 12850551 12159071 9278196 6221678
7373 6221678 3082965 -1046231 -4990299 -6250905 -4627851 -2661273 -2176439 -2224926 -943855
7364 -943855 1870160 4556280 5120017 2733678 -1544928 -5311414 -6576686 -5184810 -2398349
7355 -2398349 520840 2933082 4539180 5210235 5024074 4151233 2976970 2490727 3836827
7346 3836827 6889082 9802192 10655918 9279497 7105821 5752876 6099979 7928317 9763205
7337 9763205 9838997 8143946 6889424 7934753 10270385 11192981 9593516 6839982 4630716
7328 4630716 3381430 2854359 2944266 3213140 2686913 922761 -1274624 -2745359 -3081443
7319 -3081443 -2440600 -937425 1110973 2882289 3872392 4742654 6351837 7890197 7068015
7310 7068015 2847737 -2635350 -5783564 -5069790 -2159033 467511 2116023 3679099
7302 3679099 5584729 6905892 6561907 4825027 3305187 3443353 5043862 6498644 6770997
7293 6770997 6804076 8029854 9558968 8445934 3629423 -1861358 -4240572 -3495176 -2614994
7284 -2614994 -2972797 -2968516 -1389311 481470 1085841 779037 460422 -209639 -1620135
7275 -1620135 -2566871 -1473383 1572401 5241978 8436962 10198010 9552729 7140168 5728530
7266 5728530 7031204 8914813 8019535 4516054 1840734 2016843 3768751 5312806 6376866
7257 6376866 6918555 6373499 5195144 5028928 6268528 7319385 7268862 7210175 7644394
7248 7644394 6769394 3284936 -808480 -2359074 -835256 1915283 4355199 5589425
7240 5589425 4378085 636115 -2738403 -2483377 568898 2356992 1150334 -558333
7232 -558333 -407402 494999 106371 -1146401 -1656080 -1648972 -2573299 -4364536 -5409245 -4822289
7222 -4822289 -3084515 -823837 1402939 2456622 1536387 -181910 -432203 1332159 3397777
7213 3397777 4383983 4996499 6604503 9232563 11710887 12956577 12443944 10218380 7207866
7204 7207866 4889424 3856647 3120641 1470958 -852739 -2466015 -2496098 -1328018 97567
7195 97567 1209033 2136047 3434720 5254666 6557965 5681804 2259069 -1694904 -3238378
7186 -3238378 -1124305 3210807 7109676 9011491 9595288 10739371 13095611 14957986
7178 14957986 14301894 11651808 9468693 8571776 7255015 4972908 4510685 8021159 12476563
7169 12476563 12392012 6841878 637982 -1878548 -1147617 420978 2241667 4330619 4892031
7160 4892031 2253231 -1955422 -4393147 -4362675 -4220431 -5682479 -7972915 -9666668 -10150681
7151 -10150681 -8841894 -5049667 407901 4896155 6281242 4771876 2088878 -132817
7143 -132817 -804511 337355 2063015 2271172 174509 -2750287 -4522316 -4619798 -3716630
7134 -3716630 -2378054 -777559 877026 2251573 2884322 2252098 640421 -184070 1349977
7125 1349977 3958881 4277345 1095648 -2995462 -5401379 -6964914 -9596615 -12157353
7117 -12157353 -11546135 -7226797 -1921038 2058273 4512124 5299375 3563764 78940
7109 78940 -2142273 -1216666 1323800 3005775 3520247 3746231 3191391 586230 -3547784
7100 -3547784 -6777534 -7220383 -5127584 -2385483 -1285819 -3023357 -6194742 -7360332
7092 -7360332 -4353367 1307858 6166942 8196450 7416815 4478046 591386 -1955012
7084 -1955012 -1631897 48259 264600 -1008917 -947805 1618003 4095888 3740744 1422573
7075 1422573 233454 1645881 4489873 6789721 7379808 6470567 5612218 6368075 8331549
7066 8331549 9478944 9112702 8929648 10058829 10714726 8648688 4804727 2460586 3218974
7057 3218974 5567285 7012396 6133343 3083174 -278992 -1246899 994069 3877013 4401015
7048 4401015 2983887 2307053 2870122 2412619 -71773 -2583037 -3330123 -3266150 -4004376
7039 -4004376 -5069107 -4749719 -2424222 1112289 4427298 5699859 3726039 -187729
7031 -187729 -2763502 -2387322 -863330 -448479 -840411 -670811 -259233 -644612 -1058671
7022 -1058671 116773 2373100 3463719 2802438 2346705 3623498 5543539 5896770 3979889
7013 3979889 1137758 -738942 -902086 -62590 1059652 3139036 7051472 11356663 13075910
7004 13075910 11840876 10826873 11788965 11791547 7855683 2615484 1174764 3533987 4960635
6995 4960635 3840784 3932435 7345154 10253873 8587869 4170178 1580606 1678949 2099033
6986 2099033 2232592 3561324 5766689 6319826 4240882 1478965 157951 570710 2051523
6977 2051523 3883555 5201651 5663039 6130883 7143960 7210981 4615184 537567 -1872514
6968 -1872514 -1486728 -68536 821373 1405759 1919536 1731437 971081 954584 2260752
6959 2260752 4180926 6381642 8912742 10289052 8372145 4000826 820522 267139
6951 267139 -198006 -2224145 -3444779 -1868386 -26870 -936455 -2520624 -618293 4091385
6942 4091385 7129931 7437926 8220656 10168289 9352753 3952450 -1677711 -2890736 -1179217
6933 -1179217 -1022611 -2775653 -2767283 622861 4768641 6683291 6128394 4319562 1817537
6924 1817537 -1319178 -4544868 -6834181 -7434279 -6721496 -6415645 -7974084 -10231494 -10037302
6915 -10037302 -6351533 -2174055 -717464 -1171808 -651775 817776 401343 -2619702 -5196749
6906 -5196749 -4665037 -2053353 -67943 243079 -466186 -1492308 -2347441 -2406460 -1397429
6897 -1397429 452211 3166639 6684152 9353603 8570756 4091929 -744251 -2547784
6889 -2547784 -1617947 -876741 -2054767 -4353639 -6152234 -6589973 -5824478 -4786617 -4262578
6880 -4262578 -3498646 -701480 3950238 6945209 4925327 -967580 -6034160 -7165406
6872 -7165406 -5363428 -3133998 -1333566 557825 2504419 3719343 4060917 4475766 5610587
6863 5610587 6467565 5283477 2077521 -536667 -222020 1887665 2564950 1048684 28605
6854 28605 1337481 3099522 2889897 1593510 1644432 2980006 3648073 3509665 4209458
6845 4209458 5717007 5988551 4411834 2794488 2323241 2166472 1887746 2608502 4531232
6836 4531232 5658383 4554712 2594994 2059673 3554530 6409099 9812907 12347744
6828 12347744 12395227 10543392 9648990 10808246 11307243 8642534 4465282 1832591 466618
6819 466618 -1744724 -3788108 -2296325 2626379 6406286 6050406 3803650 2954885 2956013
6810 2956013 1400246 -1103404 -1256428 2149930 6410702 8285341 7347298 5260259 3128958
6801 3128958 746227 -2076200 -4573185 -5713580 -5342130 -4244003 -3192288 -2317122 -1498878
6792 -1498878 -901655 -607441 51545 1990967 4847213 6548696 5237231 1629857 -1342377
6783 -1342377 -1752809 -902389 -1377816 -3242510 -3705123 -1061676 2644934 4196578 3114236
6774 3114236 1120812 -1271705 -4902983 -8773052 -9783118 -6833814 -2713862 -329052
6766 -329052 758972 2091497 2753866 905476 -2352413 -3729682 -2124228 418827 2159156
6757 2159156 3441972 4524793 4170157 1669487 -1530643 -3637927 -4779778 -6184335
6749 -6184335 -7894726 -8551122 -7227422 -4599078 -2098064 -254419 1685689 4115133
6741 4115133 5516275 4006458 730808 -383290 2251293 5065063 4184902 1384692
6733 1384692 1526968 4874140 6465096 3854554 937375 1907194 5234749 6722952 5614280
6724 5614280 4121029 2985550 1318387 -350699 -569726 8472 -542035 -1837930 -1764552
6715 -1764552 -655768 -1421035 -4819233 -7846103 -8012407 -6367594 -4868612 -3459044 -1547483
6706 -1547483 60520 833644 1995312 3971880 4312628 1102318 -2890150 -2822091 1877564
6697 1877564 6950913 9176651 9511751 9551719 8251424 4468767 493368 -18536 2987488
6688 2987488 5605792 4868167 2171336 1103838 3029468 5781936 6365843 4208275 1491626
6679 1491626 495557 1207171 2085826 2645982 3881055 5929896 7094040 6374792 5526934
6670 5526934 6696758 8909476 9183654 6890102 4592976 4189472 4575867 4083669 3076934
6661 3076934 2722206 2980802 3458312 4664185 6542505 7155918 5095975 2194898 1357451
6652 1357451 2344323 2454289 1209205 1275212 4003344 6958007 7448061 6223218 5637926
6643 5637926 5828229 5099301 3215085 1807201 1485440 724475 -1518958 -3551931 -2722153
6634 -2722153 872863 3685312 2393205 -2131403 -5452173 -4425468 -548244 2230210
6626 2230210 2106269 523390 -596074 -684046 480475 3381401 7338370 10102137 10131966
6617 10131966 8160637 5579924 2681413 -353402 -2375253 -2993069 -3996290 -6747281
6609 -6747281 -9078228 -7509691 -2380493 1997338 2814995 1855069 2114177 3736500 4965967
6600 4965967 5202665 4914568 3787046 1489025 -215132 1225178 5277258 8066156 7104402
6591 7104402 4469719 3718931 5080500 5871041 4963378 4227054 5116230 6220668 5548654
6582 5548654 3513417 1948007 1413958 1459546 2638918 5823736 9614584 10912844 8797731
6573 8797731 5909824 5042269 5970013 6687932 6266873 5114574 3538533 1575047 -269318
6564 -269318 -1215837 -863085 806999 3294852 5141134 4968927 3618403 3630579 5607405
6555 5607405 6954776 5825618 4397335 5837404 9366164 11120729 9315406 5956715
6547 5956715 3757224 3750925 5621647 7860423 7880942 4753669 1683510 2653618 6471002
6538 6471002 7731195 4445813 753493 344383 1199734 -191029 -2797694 -3209708 -1579541
6529 -1579541 -1033724 -2157241 -2257691 -37417 2763100 4798316 6718873 8480405 8302355
6520 8302355 5787213 3411476 3191154 4019206 4010361 3465134 3584866 4115707 4586763 6323446
6510 6323446 10365364 14198699 13694263 8540553 3064463 879717 1017163 489110 -1385217
6501 -1385217 -2918813 -2861150 -1310050 1412947 4912596 7956766 9163447 8563221 7330169
6492 7330169 6084400 4723286 3723834 3875877 4435601 3391596 449969 -1856615 -1332400
6483 -1332400 855847 1820593 711334 -795101 -1156792 -410226 763340 1716040 1618429
6474 1618429 287450 -516149 1677220 6838895 11803693 13511032 11699479 7876585
6466 7876585 3277506 -937633 -2945260 -1731866 1123413 2864052 2787484 2661329 3747207
6457 3747207 4857850 4133647 1772732 -107934 -115639 774060 432296 -2071440 -5735252
6448 -5735252 -8968853 -10972620 -11528108 -10178568 -6675210 -2250377 621632 401024 -2064395
6439 -2064395 -4776268 -6768283 -8324235 -9379007 -8856911 -6148637 -2684263 -1163527
6431 -1163527 -2894541 -6221037 -8058195 -6968364 -4192572 -1503333 1090533 4604128
6423 4604128 8552228 10581767 9039709 4944528 796135 -1875779 -3107694 -3243763
6415 -3243763 -2054637 823009 5060892 9373252 12037179 12072862 10318812 9092162 10221460
6406 10221460 13250994 15757892 15509682 12334735 8075819 4932166 3855332 4332061
6398 4332061 5268454 5665971 4728043 2301557 -379129 -1290713 203991 2350623 2972612
6389 2972612 1857413 360208 -495241 -264872 1625326 4950024 7584897 7550949 6090256
6380 6090256 6423322 9222098 11705868 11695954 9954871 7693651 4710554 1552190 574149
6371 574149 2444493 3998746 2383506 -565145 -1028886 1348405 3907641 5439692 6553127
6362 6553127 6500623 3731420 -347912 -2024362 -312306 2073912 3329408 4400813 5222340
6353 5222340 3285602 -1757537 -5633026 -4652483 -796859 1489810 1380470 1146681 1332626
6344 1332626 426893 -1292888 -1464109 450103 2173620 2244797 1777727 1670040 886446
6335 886446 -866998 -1244923 1557880 5295784 6066341 3648061 1775591 2774965 4421762
6326 4421762 3464403 409193 -1321346 -149978 2118885 3595935 4647751 5778800
6318 5778800 5382659 1968378 -2448519 -3909442 -1531649 1399907 1917532 775182 366923
6309 366923 1235995 2220894 2611707 2358943 1054290 -1530152 -4372658 -6172842 -7005523
6300 -7005523 -7666513 -7876750 -6719847 -4585263 -2975820 -2338477 -1727835 -856238 -728676
6291 -728676 -1546762 -1615578 401167 3254289 4671661 4600461 5185176 7293305 8676968
6282 8676968 6817667 2848386 975976 3619956 8433406 11122983 10277460 8012178
6274 8012178 6474698 5674872 4908787 4305814 4110055 4062127 4508014 6566722 9961719
6265 9961719 12185170 11291795 8130843 4318268 -160259 -5081125 -7642031 -5458167
6257 -5458167 -996772 835173 -432848 -287760 3600929 7600010 7385751 3664815 179549
6248 179549 -1244852 -891396 1241877 4722472 7072489 6151397 3338075 1539939 985724
6239 985724 63984 -524672 1734164 6339416 9136713 7616036 3874185 1039097 -535019
6230 -535019 -1996258 -3456456 -4659239 -6196583 -8095730 -8845591 -7739666 -6618548 -7204933
6221 -7204933 -8116656 -6840354 -3524086 -280773 2406238 5686683 9004409 9813812 7370212
6212 7370212 4353541 3559690 4767258 5992999 6292802 6029955 5515240 4729514 3826106
6203 3826106 2970600 2069545 1155667 494262 22158 -536660 -796275 -55848 1149881
6194 1149881 1253388 108030 -245644 1600963 4146520 4908962 3522752 1396747 -610847
6185 -610847 -2244485 -2424090 -167465 3146193 4687550 3747220 2510447 2863678 4353227
6176 4353227 5887461 7335804 8311868 7368074 4117769 707437 -691186 -807201 -1804866
6167 -1804866 -3743769 -4617524 -3511051 -1553313 289203 2250415 4188410 4968245 4254963
6158 4254963 3292316 2948170 2423201 930712 -729273 -1520395 -1834037 -2348345 -2367825
6149 -2367825 -1089860 330254 81605 -1316800 -1547660 -110799 829771 -144309 -1517082
6140 -1517082 -1222859 420984 1585543 1538899 925150 310455 -113937 -777 611874
6131 611874 679439 -633526 -2422709 -2882931 -1385640 1287875 4232391 6638291 7252264
6122 7252264 5331356 2202719 477175 1515400 4626973 8412431 11559221 12811683
6114 12811683 12035097 11129726 11833876 12686301 10627167 5903098 2494960 2640926 3860121
6105 3860121 3173256 1497637 1286326 2069378 1583966 19857 -202493 1546807 3255802
6096 3255802 3445993 2700241 1946047 1534654 2183784 4605624 7873494 10097789 10850881
6087 10850881 10988017 10295924 7900706 5100587 4722224 6813427 7994010 6466942 4680521
6078 4680521 4981748 5533978 3634449 984024 1771843 6154027 9407558 8215177 4716705
6069 4716705 2878636 3155961 2872840 707190 -1545562 -1788619 -378669 910187 1629623
6060 1629623 2908139 5120617 6808605 6525567 4567861 1986474 -914511 -3706160
6052 -3706160 -4613626 -2378914 1006571 1811997 -816983 -3866404 -4716947 -4324811 -5100755
6043 -5100755 -7468669 -9920483 -11068724 -10265353 -7400336 -3521320 -742059 -236557 -979875
6034 -979875 -1342539 -1028411 -682744 -803662 -1949805 -4639431 -7927803 -9543652 -8764080
6025 -8764080 -7683639 -8143476 -8975705 -8108769 -5828317 -3695903 -1621255 1273978 3818233
6016 3818233 3862989 2008472 1383951 3307218 5565938 5616302 3479590 895001 -552058
6007 -552058 140394 3043227 6510461 8061906 6828332 4252210 2118686 939929 400306
5998 400306 168031 -23666 -116756 521422 2142647 3596190 3366521 1415819 -1044863
5989 -1044863 -3070868 -4007892 -2866729 466181 4008423 5678446 5906343 6059636 5183430
5980 5183430 1503770 -3099773 -3987431 -132289 3830912 3601246 401549 -1699063 -1089690
5971 -1089690 927971 2823030 3545809 2138289 -968144 -3273059 -2824519 -703856 682948
5962 682948 726778 332066 -414038 -2260572 -4960571 -7155794 -7991212 -7718963 -6910485
5953 -6910485 -5822606 -4211057 -1528237 1864243 3784885 2294536 -1047787 -2312907
5945 -2312907 -424597 1390030 788088 -62963 1479072 3658241 3034532 195826 -1262184
5936 -1262184 -530615 -186030 -996524 -309400 3116541 6090514 4981882 735053 -2184699
5927 -2184699 -956475 2920503 5674825 5048517 2127681 -179055 -203575 1394200 3371991
5918 3371991 5254213 6353133 5387016 2727102 1381198 3467385 6881182 7936462
5910 7936462 6314967 4554011 3382931 1030823 -2694979 -5084739 -4274651 -1564671
5902 -1564671 1047595 3086258 4182463 2999675 -662843 -4499345 -6066648 -5268097
5894 -5268097 -3475577 -1758619 -1028071 -2178905 -4677475 -6392535 -6095225 -4849219 -3899455
5885 -3899455 -2763127 -680746 1619417 3081426 3807949 3915858 2487718 -486797 -2573207
5876 -2573207 -1587065 1106025 2334270 1589259 1289659 2677910 4020069 3638090 2620943
5867 2620943 3130005 5284674 7260321 7920833 7835743 7521374 6055492 2533775 -1726321
5858 -1726321 -4009864 -3544296 -2524062 -2894549 -3573242 -2446755 110810 1937764 2543157
5849 2543157 3281662 4411860 4929420 5503672 8248897 12576425 14605830 12506134 9450251
5840 9450251 8950568 9859916 8718909 4954734 925789 -1406180 -1093843 2511886 7779847
5831 7779847 9844721 5589743 -1343956 -4419092 -2483858 -222522 -741632 -2243213
5823 -2243213 -2523765 -2079210 -1267949 1230970 4860097 5945264 2906402 -431510 82510
5814 82510 3074823 4251448 2804409 1489673 1553518 1421770 219024 -768514 -520091
5805 -520091 553282 2356320 5558452 9536112 12015614 11839114 10464613 9651515 9016980
5796 9016980 7152050 4264742 2287378 2409452 3462042 3247544 1302213 -198292 1171362
5787 1171362 4972230 8097043 8294633 6399305 4534261 3503020 3141840 3935590 6366271
5778 6366271 9231188 10465256 9487013 7278335 4600991 1860970 208071 502274 1273066
5769 1273066 108237 -2716964 -4537386 -4613035 -5107068 -6629190 -6109413 -1459078 4338982
5760 4338982 6846259 6035873 5384729 6508985 8160420 9668736 11529056 12616723 10761270
5751 10761270 6975124 5437963 7569745 9261637 6350244 478213 -3139437 -2245272
5743 -2245272 721470 2498833 2275230 1391156 1496124 2886931 3749678 1796030 -2467289
5734 -2467289 -5406322 -4479559 -1306689 1097667 2385582 3814975 4830914 4037025 2698208
5725 2698208 3511611 5804797 5673960 1783189 -2375714 -3411006 -2160060 -1151559 -786698
5716 -786698 -303203 -162276 -830400 -866283 1182417 4171533 5997452 6760802 7955646
5707 7955646 9455848 9828225 9132382 9013739 10136148 11460177 11850937 10722188 7705510
5698 7705510 3653415 1276041 2403840 5030768 5567079 3744397 2546749 3320953 4048308
5689 4048308 3032822 1225288 -228350 -1847191 -3627247 -3566266 -437677 3804832 6282918
5680 6282918 6369479 5131015 3399172 2140563 2890860 5557449 7144041 4970902 238821
5671 238821 -3610319 -5050910 -4946324 -4054810 -2615293 -1694605 -2260177 -3090713 -2020739
5662 -2020739 731177 2641885 2225900 157456 -2756381 -6220259 -8922746 -9015199 -6806691
5653 -6806691 -4693656 -3699523 -2331421 365082 3013004 4234182 4425759 3913215 1753461
5644 1753461 -1798989 -3827989 -2128107 1434444 3210004 2315226 813721 425878 1301399
5635 1301399 3255570 5857579 7637514 7350112 5922233 5346121 5876730 6119145 5612749
5626 5612749 5403660 6157024 7526983 9264395 11107007 11818206 10436346 8308403 7527917
5617 7527917 7427899 5447761 1860195 411964 3003443 6772704 8374334 8385296 8959678
5608 8959678 9575977 8477706 6830099 7664638 10882483 12637810 10350937 5802294 2396904
5599 2396904 1427698 2037541 3144669 4130562 4666708 4923284 5386146 5943774 5824104
5590 5824104 4785272 3575352 2849266 2438783 2064137 1922462 2090273 2075351 1460374
5581 1460374 442116 -532945 -1020092 -388069 1562566 3471229 3226583 746310 -1268123
5572 -1268123 -650774 1098045 721174 -2221089 -4774278 -4909055 -4236569 -5036378 -6310430
5563 -6310430 -5224386 -1911960 35010 -1225154 -2594702 -161136 5075857 8343856
5555 8343856 7383198 4671082 3159661 2896874 3044846 4186530 6313324 6939033 4294366
5546 4294366 883034 525933 2707147 3410968 1398267 -166542 910277 2623969 2695332
5537 2695332 2446609 4082002 6457412 6720395 4936796 4056139 5629231 8118026 9535576
5528 9535576 9568189 8663199 6868627 4399543 2199265 1206551 1663178 3352884 5771821
5519 5771821 7879552 8563011 7887665 7389771 8521749 10822769 12007445 10244664 6447569
5510 6447569 3831523 4649595 7734553 10113221 10693789 11031261 12517357 14572978 16184892
5501 16184892 17496594 18812151 19460366 18848966 17386010 15222117 11580757 6829757
5493 6829757 3661718 4165984 6848857 8653422 8865701 8649688 7757132 4826249 792647
5484 792647 -1136554 420235 3442845 5646608 6739336 6817725 5197918 2288642 422384
5475 422384 1085324 2910776 3877677 3920061 3897310 3656895 2931370 2716638 3729436 4631237
5465 4631237 3922921 2709299 3212534 4955881 4878687 1531578 -2846424 -5004758 -3932761
5456 -3932761 -1003721 1695221 2644496 1834500 1136879 2671575 6121095 8627580 8061685
5447 8061685 5477574 3519569 3308113 4047455 5081215 6817063 9434646 11831110 12508419
5438 12508419 11102208 8676613 6726805 5975852 5836023 5024812 3093147 1268700 1144134
5429 1144134 2532735 3607428 3493654 3472283 4706703 6097431 6103380 5763116 7484803
5420 7484803 10938688 12845985 11618965 9591520 9164444 9264054 7970850 6523321 7417647
5411 7417647 9658397 9591079 6465903 3612558 3151912 2778164 -351121 -4983096 -7405730
5402 -7405730 -6301376 -3686674 -1659198 -221833 1596234 3824510 5181709 4236290
5394 4236290 1074913 -2008507 -2097130 1583394 6825794 10518521 11082467 9038541 6235298
5385 6235298 4652482 4857053 5434788 5018870 4709550 6710260 10460533 12548822 11449454
5376 11449454 9923032 10918025 13077443 12646247 8562111 3301439 -523019 -2144716
5368 -2144716 -1738525 184599 2368570 3472647 3326196 2538658 1357210 62071 -369750
5359 -369750 412881 960383 -12947 -1271666 -733631 1261481 2833217 4113500 6832876
5350 6832876 10241539 10804956 7144030 2441951 261930 305372 285720 54380 1377732
5341 1377732 4580084 7711699 8953184 8343461 7107877 6222800 5592914 4215756 1600311
5332 1600311 -808810 -703766 2066489 4820119 5240222 3957765 2856924 2228565 1271503
5323 1271503 321263 492524 1546605 2109987 2002951 2577417 4499745 6733394 8083312
5314 8083312 8420985 8031553 7058563 6059870 5863790 6276271 6077809 5003291 4658681
5305 4658681 6604162 10348104 14019038 16174924 16113767 13413889 8533688 3339657 -297510
5296 -297510 -2173940 -2936781 -2245106 463098 3566044 3961763 1107096 -1540363 -625432
5287 -625432 2895413 5365945 5249568 4270912 4189750 4711002 4930353 4815731 4393093 3114890
5277 3114890 1172799 121351 887335 2169004 2218266 1419540 1512452 2744808 3601240
5268 3601240 3432445 3626428 5508779 8359740 10406792 10903475 10245889 8627897 5798541
5259 5798541 2210347 -600527 -1415059 -789125 -546756 -1769697 -3670915 -4627347 -3978291
5250 -3978291 -2466631 -1187275 -611248 -499592 -161370 1198068 3701705 6227798 7287943
5241 7287943 6725339 5909935 6018539 6848908 7620200 8056917 8165311 7823161 7291313 7305667
5231 7305667 7847160 7644092 5908951 3843687 3222976 4010832 4635884 4229721 3254933
5222 3254933 2170140 944894 -33156 22628 984467 1602053 1046455 -106515 -657431
5213 -657431 162151 2406634 5283173 7288690 7496334 6789731 6773342 7451729 7347350
5204 7347350 6131109 5456523 6387500 7602578 7527848 7007254 7949689 9808428 9465739
5195 9465739 5153300 -917528 -4746211 -4665069 -2542817 -1390373 -2573851 -5109009 -6725537
5186 -6725537 -5460952 -1142462 4056316 7086311 6799632 4970767 3972591 4031531 3836338
5177 3836338 3308286 3996411 6486005 9157516 10323773 10187421 9762473 9263758 8785370
5168 8785370 9265078 11146801 12933906 12685090 10403923 7564116 4931647 2388114 300506
5159 300506 -688267 -953726 -1361896 -1658781 -943317 441954 1116239 775168 646668 1729625
5149 1729625 3710695 5480000 5709290 3529871 -24746 -2019600 -732925 1963620
5141 1963620 3103775 2450274 1537231 170682 -2729627 -5357803 -4130608 784219 4774601
5132 4774601 4894220 3342307 3337289 4787842 6100279 7360630 9245657 11016571 11890538
5123 11890538 12426557 12557324 10536597 6147695 2613729 2519062 3853982 3138694 661451
5114 661451 -746937 -625047 -767783 -1132245 44265 2048583 1575875 -2273811 -6125715
5105 -6125715 -6703627 -4443690 -1517958 1232213 3696565 4826317 3670858 1197099
5097 1197099 -463765 -103699 2137012 5658529 9590471 12552350 13408317 12464655 11355680
5088 11355680 11452953 12442968 12576055 10496731 6879551 3909388 2897961 2808421 1569009
5079 1569009 -1437624 -4648090 -5918716 -4559527 -1981505 -536021 -1486163 -3996545
5071 -3996545 -6226771 -7053581 -6263344 -3824620 -267405 2712800 3838282 4388537 6752338
5062 6752338 10595811 12741153 11511898 8748621 6443139 4098615 1269082 57461
5054 57461 2290943 6044431 7968424 7849719 7918386 8600879 8186451 6375449 4990044
5045 4990044 4851379 4679790 3624885 2424066 1353780 -616258 -3520848 -5211697 -3938694
5036 -3938694 -908711 1114604 1217601 1337306 3933769 9090751 14030778 15679441 13745956
5027 13745956 10749872 8942854 8264049 7731765 7310705 7215828 6731227 5398574 4442083
5018 4442083 5245260 7045610 7837247 7068669 5850292 5022972 4735435 5509727 7852803
5009 7852803 10813142 12491388 12142043 10676748 9249656 8424122 8487735 9537300 11377914
5000 11377914 13862064 16652105 18230203 16586921 11975756 7611563 6326061 7767706
4992 7767706 10010509 12187416 14009746 14569215 13643287 12648340 12433437 11847433 10317275
4983 10317275 9581893 10502474 10632608 7987764 4841496 4214066 4879742 4077893 3159250
4974 3159250 5478093 9811083 11289762 8823837 6497222 7011306 8488641 8814388 8747240
4965 8747240 9201846 9150204 7816281 6032219 4448337 3275878 4246013 9315346 16535262
4956 16535262 20670323 19243331 15132199 12231312 11404933 11598236 12019086 12094536 11645232
4947 11645232 11797941 13565346 15500004 15239479 13054610 11024377 9294595 6580040
4939 6580040 3884242 3847359 6433976 8928604 10114017 10974378 11859444 12743775 15268855
4930 15268855 20113913 23544304 21726165 17390361 16445526 18895840 19558874 17161488
4922 17161488 15491942 15440441 13589763 9699756 7994710 9479402 10299931 9341413 10100365
4913 10100365 13392725 15712664 16332070 18086700 19797149 16888425 11360014 11297180 17737229
4904 17737229 22191671 20544685 18734899 20612394 21474588 18830834 18138503 21729641
4896 21729641 23372312 20421554 19818079 25018512 29079798 28253807 29473561 36015595
4888 36015595 39836429 37709925 39682843 50335069 58153863 56564917 57495024 68677889
4880 68677889 77718894 77683354 85574540 110665585 130367100 131948853 150405013 212029074
4872 212029074 257097885 188292862 7100809 -161951543 -212124300 -167948034 -123158721
4865 -123158721 -114444854 -109239822 -86434314 -65751087 -61570762 -59732269 -49506224 -41650501
4857 -41650501 -43640892 -44996162 -37931614 -30573216 -30215095 -31559630 -29563423 -28214972
4849 -28214972 -29607284 -28389201 -23343035 -21797645 -26945434 -32280809 -33308675 -33690564
4841 -33690564 -35640152 -35350884 -32294961 -32203608 -36077187 -36524500 -30082922 -23581975 -22973252
4832 -22973252 -24689302 -23541912 -21099593 -20590187 -20548816 -18937430 -17490396 -17263644 -15570605
4823 -15570605 -11555599 -9320612 -11582218 -15357999 -17327829 -18250976 -18930042 -17231694
4815 -17231694 -12540939 -8236028 -6617768 -5990885 -5190075 -5940717 -8388533 -9623494 -9015000
4806 -9015000 -9479299 -11137855 -9849415 -4955141 -2150837 -4874735 -8682759 -8385955 -5471840
4797 -5471840 -4054850 -4291610 -4344475 -4676969 -6033674 -6773786 -5994751 -5779481 -7125689
4788 -7125689 -7554838 -5816069 -4544754 -4963428 -3836764 275793 2608956 -1056013 -7301047
4779 -7301047 -9861865 -8210512 -6470786 -6716097 -8144492 -10395064 -13087695 -14155375
4771 -14155375 -12664191 -11175828 -11786342 -12443074 -10780787 -8577068 -8344253 -8527009 -6558459
4762 -6558459 -3866518 -3041262 -2530868 766727 5647330 8426491 8988189 9946494 11019971
4753 11019971 9288709 4398927 -1016845 -5500180 -9173039 -10892952 -9434075 -6851080
4745 -6851080 -6264606 -6828631 -5341081 -2363074 -1836380 -4407520 -6020772 -4189458 -1361015
4736 -1361015 -621996 -1767007 -3188407 -4419746 -5149658 -4527403 -3181722 -3566742 -6484131
4727 -6484131 -9019574 -7698429 -2753303 1888444 2322228 -1994814 -7872220 -11165780
4719 -11165780 -10499650 -8071448 -6551139 -6360951 -6798647 -8076129 -10411042 -12424936 -12558922
4710 -12558922 -11150552 -9218931 -6404273 -2363804 974111 1264605 -820278 -2596673
4702 -2596673 -3263073 -4209939 -5886041 -7086295 -7325380 -7418601 -7539731 -6884147 -5415150
4693 -5415150 -4059102 -3215484 -2774680 -3141154 -4297511 -4519199 -2375819 452829 855695
4684 855695 -1463961 -3845499 -4475775 -3746991 -2072216 685336 3347841 3903162 2528326
4675 2528326 1540813 1587848 449195 -3303671 -7791124 -10312055 -10480710 -9565252 -8278969
4666 -8278969 -6598972 -4625666 -2402202 305900 3093307 4436064 3030284 -543573
4658 -543573 -3875594 -4563443 -2418878 -50959 -429669 -3352368 -5445218 -4495486 -2345558
4649 -2345558 -2131261 -4150179 -6372999 -7723261 -8494958 -8475873 -7262712 -5994593 -6331533
4640 -6331533 -7909535 -8936420 -8931249 -8707711 -8154468 -6434412 -4019633 -2158254 -768510
4631 -768510 730278 1296855 -12294 -949778 1497432 5607327 5994957 1157981 -3915541
4622 -3915541 -4359486 -1300189 988220 1000747 571187 1363290 3107689 4447096 4163002
4613 4163002 2301526 540846 254205 314866 -1212461 -3412742 -3401344 -1125427 103802
4604 103802 -1162767 -2376431 -1790222 -1706830 -4228288 -6976160 -6603397 -4343787 -4238870
4595 -4238870 -7065466 -9653838 -9755470 -8310507 -6800443 -5199025 -3162151 -1158270
4587 -1158270 278457 1036922 834338 -710284 -3222158 -5663316 -7159824 -7000978 -4457859
4578 -4457859 115111 4410555 5915545 4651183 3050163 3002725 4073752 4883204 5224054
4569 5224054 6065909 7794853 9177669 8492987 5569066 2100317 -363553 -2054598 -3947403
4560 -3947403 -5874658 -6894483 -6993818 -6929980 -6706193 -5888852 -5219061 -5866249 -6931616
4551 -6931616 -5923737 -2347608 1285894 2890440 3181856 3521604 3423931 1805518 -782131
4542 -782131 -2736078 -3185384 -2151325 -163394 1409686 1185305 -103529 -10525 2068367
4533 2068367 3787894 3629264 3377438 4733058 5708976 3312273 -1622993 -5295941 -5865942
4524 -5865942 -4839897 -4154316 -4513949 -6235130 -9092399 -11334281 -11144346 -9078255 -7050551
4515 -7050551 -5346556 -3052956 -947384 -800461 -1601297 106274 5002451 9221528 9574758
4506 9574758 7862829 7639156 8777807 8168270 4763355 1070010 -311866 630561 2407069
4497 2407069 3983953 5117255 6039690 7298793 8869463 9206804 6558241 1859153 -1037189
4488 -1037189 743460 5720670 9764675 10582220 9126523 6936014 3980855 -201437
4480 -201437 -4672042 -7619397 -8243461 -7353555 -6378843 -6165271 -6340471 -5691724 -3775910
4471 -3775910 -2092503 -2515419 -4480656 -5399199 -4375163 -3461711 -4070389 -4367706 -2240219
4462 -2240219 1089431 2944453 3072942 2691054 1037744 -3449026 -9097749 -11997107 -11193563
4453 -11193563 -9304848 -7664669 -4828305 -835294 1207377 -276607 -2708711 -3491587
4445 -3491587 -3439294 -3658299 -2401382 1684139 5893185 6764280 5186205 4621770 5676137
4436 5676137 6089381 5211505 4771196 5335451 5290362 3750887 1950496 1306015 1989730
4427 1989730 3450560 4665202 4292842 2505783 2125495 5682014 11622971 15684500 15834099
4418 15834099 13581531 10606472 6824700 2302405 -1447073 -3228879 -3529724 -3189663
4410 -3189663 -2141564 -333869 1302621 1706558 720014 -1332557 -4408140 -8462224 -12625126
4401 -12625126 -14992129 -13632946 -8611506 -3066162 -903712 -2629616 -4755586 -4294029
4393 -4294029 -2251999 -1251191 -1512003 -1494045 -1069858 -1096577 -543000 2651853 7511622
4384 7511622 9760625 6820610 1134051 -2630438 -2378303 187764 1974993 1334586 -805030
4375 -805030 -2162799 -1804280 -1405860 -3203791 -7107223 -10670268 -11475020 -8781357 -3607603
4366 -3607603 1750229 5054973 6191148 7250588 9638464 12135469 12805314 11312890
4358 11312890 8088833 3227880 -1782185 -3419500 -168611 4394636 5758434 4366995
4350 4366995 3869682 4785019 4278899 1870013 640890 1945793 3153589 2188221 734941
4341 734941 1085072 2745795 4083328 4879599 5398100 4886482 2701754 -497625 -3732295
4332 -3732295 -6502681 -8199066 -8491011 -8491769 -9408444 -10047993 -8344947 -5379452 -4467725
4323 -4467725 -5701689 -5251691 -1505336 1924359 1539202 -998756 -1798233 -92346 1888067
4314 1888067 2147125 -250591 -5262957 -10429049 -11694745 -8229324 -4184150 -3050124
4306 -3050124 -2745743 418131 5159205 6771507 4163734 1251391 1344059 3531814 5062379
4297 5062379 4575253 2420161 -116597 -1461978 -1226400 -988736 -2100903 -3240209 -2165272
4288 -2165272 500067 1679280 203585 -1678335 -1961415 -1961969 -4276135 -8875751 -12864933
4279 -12864933 -13986215 -13259257 -13569295 -15904119 -17776054 -16012811 -10705612 -5343815
4271 -5343815 -3067802 -3955998 -6104984 -7842515 -8274165 -7234981 -5920300 -6505169 -9822377
4262 -9822377 -13898761 -15686550 -13939981 -10042875 -6629453 -5579670 -6500568 -7040346 -5639855
4253 -5639855 -3734188 -3747185 -5273638 -5626405 -4393368 -4521203 -7605430 -10845814 -10817169
4244 -10817169 -8235728 -6505071 -6813805 -7181785 -5864145 -3548753 -2027332 -2045052 -2757942
4235 -2757942 -2785318 -1836212 -1253009 -2257801 -3765044 -3165757 427096 4840875 7074506
4226 7074506 6003639 2926403 327408 -346285 -660575 -3846974 -10013290 -14454909 -13313641
4217 -13313641 -9254500 -8079181 -10969682 -14014974 -14429869 -12868425 -10291031 -7300602
4209 -7300602 -6200990 -8816233 -12572446 -13651935 -13212630 -15023197 -18450608 -20482331
4201 -20482331 -22682230 -27622566 -30551185 -25554544 -18513705 -20369834 -27877521 -27880172 -22490726
4192 -22490726 -29116661 -49392605 -63189271 -67077876 -90495353 -146601999 -189696801
4185 -189696801 -160755346 -68048471 16462162 43688866 34158387 29830419 36646174
4178 36646174 36574491 27922282 23696484 24378629 19439674 9666706 6140348 10133025 12163896
4169 12163896 9373787 8243744 10861595 12245421 11189358 11702182 13554233 12117495
4161 12117495 7650607 5001587 4352492 1575987 -2706446 -3775826 -2179807 -3058963
4153 -3058963 -6039658 -5250449 -289487 2037757 -1214689 -4610077 -3143541 1638776
4145 1638776 6363710 9951232 11147579 8351818 3738982 1647514 1611614 -796397 -5154814
4136 -5154814 -5267719 945523 7433545 8567591 5580474 1804019 -2363404 -6431423
4128 -6431423 -7364797 -3966883 615021 3741191 6391152 9028629 9264384 6647326 5120077
4119 5120077 7365225 10820725 12350622 12664003 13003042 11861890 8662290 6670521 8315676
4110 8315676 10998554 11186882 9372890 7533647 5291915 2443107 1702748 4542248 7410154
4101 7410154 6680807 4575420 5346197 8046448 8375555 5993119 4532614 5122995 5175698
4092 5175698 3764119 3487061 6014105 9403119 10917873 9872617 7076903 3731670
4084 3731670 1227475 169980 -296696 -614845 732658 4616694 8248872 7859369 3970724
4075 3970724 954874 1338912 3437873 4854135 5395428 5729540 5639540 4825379 3836477
4066 3836477 3324882 3413775 3992620 4526531 3853632 1660830 -187737 410457 2713996
4057 2713996 3864400 2611745 387231 -1304364 -2388359 -2798147 -1791864 371716
4049 371716 1785338 1042426 -1022908 -2504227 -2438887 -1115642 777016 2722206 4498337
4040 4498337 5870349 6003677 3936098 408008 -1809471 -906464 1419396 2199272 1329729
4031 1329729 1285669 3032995 4797163 5245472 5433316 6766867 9180672 12298449 16323782
4022 16323782 20492734 22466612 20850534 17105408 13726566 11656258 10384671 9040782
4014 9040782 6268143 911998 -5437533 -8366495 -5453036 61580 2942876 2427851
4006 2427851 2255254 4734322 7972251 9405771 8993703 7692047 5449839 2538895 797982
3997 797982 1448218 3111069 3965403 4528857 6088017 7550833 6615860 3614652 1385874
3988 1385874 1199622 1520431 1350374 1969929 4042080 5471302 4105300 845140 -1863856
3979 -1863856 -3212105 -3727899 -3146331 -992412 1410435 1903287 349997 -1348315 -1911933
3970 -1911933 -1614502 -921368 -154793 -240234 -1656405 -2805445 -1786422 204185 -24082
3961 -24082 -2677605 -4101623 -2141343 481452 220182 -2145465 -2973817 -887791 2198348
3952 2198348 4318767 5099089 4361496 1574420 -2611319 -5913596 -6501138 -4912138 -3378010
3943 -3378010 -3466123 -4522296 -4392336 -1813210 2080391 5117109 6605224 7453528 8058827
3934 8058827 7733816 6473406 5418446 4876424 3775032 2049165 1541580 3120878 4887738
3925 4887738 5038869 4623443 5315462 6305447 6086665 5715262 7001941 8512178 7156275
3916 7156275 3640878 2491191 5748805 9980282 11053997 9159581 7228923 6500328
3908 6500328 5771235 3797377 602023 -2930320 -5513387 -6097167 -4931099 -3445102 -2626510
3899 -2626510 -2330569 -2388905 -3028417 -3684726 -2966179 -731893 1167244 1287074 500077
3890 500077 418189 1152289 1928870 2766852 3958588 4734140 4170000 3034086 3156375 5034890
3880 5034890 7301141 8503434 8343583 7223968 5641394 4147933 3102201 2317004 1397794
3871 1397794 232729 -1232116 -3082119 -4600325 -4141293 -1045558 2826864 4854211
3863 4854211 4673774 3988669 3524870 2028911 -1220415 -4662130 -6326468 -6252165 -5795193
3854 -5795193 -5378297 -4289783 -2293563 -127186 1547429 2612688 2879578 2055669 604270
3845 604270 -269135 29981 768877 973520 721893 909396 2137793 4207534 6237077
3836 6237077 6882807 5082855 1334500 -2202627 -3714762 -3518381 -2971870 -2137825 -81329
3827 -81329 2511726 3036146 400017 -2761251 -3013460 -438528 1847588 2115796 1781187
3818 1781187 2337932 2798179 1724318 250627 771289 2976043 3488190 146034 -5061429
3809 -5061429 -8443074 -8674089 -7022636 -4701204 -2157133 -562044 -1316426 -3266849 -2800896
3800 -2800896 1608954 6723849 8451448 7062596 6022373 6602433 6795816 5555100 4733733
3791 4733733 5650041 6570457 5483206 3251216 1898382 1340548 76821 -1849786 -2710157
3782 -2710157 -1416884 1626703 5389298 8405543 8910863 6601173 3783288 3123043 4695857
3773 4695857 6713982 8285137 9501506 9633094 7760272 4998949 3657881 4091859 4684319
3764 4684319 5014454 6427811 8956231 10324158 9084960 6548501 4546469 3377329
3756 3377329 2953615 3617025 4423638 3030153 -792359 -3687026 -3033158 -831572 -561481
3747 -561481 -1730645 -924066 2368628 4614910 3578647 1763534 2973707 7402089 11864484
3738 11864484 13822149 13570832 12819130 12368504 11448876 8850198 4512844 18312 -2638840
3729 -2638840 -2834086 -1757695 -1103381 -1455359 -1933894 -1302196 594240 2550757 3268618
3720 3268618 2671832 1612671 562540 -711525 -2287064 -3730450 -4637210 -4767643 -3803582
3711 -3803582 -2018790 -930026 -1661121 -2634859 -1025967 2869841 5144096 3545112 814340
3702 814340 515792 1676032 759489 -2328439 -3965768 -2387983 110453 1282232 1882741
3693 1882741 3039526 3575613 2158058 68491 -562781 -11210 -231286 -1712437 -3094388
3684 -3094388 -3367560 -2581513 -797186 1735469 3540893 3047024 974463 -185072 540553
3675 540553 1592820 1763408 2187028 4177493 6608721 7296986 6227218 5489485 6098021
3666 6098021 6629883 5551475 3590469 2863591 4222176 6245867 6806367 5307839 3342466
3657 3342466 3040981 4709342 6564701 7183530 7384578 8571784 9883671 8871265 5133276
3648 5133276 1307011 -310210 -362721 -648533 -1493391 -2292996 -2963598 -3086409 -1291491
3639 -1291491 2210987 4034208 1568419 -2421651 -2602048 1761813 5996742 6633851 5002753
3630 5002753 3302260 1254518 -1139973 -1263423 2422435 6944733 8445983 7265854
3622 7265854 6120520 5118474 2481873 -977791 -2308500 -1049328 497901 1692528
3614 1692528 4252444 7871644 9208355 6902459 4169291 4245598 6018782 6463470 5029210
3605 5029210 3080922 947796 -1665229 -3660448 -3783480 -3212247 -4349051 -7242982 -9390195
3596 -9390195 -9052852 -6881025 -4251671 -1830651 63200 1379936 2952941 5705716
3588 5705716 8922791 10705379 10437248 9314368 8051360 5824805 2446704 -22609
3580 -22609 574213 3572198 6231932 6959896 6386832 5548839 4666164 4049243 4639912 6579513
3570 6579513 8110469 7142696 3696382 -194202 -2969275 -4940321 -6930722 -8503552
3562 -8503552 -8369253 -6143297 -2907883 -148993 1225997 997811 -299796 -1242175 -452986
3553 -452986 1632121 2709429 1347091 -676261 -160490 3277127 6275164 5863039 3183098
3544 3183098 1591546 1988011 2245640 1236100 858129 2883745 5925350 7535328 7810023
3535 7810023 8405549 8900351 7200383 3613587 1330864 1763184 2263887 378451 -2015957
3526 -2015957 -1424061 1914534 4242202 3297468 590536 -1191929 -772784 1813696 5655735
3517 5655735 8728383 9065899 6943951 4616010 3516173 3118000 2808887 3159652 4699016
3508 4699016 6985618 9560001 12265561 13989473 12956941 9374923 6015892 4814691
3500 4814691 4591050 3728839 3210615 4613445 6588614 6397122 4317377 3272567 3890434
3491 3890434 3231222 -402343 -4277484 -4835008 -2426075 -199270 350637 357799 933486
3482 933486 1947114 3233566 4792654 5630852 4489503 2164909 1048681 1572468 1194327
3473 1194327 -1717593 -4907404 -5176406 -2949944 -1399004 -1628898 -1527380 250221 1774261
3464 1774261 661899 -2344745 -4231888 -3207890 -18079 3522659 5968838 6543023
3456 6543023 5259015 3004702 950300 -273207 -751025 -982796 -1526688 -2478410 -3238840
3447 -3238840 -3393617 -3699263 -5171025 -7213419 -8065981 -7343680 -6443625 -5930211 -4636151
3438 -4636151 -2497500 -1964867 -4516378 -7627029 -7838111 -5600727 -4283539 -5222662 -6751000
3429 -6751000 -7717557 -8750302 -9777341 -9380379 -7415134 -5609774 -4639034 -3093046 -344834
3420 -344834 2066862 3129829 3940081 5115517 5118385 3049329 780554 19118 -607447
3411 -607447 -2762131 -4539326 -2849953 1306056 3682018 2962407 2542320 5144671 8778513
3402 8778513 9907455 8319327 6437702 5115822 2750277 -1543951 -6076023 -8619923
3394 -8619923 -8935263 -8333340 -7608039 -6515297 -5037362 -4128070 -4883570 -7362021 -10300970
3385 -10300970 -11821490 -10858319 -8525270 -7496575 -8865426 -10113877 -8049095 -3642125
3377 -3642125 -1347036 -2779543 -4033411 -1374924 3062701 4444903 2159226 -305890
3369 -305890 -1349457 -2777036 -5320432 -7059524 -7432360 -8810341 -12133668 -14279061 -12141716
3360 -12141716 -6887831 -2010409 673310 1114661 -607892 -3656152 -5859060 -5974463
3352 -5974463 -5226505 -4985525 -4621959 -3337796 -2188075 -2291578 -2832833 -2872165 -3377774
3343 -3377774 -5411947 -8027075 -9836189 -10634370 -9656010 -5090186 1982504 6230182 4405112
3334 4405112 544180 601267 4013333 5444868 3346333 1271571 1194745 1169626 266989
3325 266989 587111 2854876 4494014 3935069 3074261 3635832 4446269 4081189 3178988
3316 3178988 2501509 1551978 560336 1015143 2941246 4527076 5426160 6985601 8119855
3307 8119855 5250701 -1532165 -6574299 -5998083 -3101896 -2819455 -4377931 -3967567 -1883577
3298 -1883577 -1711227 -3788973 -4658670 -2836856 -626206 236698 827414 2170593 3534817
3289 3534817 4571694 6192589 8203294 8750528 7467924 6807177 8574817 10973829 10924448
3280 10924448 8154614 5237750 4157942 4356735 4136437 2905846 1676171 1738055 3144364
3271 3144364 4603484 4915028 4280955 3912989 4572834 6000042 7701322 9571565 11211029
3262 11211029 11012024 7059129 -193406 -6714849 -8034764 -4142915 289706 1696361
3254 1696361 1930128 4745009 9404620 11036787 7231353 1005693 -3585469 -5777964
3246 -5777964 -6704618 -6553817 -5292481 -4206306 -4440785 -5277912 -5641024 -5988831 -6963879
3237 -6963879 -7478707 -6047740 -3005822 266000 3226250 5628816 6314020 4494686 1411189
3228 1411189 -992502 -2205514 -2555172 -1813469 -218089 477153 -788190 -2156371 -1126248
3219 -1126248 1825587 4227879 5350696 6305645 6956018 5679741 2479354 -216524 -598387
3210 -598387 472722 1056091 411810 -710217 -1099772 -376873 127356 -1505516 -4964480
3201 -4964480 -7305525 -6641797 -4634352 -3533949 -2644190 -313233 2333274 3007806 2333905
3192 2333905 2541938 2968416 1119134 -2024851 -2463728 360251 2297063 1335840 1157052
3183 1157052 5067691 10177549 11245569 7844374 4071361 2625310 2490352 1733701 -265812
3174 -265812 -3098224 -5544973 -5702873 -2839398 948327 2622414 1805349 1064683 2466870
3165 2466870 5120442 6559894 5647668 3387933 1119601 -1302707 -4787853 -8600861
3157 -8600861 -10020211 -7417781 -2723077 634241 1567088 1498256 1412195 970920 375060
3148 375060 678089 1813887 2347159 1615284 246830 -1608727 -4358321 -6992798 -7449057
3139 -7449057 -5466510 -2778316 -184529 2811077 5186976 4782611 2434427 1822367 3491290
3130 3491290 3178687 -1176299 -4783780 -2275025 4487050 9268502 9807302 8629899 7281740
3121 7281740 5009925 2747424 3281032 6622400 9319263 9394997 8375317 7404276 5081489
3112 5081489 907893 -2378978 -2263265 109388 2257876 4219058 7504579 11351245
3104 11351245 12662764 9683702 3927609 -1748553 -5588469 -7129394 -6364472 -3919855
3096 -3919855 -1586821 -1191132 -2312201 -2207268 779701 4448463 5080580 2248542 -826821
3087 -826821 -1885699 -2027347 -2601318 -2521384 -656237 1427259 1660123 718484 452985
3078 452985 473171 -920472 -3441399 -5206839 -5590795 -5129018 -3663739 -1441062 -846442
3069 -846442 -3574802 -6947592 -6879506 -3925309 -2113988 -2004326 119559 5347222 9626031
3060 9626031 10155019 9596144 11072470 13047158 12635642 10703994 9883927 10004641 9256237
3051 9256237 7984558 7642537 7372547 5175868 1586754 -902670 -1247020 33767 2863624
3042 2863624 6604939 8264392 5451266 694489 -810000 2205903 6041397 7602632
3034 7602632 7519014 7302184 7048680 7050766 8341152 10098417 9461061 5723425 2148768
3025 2148768 1680838 3152792 3815778 3480858 3711914 4605942 5063971 5227130 6081398
3016 6081398 7165824 6938636 5204768 3284465 1964427 1006595 472155 769901 1399696
3007 1399696 1232927 83226 -1389918 -3150817 -5510600 -7415492 -6830392 -3243909 1608533
2998 1608533 5673250 7738597 6839490 2857536 -1658207 -2748720 365249 3847091
2990 3847091 4052116 2005417 1093547 2000545 2723863 2667636 3502454 5790159 7619604
2981 7619604 7443545 5985692 4367109 2483616 483311 -239136 649984 783642 -1947732
2972 -1947732 -5771217 -6852979 -4552879 -2468357 -3674088 -6933430 -8800618 -8024481
2964 -8024481 -6253147 -5064254 -4112916 -2544713 -847573 -254145 -866291 -1468576 -1186869
2955 -1186869 -375045 366280 1060938 1720776 1835835 1380275 1395820 2320866 2545281 341702
2945 341702 -3185335 -5047012 -4250833 -2643385 -1565482 -29097 2751129 5203363 5420002
2936 5420002 3772613 1918251 555919 -261751 34750 1557624 2938771 3047324 2624364
2927 2624364 2458976 1379013 -1575353 -4235237 -3541301 -142476 2248303 1991063 1043502
2918 1043502 1142853 1559028 1497182 1898546 3458496 5027474 5318417 4445534 2826802
2909 2826802 562730 -1046339 416839 5317645 10692210 13706932 14732034 15407802
2901 15407802 15455464 13508037 9811082 5895081 2349716 -1091941 -3834119 -4712785 -3834259
2892 -3834259 -2617123 -2105515 -2341755 -3068516 -3969076 -4522864 -4458695 -3858070 -2239456
2883 -2239456 1325605 6180013 9518763 9459675 7599391 6660191 6511445 4800504 1118264
2874 1118264 -1984954 -2566321 -1764328 -1777935 -2870947 -3538053 -2868809 -1692614 -1383051
2865 -1383051 -1931080 -1554702 1249436 5241025 7079906 5120726 1516103 -575348 -885333
2856 -885333 -1534405 -3264810 -4184464 -2538881 778599 3112317 2698545 229970 -1687691
2847 -1687691 -824841 2311754 4811468 4718344 3333185 3209121 4785847 6472065 7256272
2838 7256272 7340526 6609170 4540372 1688329 -577308 -1888566 -2669042 -2217041 719299
2829 719299 5054705 7453459 6355834 3947358 2921240 3091864 2663738 1265294 -35900
2820 -35900 -646455 -666518 56684 1510841 2654551 2436321 1443150 1347298 2877738 5259160
2810 5259160 7322367 8212676 7388353 5054014 2467727 833016 -12017 -892272 -1512339
2801 -1512339 -639374 1668379 3161284 1498134 -3219578 -8520557 -11819610 -12195301 -10350560
2792 -10350560 -7571645 -4835528 -2416593 -68520 2146346 3116043 1449190 -2368169
2784 -2368169 -5250872 -4343726 -598887 2021492 1462776 29353 755948 3007669 3761604
2775 3761604 2211836 565435 578024 1909650 4114831 7479322 10925116 11719986 9009711
2766 9009711 5647732 4553119 4859371 3886338 1681384 969056 2984705 5811333 7108225
2757 7108225 6539139 5059498 3461829 2232077 1510109 609323 -1242565 -3142121 -2737705
2748 -2737705 946234 5905588 9294335 10326575 10023901 8907198 6591145 3667993
2740 3667993 2288651 3755614 6223660 6046263 1655622 -4548578 -8543751 -8543526 -6133352
2731 -6133352 -3876295 -2534145 -989315 1544252 4016722 4578318 2711777 -336948
2723 -336948 -3291419 -6171954 -9295020 -11727446 -12038843 -10411650 -8495921 -6909084 -4606516
2714 -4606516 -1528833 100867 -1099857 -2814580 -1786729 1414183 3209986 2377294
2706 2377294 1468765 2276463 3091583 2107958 755309 1229397 2819647 3578483 4204750
2697 4204750 6932926 10980123 12436560 9367064 4369548 971810 -316618 -973636
2689 -973636 -1427411 -1084368 -341513 -410286 -1254885 -1450999 -409595 706774 931653 1079684
2679 1079684 2154854 2919428 815823 -4315804 -8904994 -9211993 -5539017 -1612814 -40141
2670 -40141 144452 1065394 2622323 2755353 522663 -2381272 -3466305 -2138059 -95824
2661 -95824 774182 465551 555885 2080985 4315199 5815373 5935623 4828000 2799802
2652 2799802 611207 -362972 340818 1058365 -53283 -2036785 -1981458 933250 4203414
2643 4203414 5439006 5114605 4881704 4969251 4758971 4570873 5220990 6642003 8277220
2634 8277220 10054756 11782652 12423028 11173051 8519555 5258798 1527211 -2123936
2626 -2123936 -4046958 -3455797 -1987802 -1704664 -2477927 -2826980 -2156468 -513242 2415360
2617 2415360 5911638 7291466 5081990 2054826 2082098 4767007 6522669 6473755 7418358
2608 7418358 10632694 13659864 14338815 13390553 11542997 7737099 2401267 -749374 934403
2599 934403 5244973 8378285 9773020 10798393 10802001 8248120 4662061 3550907 5462188
2590 5462188 7429290 7585553 7181251 7324991 6819276 4800850 3107766 3833289 5835432
2581 5835432 5813889 2519500 -1690547 -3583776 -2216344 921786 4001459 6269314 7644375
2572 7644375 8028468 7754855 8015155 9490238 10673034 9244609 5668555 3569335 5136227
2563 5136227 7693873 6925868 2603303 -1269738 -1712407 337159 2644912 4543097 5948310
2554 5948310 5744675 3218851 -9907 -1518595 -1217478 -1368923 -3475889 -6409039 -7802220
2545 -7802220 -6370289 -2717740 1273076 3643432 3750888 2845905 2767066 3869570 4751612
2536 4751612 4098692 2059469 -428986 -2759656 -4478790 -4806516 -3362116 -1063803 570693
2527 570693 856070 -10665 -1856542 -4351169 -6201130 -6047342 -4429711 -3420395 -3795912
2518 -3795912 -4035884 -2884739 -1312789 -690310 -543143 61126 76192 -2266892 -6248411
2509 -6248411 -8994088 -9037580 -7504035 -5659607 -3510995 -1312381 -182125 -187706 265711
2500 265711 1923647 3221058 2602501 749627 -858434 -1991449 -2578540 -1183374 2963436
2491 2963436 7211814 7486584 3332978 -1109164 -1910639 324697 1839245 519901 -1721815
2482 -1721815 -1373904 2392650 6513690 7603019 6118232 5445697 6804595 7335179 4570581
2473 4570581 678074 -238960 2149517 4298618 4073472 3147748 3542645 4489289 4180865
2464 4180865 2735250 1664580 1445195 1146006 1136 -1696770 -2957194 -2744078 -782542
2455 -782542 1806661 3385778 3829788 4749405 6838739 7950924 5328483 -386568 -4804896
2446 -4804896 -4127945 775599 5291443 5925082 3666180 2180751 3076568 3968018 1737672
2437 1737672 -3159139 -6918271 -6793286 -3952100 -1461570 -554054 89595 1900684 4470851
2428 4470851 6254845 6459053 5618040 4442130 2751300 44462 -3196921 -5676990 -6948815
2419 -6948815 -7873089 -8722214 -7940141 -4295434 290380 2044029 -130113 -3045465 -2979812
2410 -2979812 212829 3664147 5024532 4139238 1954918 -642069 -2848853 -4000762
2402 -4000762 -4008540 -3184300 -1592299 770822 3135268 4206981 3725812 3103161 3798616
2393 3798616 5429438 6299536 5666710 4487287 3660208 2697139 1068697 -103702 643112
2384 643112 2431017 2682241 896087 -330802 642525 1362384 -1556273 -7262004 -11355367
2375 -11355367 -11547003 -10010224 -9637407 -10486459 -11154225 -11531234 -12256770 -12635308 -11073932
2366 -11073932 -7298445 -2821630 576335 1890299 896588 -1634289 -3775515 -3583051
2358 -3583051 -827086 2732078 4858251 4576576 2821361 1652052 2438337 4597258 6548823
2349 6548823 7784919 8882444 9358988 7400647 2994694 -300341 1038669 5724498
2341 5724498 8759392 7358709 3653555 1055602 181393 -338660 -880096 -749224 -233689
2332 -233689 -561013 -1764004 -2387019 -1838446 -1513181 -2600013 -3935180 -3478462 -1422890
2323 -1422890 -255034 -1500472 -3721705 -4399490 -2838220 -394650 1360388 1621514 119954
2314 119954 -2529896 -4175469 -2408915 2500114 6742779 6209705 667745 -5838206 -8830401
2305 -8830401 -7340058 -4051599 -2042249 -1938791 -2351007 -2318276 -2241091 -2387133 -1858111
2296 -1858111 -33942 1791659 1538633 -1130989 -4485273 -6737812 -7357151 -6617584 -5136508
2287 -5136508 -3919674 -3709765 -4177121 -4698579 -5569541 -6935831 -6886833 -2970850 3773696
2278 3773696 8542108 7874962 3513934 -49752 -393225 1728236 4472162 6300674 6329256
2269 6329256 5052168 4139180 4287912 4173561 2711761 1048592 620853 471362 -1415953
2260 -1415953 -4941896 -8079041 -9426585 -8522586 -4701163 1546545 6715279 7173847 4268011
2251 4268011 3413087 7190345 12147447 13642446 11170501 7281451 3758940 1159833
2243 1159833 297449 1557790 3542274 4467154 4455429 4890345 6119162 7354781 8289691
2234 8289691 9166006 9519750 8397320 5902870 3456576 2448433 3196964 4724421 4852251
2225 4852251 1472634 -4874391 -10259485 -10768958 -6526187 -1057292 2992670 5849488
2217 5849488 8376645 9899896 9273661 6937884 4813712 4566633 6429977 9146502 10651031
2208 10651031 9512554 6359082 3480767 2504365 2781047 2495195 963901 -808827 -1736881
2199 -1736881 -2092952 -2941421 -4402650 -5108621 -3751763 -784122 2188608 4640247 7625806
2190 7625806 11499787 14299294 13723373 10156052 6285067 3988486 3154257 3426759 4954867
2181 4954867 6647879 5848647 1608226 -2921250 -3462253 343946 4550544 5389734 2522997
2172 2522997 -2075106 -6436071 -9078941 -8919991 -6168378 -2663949 -342085 279906 -251659
2163 -251659 -1195514 -1428296 432287 4390251 8275120 10001342 10178289 11001861 12829653
2154 12829653 13560309 11636575 8097499 5057152 3386825 2592639 1975387 1158919 166321
2145 166321 -503270 -486427 -410198 -1173228 -2224372 -1934702 -143742 1279471 1311087 1514598
2135 1514598 3458551 5866357 6265506 4489798 2498737 1385038 741719 685349 2187904
2126 2187904 5098218 7761147 9050820 9196056 8406355 6546326 4556674 4126667 5074019
2117 5074019 4922200 2265628 -1023988 -2234292 -1090477 706410 1920203 2289791 1747345
2108 1747345 779490 707405 1957392 2788426 1486413 -780864 -1259430 517187 2191761
2099 2191761 1997844 638804 -683310 -1933271 -2805182 -1558754 2754169 7880850 10232155
2090 10232155 9025601 6919780 6349777 6756361 6023982 3338270 -379945 -3935125 -6494524
2081 -6494524 -7283280 -6037233 -3801581 -2179242 -1659471 -1665620 -2174143 -3789140 -5845590
2072 -5845590 -6189307 -3950459 -1128869 -27472 -306081 -206078 405699 275496 -677617
2063 -677617 -1311752 -1464897 -1920501 -2267131 -1230413 675610 1448340 1103016 2083203
2054 2083203 5044958 7029229 5689731 3000105 2521105 4802437 7761674 9983177
2046 9983177 11118990 10362638 7401356 4277884 3692995 5659764 7947339 9362481 10307467
2037 10307467 10551156 9124652 6537136 4612184 3780137 2833499 1697112 1880689 3372052
2028 3372052 3624652 1125004 -1983296 -2514155 -61130 3374120 6331431 8595995 9618367
2019 9618367 8279858 4697375 1050203 -308552 635791 1670631 1393403 1442957 4282337
2010 4282337 8770913 10197409 6129873 177359 -2503476 -1845687 -1752954 -3343763 -3543542
2001 -3543542 -868412 1682461 1370146 -185161 -190920 780087 252022 -2236916 -5446341
1992 -5446341 -8842569 -11779858 -11900945 -7778148 -2314143 -126108 -1729364 -3354378
1984 -3354378 -2508577 -585615 507290 1197119 2490469 3841364 4296330 4005485 3234414
1975 3234414 1352294 -1821681 -4769985 -5658230 -4308057 -1978248 132895 1545596
1967 1545596 2344712 2829120 2780474 1267368 -1670082 -3500562 -1474176 3192826 5764945
1958 5764945 3757952 40744 -1440267 -769696 -421259 -384877 1540682 5097405 6850442
1949 6850442 5025118 2236428 1843731 3596025 4734070 4145374 3448128 4308732 6282089
1940 6282089 7615192 7330573 6078422 5130672 4783740 4075250 2318368 435445 22119
1931 22119 1376837 3365941 4935666 5577795 4704832 2428773 949864 2692347 6212719
1922 6212719 6649107 2129784 -2662104 -2135762 2676217 5614810 3575347 -517866 -2986529
1913 -2986529 -3788546 -4343964 -4280134 -2603438 -68344 1741375 2428654 2409763 1878847
1904 1878847 1416170 2052619 3324470 2925210 -114663 -3576937 -5082964 -5093577 -4838746
1895 -4838746 -3411934 73015 3124317 2393173 -1193894 -3568824 -3647633 -4521473 -7976982
1886 -7976982 -11525688 -12264591 -10615336 -8531875 -6522606 -4260071 -2147250 -633202
1878 -633202 394238 390076 -1708811 -4954721 -6275301 -4463559 -2062150 -1467134 -1490445
1869 -1490445 -152779 1298066 258266 -2731068 -4589977 -4201760 -3368859 -3453407 -3703255
1860 -3703255 -3027312 -1173156 1936527 5881517 8704232 8474561 6263370 5440566 7485605
1851 7485605 10457684 12163165 12698920 12854291 12017175 9331169 5716958 3110233 2254015
1842 2254015 2444128 2995738 3823056 4736111 5117753 4471817 2881516 966811 -332660
1833 -332660 -199986 1276725 2753800 2640211 848565 -825830 -800300 -149737 -1848636
1824 -1848636 -6847965 -11938134 -12960407 -9607260 -5330452 -2768413 -1401934 32971
1816 32971 1270237 1709863 1795146 1858557 1359982 464745 387325 836333 -541268 -4400538
1806 -4400538 -7938537 -9172886 -10173905 -12912784 -14778789 -12629313 -9060548 -9155309 -12028927
1797 -12028927 -11692355 -6700459 -2754224 -3854853 -6640854 -6698946 -5561216 -7083275 -10380141
1788 -10380141 -11226562 -8678154 -5902443 -5058005 -4913177 -3599597 -1156161 899283 988201
1779 988201 -1280313 -4222287 -5296771 -4199159 -3420608 -4644146 -6361414 -6537674 -5609564
1770 -5609564 -4785564 -3298353 54818 4058240 6445378 7101570 7395868 7275309 5615131
1761 5615131 2763202 272807 -1307839 -2153039 -1597806 546280 1945603 -7322 -4194897
1752 -4194897 -6801679 -6169756 -3952079 -1669166 862604 3434495 4705932 4239002 2927876
1743 2927876 1032850 -1849061 -4669307 -5441039 -4204782 -2729618 -944820 3028647
1735 3028647 8374746 10682767 7564084 2387173 147111 1773508 4675910 6862720
1727 6862720 7971718 7659482 5613029 2675999 176606 -1410883 -2008835 -1179484 811997
1718 811997 2173234 1296865 -1330074 -3879032 -4925834 -3745592 -409969 3238991 4308490
1709 4308490 2104844 -612645 -1005867 654073 2507173 3807337 4051101 1459574 -4608926
1700 -4608926 -10879794 -12995122 -10734934 -7607421 -5619613 -3523666 -332691 2644532
1692 2644532 4158482 4732103 4933744 4267464 2977649 2779011 4262406 5316545 3764546
1683 3764546 312235 -2538971 -3374540 -2317128 262489 3836267 7100558 8671235
1675 8671235 8200474 6080642 2752820 -807550 -2862447 -2563340 -1334164 -1275278 -2488162
1666 -2488162 -3213327 -2301417 -126694 2793688 6312643 9252573 9154833 4869709 -1180927
1657 -1180927 -4610533 -3102996 1692818 6197339 8198181 8079040 7517363 7622348 8291665
1648 8291665 8825473 8655617 7422623 4836728 1121923 -2309501 -3367503 -1287938 1988003
1639 1988003 3322055 1649190 -899147 -1645052 -467650 617980 471989 63824 600058
1630 600058 1833668 2957052 4051232 5497170 6586040 6028005 3780247 1298596 -231864
1621 -231864 -1076775 -1993072 -2698978 -1920870 985352 4675721 6439427 4699063 976738
1612 976738 -1310485 -443078 1871894 2966289 2548551 2324724 2780997 2168718 -730579
1603 -730579 -4214369 -5220715 -2805565 880076 3012530 2816182 1682356 988329 343387
1594 343387 -1604759 -4753022 -6769839 -5470446 -1624421 1493460 1422279 -1272520 -4113555
1585 -4113555 -5251017 -4654152 -3484302 -2776291 -2465714 -1498978 914087 4252485 7232255
1576 7232255 9132257 9971018 9733824 8503337 7297907 7427808 8552807 8627101 6642552
1567 6642552 4447210 4638017 7075629 8642480 6573928 1380238 -3690786 -5788241
1559 -5788241 -4997497 -3839445 -4269963 -5563186 -5637143 -3921660 -1751749 -158898 1092684
1550 1092684 2007037 1817074 881333 1204648 3420967 4883607 3058418 -206169 -506099
1541 -506099 3215475 7252551 8104856 6422464 4935033 4545771 4135129 2927705 1350009
1532 1350009 150640 -83939 911629 2301733 2107201 -782421 -4785430 -6962550 -6192504
1523 -6192504 -4143470 -3075996 -3507860 -4204542 -3801859 -2147554 -375222 224742 -415914
1514 -415914 -1015420 -438374 920728 1613826 759658 -1224908 -3232490 -4232033 -3597388
1505 -3597388 -1380079 1532050 3888231 4909858 4649401 3736126 2936068 2658225 2656532
1496 2656532 2584781 2988537 4906203 7883283 9438437 7914465 5246822 4974587 7388515
1487 7388515 8753498 6342296 2398799 1236443 3413487 5062269 3070359 -1116182
1479 -1116182 -3783064 -3589815 -2381690 -1854690 -1123274 1619856 5922062 8916342 8662904
1470 8662904 6689997 6243322 8318767 10557033 10279866 7493588 4176956 1570913 -547848
1461 -547848 -2283914 -2783355 -1412945 1089033 3200783 4015190 3851088 3778997 4496358
1452 4496358 5247976 4131613 315694 -4190007 -6199075 -5107136 -3756544 -4856331
1444 -4856331 -7677419 -9327229 -8330209 -5603740 -2587339 -50951 1431937 1492650 790283
1435 790283 528294 688686 -168619 -2833301 -6101233 -8031291 -7783417 -5839579 -3286662
1426 -3286662 -1324339 -551329 -185071 1127521 3231579 4289660 3356519 1872242 1561035
1417 1561035 2096071 2272297 2372926 3481453 5112085 5615610 4819849 4314099 4899521
1408 4899521 5498473 4968150 3459745 1601829 -207874 -1339814 -1198745 -271899 484890
1399 484890 1337608 3060353 4591837 3912000 1672618 951483 2267548 2155669 -1243541
1390 -1243541 -4507264 -3937367 -1294565 -477217 -782317 1497511 5885645 7644638 5144391
1381 5144391 1993073 615054 -1075482 -4336743 -5917226 -3305990 246149 233607 -2351945
1372 -2351945 -3249583 -1999755 -2094574 -4862987 -7636362 -8148865 -7025164 -5426119 -3506210
1363 -3506210 -1869571 -1634815 -2274393 -1923654 -418648 496887 424090 906336 2092999
1354 2092999 1968733 199070 -415439 1704210 3955162 3504411 1871654 2531708 5500907
1345 5500907 7539599 7093862 6047285 6439666 7818702 8372343 7114154 4570423 2344688
1336 2344688 1977083 3368426 4697977 4653590 3857912 3145572 1920776 -73397 -998547
1327 -998547 415015 1708574 -307410 -3833044 -3432989 2080031 7140329 6777596 2919527
1318 2919527 473052 104609 -1109930 -3586192 -4331902 -2083983 716387 2067359 3083112
1309 3083112 4855692 5572740 3267771 -485894 -2428972 -2177109 -2172871 -3339740 -3499245
1300 -3499245 -755167 3744226 7540951 9717311 10740243 10802642 9875581 8550482 7254966
1291 7254966 5220904 1897114 -962517 -554099 3334330 7590402 9267957 8434847 6988119
1282 6988119 6173246 6225581 7023021 7721443 6831692 4179353 1971301 2324383 4399291
1273 4399291 5734986 5867251 6423403 7655544 7409151 4516456 1106076 -129485 407581
1264 407581 196283 -1465954 -2475606 -945193 2459747 5843843 8527001 11103457 13605144
1255 13605144 14822182 13764617 11078415 8383828 6490739 4979411 3566571 3032569
1247 3032569 4218785 6616793 8718002 9643106 9823251 10108308 10739336 11261211 11102261
1238 11102261 10273590 9668744 10234632 11376125 10770099 6737572 604912 -4271655 -5847936
1229 -5847936 -4929677 -3480386 -2479138 -1656191 -347894 1786443 4174557 5268895 3927477
1220 3927477 1089452 -829763 -520420 1107787 2598862 3622237 4508195 5229653 5607683
1211 5607683 5772608 5859274 5961137 6646089 8389265 10111051 9780032 7299512 5232432
1202 5232432 5399932 6255046 5341759 3092188 2027441 2977409 4455760 5475833 6475258
1193 6475258 7148701 5874568 2439268 -560976 -572312 1802483 3976757 4902360 5878834
1184 5878834 7965126 9969029 9735302 6985310 4078171 3510748 4946307 5568677 3688948
1175 3688948 1062105 737948 3327353 6625275 8440046 8230396 6099936 2151110 -2437140
1166 -2437140 -5333964 -5354798 -3932080 -3143948 -2953277 -1607861 1578947 5047750 6662638
1157 6662638 5723087 3174542 503978 -1256783 -1818947 -1342221 -1797 2035089 4216081
1148 4216081 5527472 5145241 3137917 393933 -2035827 -3377880 -3126891 -1110333 2025793
1139 2025793 4534926 4559322 2111288 -287753 -6841 2535404 4227131 3151541 770123
1130 770123 -619674 -1067088 -1925853 -2812043 -2018134 307543 1851815 1439124 459321
1121 459321 212889 -118714 -1634168 -3578312 -4550963 -4521202 -4084249 -2839471 -256813
1112 -256813 2629862 4273554 5036659 6770492 9881908 12437072 12723890 11492257 10816448
1103 10816448 11394146 11890950 10932228 8974086 7536899 6821327 5279319 2244760 -225237
1094 -225237 217569 2647214 3937785 3233939 2674706 3167607 2573761 -301770 -2914134
1085 -2914134 -2753937 -1463347 -1990701 -3582201 -3398165 -1837656 -1923681 -3708976 -3831162
1076 -3831162 -1362545 275868 -1092583 -2827373 -1891295 527890 1829777 2740344 5662193
1067 5662193 9925359 12295961 11588207 9641831 7911962 5969985 3675639 2287247
1059 2287247 2581333 3615636 4086206 3656762 2535984 941327 -597084 -1331256 -949709
1050 -949709 484617 2905758 5606346 6870959 5841656 4427549 5445209 8709757
1042 8709757 10909263 9927356 7496262 6677559 8277328 10824360 12685771 12858616 10789061
1033 10789061 7052171 3746690 2808296 3993564 5434925 5920871 5682272 5199900 4439496
1024 4439496 3484492 2933503 3078513 3209408 2405484 945121 312820 1389173 2955525
1015 2955525 2811535 604153 -1343326 -752404 1822229 4011978 4763669 4854153 4640936
1006 4640936 3440725 1562675 766317 1584611 2177305 1482272 1720122 5401791 10902052
997 10902052 13690030 11826022 7879635 5131132 4060265 3265872 1900685 81085
989 81085 -1712983 -2548323 -1453939 1043305 2753367 2239774 595200 -266057 -354929
980 -354929 -1317859 -3677689 -5674326 -5191458 -2098507 1773532 4766410 7152715 10417979
971 10417979 14614456 17079664 14957733 9095396 4115491 3789503 7119035 9788481
963 9788481 8789328 4719517 195402 -2706136 -3474923 -2759487 -1485808 -225146 651824
954 651824 475851 -1269466 -3788526 -5284560 -5079033 -4458934 -4545146 -4385176 -2540604
945 -2540604 244214 1749733 1433637 1150389 2526052 5072041 7229642 7983758 7091955
936 7091955 5063266 3530580 4470276 8175320 12643611 15478114 15736696 13676792 9819093
927 9819093 5069998 954817 -1311748 -1839047 -1661582 -1547668 -1481179 -1019047 91491
918 91491 1510919 2581264 3128853 3470731 3255001 1378602 -1793300 -3309982 -819546
909 -819546 3771920 6331845 5953321 5409364 5910571 5046704 1400108 -2389565 -3740210
900 -3740210 -4254555 -6430717 -8702183 -7729712 -4060640 -1247987 -135070 1523956 3744669
891 3744669 3290833 -719207 -4195451 -3234323 976378 4459125 5277694 4139234 2365708
882 2365708 1357550 2302815 4425949 5050880 3168143 1255808 1636359 2824393 1927838
873 1927838 -793182 -2587781 -2569076 -2528499 -3608963 -4768473 -4808653 -3807505 -2211170
864 -2211170 -331075 967875 801342 -163811 -247691 772858 1224848 2830 -1889087
855 -1889087 -2765706 -2114191 -613744 767094 1522411 2311037 4629457 8533118 11138048
846 11138048 9349597 4140066 -57559 -763984 -79837 -922513 -2822995 -3179918 -1120744
837 -1120744 1846288 4104418 5072065 4676224 3307075 1999980 1387754 800364 -518651
828 -518651 -1862609 -1975340 -975372 20760 747535 1730766 2699692 2811365 2515190 3445615
818 3445615 6014741 8607538 9733533 9638747 9187744 8506977 7545285 6740205 6167168
809 6167168 5091860 3303144 1764133 908335 -336960 -2297154 -2750810 212504 4338347
800 4338347 5193197 2177959 -493579 160376 1922611 1514390 2280 842097 4144531
791 4144531 6717595 7430747 8577649 11103765 12230271 9796508 5956780 3914953 3240974
782 3240974 1499284 -1029556 -1704121 40329 1987215 2934565 3989116 5445550 5420056
773 5420056 2864492 -592831 -3254951 -5469263 -7493192 -7627698 -4863910 -1626072 -1137692
764 -1137692 -3068207 -4432149 -4158265 -3998088 -4969258 -5636289 -4635202 -2766458 -1541260
755 -1541260 -1090761 -431826 1146662 3471505 5396632 5213396 2296801 -1518558 -3437092
746 -3437092 -2709557 -914771 561984 1489200 1234875 -1213411 -4762414 -6212989 -4383039
737 -4383039 -2167160 -2488591 -4037601 -3545814 -890473 1075475 1104625 737279 747136 -386137
727 -386137 -3285438 -5579815 -4860122 -2066371 -28174 373788 794793 2625089 5142194
718 5142194 6485667 5484979 2517505 -723560 -2399233 -2122009 -1368069 -1871033 -3807155
709 -3807155 -5984460 -7392664 -7807206 -7126650 -5168053 -2466984 -550993 -714019 -2572107
700 -2572107 -4251449 -4220400 -2828075 -1769136 -1976200 -2474357 -1755120 108469 1591342
691 1591342 1920134 2048876 2976223 4117290 4219423 3117730 1492367 -512164 -3017105
682 -3017105 -5001469 -4840872 -2706804 -982617 -1385576 -2774053 -2978904 -2006519 -1936310
673 -1936310 -3920544 -6867548 -9347580 -11218021 -12453103 -11727058 -7930720 -2757111 76377
664 76377 -1127739 -3915913 -4425195 -1466320 2944526 6260192 7300249 6030411 3278615
655 3278615 1017977 1287115 3778101 5482237 3829776 -394360 -4118096 -5274617 -4054945
646 -4054945 -1696265 447625 1022255 -316100 -1753401 -839218 2243214 4454031 3830718
637 3830718 2147592 2253959 4010044 4884024 4059085 3647717 5361214 7911374 8865913
628 8865913 7794697 6177660 4922409 3508982 1538206 -207530 -753363 -203074 596425
619 596425 1350341 2725765 5284780 8092987 8772861 5684612 380546 -2968354 -1675481
610 -1675481 2289112 4510294 3411619 1667827 1933608 3255164 3320067 2596052 3612679
601 3612679 6622154 8733798 7927821 5631130 4274949 4283916 4878907 6060371 7803086
592 7803086 8474374 6345859 2317296 -842338 -1944395 -2346232 -3363432 -4414396 -4225928
583 -4225928 -2542769 -63745 2326214 3859706 4321931 4430655 4908298 5182759 4197234
574 4197234 2541604 2235944 3963993 6026435 6696384 6183153 5503308 4903915 4417935
565 4417935 4526259 4989990 4336211 1976806 -290834 -469353 963472 2222302 3054317
556 3054317 4462880 6404189 7984468 9468887 11691346 13600586 12976148 9969653 7407172
547 7407172 6764930 6299174 4417133 2497481 2390580 3003088 1878189 -828809 -2450427
538 -2450427 -1598625 329607 1565812 1959876 2076704 1944994 1534171 1339112 1644330
529 1644330 1993520 2108506 2606551 3945165 5159845 4672300 2344388 -44233 -582593
520 -582593 972791 3330982 5111809 5831133 5807971 5622382 5673103 5923871 6003586 5731447
510 5731447 5444080 5498316 5629154 5395989 5225192 6118657 7959234 9038181 8085742 6087469
500 6087469 5057748 5502174 6320597 6947821 8084357 10038905 11711797 11870511 10458126
491 10458126 8086498 5257737 2788314 1894192 2637652 2939702 555498 -3932545 -7141709
482 -7141709 -6261976 -1881302 2776988 5061620 5039714 4503825 4207445 2821424 -834743
473 -834743 -5228403 -7192430 -5686102 -3041767 -1859572 -2054707 -2034111 -1514730 -1536776
464 -1536776 -2379195 -3226978 -3749825 -4397467 -4954758 -4268327 -1968673 532219 1344479
455 1344479 -98911 -2643800 -4222447 -3247523 -180052 2325641 1976389 -296274 -1181873
446 -1181873 1024966 4515458 6461128 6060142 4380844 2590480 1536242 1908641 3254688
437 3254688 3583592 1642849 -825037 -860660 1775132 4287932 4720162 4123618 4014356
428 4014356 3678772 1794073 -645518 -1385458 -463128 -262067 -1570820 -1841632 1294679
419 1294679 6371542 9701581 9789448 8336658 7207937 6292713 4754697 2883394 1835281
410 1835281 2255808 3644267 4518291 3157344 -754759 -4879725 -5820070 -2768882 1315006
401 1315006 2973359 1844188 126347 -612026 -788524 -1502757 -3259954 -5907666 -8735897
392 -8735897 -10598654 -10784142 -9743264 -8305283 -6508221 -4064487 -1564026 -42933 450794
383 450794 658581 596717 -428000 -2192538 -3286321 -2774349 -967873 1636113 4738259
374 4738259 7139811 6938896 3928336 603397 -482654 411660 1113230 566959 -349542
365 -349542 -653219 -517914 -550356 -766242 -658144 143625 1433150 2466291 2560313 1816257
355 1816257 921790 43212 -1527600 -4139382 -6679094 -7402094 -5740668 -2853204 -536753
346 -536753 122098 -604532 -1312001 -628137 1332871 2811301 2067646 -864830 -4189623
337 -4189623 -5797619 -4698873 -1701332 1001624 1609181 600375 249570 1744434 3548426
328 3548426 3451800 1533524 -142042 -447296 -376203 -1021431 -1634588 -679635 1662838 3130862
318 3130862 1907379 -1059225 -3042779 -2803159 -1840650 -1834904 -2029458 -713783 1382896
309 1382896 1462173 -1259397 -4109837 -4683870 -3992887 -4307537 -5608599 -6299848 -6163233
300 -6163233 -6119458 -5745405 -3676189 -450965 1534001 1389617 873689 1428374 2063302
291 2063302 1307586 -309686 -1076684 -401243 874711 1811917 2113874 2027827 2188625 3125266
281 3125266 4443358 4950152 3932985 1881462 -136913 -1188909 -662798 1209787 2879364
272 2879364 2703305 1063301 223476 1657872 4541736 7233402 8956754 9402284 8048059
263 8048059 4977439 1465977 -1208538 -2801415 -3272576 -2026689 936089 3976353 5153675
254 5153675 4204987 2431500 1241764 1458594 3122855 5055180 5527331 4393077 3625591
245 3625591 4661895 6321552 6766216 6407927 7001329 8614028 9583469 9123904 7901873
236 7901873 6146139 3360745 191187 -1529671 -1290717 -703699 -1033286 -1542559 -1194041
227 -1194041 -464933 -273255 -280500 431134 1754336 2777311 3083455 2914727 2526397 2172077
217 2172077 2216619 2476322 1944727 -2400 -2557467 -4474283 -5731744 -7234852 -8982696
208 -8982696 -9545979 -7727374 -4200505 -1095741 -91752 -1084792 -2646790 -3518055 -3375028
199 -3375028 -2311413 -404197 1688973 2548006 1567555 236178 338232 1030867 -370035
190 -370035 -4177422 -6932085 -5557311 -1358524 1845453 2413823 1670394 778146 -663814
181 -663814 -2700740 -3981156 -3632851 -2658919 -2385689 -2616806 -2405285 -1808484 -1694008 -2273776
171 -2273776 -2935188 -3348556 -3800394 -4448883 -5068232 -5619752 -6322997 -6934488 -6657244 -5220985
161 -5220985 -3552304 -2785666 -2880424 -2852484 -2268913 -1738606 -1686996 -1418887 -81157 1886545
151 1886545 3128672 3105677 2586094 2264357 1760081 462233 -1296173 -2524636 -2655244
142 -2655244 -1884277 -854254 -390437 -937617 -1669668 -890296 1731254 3967274 3403840
133 3403840 684905 -1169460 -721943 369432 363292 114103 1355266 3625389 4753702
124 4753702 3857536 2120332 776750 54965 288527 2292806 5825526 8977081 10074373
115 10074373 9321244 7820172 6064638 4435747 4019740 5233287 6263818 4833703 1499989
106 1499989 -709287 -340924 719039 422339 -352839 496500 2832947 4566056 4801912
97 4801912 4614103 4710390 4402445 3492120 3388100 5189684 7806227 9174647 8634760 7063527
87 7063527 5282822 3519549 2154778 1829716 2653296 4061062 5557591 6959996 7863014
78 7863014 7619883 6218436 4693732 4196305 4760197 5286022 4778051 3441160 2410051
69 2410051 2438586 3176738 3935756 4676253 5539072 5720387 4035704 946922 -1140156 -465005
59 -465005 1966477 3757904 3967927 3518415 3261471 2943952 2079957 793688 -336513
$$ [...]
##END NTUPLES=NMR SPECTRUM
##END=
