##TITLE=31Pdec_DE-154_N2
 CCl4,64 sc
 10.6.2026
##JCAMPDX= 6.0         $$ Bruker NMR JCAMP-DX V2.0
##DATA TYPE= NMR SPECTRUM
##DATA CLASS= NTUPLES
##ORIGIN= UXNMR, Bruker Analytische Messtechnik GmbH
##OWNER= root
$$ XWIN-NMR		Version 3.5
$$ Wed Jun 10 14:20:32 2026 Russian Standard Time (UT+4h)  she@DPX200
##.OBSERVE FREQUENCY= 81.013821
##.OBSERVE NUCLEUS= ^31P
##.ACQUISITION MODE= SIMULTANEOUS
##.ACQUISITION SCHEME= undefined
##.AVERAGES= 64
##.DIGITISER RES= 17
##SPECTROMETER/DATA SYSTEM= spect
##.PULSE SEQUENCE= zgpg30
##.SOLVENT NAME= CDCl3
##.SHIFT REFERENCE= (INTERNAL, CDCl3, 0, 197.392)
##AUDIT TRAIL= $$ (NUMBER, WHEN, WHO, WHERE, WHAT)
$$ ##TITLE= Audit trail, XWIN-NMR		Version 3.5
$$ ##JCAMPDX= 5.01
$$ ##ORIGIN= Bruker BioSpin GmbH
$$ ##OWNER= she
$$ F:/spectra/data/she/nmr/P31/2/pdata/1/auditp.txt
$$ ##AUDIT TRAIL=  $$ (NUMBER, WHEN, WHO, WHERE, WHAT)
(   1,<2026-06-10 14:19:15.84 +0400>,<she>,<DPX200>,
      <created by zg, POWCHK disabled, PULCHK disabled
       configuration hash MD5:
       00 E9 B6 7A A2 85 ED C7 34 08 36 98 17 FE 4E 26
       data hash MD5: 32K
       88 50 9F F1 38 07 BD 7E 9A B4 E9 C7 EE E9 05 58>)
(   2,<2026-06-10 14:19:18.04 +0400>,<she>,<DPX200>,
      <Start of raw data processing
       efp BC_mod = 2 LB = 1.5 FT_mod = 6 PKNL = 1 PHC0 = 1819.944 PHC1 = -362.6993 SI = 64K 
       data hash MD5: 64K
       9D 3A 6D DF A6 65 5D 82 AA 6D BA B5 B8 C6 62 51>)
(   3,<2026-06-10 14:19:34.84 +0400>,<she>,<DPX200>,
      <pk PHC0 = 2.142009 PHC1 = 0 
       data hash MD5: 64K
       25 A7 32 2C 89 26 9F EA 6C F8 14 31 B2 58 E8 A2>)
(   4,<2026-06-10 14:19:53.85 +0400>,<she>,<DPX200>,
      <pk PHC0 = -37.40004 PHC1 = 0 
       data hash MD5: 64K
       5F 0F B6 37 A4 98 F1 BF 2E 36 22 BE 62 84 4F E8>)
$$ ##END=
$$ 
$$ hash MD5
$$ B9 1D 14 CB 10 B8 09 21 78 88 6A 35 4E D0 C8 39
##$RELAX= 
##$RELAX= 
##$RELAX= 
##$RELAX= 
##$RELAX= 
##$RELAX= 
##$RELAX= 
##$RELAX= 
$$ Bruker specific parameters
$$ --------------------------
##$DU= <F:/spectra>
##$EXPNO= 2
##$NAME= <P31>
##$PROCNO= 1
##$TYPE= <nmr>
##$USER= <she>
##$AMP= (0..31)
100 100 100 100 100 100 100 100 100 100 100 100 100 100 100 100 100 100 
100 100 100 100 100 100 100 100 100 100 100 100 100 100 
##$AQSEQ= 0
##$AQ_mod= 1
##$AUNM= <au_zg>
##$AUTOPOS= <>
##$BF1= 81.014009
##$BF2= 200.13
##$BF3= 200.13
##$BF4= 200.13
##$BF5= 200.13
##$BF6= 200.13
##$BF7= 200.13
##$BF8= 200.13
##$BYTORDA= 1
##$CFDGTYP= 0
##$CFRGTYP= 5
##$CHEMSTR= <none>
##$CNST= (0..31)
1 1 145 1 1 1 1 1 1 1 1 1 1 1 1 1 1 1 1 1 1 1 1 1 1 1 1 1 1 1 1 1 
##$CPDPRG= <waltz16>
##$CPDPRG1= <>
##$CPDPRG2= <waltz16>
##$CPDPRG3= <>
##$CPDPRG4= <mlev>
##$CPDPRG5= <mlev>
##$CPDPRG6= <mlev>
##$CPDPRG7= <mlev>
##$CPDPRG8= <mlev>
##$CPDPRGB= <>
##$CPDPRGT= <>
##$D= (0..31)
0 1 0 0 0 0 0 0 0 0.06 0 0.03 2e-05 3e-06 0 0 0.0002 0 0 0 0 0 0 0 0 0 
0 0 0 0 0 0 
##$DATE= 1781086755
##$DBL= (0..7)
120 120 120 11 120 120 24 19 
##$DBP= (0..7)
150 150 150 150 150 150 150 150 
##$DBP07= 0
##$DBPNAM0= <>
$$ [...]
##$SUBNAM2= <"">
##$SUBNAM3= <"">
##$SUBNAM4= <"">
##$SUBNAM5= <"">
##$SUBNAM6= <"">
##$SUBNAM7= <"">
##$SUBNAM8= <"">
##$SUBNAM9= <"">
##$SW= 400.765351723535
##$SWIBOX= (0..15)
0 1 3 0 0 0 0 0 0 0 0 0 0 0 0 0 
##$SW_h= 32467.5324675325
##$TD= 32768
##$TD0= 1
##$TE= 0
##$TE2= 300
##$TE3= 300
##$TEG= 300
##$TL= (0..7)
0 120 53 12 22 120 120 120 
##$TP= (0..7)
150 150 150 150 150 150 150 150 
##$TP07= 0
##$TPNAME0= <>
##$TPNAME1= <>
##$TPNAME2= <>
##$TPNAME3= <>
##$TPNAME4= <>
##$TPNAME5= <>
##$TPNAME6= <>
##$TPNAME7= <>
##$TPOAL= (0..7)
0.5 0.5 0.5 0.5 0.5 0.5 0.5 0.5 
##$TPOFFS= (0..7)
0 0 0 0 0 0 0 0 
##$TUNHIN= 0
##$TUNHOUT= 0
##$TUNXOUT= 0
##$USERA1= <user>
##$USERA2= <user>
##$USERA3= <user>
##$USERA4= <user>
##$USERA5= <user>
##$V9= 5
##$VALIST= <valist>
##$VCLIST= <CCCCCCCCCCCCCCC>
##$VD= 0
##$VDLIST= <DDDDDDDDDDDDDDD>
##$VPLIST= <PPPPPPPPPPPPPPP>
##$VTLIST= <TTTTTTTTTTTTTTT>
##$WBST= 1024
##$WBSW= 4
##$XGAIN= (0..3)
0 0 0 0 
##$XL= 0
##$YL= 0
##$YMAX_a= 3227
##$YMIN_a= -3600
##$ZGOPTNS= <>
##$ZL1= 120
##$ZL2= 120
##$ZL3= 120
##$ZL4= 120
##$ABSF1= 0
##$ABSF2= 0
##$ABSG= 0
##$ABSL= 0
##$ALPHA= 0
##$AQORDER= 0
##$ASSFAC= 0
##$ASSFACI= 0
##$ASSFACX= 0
##$ASSWID= 0
##$AUNMP= <proc_1d>
##$AZFE= 0.1
##$AZFW= 0.5
##$BCFW= 0
##$BC_mod= 2
##$BYTORDP= 0
##$COROFFS= 0
##$CY= -3
##$DATMOD= 1
##$DC= 0
##$DFILT= <>
##$DTYPP= 0
##$F1P= 0
##$F2P= 0
##$FCOR= 1
##$FTSIZE= 65536
##$FT_mod= 6
##$GAMMA= 0
##$GB= 0
##$INTBC= 1
##$INTSCL= 9.790993e-09
##$ISEN= 30
##$LB= 1.5
##$LEV0= 0
##$LPBIN= 0
##$MAXI= 10000
##$MC2= 0
##$MEAN= 0
##$ME_mod= 0
##$MI= 50
##$NCOEF= 0
##$NC_proc= -8
##$NLEV= 6
##$NOISF1= 182.463
##$NOISF2= 159.3651
##$NSP= 0
##$NTH_PI= 0
##$NZP= 0
##$OFFSET= 197.3918
##$PC= 4
##$PHC0= 1784.686
##$PHC1= -362.6993
##$PH_mod= 1
##$PKNL= yes
##$PPARMOD= 0
##$PSCAL= 0
##$PSIGN= 0
##$REVERSE= no
##$SF= 81.014063255964
##$SI= 65536
##$SIGF1= 159.3651
##$SIGF2= -187.1042
##$SINO= 113.3802
##$SIOLD= 16384
##$SREGLST= <1H.CDCl3>
##$SSB= 0
##$STSI= 65536
##$STSR= 0
##$SW_p= 32467.5324675325
##$SYMM= 0
##$S_DEV= 0
##$TDeff= 32768
##$TDoff= 0
##$TI= <>
##$TILT= no
##$TM1= 0
##$TM2= 0
##$TOPLEV= 0
##$USERP1= <user>
##$USERP2= <user>
##$USERP3= <user>
##$USERP4= <user>
##$USERP5= <user>
##$WDW= 1
##$XDIM= 65536
##$YMAX_p= 385175688
##$YMIN_p= -45765167
$$ End of Bruker specific parameters
$$ ---------------------------------
##NTUPLES= NMR SPECTRUM
##VAR_NAME=  FREQUENCY,     SPECTRUM/REAL,   SPECTRUM/IMAG
##SYMBOL=    X,             R,               I
##VAR_TYPE=  INDEPENDENT,   DEPENDENT,       DEPENDENT
##VAR_FORM=  AFFN,          ASDF,            ASDF
##VAR_DIM=   65536,         65536,           65536
##UNITS=     HZ,            ARBITRARY UNITS, ARBITRARY UNITS
##FACTOR=    0.49542278885378, 1,            1
##FIRST=     15991.5117654749, 0,            0
##LAST=      -16476.0207020576, 0,           0
##MIN=       -16476.0207020576, -45765167,   0
##MAX=       15991.5117654749, 385175688,    0
$$ Real data points
##PAGE= N=1
##DATA TABLE= (X++(R..R)), XYDATA
$$ [...]
7486A584540J07957k464848k847181j791765j288031n82271J822279M145102L583904
7477B269686J279113O73296J764999J452579p56675j943131r98780l16621j337150
7468B087316k260401j461038Q7972J033768J398900J105061m16292k136073j755352
7459b316139P80175K700859K331335J007749K58392r4892r4660R80394K142130
7450G695343Q59077k560094m021178j443019J517878N49406k935051l983708j149676
7441e471022K199443L005490J721886K61367n56697p65881l02699P65011J891731
7432B748629K369318J651693l38861k680443l747302k841560j165025m48605r76045
7423e428201j615185j412851m88320L88879N95698K22511N3116O51317J523363
$$ plain form
7486 1584540 1692497 -772351 -3619532 -5411297 -6699328 -7281599 -5459320 -1314218 2269686
7477 2269686 3548799 4222095 5987094 7439673 6682998 4739867 3741087 3424466 2087316
7468 2087316 -173085 -1634123 -1546151 -512383 886517 1991578 1575286 -560787 -2316139
7459 -2316139 -1535964 1164895 3496230 4503979 4762371 4667479 4572819 5553213 7695343
7450 7695343 8554420 5994326 1973148 530129 2048007 2597413 -337638 -4321346 -5471022
7441 -5471022 -3271579 -266089 1455797 1717164 1160467 394586 91887 856898 2748629
7432 2748629 5117947 6769640 6430779 3750336 3034 -2838526 -4003551 -4452156 -5428201
7423 -5428201 -7043386 -8456237 -8944557 -8555678 -7959980 -7737469 -7684353 -7033036 -5509673
7414e509673J829720J753968K095024K556063J930790L47773l46114O64540J568665
7405F890756M29114j882103k823770j535353N42565J972864K569409K335164Q67855
7396I366501j462461k990902k539489j097215n47882j004790q45731L39524N73854
7387b08591j458963l649727k982998j26137J285115J07170o55204J234001L741583
7378b713751M019940K642210J683525Q96896r01839k434977j716003q5562n71883
7369H18556k763176l283050j294100M81391N61329M52048Q36258K02681j283621
7360e271684o44375K920254N438946L383685j192382l559494k344605k8892J034773
7351b63774O64400r3125r5931R64842J813427R56006p76055j049684J60349L40876
$$ plain form
7414 -5509673 -3679953 -1925985 169039 2725102 4655892 5003665 4657551 5322091 6890756
7405 6890756 7319870 5437767 2613997 1078644 1621209 3594073 6163482 8498646 9366501
7396 9366501 7904040 4913138 2373649 1276434 728552 -276238 -1121969 -782445 -208591
7387 -208591 -1667554 -5317281 -8300279 -8426416 -7141301 -7034131 -7689335 -6455334 -2713751
7378 -2713751 1306189 3948399 5631924 6528820 5626981 3192004 1476001 1390439 818556
7369 818556 -1944620 -5227670 -6521770 -6040379 -5479050 -5027002 -4190744 -3988063 -5271684
7360 -5271684 -5916059 -2995805 2443141 5826826 4634444 1074950 -1269655 -1298547 -263774
7351 -263774 400626 307501 211570 1176412 2989839 3945845 3169790 2120106 2280455 2621331
7341B621331j142181j739059l65614K73248j595175l295161k083543J04932P7327
7332g143895j095088k60172K051681K608995J107356L45110J215158J707327R34230
7323A470702K86902K45120l66524j361604q34574J239631K091397J57690k355050
7314E73690k243474R07444M461767N031691J081323n150981q597508o202314o42983
7305a0781345K762270K391920J095269J064973J166552p1572j808477k460573
7297f640983j738487j28129J736290K468733P69887k272926l636386j972203R28353
7288a0485851K850996L446630L217079K273557R71009Q723p58628j865204k353428
7279b695117o90953K029233K658313O95030o18596O26399J976403Q31217j302502
$$ plain form
7341 2621331 1479150 -259909 -625523 -352275 -1947450 -5242611 -7326154 -7221222 -7143895
7332 -7143895 -8238983 -8499155 -6447474 -3838479 -2731123 -2386013 -1170855 536472 1470702
7323 1470702 1757604 2002724 1636200 274596 -559978 679653 2771050 2928740 573690
7314 573690 -1669784 -762340 3699427 8731118 9812441 4661460 -3936048 -10138362 -10781345
7305 -10781345 -8019075 -5627155 -4531886 -3466913 -2300361 -2371933 -4180410 -6640983
7297 -6640983 -8379470 -8507599 -6771309 -4302576 -3532689 -5805615 -9442001 -11414204 -10485851
7288 -10485851 -7634855 -4188225 -971146 1302411 2273420 2282143 1523515 -341689 -2695117
7279 -2695117 -3386070 -1356837 1301476 1996506 1377910 2004309 3980712 4811929 3509427
7270C509427j701498j065892j720566k940610k031270P18791K123030J229303
7262a879285O63198J975758K961019J276481j780401l192556k333394j147273
7254c456453j115001j815317k145114j582452l36498P98550R36868K66652L27435
7245h121330K067031L941197L359033J75947k696714k793847r49457K76815j12978
7236d854303j162435j984159k455817k231877q84064P65309J081203q0426q25926
7227a2632495M13101K981659M833968M305964J099898l102968n131438l341612
7219a0573923j85162O02573m98089N99368M565954O361100K572001k701640l298565
7210b556383L59613K698570J348270r13359j836305k173436k098628q160L694989
$$ plain form
7270 3509427 1807929 742037 -978529 -3919139 -5950409 -5231618 -3108588 -1879285
7262 -1879285 -1216087 759671 3720690 4997171 3216770 24214 -2309180 -3456453
7254 -3456453 -4571454 -6386771 -8531885 -10114337 -10450835 -9652285 -8715417 -8448765 -8121330
7245 -8121330 -6054299 -2113102 1245931 1421878 -1274836 -4068683 -5018140 -4741325 -4854303
7236 -4854303 -6016738 -8000897 -10456714 -12688591 -13572655 -12807346 -11726143 -11806569 -12632495
7227 -12632495 -12219394 -9237735 -4403767 -97803 1002095 -2100873 -7232311 -10573923
7219 -10573923 -10759085 -10156512 -10654601 -10055233 -5489279 871821 3443822 742182 -2556383
7210 -2556383 -2196770 501800 1850070 936711 -899594 -3073030 -5171658 -5179818 -1484829
7201a484829N630184M019916J058119q04177j894523l091765l531562k425252
7193b523889p69235M27121J471935K291366J813633L31402r8659R94595J460456
7184E398725L52903j76156J251559K468746J279441r86753k053085k197997k358401
7175B978982j460125R13690J674141j752783o211685o086049j018864L899289
7167g063404N372089M983951M603543L089299n94844m237485m825633k483865
7159a156349q8645K14104j039848j637348j14508K441512L202167Q90519k312120
7150C99484l254384j533456P09498J987085K526304K492815J363716n66030j808488
7141B316544j433683j02083R01687P74602n49791k314518l353854l344612k968126
$$ plain form
7201 -1484829 4145355 8165271 9223390 8419213 6524690 3432925 -98637 -2523889
7193 -2523889 -3293124 -2866003 -1394068 897298 2710931 3042333 2943674 3938269 5398725
7184 5398725 5751628 5575472 6827031 9295777 10575218 9588465 7535380 5337383 2978982
7175 2978982 1518857 2432547 4106688 2353905 -3857780 -9943829 -10962693 -7063404
7167 -7063404 -1691315 3292636 7896179 10985478 10390634 6153149 1327516 -1156349
7159 -1156349 -1244994 -1030890 -2070738 -3708086 -3822594 -1381082 1821085 2711604 399484
7150 399484 -2854900 -4388356 -3678858 -1691773 834531 3327346 4691062 4125032 2316544
7141 2316544 882861 780778 1682465 2457067 1907276 -407242 -3761096 -7105708 -10073834
7132a0073834k161951K31639L687048M900376K039313j563645j307362K127806
7124b120610L909791K254497K47841J44271L75444l49885l23561J354674K009219
7115G501681m04522l266212l001376o60656n7402j744769k689282j402759K67454
7106e457843P40809Q94577J764293K572508K246843J115497o416j021475j817332
7097A031461j510792L82514K666272L415391K066667p9342j417897j667039j752612
7088C134623k230938k323872j081068P58648J204127k85055j721877j180081N49434
7079c176059J274003O44604L07245J016501J550032R49368O2208j06263j33288
7070B388351r52626j909375j584877o4267J147961J361028J370125J685636J562376
$$ plain form
7132 -10073834 -12235785 -12004146 -8317098 -3416722 -1377409 -2941054 -4248416 -2120610
7124 -2120610 1789181 4043678 4291519 4435790 4811234 4461349 4137788 5492462 7501681
7115 7501681 7097159 3830947 829571 168915 111513 -1633256 -4322538 -5725297 -5457843
7106 -5457843 -4717034 -3822457 -2058164 514344 2761187 3876684 3870268 2848793 1031461
7097 1031461 -479331 -96817 2569455 5984846 8051513 7972171 6554274 4887235 3134623
7088 3134623 903685 -1420187 -2501255 -1742607 -538480 -823535 -2545412 -3725493 -3176059
7079 -3176059 -1902056 -1257452 -950207 66294 1616326 2565694 2627902 2521639 2388351
7070 2388351 1435725 -473650 -2058527 -2122794 -974833 386195 1756320 3441956 5004332
7061E004332N01093m96537k82824N78832N44260o81087j859065k069681j612410
7052c73087r18274J06050J091092Q47566r19375k432156j756521M87580J713367
7043b153758O57395j220484j870209q89647R12235K857655M211264L712122R55638
7034G172211k113604k847854j275085j79635j201165k623153k305899j060940
7026f435124q84744j083134O85354L653211L863425J11627l386429k653541M78961
7017e650394J597449L03249l37667M30389L73978q57577q42472Q30577J358523
7008b793945j77798q78224N80024R67383j802948l996726j489313L166339M219974
6999b205234J340165o79485Q1626O22358p20152j472050q6108R71132l35875j900069
$$ plain form
7061 5004332 5505425 5008888 4726064 5304896 5849156 5168069 3309004 1239323 -373087
7052 -373087 -1291361 -1185311 -94219 753347 -166028 -2598184 -4354705 -3867125 -2153758
7043 -2153758 -1496363 -2716847 -4587056 -5476703 -4564468 -1706813 2504451 6216573 7172211
7034 7172211 5058607 2210753 935668 756033 -445132 -3068285 -5374184 -6435124
7026 -6435124 -7319868 -8403002 -7717648 -4064437 -201012 -89385 -3475814 -6129355 -5650394
7017 -5650394 -4052945 -3749696 -4087363 -3656974 -3282996 -4140573 -4983045 -4152468 -2793945
7008 -2793945 -2971743 -3849967 -3269943 -2302560 -4105508 -8102234 -9591547 -6425208 -2205234
6999 -2205234 -865069 -1544554 -1462928 -840570 -1560722 -3032772 -3118880 -2147748 -2483623 -4383692
6989d383692j096343P80139P20262j354285k895535k242088M47696M320386P576978
6980A873518P466051L175672j999452l829976k100215j93690j69672q20757p88142
6971B613337q50513j876207k648916j682985L9525L55218n14526j12509K055887
6962b621689L004604P32651j829658l98839L975632N550807J828800k907807l824836
6953C509665j767440l42676N6452J133402J811741l96293l876546m010362l19555
6944d201612K362830J187770q37850l53234J208798Q92047p66109j303191m58647
6935b269198M11751J129544K012660K051782M67447j381495k069476k425796l301492
6926e374273k940772L07279M162978M746331J946539o81868q73281L73754J307848
$$ plain form
6989 -4383692 -5480035 -4699896 -3979634 -5333919 -8229454 -10471542 -10023846 -5703460 1873518
6980 1873518 9339569 12515241 10515789 6685813 4585598 4391908 4222236 3401479 2613337
6971 2613337 1762824 -113383 -2762299 -4445284 -4405759 -4050541 -4565067 -4677576 -2621689
6962 -2621689 382915 1115566 -714092 -1112931 2862701 8413508 10242308 7334501 3509665
6953 3509665 1742225 1399549 1456001 2589403 4401144 4004851 128305 -3882057 -4201612
6944 -4201612 -1838782 -651012 -1488862 -1842096 -633298 258749 -507360 -1810551 -2269198
6935 -2269198 -1857447 -727903 1284757 3336539 3803986 2422491 353015 -2072781 -5374273
6926 -5374273 -8315045 -8007766 -3844788 901543 2848082 2166214 1292933 1666687 2974535
6917B974535J147612l27455k362232k945238j416857l75509k000287l613429q58872
6908i777732N106837Q023848M780727q60669l969428l916175k434868j02234K574872
6899e74822L593010K050669K96793P41978K187390J942894J13940j016428q52279
6890H483145q80656j618263j785877o93984O23925J044512O05979j42553q29314
6881D806914j141539r94845p92824p13458j39893J195239K121122J527581M41060
6872F309357P04234J687841O33081k968231n593997m063659j60792J508007k60936
6863b205095j832126j71213K712990K733770k48562k074936q4483L248052L828306
6854E906703J383149o58920m3304J722367J950275J53757k119595l689053m659251
$$ plain form
6917 2974535 4122147 3794692 1432460 -1512778 -2929635 -3305144 -5305431 -8918860 -9777732
6908 -9777732 -4670895 3352953 8133680 7273011 3303583 -612592 -3047460 -3149694 -574822
6899 -574822 3018188 5068857 5365650 6107628 8295018 10237912 10351852 9335424 8483145
6890 8483145 7602489 5984226 4198349 3504365 4128290 5172802 5778781 5636228 4806914
6881 4806914 3665375 2670530 1877706 1164248 1024355 2219594 4340716 5868297 6309357
6872 6309357 7013591 8701432 9334513 6366282 772285 -3291374 -3452166 -1944159 -2205095
6863 -2205095 -4037221 -4208434 -1495444 1238326 989764 -1085172 -1169655 2078397 5906703
6854 5906703 7289852 6630932 6587628 8309995 10260270 10414027 8294432 4605379 -53872
6845e3872n216361m619451j923604K423432O034996O167374K394317k401051m406316
6836a600536k562333N50010J744770O32272n17842J08817J836813K815359K488504
6827E495834J832830J495907J029250L15431K87724J073304P18156k233065n583904
6818D431467n509405j904183J061832O88186p77373k20197J455216J371258l25715
6809B71086j012900j85576J34992n35423k58390J539554K775939K440980K471972
6800G642234L994222M443721J176321l796533n697558l051174P01021J753708
6792G165962K3406j881925k159418j205490l01741q6448m53483j165732j835869
6783a900738j567211K61182K470730K614413J10072k272560j685506Q85352K075743
$$ plain form
6845 -53872 -5270233 -9889684 -11813288 -9389856 -3354860 2812514 5206831 2805780 -1600536
6836 -1600536 -4162869 -3612859 -1868089 -1235817 -1753659 -1644842 191971 3007330 5495834
6827 5495834 7328664 8824571 9853821 10169252 10456976 11530280 12248436 10015371 4431467
6818 4431467 -1077938 -2982121 -1920289 -1232103 -2009476 -2229673 -774457 596801 271086
6809 271086 -741814 -927390 -792398 -1327821 -1586211 -46657 2729282 5170262 7642234
6800 7642234 11636456 16080177 17256498 13459965 7762407 4711233 5412254 7165962
6792 7165962 7189368 5307443 3148025 1942535 1640794 1554346 1100863 -64869 -1900738
6783 -1900738 -3467949 -3206767 -736037 1878376 1988448 -284112 -1969618 -1084266 991477
6774I91477J011782J44834J067358K281120K083990J124154O08140K04772m57812
6765I059815k06835J533825K575441M91550l551582n938081n185014l156435j831688
6756f209004j042090J81484J748893K698713K276046N49860j321868j714793m73398
6747c306157J90216j758940m858663n182302j225191L801577N571568L511715
6739c256177R09214O20532J839524J472043j771075n302660n167567o13942M547934
6730f722174N761676K497622j551829k827508j473255l00144j046396k514303
6722h176311k400240l18499J644084J487548k22030j126447n7668J728742K484844
6713d955977K155727J988176K553885K959792K017903j47624j862145j616230
$$ plain form
6774 991477 2003259 2148093 3215451 5496571 7580561 8704715 9312855 9517627 9059815
6765 9059815 8852980 10386805 12962246 13453796 9902214 3964133 -1220881 -4377316 -6209004
6756 -6209004 -7251094 -7069610 -5320717 -2622004 -345958 203902 -1117966 -2832759 -3306157
6747 -3306157 -3115941 -4874881 -9733544 -14915846 -16141037 -12339460 -6767892 -3256177
6739 -3256177 -2346963 -1726431 113093 1585136 -185939 -5488599 -10656166 -11270108 -6722174
6730 -6722174 -960498 1537124 -14705 -2842213 -4315468 -4615612 -5662008 -8176311
6722 -8176311 -10576551 -10895050 -9250966 -7763418 -7985448 -9111895 -9169563 -7440821 -4955977
6713 -4955977 -2800250 -812074 1741811 4701603 6719506 6571882 4709737 3093507
6705C093507j59207p517k016370l498978j560208K366061L870977J585183j055822
6696B617626j041826J72002k19671j804914k207638j092008K5988P92795J929069
6687h28577K882594K400218R90473J63705k96615j513951k504365j307446R45613
6678I31649P99737k021609l619729j814319N54468L24078j226048j097699N40944
6669f628528J419956J260031J416995J618584M73526j266547j213808Q08372K314464
6660B03045J893400P16867k10513j597731l632006m640729l462373j255623M75219
6651a1510444J842013L008842K609622k5321k527802k096968K86395J060341o58027
6642h011349j914085n56471J765371K512960J781921J180134J111233J168560
$$ plain form
6705 3093507 2934300 2926783 910413 -2588565 -4148773 -1782712 2088265 3673448 2617626
6696 2617626 1575800 1747802 1528131 -276783 -2484421 -3576429 -3550441 -2757646 -828577
6687 -828577 2054017 4454235 5444708 5608413 5311798 3797847 1293482 -13964 931649
6678 931649 1731386 -290223 -3909952 -5724271 -5169803 -4845725 -6071773 -7169472 -6628528
6669 -6628528 -5208572 -3948541 -2531546 -912962 -439436 -1705983 -2919791 -2111419 203045
6660 203045 2096445 2813312 2602799 1005068 -2626938 -7267667 -10730040 -11985663 -11510444
6651 -11510444 -9668431 -6659589 -4049967 -4075288 -6603090 -8700058 -8413663 -7353322 -8011349
6642 -8011349 -9925434 -10481905 -8716534 -6203574 -4421653 -3241519 -2130286 -961726
6634i61726J672548K623393K422071R1895k225310j719589Q10849K133255J651415
6625F498801J749930K740314J543397k865354o437514n399460j870950o99770
6617d740606k493591l482041j483628J539171K910893K267239P97645r9713Q69953
6608c914678L616138N431551L465283j059947l536439j726511J494562K312623
6600F082582O63405r05798j169360q00170r7532J434910L212465L207515L66641
6591A1994658l472531n092905l387998o63332J06758j181626k161135j783367
6583e641478j695901k945229l571347j616123J233031J861504M39493l15289J67321
6574a2084018J39373q2832K025797N939990P135092L627136m54481q37350P10443
$$ plain form
6634 -961726 710822 3334215 5756286 5848181 3622871 1903282 2714131 4847386 6498801
6625 6498801 8248731 10989045 12532442 9667088 3229574 -2169886 -4040836 -4740606
6617 -4740606 -7234197 -10716238 -12199866 -10660695 -7749802 -5482563 -4684918 -4784631 -3914678
6608 -3914678 -298540 5133011 8598294 7538347 4001908 2275397 3769959 6082582
6600 6082582 6745987 5840189 4670829 3870659 3773127 5208037 8420502 11628017 11994658
6591 11994658 8522127 3429222 41224 -622108 -515350 -1696976 -3858111 -5641478
6583 -5641478 -7337379 -10282608 -13853955 -15470078 -14237047 -12375543 -11936050 -12251339 -12084018
6574 -12084018 -11944645 -12027477 -10001680 -4061690 3073402 6700538 6246057 5408707 6119150
6565F119150j21358l106734m227311k098109N82138J577964J382841R01675K04441
6556A214697p6886Q82100J850595N08985k669432m271707k682564l69317m8160
6547e661689r29680p20605L94498J63324j987188l734410k742717M43094L020296
6538a1755077L029915J229360l15482q69979j181753j185369M51869L466643M782233
6529b347640K418039q80272r36375J700626K468320j80620k368803q30822K248702
6520A291155K948857J309660R1308j90994j263207k940691k721569J10434L069402
6511A704355M005246L451016K386217K71139k865337m529815k562498J232604
6503C092927K879250J353604n69771p89190n71076j689358l216563l155262j727365
$$ plain form
6565 6119150 5997792 2891058 -1336253 -3434362 -2852224 -1274260 108581 1010256 1214697
6556 1214697 1137811 2019911 3870506 4379491 1710059 -2561648 -5244212 -5613529 -5661689
6547 -5661689 -6591369 -7311974 -6917476 -6754152 -8741340 -12475750 -15218467 -14775373 -11755077
6538 -11755077 -8725162 -7495802 -7811284 -8681263 -9863016 -11048385 -10596516 -7129873 -2347640
6529 -2347640 70399 -809873 -1746248 -45622 2422698 2242078 -126725 -957547 1291155
6520 1291155 4240012 5549672 5640980 5449986 4186779 1246088 -1475481 -1365047 1704355
6511 1704355 5709601 9160617 11546834 11817973 8952636 4422821 1860323 3092927
6503 3092927 5972177 7325781 6756010 5966820 5395744 3706386 489823 -2665439 -4392804
6494d392804p23210m61976J60916J038048R16316J63655O13528J990669J562165
6485H67307j172061k569284j80837K715392J546704k369474l445881j72122K711508
6476b068748J345182k018827k980922j023296J096895J824571J818410J640443
6468c66292J042669K44243L2508O37943J612458K395982K191265K86837k359280
6459E718333l084430o98395K341141K848123J166914K51477R53051Q88178j572132
6450H812260m634125n584120m209013k311879j000286K2554J030117J572656J326773
6441d975063P64479N93170Q52037R16543M66799J55205P99503J934549K026734
6432C533956N84592q85353r43380l65766q50802k179031k445895j029806N73316
$$ plain form
6494 -4392804 -5116014 -5577990 -5417074 -4379026 -3462710 -3299055 -2685527 -694858 867307
6485 867307 -304754 -2874038 -3054875 -339483 1207221 -1162253 -4608134 -4780256 -2068748
6476 -2068748 -723566 -2742393 -5723315 -6746611 -5649716 -3825145 -2006735 -366292
6468 -366292 676377 920620 953128 1591071 3203529 5599511 7790776 8077613 5718333
6459 5718333 2633903 1935508 4276649 7124772 8291686 8543163 9496214 10384392 8812260
6450 8812260 4178135 -1405985 -5614998 -7926877 -8927163 -8904609 -7874492 -6301836 -4975063
6441 -4975063 -4210584 -3617414 -2765377 -1848834 -1382035 -1226830 -427327 1507222 3533956
6432 3533956 4118548 3233195 2289815 1924049 1073247 -1105784 -3551679 -4581485 -4008169
6423d008169J241213J634407K286983K152309N16970j055582n87760J238534J789764
6414E208669J20055j834328k023274q13776n2996n46016j322898j076689K93350
6405b047903J632929J853893J157003O33086O06352J09160j382770k463316j353304
6396a254870J265745K542600J070447j153154j340495N31331K064372J771939
6388E497915N99591P9279K85038K09358o32839j681775k097239j596562p17987
6379e5221m77029j448408k889629l069556r09042K705309N452819N475575K866560
6370G651378m26711k170250j732146n56263l86677j020954n89331J616465L591904
6361E977415K882478j93216k815461l000913j463171n9133L61108R2215l38130
$$ plain form
6423 -4008169 -2766956 -1132549 1154434 3306743 3823713 2768131 2180371 3418905 5208669
6414 5208669 5328724 3494396 1471122 657346 604350 58334 -1264564 -2341253 -2047903
6405 -2047903 -414974 1438919 2595922 3229008 3835360 3944520 2561750 98434 -1254870
6396 -1254870 10875 2553475 3623922 2470768 1130273 1661604 3725976 5497915
6388 5497915 6097506 6176785 6461823 6671181 6038342 4356567 2259328 662766 -55221
6379 -55221 -532250 -1980658 -4870287 -7939843 -8848885 -6143576 -690757 4784818 7651378
6370 7651378 7224667 5054417 3322271 2766008 2379331 1358377 769046 2385511 5977415
6361 5977415 8859893 8666677 5851216 2850303 1387132 1327999 1689107 1781322 1443192
6352A443192m42514J88456J417007K495196K775702J958983l50760m131136p605260
6343b251134q019611m910358j254753J09156o6827N30448J596610R48393j023400
6334a4341476j105991J690615M051872L141836Q29236O32833K381674K924644
6326B05243J176981n89226l94401J130748K396538K610788J459556q97054k921168
6317D178005k754465r41488k31433j769261l388793k894522j136031j27581K17230
6308h848339J241284K530259K303859O00612l04058Q11938K201148J415167j538842
6299D13028m051930l480917K61280M167450M481376N54363l830854m227552o69386
6290f383142K322378J247075k269771l742763j146606L139769N173264L253421
$$ plain form
6352 1443192 1000678 1189134 2606141 5101337 7877039 9836022 9485262 5354126 -2251134
6343 -2251134 -10270745 -15181103 -16435856 -16326700 -16393527 -15863079 -14266469 -13318076 -14341476
6334 -14341476 -15447467 -13756852 -9704980 -6563144 -5733908 -5101075 -2719401 205243
6326 205243 1382224 792998 398597 1529345 3925883 6536671 7996227 7099173 4178005
6317 4178005 1423540 482052 250619 -1518642 -4907435 -7801957 -8937988 -9065569 -8848339
6308 -8848339 -7607055 -5076796 -2772937 -2172325 -2476383 -1664445 536703 1951870 413028
6299 413028 -3638902 -7119819 -6858539 -2691089 1790287 2344650 -1486204 -5713756 -6383142
6290 -6383142 -4060764 -2813689 -5083460 -8826223 -9972829 -6833060 -1659796 1593625
6282A593625q67309l761535l306304m25759J999515K072898N88742k56800N40453
6273a822474J860543J982652O69150n30503j73163J120202J230961p48778l184937
6264D03653l905357k751810j142000K05799J658495L088713L548884K722009J332986
6255E161372r7540j581982k625179k438688j518900j303941j739973j057691J197783
6246f004739K882123K272394N95930K9088P67101J677606K230990J967907j75544
6237F242856l651079n047196k049893K429507L376629L67655k294746j945687
6229b571954k30448J056897K558686M065736K710223k430471o910331n967843
6221g719505j305139J187521k17719j198400J534747N232918N437946K595195
$$ plain form
6282 1593625 726316 -3035219 -6341523 -6767282 -4767767 -2694869 -2106127 -2362927 -1822474
6273 -1822474 38069 2020721 2689871 2159368 1986205 3106407 4337368 3588590 403653
6264 403653 -3501704 -6253514 -7395514 -7189715 -5531220 -2442507 1106377 3828386 5161372
6255 5161372 5063832 3481850 856671 -1582017 -3100917 -4404858 -6144831 -7202522 -6004739
6246 -6004739 -3122616 -850222 -254292 -225204 541897 2219503 4450493 6418400 6242856
6237 6242856 2591777 -2455419 -4505312 -2075805 1300824 1668479 -626267 -2571954
6229 -2571954 -2802402 -1745505 813181 4878917 7589140 5158669 -1751662 -7719505
6221 -7719505 -9024644 -7837123 -8054842 -9253242 -7718495 -2485577 2952369 5547564
6213E547564J093067K640495L909818J553191k950275n343412m117116j685622
6205F47710m43885j69752O4634j31637j001883j133796L88436J768262R81231
6196I69320n94544l6401K187717K591860K18425j776517j137907L38411L88728
6187C149092k31795k04936o40878k546550l641403j289683K824255M512499K758734
6178D689335K35152j239940k239572k859788j965592M2131R32653J46078k22315
6169b481858R47665J902688J181560J72352O70122J899656J968882P96145l13251
6160F743961q83077j328381j673727j720169j777228j986708j670285m52559P83783
6151c964390J078101O39396L3303p42497j448001j278959m71127n56344j591898
$$ plain form
6213 5547564 6640631 9281126 13190944 14744135 11793860 6450448 2333332 647710
6205 647710 203825 34073 98707 -32930 -1034813 -2168609 -1780173 -11911 969320
6196 969320 374776 338375 2526092 5117952 5336377 3559860 2421953 2760364 3149092
6187 3149092 2917297 2712361 2071483 -475067 -4116470 -5406153 -2581898 1930601 4689335
6178 4689335 4924487 3684547 1444975 -1414813 -3380405 -3338274 -2405621 -2259543 -2481858
6169 -2481858 -1534193 368495 1550055 1722407 2392529 4292185 6261067 7057212 6743961
6160 6743961 5860884 4532503 2858776 1138607 -638621 -2625329 -4295614 -4748173 -3964390
6151 -3964390 -2886289 -2246893 -2213590 -2956087 -4404088 -5683047 -6154174 -6710518 -8302416
6142h302416j137635J882222M347643L023788r3101l30657K492403L783511J424672
6133G090430j162719q14237O05889l8212j888479k064787o79472q3149l31652
6124F33612P07553K935060L361998O20918k805912m014742l003928j365552J88188
6115b742805J377129J175867q42768k824494k201110J138411M462987M989004
6107D532221K354218j367887l407706k482193n7457R21079o76662k582598j748620
6098d515605J859415N193044N674210L665487J315447N6960l23359q67811k131882
6089I925906l358024l052099r52323R07544K22365k477793m065720k627379K02155
6080e275368J506494O09214p87056j203753p57356j61809L70467R54573J493238
$$ plain form
6142 -8302416 -9440051 -7557829 -3210186 -186398 -279499 -610156 1882247 5665758 7090430
6133 7090430 5927711 5113474 5719363 5681151 3792672 1727885 1048413 965264 633612
6124 633612 1341165 4276225 7638223 8259141 5453229 1438487 -1565441 -2930993 -2742805
6115 -2742805 -1365676 -189809 -1032577 -3857071 -6058181 -4919770 -456783 4532221
6107 4532221 6886439 5518552 2110846 -371347 -428804 492275 -184387 -2766985 -4515605
6098 -4515605 -2656190 2536854 8211064 11876551 13191998 13248958 12925599 12057788 9925906
6089 9925906 6567882 3515783 2563460 3471004 3693369 1215576 -2850144 -5477523 -5275368
6080 -5275368 -3768874 -3159660 -3946716 -5150469 -5907825 -6069634 -5699167 -4744594 -3251356
6071c251356J586489P50319r99806k405500j506164J997328N306547M955341R46050
6062G379248k937866l620116k214263j843765l052556l282985q37041K547226
6054g862118L954878K873928J266027P22094R68058J165636J322793J762192K038828
6045H212316J287465n77420k619499l772529l592621k257477k72068J708215K937222
6036A053604K657333N38259k477557m108815k640615Q00027L002255K376131P97848
6027A998470P99769K117845K575848J483115J53507n55205j090458j564312j365175
6018D553404p57512q64108j555535j366186r4432O90990M78765O64857J468821
6009C219064Q32919j748880l159378j094154J939640K324109Q40758N82429J157860
$$ plain form
6071 -3251356 -1664867 -914548 -1914354 -4319854 -5826018 -3828690 1477857 6433198 7379248
6062 7379248 4441382 821266 -1392997 -3236762 -6289318 -9572303 -10409344 -7862118
6054 -7862118 -3907240 -1033312 232715 954809 1922867 3088503 4411296 6173488 8212316
6045 8212316 9499781 8922361 6302862 2530333 -1062288 -3319765 -3591833 -1883618 1053604
6036 1053604 3710937 4249196 1771639 -2337176 -4977791 -4177764 -1175509 1200622 1998470
6027 1998470 2798239 4916084 7491932 8975047 9128554 8573349 7482891 5918579 4553404
6018 4553404 3795892 2931784 1376249 10063 -84369 606621 1085386 1750243 3219064
6009 3219064 4051983 2303103 -856275 -1950429 -10789 2313320 3154078 3736507 4894367
6000D894367k58171k975169l225847q64122j64687k470822l437667l38271K843780
5991e996609J608846j782144k079103P51314K420676J741222J548665K585230
5983G98097J994551j071029l213616k141273l01554o88316k177146j876006J91954
5974h484338J692883J752432J386719J137815P56717O21476J211900J566028L67212
5965B008844j652065k401076j440436l24583R8035O03143J418775J332173o3232
5956d20422j145566o62790K00252j93741j087348m41106J744130L282872K929177
5947D205458J722097Q45995o0930j624124l189794l648679k794809r20730J812960
5938c652556M374386M437274R41619l477149m848215k752582o56690q75842j656961
$$ plain form
6000 4894367 4636196 1661027 -1564820 -2428942 -2593629 -5064451 -8502118 -8840389 -5996609
5991 -5996609 -4387763 -6169907 -8249010 -7497696 -5077020 -3335798 -1787133 798097
5983 798097 2792648 1721619 -1491997 -3633270 -3934824 -4623140 -6800286 -8676292 -8484338
5974 -8484338 -6791455 -5039023 -3652304 -2514489 -1757772 -1136296 75604 1641632 2008844
5965 2008844 356779 -2044297 -3484733 -3809316 -3711281 -3108138 -1689363 -357190 -420422
5956 -420422 -1565988 -2228778 -2028526 -2222267 -3309615 -3750721 -2006591 1276281 4205458
5947 4205458 5927555 6773550 6712620 5088496 1898702 -1749977 -4544786 -5465516 -3652556
5938 -3652556 721830 5159104 6100723 2623574 -2224641 -4977223 -5633913 -6509755 -8166716
5929h166716o22986J237620J442422L27888M74921K307520L326596K168476O41646
5920C137387O26792J341309J215497M70923k438o25854j864787k396631j011411
5911H90787O28643j55186k873162m277021k936318o87598P26971J564688J945117
5902e173079Q79916j180573j697386J92799J878696J392522O79564K002450L630764
5893B605673K721815M80676J41724J081840j68212l322897l978695q21004J814675
5884E55595O23760j891671k066183n22350L70946J022675K580386L089600K59492
5875D022250l576629l843852l60039K577837K428020P52030o31451j791146k432392
5866b855372j352433P61700J359464N6119n02170R60105K289591J789656R25384
$$ plain form
5929 -8166716 -8789702 -7552082 -6109660 -5781772 -5306851 -2999331 327265 2495741 3137387
5920 3137387 3764179 5105488 6320985 6791908 6789470 6163616 4298829 1902198 890787
5911 890787 1519430 1364244 -1508918 -5785939 -8722257 -9409855 -8682884 -7118196 -5173079
5902 -5173079 -4293163 -5473736 -7171122 -6978323 -5099627 -3707105 -3027541 -1025091 2605673
5893 2605673 5327488 5808164 5949888 7031728 6863516 3540619 -438076 -1259080 555595
5884 555595 1179355 -712316 -2778499 -3300849 -2929903 -1907228 673158 3762758 4022250
5875 4022250 445621 -3398231 -3758270 -1180433 1247587 1999617 1368166 -422980 -2855372
5866 -2855372 -4207805 -3446105 -2086641 -2030522 -2532692 -1572587 717004 2506660 3432044
5857C432044J106615Q61531j149933k963747k227564k33933K03437o60135m44047
5848b075732Q75210J046845j48467j79859K076042M389655M396089K492768N14760
5839A3387311n71687o57290R9539P62045K3956j746267k288338n69234J233371
5830I673406N74945j657251k384378j033822m45570k304011m071603k585428P47971
5821c485741J379935j711378l960136j471470L173586M223956N87629k931886
5813d195505k176055J650825M508791M084342P93445l211914m664696j371322
5805d582089M317095O584796L028705j754418k255831M40821J023839j664286
5797E138632l334715j396152J285612J239525q53486k375819k625258k022726
$$ plain form
5857 3432044 4538659 5400190 4250257 1286510 -941054 -1174987 -971550 -1631685 -2075732
5848 -2075732 -1200522 -153677 -302144 -482003 1594039 5983694 10379783 12872551 13387311
5839 13387311 12815624 12158334 12257873 13019918 13043874 11297607 9009269 8440035 9673406
5830 9673406 10248351 8591100 6206722 5172900 4727330 2423319 -1648284 -4233712 -3485741
5821 -3485741 -2105806 -3817184 -7777320 -9248790 -6075204 -1851248 -1263619 -4195505
5813 -4195505 -6371560 -4720735 -211944 3872398 4665843 1453929 -3210767 -4582089
5805 -4582089 -264994 6319802 9348507 7594089 5338258 5779079 6802918 5138632
5797 5138632 1803917 407765 1693377 2932902 2079416 -296403 -2921661 -4944387
5789d944387j13292K803672M084682J912125j283021j720654K89062J153364j00221
5780B081330m88936J541690L021834R19638k905123m093882j770055P99477J100222
5771B06195J35998j20349M13042P95286J008637J492604J780124J076239l43559
5762F444217j455026j721866j105449L61176J842535J507646j201092l789022
5754H83119l301405l90826J547244J330818J342537L179362M791544L657438N60698
5745A3600529j859008k621481k430081j700495p13789l98786p85550q8582K220872
5736E223629L023239m50568n305230n708978r38158L399047L070076J66479j394242
5727A085294j505862k092049k624748j239484J116014J458749m75787j549692
$$ plain form
5789 -4944387 -5057679 -2254007 1830675 3742800 2459779 739125 1028187 2181551 2081330
5780 2081330 1592394 3134084 6155918 7075556 4170433 76551 -1693504 -894027 206195
5771 206195 342193 221844 634886 1430172 2438809 3931413 5711537 6787776 6444217
5762 6444217 4989191 3267325 2161876 2523052 4365587 5873233 4672141 883119
5754 883119 -2418286 -2809112 -1261868 68950 1411487 4590849 9382393 13039831 13600529
5745 13600529 11741521 9120040 6689959 4989464 4275675 3876889 3091339 3002757 5223629
5736 5223629 8246868 7796300 2491070 -3217908 -4156066 -757019 2313057 2479536 1085294
5727 1085294 -420568 -2512617 -5137365 -6376849 -5260835 -3802086 -4277873 -5827565
5719e827565K9939J986055J418321q85010j520590Q37997L673386L867172J357593
5710D937298j377440k612412k623968j865369N8997K689140L880547K492250N29558
5701F108601L57714Q83876n92483l331944l595516o22822J625534L49042j911310
5692g29308j507685P97780J842091J470399K081089L793909M003437J814893n44167
5683A3022438j413183j782666k625270k822725j334991N90253J119292L45228
5675E098376m56056r11077j312318j230662q3069J375573J721740Q92838J40098
5666E235443o0795n90731j775030k301232j070010P71085J004098o63004k091295
5657a541471j519965K59441J277914J023201N33724L69950j7828p73010r46760
$$ plain form
5719 -5827565 -5797626 -3811571 -2393250 -3278260 -4798850 -3960853 -287467 3579705 4937298
5710 4937298 3559858 947446 -1676522 -3541891 -3482894 -793754 3086793 5579043 6108601
5701 6108601 6466315 7350191 6757708 3425764 -169752 -792574 832960 1182002 -729308
5692 -729308 -2236993 -1439213 402878 1873277 3954366 7748275 11751712 13566605 13022438
5683 13022438 11609255 9826589 7201319 4378594 3043603 3633856 4753148 5098376
5675 5098376 4642320 3731243 2418925 1188263 1105194 2480767 4202507 5095345 5235443
5666 5235443 5174648 4583917 2808887 507655 -562355 208730 1212828 549824 -1541471
5657 -1541471 -3061436 -2801995 -1524081 -500880 32844 402794 384966 -388044 -1334804
5648a334804l6251R02309O70943k88633o20317q2690L12827n397n44523r34035
5638a960571j544566k387766k377866o20129K042107L727568L644815K635775
5630C159367J576551L64234r65303j303422o364J299010L01420k515736l940941
5621b031184k309055K28379J033366O94158J305268K535938K254637M10560p80385
5612C341682n98501o97568j567623j232587J072619K705234J220850j878087l254709
5603h88690k082110j44114J080230J254043K33948j437436j910259j03514K234854
5594a763048K616737J262111K70170J04386m73662j382841j079842L69231R67023
5585H90265K16108J25257J681495K905411K044597M67832K90351Q28915q7934
$$ plain form
5648 -1334804 -1371055 -468746 202197 -86436 -706753 -789443 -476616 -482013 -1026536 -1960571
5638 -1960571 -3505137 -5892903 -8270769 -8890898 -6848791 -3121223 523592 3159367
5630 3159367 4735918 5100152 4134849 2831427 2825063 4124073 4425493 1909757 -2031184
5621 -2031184 -4340239 -4111860 -3078494 -2384336 -1079068 1456870 3711507 4122067 3341682
5612 3341682 2743181 2045613 477990 -754597 318022 3023256 4244106 2366019 -888690
5603 -888690 -2970800 -3114914 -2034684 -780641 -546693 -1984129 -3894388 -3997902 -1763048
5594 -1763048 853689 2115800 2385970 2490356 2016694 633853 -445989 -76758 890265
5585 890265 1106373 1231630 2913125 5818536 7863133 8330965 8621316 9450231 9362297
5576I362297k188558k751079o49105J725245J485659j031642k719473j549496
5568A683848R97935J834884K05214j252022R5731L206610M330540J531122l025684
5559I608178n659892m974385k456080k04559R39040J277069J160576M45052r38643
5550h03644k132192j793310J27916J784769J599625M61688L45580J080264M65475
5541A136171k020340l761543k531428K17585J448058Q35978P30791K115396L013818
5532A184486J708879l91490p09483P33464J454436K99693q87070k59532R92086
5523D125469L77732j910062l024079j698547j56476n85786j677275p55950J825644
5514c479330K987512J446097n01449l64913J325399K302969J667824L77017n86748
$$ plain form
5576 9362297 7173739 4422660 3773555 5498800 6984459 5952817 3233344 1683848
5568 1683848 2681783 4516667 4721881 3469859 3565590 6772200 11102740 12633862 9608178
5559 9608178 3948286 -1026099 -3482179 -3686738 -2747698 -1470629 -310053 134999 -803644
5550 -803644 -2935836 -4729146 -4601230 -2816461 -1216836 -755148 -409568 670696 1136171
5541 1136171 -884169 -4645712 -7177140 -6959555 -5511497 -4675519 -3944728 -1829332 1184486
5532 1184486 2893365 2501875 1792392 2525856 3980292 4279985 3392915 3133383 4125469
5523 4125469 4503201 2593139 -430940 -2129487 -2285963 -2871749 -4549024 -5304974 -3479330
5514 -3479330 -491818 954279 452830 87917 1413316 3716285 5384109 5761126 5174378
5505E174378j244378j960507k609286k591703j472215M01954J982628K399640
5497H0511J575376j59932k353076l752805k438138J799489N726310N358243P08661
5488F544639l875369m662766k217025N08757J916415K289383K016147J088743
5480C608924j12541q71288q50642j25358R77745J554695N82822j456233k409311
5471H98813j046405J058582J578716N87609L0563N23258N68551r18395l030926
5462B50366m328553m423675l383237q60957K948856O173983O420357L221989j310567
5453D708562m384433m658475k624714K89856K449925K413975j50840l436631m294768
5444i687543j318571K995705M470911K052562q20370m84681K469872M450523L784721
$$ plain form
5505 5174378 3930000 1969493 -639793 -3231496 -4703711 -4301757 -2319129 80511
5497 80511 1655887 1495955 -857121 -4609926 -7048064 -5248575 477735 5835978 6544639
5488 6544639 2669270 -1993496 -4210521 -3701764 -1785349 504034 2520181 3608924
5480 3608924 3496383 2625095 1774453 1649095 2626840 4181535 4764357 3308124 898813
5471 898813 -147592 910990 2489706 3077315 3107878 3631136 4199687 3281292 250366
5462 250366 -4078187 -8501862 -11885099 -12746056 -9797200 -3623217 2797140 6019129 4708562
5453 4708562 324129 -4334346 -6959060 -6669204 -4219279 -1805304 -1956144 -5392775 -9687543
5444 -9687543 -11006114 -8010409 -3539498 -1486936 -2307306 -2791987 -322115 4128408 7913129
5435G913129K264829J666085J079417r54156l425761m085645k815628j465073
5427A77197n70360J154005L473046L565794R7601l837683m402585k177992o92512
5418c213489p64903M9444K329965L129072Q90599j500742j007458R55977J074854
5409A943319p43725j892925j321298j94658P39847J470152J164837o35551j853942
5400a323944j89656K672212K728077k02025j747563N30302L472178L013086k84787
5391H667880k618657j889844P48294K830787K489784k49622k876200k561636J03382
5382D644168J398357m00606k468011j756459L51865K92456k201594l694279j810939
5373e645042J784599L444381J377408k624681m758442k901517J043140L324043
$$ plain form
5435 7913129 10177958 11844043 12923460 11969304 8543543 4457898 1642270 177197
5427 177197 -393163 760842 4233888 7799682 7897283 4059600 -342985 -2520977 -3213489
5418 -3213489 -3978392 -3928948 -1598983 1530089 2420688 919946 -87512 868465 1943319
5409 1943319 1199594 -693331 -2014629 -2209287 -1469440 712 1165549 529998 -1323944
5400 -1323944 -1513600 1158612 3886689 3684664 1937101 2467403 5939581 8952667 8667880
5391 8667880 6049223 4159379 4907673 7738460 10228244 9978622 7102422 4540786 4644168
5382 4644168 6042525 5641919 3173908 1417449 1769314 2061770 -139824 -3834103 -5645042
5373 -5645042 -3860443 -416062 961346 -1663335 -6421777 -9323294 -8280154 -4956111
5365d956111K757523J376293P14035j9571j250630j325786P68731L256704M076386
5356E397574L532660K608280Q76518j662711k917838j612227Q1254k57178j258472
5347D787860j96653K123879K639484J172313L81037R44806O91160j212423k821726
5338H509737k888355k529921k461301j550964M98554J604924K31471j881845j722073
5329b189773J051057L471093K521044j386691m400523l260698P34307L180780
5321b79404K202040L41950k6139k9780r68043j125599O39048J350762j370753
5312G34082l725873o65847N265277O627150K205204j526166q71291K89916j587162
5303F745290l818248l159854j556734j801772k211213l38304J910646J651823
$$ plain form
5365 -4956111 -2198588 -822295 -108260 -127831 -1378461 -2704247 -1935516 1321188 5397574
5356 5397574 8930234 11538514 12415032 10752321 7834483 6222256 6303510 6046332 4787860
5347 4787860 4591207 6715086 9354570 10526883 10907920 11852726 12543886 11331463 8509737
5338 8509737 5621382 3091461 630160 -920804 -422250 1182674 1414145 -467700 -2189773
5329 -2189773 -1138716 2332377 4853421 3466730 -933793 -4194491 -3460184 -279404
5321 -279404 1922636 2264586 2238447 2208667 1240624 115025 754073 2104835 734082
5312 734082 -2991791 -3657638 1607639 8234789 10439993 8913827 8042536 8332452 6745290
5303 6745290 2927042 -232812 -1789546 -3591318 -5802531 -6140835 -4230189 -2578366
5295b578366K63031N33192J434928N61632o75189O66793L364941L597547J040622
5286H209131j199177j796456j944703j720256j30718J726444J752510O20022M37546
5277E954343M69712j300238l171048j662090J673021J315997l337712o156374
5269f214389l403584J025176K504911K375641L523402L989078N47478m328312
5261A9401n020093j117710K104743J494065l71762j40699J673191K466352J153933
5252B261421j450338l856189m386716k169419J333193L156067K031409l11411
5244c391983j423888m94043J689981L472716K765277j211441n861265o963371
5236a1418017l665951K53093J527309J527832K997080M861829L882236M77164
$$ plain form
5295 -2578366 -2315335 -1782143 -347215 214417 -460772 206021 3570962 7168509 8209131
5286 8209131 7009954 5213498 3268795 1548539 1417821 3144265 4896775 5516797 5954343
5277 5954343 6424055 5123817 1952769 290679 1963700 3279697 -58015 -6214389
5269 -6214389 -9617973 -8592797 -6087886 -3712245 -188843 3800235 4347713 19401
5261 19401 -5000692 -6118402 -4013659 -2519594 -2891356 -3032055 -1358864 1107488 2261421
5252 2261421 811083 -3045106 -7431822 -9601241 -8268048 -5111981 -3080572 -3391983
5244 -3391983 -4815871 -5309914 -3619933 -147217 2618060 1406619 -4454646 -11418017
5236 -11418017 -15083968 -14830875 -13303566 -11775734 -8778654 -3916825 -34589 442575
5228D42575j219409M23009K117254R87743j077499q74088R13970J077338j060154
5219A730739l101335l416255k609705j347167N15547K325960K615459J331743
5211a955014J07604k35512n38817j156613j013520L70863J770799K037917J308695
5202F96402j65418k298805l567537j818430J842324K820544q65319m746431l426246
5193a1528916J853607M990533L433510O42880L139N04471m4863j055079q17606
5184b018324K62762O72754N26581Q83829J309934M79826j195061j728858m74633
5175a281190R06263P85290n25963j696037k020449j520957l22417J291758K664252
5166a719450L162253K587482J106762p06128j741275j175888K11245N06615r38064
$$ plain form
5228 442575 -776834 -353825 1763429 2751172 1673673 799585 1713555 2790893 1730739
5219 1730739 -1370596 -4786851 -7396556 -8743723 -8228176 -5902216 -3286757 -1955014
5211 -1955014 -1847410 -2082922 -2621739 -3778352 -4791872 -4421009 -2650210 -612293 696402
5202 696402 530984 -1767821 -5335358 -7153788 -5311464 -2490920 -3356239 -8102670 -11528916
5193 -11528916 -9675309 -4684776 -1251266 -608386 -605247 -100776 -145639 -1200718 -2018324
5184 -2018324 -1755562 -1082808 -556227 327602 1637536 2117362 922301 -806557 -1281190
5175 -1281190 -374927 410363 -115600 -1811637 -3832086 -5353043 -5675460 -4383702 -1719450
5166 -1719450 1442803 4030285 5137047 4430919 2689644 1513756 1725001 2231616 1293552
5157A293552k545043k804288k428384k807917l244109j800603J292784L339304
5149i704704K797700J202517N89532Q83756J115110J510764K599993L415547K508150
5140F918365J67859j963466l046652l438452l429227k951437k189265j377215
5132a1309490m43410L77787N40382N68403J843321L851604L829468J079538q93578
5123e55975M57605J947958o94332n283702n679266j214096K282162J576618J24593
5114g038435J092063K166126P55684p34377O19815K417973P15060k945527l525324
5105f476942k04215K736362K375788L37442o92114j95723R33530J773159J549952
5096B137239L01393o74892m91544q0969m22180o49570J46527P99676J47976m15087
$$ plain form
5157 1293552 -1251491 -4055779 -6484163 -9292080 -12536189 -14336792 -13044008 -9704704
5149 -9704704 -6907004 -5704487 -5114955 -4231199 -3116089 -1605325 994668 4410215 6918365
5140 6918365 7086224 5122758 2076106 -1362346 -4791573 -7743010 -9932275 -11309490
5132 -11309490 -11752900 -11375113 -10834731 -10266328 -8423007 -4571403 -741935 337603 -555975
5123 -555975 -98370 1849588 1155256 -4128446 -9807712 -11021808 -8739646 -7163028 -7038435
5114 -7038435 -5946372 -3780246 -3024562 -3758939 -3139124 -721151 -6091 -2951618 -6476942
5105 -6476942 -6681157 -3944795 -1569007 -1231565 -1923679 -2119402 -1185872 587287 2137239
5096 2137239 2438632 1763740 1272196 1191227 769047 119477 266004 1065680 1213656 798569
5086G98569O44503J672640M02261j538789q33185J642621J789190q67472k227012
5077A483326n23764P51679r17618k372453J51727M405821M818321L69575m179839
5068C986775m781793k488447n71924P0161Q41672K192298K702756J599269L50194
5059C900961M83438R21022n25134l270803m008298j417484J492601J357019j104266
5050b170944k624545j857696k2309J732473L027887L004438J015869j505118k135451
5041a535396n50277J278511J857703J367398L35499r12381j532926p76362O24411
5032A56180J304824J325159J651174J913516P98114j310214k256389j176683K26675
5023B632356K15293o27075n02372R17593J793619K84063k671196l504579k08797
$$ plain form
5086 798569 1443072 3115712 3517973 1979184 1145999 2788620 4577810 3710338 1483326
5077 1483326 959562 1711241 793623 -1578830 -1427103 2978718 7797039 8166614 3986775
5068 3986775 -795018 -3283465 -3855389 -3785228 -2943556 -751258 1951498 3550767 3900961
5059 3900961 4384399 5305421 4780287 1509484 -2498814 -3916298 -2423697 -1066678 -2170944
5050 -2170944 -4795489 -6653185 -6675494 -4943021 -1915134 1089304 2105173 600055 -1535396
5041 -1535396 -2085673 -807162 1050541 2417939 2753438 1841057 308131 -468231 156180
5032 156180 1461004 2786163 4437337 6350853 7148967 5838753 3582364 2405681 2632356
5023 2632356 2847649 2220574 1718202 2635795 4429414 4713477 2042281 -1462298 -1671095
5014a671095M125166M282886k60238m344290l991412j082944O75397J051341J602550
5005C87361J719755J71537j480640q77246J157005K065187J566416R95533L71851
4996F076759n11564r9955K054838K614462j005294n420027n422857j664214Q69161
4987b508691N46714j22266j46561p52728j193596L92099K424449J833585n4725
4978D18280M83106K389200J248270k401199l307577m74856J359949J99944n56374
4969f41257N61569M19202j939318k795752n41455J508069J373220J065117R96382
4960E777j305359m693586m069875O70500K973770J21651k452091j095215l2782
4951i877210k752365n153232k952543J083288K985166L966280N378799M195298
$$ plain form
5014 -1671095 2454071 6736957 6476719 2132429 -1858983 -2941927 -2266530 -1215189 387361
5005 387361 2107116 2278653 798013 -79233 1077772 3142959 4709375 5704908 6076759
4996 6076759 5565195 5465240 7520078 10134540 9129246 3709219 -1713638 -3377852 -2508691
4987 -2508691 -1961977 -2084243 -2230804 -2983532 -4177128 -3785029 -1360580 473005 418280
4978 418280 901386 3290586 4538856 2137657 -1169920 -1644776 -284827 -84883 -641257
4969 -641257 -79688 339514 -1599804 -4395556 -4937011 -3428942 -2055722 -990605 5777
4960 5777 -1299582 -5993168 -10063043 -9392543 -6418773 -6297122 -8749213 -9844428 -9877210
4951 -9877210 -12629575 -17782807 -20735350 -19652062 -16666896 -12700616 -7321817 -3126519
4943c126519l92285k681008O13167L655186P70924l793881l023875J466442L080221
4934c431628P29671j822354l112244l595428j996487J680935L493682J508743
4926f545110j88632J435762K975492J561256N12481K101198K149038j481200l139460
4917f19175L34434K412384j338357l703071J543200O916299L451843l060156j902412
4908D034989M003573M136794j159447l349503j829355k422675m071842j619661
4900b277127K204283J578680m50177J346038K173901l259702o898552k92920P145302
4891A269726K718112n482727j940814P250552M971972m486696l082182O312248
4883G530191N380362l206025o38797Q824945L808450q924743j694534J7930180
$$ plain form
4943 -3126519 -3518804 -6199812 -5586645 -1931459 -1160535 -4954416 -7978291 -6511849 -3431628
4934 -3431628 -2701957 -4524311 -7636555 -11231983 -13228470 -11547535 -8053853 -6545110
4926 -6545110 -6733742 -5297980 -2322488 -761232 -248751 1852447 4001485 2520285 -619175
4917 -619175 -284741 2127643 789286 -2913785 -1370585 5545714 8997557 5937401 4034989
4908 4034989 8038562 12175356 11015909 7666406 5837051 3414376 -657466 -2277127
4900 -2277127 -72844 1505836 1055659 2401697 4575598 1315896 -5582656 -5875576 1269726
4891 1269726 3987838 -1494889 -3435703 3814849 8786821 4300125 1217943 7530191
4883 7530191 12910553 9704528 9065731 17890676 21699126 12774383 11079849 29010029
4875B9010029J4291459n53545L3665607J16077541J44697852M7986745r5762048
4868B89413640j47696022q6227649j4330900l928436k0632895j3215044N656283
4861I038977L725169q406722m778953O541901L900768o033179m059209M585674
4853D514426K347106p223097p916472o82848J533375r77338J305447N881232L166589
4844A948420l571066l413617K124012K603724k075429l034753M94779J313982
4836c609948j250354j431960P59094N19434r69852J041989M236788K644248j872710
4827F6729k672515j74153J86925j044439O68983L577455K403044r02864j36512
4818A972653L332449K694521j722316k976657k9155Q89200k322028m673549l262006
$$ plain form
4875 29010029 43301488 42747943 76413550 192491091 337188943 385175688 289413640
4868 289413640 141717618 55489969 41159069 37230633 16597738 3382694 9038977
4861 9038977 12764146 4357424 -421529 6120372 10021140 3987961 -71248 4514426
4853 4514426 6861532 -361565 -8278037 -8960885 -7427510 -8404848 -7099401 -1218169 1948420
4844 1948420 -1622646 -5036263 -2912251 -308527 -2383956 -5418709 -4923930 -3609948
4836 -3609948 -4860302 -6292262 -5533168 -5013734 -5983586 -4941597 -704809 1939439 66729
4827 66729 -2605786 -2779939 -2593014 -3637453 -2968470 608985 3012029 2109165 1972653
4818 1972653 5305102 7999623 6277307 3300650 3271495 4160695 1838667 -2834882 -6096888
4809f096888o73912J311026L389220M069518J168806k337727j706636J128271
4801B51678O01572k180014j316956K399215J974786l157115n207813q39581L668635
4792c805593L172289Q78712J010124J948109R73697n75683r66183j425630k360468
4783a150626j328779K044731L980687K288749l95760j602301k421606l402590
4775a987495k160418J759038M240875K281296j514603l185914k575888j396292
4767d539401K68964K436376L277682J726282l26206p28132K68230J554165K662306
4758F600266K482034k22780l607307l753635o56558P46553k125840n150504l604217
4749i291988Q33482K937952J300905r84244j436988m99612N18229J029432R96524
$$ plain form
4809 -6096888 -6770800 -5459774 -2070554 1998964 3167770 830043 -876593 251678
4801 251678 853250 -1326764 -2643720 -244505 1730281 -1426834 -6634647 -7474228 -3805593
4792 -3805593 -633304 245408 1255532 3203641 4177338 3601655 2635472 1209842 -1150626
4783 -1150626 -2479405 -434674 3546013 5834762 5439002 3836701 1415095 -1987495
4775 -1987495 -4147913 -2388875 1852000 4133296 2618693 -567221 -3143109 -4539401
4767 -4539401 -4270437 -1834061 1443621 3169903 2843697 2115565 2383795 3937960 6600266
4758 6600266 9082300 8859520 5252213 1498578 842020 1588573 -537267 -5687771 -9291988
4749 -9291988 -8458506 -5520554 -4219649 -5203893 -6640881 -7140493 -6622264 -5592832 -4596308
4740d596308R81420J861399L252017L193123P03907k355859l316590j875818j91434
4731b344143k82862j922248k767550p37668L123044M944354K484689j703959l411134
4722b617477j994274q4273Q37958J439740J699639N35704j627731k996273l186461
4713g993448l024632k007020O70441L064656K467364K10903R9021K016368K037024
4704b459323n68302j878887k41949R60824k44486o96662J897920M141662K220745
4695C131542j841622l408060j755014M65180J751656K178993J527977J82031k34805
4686A997878K53182q42522l711004m124346K31569M685030L566887j281490l258170
4677b482986p14814J572320L49169j890982j662769N79895J991663J293907l00347
$$ plain form
4740 -4596308 -3614888 -1753489 1498528 4691651 5395558 3039699 -276891 -2152709 -2344143
4731 -2344143 -2627005 -4549253 -7316803 -8054471 -4931427 12927 2497616 793657 -2617477
4722 -2617477 -4611751 -4696024 -3858066 -2418326 -718687 -182983 -1810714 -4806987 -7993448
4713 -7993448 -11018080 -13025100 -12354659 -9290003 -6822639 -6611736 -6512715 -4496347 -2459323
4704 -2459323 -3027625 -4906512 -5148461 -4187637 -4432123 -5128785 -3230865 910797 3131542
4695 3131542 1289920 -2118140 -3873154 -3407974 -1656318 522675 2050652 2232683 1997878
4686 1997878 2251060 1408538 -2302466 -6426812 -6195243 -1510213 2056674 775184 -2482986
4677 -2482986 -3197800 -1625480 -1276311 -3167293 -4830062 -4250167 -2258504 -964597 -1264944
4668a264944q03000N78685K453710K462223J72424k103224k210243n85587J125187
4659a74769K134511K009899K16763k200324k637596n27702J279000P36754k98441
4650E38095L33133J072037n13490l056375l264855j002185J008925J421813R79849
4641b483053J41167q34091n60011J529108L042692J652451r52680j512207l75658
4632c52282m82920k072073k416906n56569J469570K163883K033731J509366M80856
4623A776656j43810P13238K100360K312026J710206J549199J103930q03590k624538
4614G693677k138828o02150q02245j981009j187486J027504J165454j193986k885416
4605i04485k755920k698043k776550p14297K865336M087231K138749P71676J874622
$$ plain form
4668 -1264944 -2067944 -1489259 964451 3426674 3599098 1495874 -714369 -1299956 -174769
4659 -174769 1959742 3969641 4186404 1986080 -651516 -1179218 99782 836536 538095
4650 538095 871228 1943265 1429775 -1626600 -4891455 -5893640 -4884715 -3462902 -2483053
4641 -2483053 -2341886 -3175977 -3735988 -2206880 835812 2488263 1535583 23376 -352282
4632 -352282 -835202 -2907275 -5324181 -5880750 -4411180 -2247297 -213566 1295800 1776656
4623 1776656 1632846 2346084 4446444 6758470 8468676 10017875 11121805 10318215 7693677
4614 7693677 5554849 4952699 4150454 2169445 981959 2009463 3174917 1980931 -904485
4605 -904485 -3660405 -6358448 -9134998 -9849295 -6983959 -2896728 -757979 13697 1888319
4596A888319K712541J478789L46384O33291J46203j836985k076641P71099K704416
4587F767416P03251j961598j130631J425695J325820j372553l136167k635873
4579a4640j228539K21771J237765M79134j920397k941814q99261J449786J374116
4570b242079P33631K096210L441478J642626j357236j300434J233562J937203
4562F184961j12434j849394k036238k371265l002983k069422P3624R44118O01849
4553c637184J606220L795856L698993J22692l803686n226611m520860k873609
4545a0838189o22995J237696J522803J398906K747462L774690Q50171m516582
4537d446038n798760o22158N060950M990131P27044j741183l10913K148787K909835
$$ plain form
4596 1888319 4600860 6079649 6426033 7059324 7205527 5368542 3291901 4063000 6767416
4587 6767416 7470667 5509069 4378438 5804133 7129953 5757400 2621233 -14640
4579 -14640 -1243179 -1021408 216357 695491 -1224906 -4166720 -5065981 -3616195 -2242079
4570 -2242079 -1508448 587762 4029240 5671866 4314630 3014196 4247758 6184961
4562 6184961 6072527 4223133 2186895 -184370 -3187353 -5256775 -5183151 -4239033 -3637184
4553 -3637184 -2030964 1764892 5463885 5586577 1782891 -3443720 -7964580 -10838189
4545 -10838189 -11461184 -10223488 -8700685 -7301779 -4554317 -779627 70544 -4446038
4537 -4446038 -10244798 -10866956 -5806006 -815875 -88831 -1830014 -2140927 7860 2917695
4528B917695J953501L90668r53742j747415k380075l273397l448803j474778J655858
4519f360488K988178J832769Q57484J698596K325553N87036k201568l309971k128175
4510c710586J88989K530432L562838J859932j837723m471440m356514k955870
4502i189942j791962l87771J254217J473629L67539R07105L965202N739322L416130
4493E753469j6452n05274P85951N35835l23241J208439L572990K328149k142487
4484A1197379m474118k367200M79346O22917o00091n06394P88148J572772J134940
4475G847699k65172j822909j961453N2863K159822J765582k55276q99286l7139
4466F584731k95404j974659k476787j416036j572358l330728k966427J177836
$$ plain form
4528 2917695 4871196 5261864 4308122 2560707 180632 -3092765 -6541568 -8016346 -6360488
4519 -6360488 -3372310 -1539541 -682057 1016539 3342092 3929128 1727560 -1582411 -3710586
4510 -3710586 -3521597 -991165 2571673 4431605 2593882 -1877558 -6234072 -9189942
4502 -9189942 -10981904 -11369675 -10115458 -8641829 -8274290 -7367185 -3401983 2337339 5753469
4493 5753469 5737017 5231743 6017694 6553529 6230288 7438727 11011717 13339866 11197379
4484 11197379 6723261 4356061 4835407 5458324 4858233 4351839 5139987 6712759 7847699
4475 7847699 7582527 5759618 3798165 3851028 6010850 7776432 7521156 6621870 6584731
4466 6584731 6289327 4314668 1837881 421845 -1150513 -4481241 -7447668 -6269832
4458f269832N189863N211645K718800R73221j65128k112829l422406k144989j00238
4449a21893l55651j942592j443908J061508K012794K20651j347872l21303J876736
4440c61530K660421J568663j86804j536831j909808j139427J85831J062159R85118
4431A327792L3571j401568k242143j206882J060620J707403o41987l282805k931990
4422g577989o01590J16320j142665j159795J253224L193885K455038Q66113Q77623
4413a719836J730390J472171M70250J68726O6002j143645k529858k011579L4336
4404c463043J137275O51574M68032J370277J521323k25869j987771j646568j61089
4395b335859J6286j415138k720767l021362k716599j507504J331730M452792M847171
$$ plain form
4458 -6269832 -1079969 4131676 6850476 7823697 7658569 5545740 2123334 -21655 -121893
4449 -121893 -477544 -2420136 -3864044 -2802536 -789742 -569091 -1916963 -2238266 -361530
4440 -361530 2298891 3867554 3680750 2143919 234111 -905316 -719485 342674 1327792
4431 1327792 1361363 -40205 -2282348 -3489230 -2428610 -721207 -1363194 -4645999 -7577989
4422 -7577989 -8179579 -8063259 -9205924 -10365719 -9112495 -5918610 -3463572 -2597459 -1719836
4413 -1719836 10554 1482725 1952975 2121701 2187703 1044058 -1485800 -3497379 -3463043
4404 -3463043 -2325768 -1674194 -1206162 164115 1685438 1459569 -528202 -2174770 -2335859
4395 -2335859 -2319573 -3734711 -6455478 -9476840 -12193439 -13700943 -12369213 -7916421 -3069250
4386c069250J764413j937533l484909l098516j885953O06558M292529O190155
4378f22506L722670o06398j624904J371590L575520J621670j947191k969254j429889
4369A091308l54602r57349j745589j495765o02088K34552P29651N88197r6385
4360b608070k11736J190461L192447L739525K063581n59720k320072k335464r59342
4351A191610M94478O61528m46748j327885r60843j50406j482J1491J044822K623180
4341C139745L067302K004735Q76331Q20130J405769J669966J143128m18021k978187
4332A0730898n274278n092955j641743K757880M377506J760228k692115n065943
4324a40522l732605n72134J434896J211189q9542r37611o46396Q01991K824720
$$ plain form
4386 -3069250 -1304837 -3242370 -6727279 -9825795 -11711748 -11105190 -6812661 -622506
4378 -622506 3100164 2493766 868862 2240452 5815972 7437642 5490451 2521197 1091308
4369 1091308 736706 -220643 -1966232 -3461997 -4064085 -3829533 -3099882 -2511685 -2608070
4360 -2608070 -2819806 -1629345 1563102 5302627 7366208 6806488 4486416 2150952 1191610
4351 1191610 1686088 2347616 1900868 572983 -387860 -538266 -539748 -528257 516565 3139745
4341 3139745 6207047 8211782 9088113 9908243 11314012 12983978 14127106 13709085 10730898
4332 10730898 5456620 363665 -1278078 1479802 5857308 7617536 4925421 -140522
4324 -140522 -3873127 -4445261 -3010365 -1799176 -1888718 -2826329 -3472725 -2670734 153986
4315A53986M045626L242195Q54664j336763k213688k072279j419457l63322N43545
4306A434507K81984j221770k759681l320828k845979j404147R36186L150134L713722
4297b035872K432402N12311j139926k072933j260959J538203L672796K142066
4289C788088j481423k477737j56414Q00236j990172m279490j766636L083164M925432
4280D45048L022909L95812j849281m413766n792558l448256J529605N120346N449002
4271D58861L818634J496827j068333k657939k318973j230073o37517M98667K623793
4262I83947K788100q91075m313692k428042K491336L716420K69068k346675j481604
4253a212217l95076r62645l80356K464729L664190O72433l100828l542017j457459
$$ plain form
4315 153986 4199612 7441807 8296471 6959708 4746020 2673741 1254284 890962 1434507
4306 1434507 1716491 494721 -2264960 -5585788 -8431767 -9835914 -8899728 -5749594 -2035872
4297 -2035872 396530 908841 -231085 -2304018 -3564977 -2026774 1646022 3788088
4289 3788088 2306665 -171072 -327486 472750 -1517422 -5796912 -7563548 -4480384 445048
4280 445048 3467957 3863769 2014488 -2399278 -8191836 -11640092 -10110487 -4990141 458861
4271 458861 4277495 5774322 4705989 2048050 -270923 -1500996 -2138513 -1639846 983947
4262 983947 3772047 2880972 -1432720 -3860762 -1369426 2346994 2616062 269387 -1212217
4253 -1212217 -1607293 -2569938 -2950294 -485565 3178625 3851058 750230 -2791787 -4249246
4244d249246K42677J147841J975810J971697P38792j29563K26721L12457m99345
4235A737841j56297K356020M418494L398183M13577j741349k236773j892285j330977
4226D966434j076605j611953k198824j426873N75233K395015L529909L975351
4218I127687K654916n05257k342239m87741J849368J82383l658397m185992j166717
4209A468011R64035J420054K939495M135020R53835m145637m118186P59485K946250
4200G322362O66273k9588K345189K385629k008J587165O138226M950510r14004
4191B4449754J46256Q323208R308219R91395N12671J2691000J7629358Q660889
4183H2712750J3437286M6097732O4384001J9581378o2960103j03315110o9664911
$$ plain form
4244 -4249246 -4006569 -2858728 -882918 1088779 1827571 1698008 1924729 2237186 1737841
4235 1737841 1581544 3937564 8356058 11754241 12167818 10426469 8189696 6297411 4966434
4226 4966434 3889829 2277876 79052 -1347821 -772588 1622427 5152336 9127687
4218 9127687 11782603 11277346 8935107 8447366 10296734 10479117 6820720 2634728 1468011
4209 1468011 2432046 3852100 6791595 10926615 11880450 7734813 3616627 4376112 7322362
4200 7322362 7988635 7959047 10304236 12689865 12687857 14275022 20413248 25363758 24449754
4191 24449754 24596010 32919218 42227437 43218832 43731503 56422503 74051861 82712750
4183 82712750 96150036 142247768 206631769 226213147 163253044 59937934 -9726977
4176i726977j4311217N139554m822208o820762M215727P030084j138849l502435
4168b3937083L023880N332304Q35121M31459N917591O768779L36015l700819j016753
4159f009506J346550q63934k761185r84909Q12526j26221j638840k260332k806587
4150a5292438j891104K338600O255776M447777j055052l024822j1329K602425
4142e630167K019129Q88706R59083R86810Q44134J356972Q02077k372688m894200
4133e040144l027806N76139J152993J89466J807113L667328N08196n286407o304358
4124a1757480k173133P12562Q42857K752640O398542O049184J328197r25072J606516
4115D834813K783791r29723m526959l514805q00737l27594r71693p83443q38833
$$ plain form
4176 -9726977 -24038194 -18898640 -23720848 -30541610 -26325883 -19295799 -20434648 -23937083
4168 -23937083 -20913203 -15580899 -14745778 -14314319 -8396728 -1627949 -1291934 -4992753 -6009506
4159 -6009506 -4662956 -5526890 -8288075 -9272984 -8460458 -8586679 -10225519 -12485851 -15292438
4150 -15292438 -17183542 -14844942 -8589166 -4141389 -5196441 -8221263 -8232592 -5630167
4142 -5630167 -3611038 -2722332 -1763249 -776439 67695 1424667 2226744 -145944 -5040144
4133 -5040144 -8067950 -7491811 -6338818 -6149352 -4342239 -674911 -166715 -5453122 -11757480
4124 -11757480 -13930613 -13218051 -12375194 -9622554 -3224012 2825172 4153369 3228297 4834813
4115 4834813 7618604 6688881 2161922 -1352883 -2153620 -2481214 -3452907 -4236350 -5075183
4106e075183j337562q0273K170079J278045k548811l596767j70027K135508J69415
4097g055576j536899L72105J804811p33979l173110j342450J154538l51663k654834
4088a3517057k20877M607178M983243N16324k610176j189926J731841K643222
4080c056228J435570m23554j742681j769273q71437j30892Q74138L270446M972908
4071B558997K077888l893430n768873j119261L122055J185918k515974j348584
4063e701264K176662J258520k960110l322819J037131L535409J176936j736217
4055d535752j970796j678060k432274j948532N69778J829468K22525r79215O68524
4046a0254334K551551J845252L62735P38951J419248j25341j907868j34885L893036
$$ plain form
4106 -5075183 -6412745 -6493018 -4322939 -3044894 -5593705 -9190472 -9360499 -7224991 -7055576
4097 -7055576 -8592475 -8220370 -6415559 -7149538 -10322648 -11665098 -10510560 -10862223 -13517057
4088 -13517057 -13737934 -9130756 -4147513 -3631189 -6241365 -7431291 -5699450 -3056228
4080 -3056228 -1620658 -2044212 -3786893 -5556166 -6427603 -6558495 -5684357 -2413911 2558997
4071 2558997 4636885 743455 -5025418 -6144679 -3022624 -1836706 -4352680 -5701264
4063 -5701264 -3524602 -2266082 -5226192 -8549011 -7511880 -3976471 -2799535 -4535752
4055 -4535752 -6506548 -8184608 -10616882 -12565414 -11995636 -10166168 -9943643 -10922858 -10254334
4046 -10254334 -7702783 -5857531 -5494796 -4755845 -3336597 -3461938 -5369806 -5504691 -1611655
4037a611655M654090N38335l350715k303422J529619K692179L51113j083914J009101
4028B424731L659298L080613J41464j748567k091224l022045m596392m336975
4020f489097j632884J106665K359620L046839L342795J719044j377264k685046
4012f09328j037310M31171o10067j821299l22691K479275L503787K742028J976558
4003F732124J121874o52940k148556j889112r20830q16217q44656j10681j04617
3994C66389j695650k152787P71637M125779L646326L76277j403418j117480j545857
3985A371216k828096k445165o33874j90431r00333J95636K545625J925272k190039
3976c150189m715394k585365O64779O40026j754411k783931j173162J743942M341263
$$ plain form
4037 -1611655 3042435 3580770 230055 -2073367 -543748 2148431 2499544 1415630 2424731
4028 2424731 6084029 9164642 9306106 7557539 5466315 2444270 -2152122 -6489097
4020 -6489097 -8121981 -7015316 -4655696 -1608857 1733938 3452982 2075718 -609328
4012 -609328 -1646638 -1215467 -1825534 -3646833 -3969524 -1490249 2013538 4755566 6732124
4003 6732124 7853998 7201058 5052502 3163390 2242560 1426343 581687 471006 366389
3994 366389 -1329261 -3482048 -2710411 1415368 5061694 5437971 4034553 2917073 1371216
3985 1371216 -1456880 -3902045 -4535919 -4726350 -5626683 -5431047 -2885422 -960150 -3150189
3976 -3150189 -7865583 -10450948 -9786169 -9146143 -10900554 -13684485 -14857647 -13113705 -8772442
3967h772442M904323K253579j738768k969707m51411J976604J334818k17602N40053
3958c140553K516666K470310L78183j069043j045829j059761j447993q45891P05130
3949b538781J159826k15960j311737j45003K295232L467878K430998K67892j858966
3940C551379l489379l898664k210436P80225K523430J872680R51926J861660K811926
3931D754747N96879l689761n353745l030841o42778q70716j154650J039355L280320
3922e071190K415118M2711q42384j387516l737698n213906j962255L391469M585148
3913g780503J512101J63840K551123L873994J214044j866419j995427j075349
3905c402596j456535j473610N25381K334288J820143P00515Q63267P30736j123269
$$ plain form
3967 -8772442 -3868119 -1614540 -3353308 -6323015 -6774426 -4797822 -3463004 -3680606 -3140553
3958 -3140553 -623887 1846423 2224606 1155563 109734 -950027 -2398020 -3243911 -2538781
3949 -2538781 -1378955 -1594915 -2906652 -3051655 -756423 2711455 5142453 5410345 3551379
3940 3551379 62000 -3836664 -6047100 -5266875 -2743445 -870765 81161 1942821 4754747
3931 4754747 5351626 1661865 -3691880 -6722721 -7365499 -8236215 -9390865 -8351510 -5071190
3922 -5071190 -2656072 -2613361 -3455745 -4843261 -8580959 -13794865 -15757120 -12365651 -7780503
3913 -7780503 -6268402 -6104562 -3553439 320555 1534599 -331820 -2327247 -3402596
3905 -3402596 -4859131 -6332741 -5807360 -3473072 -1652929 -952414 -89147 641589 -481680
3896d81680k384380q21974J547768J856413R14823P42806O58055m09436q16510
3887H05885N16512Q15106k042528m637548k766103J334685K223861P3962O6683
3878c609485L437986N371977K842186r24495j836019m41133M15131J92081K55442
3869E703671Q95705J073201K13571j192068k294596k575632k285768k249921k743638
3860e455475k982572k333192j226128j54451J008300J790609R57887j052967j565762
3851a1013751M89354K288187J268597n28083L48403K921116L229643P44770j000754
3842a252518k28006Q32326K71886p11957o89134m04726o86033n84198O87806J981494
3832g83060J865812N23245r68001j778496j286564L19443J133803n26212k927148
$$ plain form
3896 -481680 -2866060 -3688034 -2140266 -283853 630970 1373776 2031831 1622395 805885
3887 805885 1322397 2137503 94975 -4542573 -7308676 -5973991 -3750130 -3676168 -3609485
3878 -3609485 -171499 5200478 8042664 7118169 5282150 4841017 5256148 5448229 5703671
3869 5703671 6599376 7672577 7886148 6694080 4399484 1823852 -461916 -2711837 -5455475
3860 -5455475 -8438047 -10771239 -11997367 -12151818 -11143518 -9352909 -8395022 -9447989 -11013751
3851 -11013751 -10524397 -8236210 -6967613 -7495696 -7147293 -4226177 -996534 -251764 -1252518
3842 -1252518 -1480524 -648198 -376312 -1088269 -1777403 -2182129 -2868162 -3452360 -2764554 -783060
3832 -783060 1082752 1605997 637996 -1140500 -2427064 -2107621 -973818 -1500030 -4427178
3823d427178k437998R37296K697783K31112k956680k074957K184833N003262M237850
3814C395323K335780J639521J220166m87907k494629k694692j191852j29878n73422
3805A018410j458306j925143k758778m290364m523559j624237K453031L621804
3797i487142J263127o47200Q65676L785586M602195L290817K104125J319897n25322
3788F571759l166747m582108m039811k434788j18490K729898M175704K392839
3780A528256o73023j146537R34493J464253j117680l099408j311538J956273K591412
3771A126501M30145j619847k186367k065114j560650j78391J564173K401610K159166
3762G1226J619780J041473L22990l6646L03475N03425k05704j023755r18637n89110
$$ plain form
3823 -4427178 -6865176 -5927880 -3230097 -2998985 -5955665 -8030622 -5845789 -842527 3395323
3814 3395323 5731103 7370624 8590790 8102883 5608254 2913562 1721710 1591832 1018410
3805 1018410 -439896 -2365039 -5123817 -9414181 -13937740 -15561977 -13108946 -9487142
3797 -9487142 -8224015 -8871215 -8005539 -4219953 382242 3673059 5777184 7097081 6571759
3788 6571759 3405012 -1177096 -5216907 -7651695 -7770185 -5040287 -864583 1528256
3780 1528256 855233 -291304 643189 2107442 989762 -2109646 -3421184 -1464911 1126501
3771 1126501 1556646 -63201 -2249568 -4314682 -5875332 -6053723 -4489550 -2087940 71226
3762 71226 1691006 2732479 3055469 3018823 3322298 3825723 3620019 2596264 1677627 1088517
3752A088517j220447j990333r74351J682005L545693K997100Q59949j196274k295734
3743B496125k246822j354247o21076p76308r87959l3897J237615O18496j789589
3734c457662k858878p07670K254641K528710L92977q58656J20237J268213R06028
3725d12060K92888J040727K069367J264668r63721k112416j281272k31093m14683
3716g47595r80146o69542o8052n41635j872114k349702q68561J982397M526475
3707a588475N034626K862033n54971k497318j752326k4608L70318o01463j372727
3698a24911j495490j865848k577670k502081j221913K74623J203432J810224K201032
3689d298602J870157J011435Q42456J697929J988060J96165k817376m567142l668053
$$ plain form
3752 1088517 -131930 -2122263 -3096614 -1414609 2131084 5128184 5988133 4791859 2496125
3743 2496125 249303 -1104944 -1726020 -2502328 -3490287 -3524184 -2286569 -1668073 -3457662
3734 -3457662 -6316540 -7024210 -4769569 -2240859 -1847882 -2706538 -2586301 -1318088 -412060
3725 -412060 -119172 921555 2990922 4255590 3291869 1179453 -101819 -332912 -747595
3716 -747595 -1727741 -2397283 -2465335 -3006970 -4879084 -7228786 -8097347 -6114950 -1588475
3707 -1588475 3446151 6308184 5753213 3255895 1503569 1478961 1849279 1247816 -124911
3698 -124911 -1620401 -3486249 -6063919 -8566000 -9787913 -9513290 -8309858 -6499634 -4298602
3689 -4298602 -2428445 -1417010 -574554 1123375 3111435 3307600 490224 -4076918 -7744971
3680g744971j103067R71417J218001J84368l35507P00293K192450K109265J79835
3671a627916j466950q24102J497171K967797K066244q3348j125019l18179M19377
3662A505075j129084m118741m814362j078257M183694N697511J907663l142028
3654i88529m512829j720873J517695K108339Q22828M23827J508094J656853p66073
3645D9332l439346k710209J064379L489348K126594l03908m21354Q22673M43090
3636A120599j327213j626131J84544J787210J733107P25479q49214l340217n457409
3627g049245m770797j412723J549853K234784J815529J741856J965422K526366
3619a398955L784274M313453J951103k050847l574828j680164j40520j119039
$$ plain form
3680 -7744971 -8848038 -7876621 -6658620 -6474252 -6809759 -6109466 -3917016 -1807751 -1627916
3671 -1627916 -3094866 -3918968 -2421797 546000 2612244 2528896 1403877 1085698 1505075
3662 1505075 375991 -3742750 -8557112 -9635369 -5451675 245836 2153499 -988529
3654 -988529 -5501358 -7222231 -5704536 -3596197 -2773369 -2349542 -841448 815405 49332
3645 49332 -3390014 -6100223 -5035844 -1546496 580098 276190 -145164 677509 1120599
3636 1120599 -206614 -1832745 -1648201 139009 1872116 2597595 1748381 -1591836 -7049245
3627 -7049245 -11820042 -13232765 -11682912 -9448128 -7632599 -5890743 -3925321 -1398955
3619 -1398955 2385319 6698772 8649875 6599028 3024200 1344036 1203516 84477
3611H4477j682530N50061K638442J210119j546103j571444J55218l10851k678464
3602c151075k808732L04905L120758L317840K347662J613373L92171j384350k111321
3593A641231j565935j613107k584598k208077L50886K443980J745860n18541j935240
3584d243541k030589j203580R71678M033533N295310K937192q62557k416296j256424
3575A224726k0214k81667r51097o99920K82278J293336K019265J905670K53405
3566E025782k281834l606924k595112o37584K15997q3048K3239J115852K055889
3557g67743J898572J142205N43244l9543p39759p85291K12598R89435K49711j068976
3547A634453j008642K62670O14376o74663j918643j837635j140570n68981L68250
$$ plain form
3611 84477 -1598053 -1047992 1590450 2800569 1254466 -316978 -161760 -472611 -3151075
3602 -3151075 -5959807 -5654902 -2534144 783696 3131358 4744731 5136902 3752552 1641231
3593 1641231 75296 -1537811 -4122409 -6330486 -5979600 -3535620 -1789760 -2308301 -4243541
3584 -4243541 -6274130 -7477710 -6506032 -2472499 2822811 5760003 4897446 2481150 1224726
3575 1224726 1204512 922845 -28252 -728172 -445894 847442 2866707 4772377 5025782
3566 5025782 2743948 -862976 -3458088 -4095672 -3879675 -3962723 -3939484 -2823632 -767743
3557 -767743 1130829 2273034 2816278 2776735 2036976 1251685 1464283 2453718 2703429 1634453
3547 1634453 625811 888481 1502857 828194 -1090449 -2928084 -4068654 -4637635 -4269385
3538d269385J663831K082157J450289J367859K109823J390773j651054l830314
3530C13979k209275J108035J911334M8227j082236j74684Q32020R03346J195083
3521B845829J856329J331212k96385o98532Q03918J853266Q58710p14173j276429
3512F563745j515651k190399k212013r53957j43869j245076k895889l122345k280978
3503i996432j544531k88613K263059M202498K933015n68321k568808j719116m62004
3494g749253o98986q95140R39669L580933M185609K418789N34403l87475j654162
3485B74387l612249l683742m6320M339557M609834O21978k722012k465432j221261
3476c905260j935239k821086j068290J382796O58651j974644j323619L363925
$$ plain form
3538 -4269385 -2605554 -523397 926892 2294751 4404574 5795347 4144293 313979
3530 313979 -1895296 -787261 1124073 1172300 90064 -84620 747400 1650746 2845829
3521 2845829 4702158 6033370 5736985 5038453 5842371 7695637 8554347 7840174 6563745
3512 6563745 5048094 2857695 645682 -308275 -452144 -1697220 -4593109 -7715454 -9996432
3503 -9996432 -11540963 -11829576 -9566517 -5364019 -2431004 -2999325 -5568133 -7287249 -7749253
3494 -7749253 -8448239 -9343379 -8403710 -4822777 -637168 1781621 2316024 1928549 274387
3485 274387 -3337862 -7021604 -7067924 -2728367 1881467 2503445 -218567 -2683999 -3905260
3476 -3905260 -5840499 -8661585 -9729875 -8347079 -7688428 -9663072 -10986691 -7622766
3468g622766O579193M554695L87114j210899l70536k85146j877636l377520l348838
3459f572339j622507J185729L157897K077709j079073k006892J181226M510738
3451H32488L457275n26724k463369j189662o1291r63126j855758q24681R67503
3442b627345J561712Q87382o6n57631p68796q44840j294310k159495k363203j148236
3432i314828L55585O79509M39561J096221J968980J167397p62356j115618P41844
3423d743705K376750K174351J246814M48291j366464m281210n350067k348171
3415a1843411K317577M153379K081987q60326j650582l8046K385207L879596L289682
3406C715063O76418k391000l994658l435062j364942R85285K174793J172969j300222
$$ plain form
3468 -7622766 -1043573 3511122 3898236 2687337 2316801 2031655 154019 -3223501 -6572339
3459 -6572339 -8194846 -7009117 -3851220 -1773511 -2852584 -4859476 -3678250 832488
3451 832488 4289763 3763039 1299670 110008 48717 -914409 -2770167 -3594848 -2627345
3442 -2627345 -1065633 -178251 -178317 -735948 -1504744 -2349584 -3643894 -5803389 -8166592 -9314828
3432 -9314828 -8959243 -8279734 -7840173 -6743952 -4774972 -3607575 -4369931 -5485549 -4743705
3423 -4743705 -2366955 -192604 1054210 1502501 136037 -4145173 -9495240 -11843411
3415 -11843411 -9525834 -5372455 -3290468 -4150794 -5801376 -5839422 -3454215 425381 3715063
3406 3715063 4391481 2000481 -1994177 -5429239 -6794181 -5808896 -3634103 -2461134 -3761356
3397c761356k819342j771502Q03968K825945L603970L421163J997462n95357k410006
3388A294945j569274N33903O39077j580216k910278j515468M95121R17044R45921
3379b749225K321182L389124J482612k094737l307126j380826K68103k30706l82235
3370b683834J899990M094170K732532r28566k514156q95185O31968l13268j975272
3361D8379j755276j30751N69346k88936j263074j213800l63789P19906J719278
3352a958717K065715J125681o20729j485896m33089J404375J923544P03932n47125
3343B177691o11727o38286k087098l642018k441198J357605L766255K161652q26132
3334g83256r04331J835395L261234J067407k491355l949591k344088Q82759L592373
$$ plain form
3397 -3761356 -6580698 -8352200 -7548232 -4722287 -1118317 2302846 4300308 3704951 1294945
3388 1294945 -274329 259574 898651 -681565 -3591843 -5107311 -4612190 -3695146 -2749225
3379 -2749225 -428043 2961081 4443693 2348956 -958170 -2338996 -2070893 -2301599 -2683834
3370 -2683834 -783844 3310326 6042858 5114292 2600136 1704951 2336919 2023651 48379
3361 48379 -1706897 -1837648 -1268302 -1557238 -2820312 -4034112 -4397901 -3677995 -1958717
3352 -1958717 106998 1232679 611950 -873946 -1307035 97340 2020884 2724816 2177691
3343 2177691 1565964 927678 -1159420 -4801438 -7242636 -5885031 -2118776 42876 -783256
3334 -783256 -1687587 147808 3409042 4476449 1985094 -1964497 -4308585 -3425826 166547
3325A66547L991938J843942p99602j690704j323942j778659k750110j710642J319790
3316b731442K559115j75459l807388m123578j261640J532023K706389L100851
3308b201129L243275K899575K514788K506544J806898m80527k759935k873262
3300D656227j667080j768180l129606k883913J4672K869682K917516P28629j112283
3291F25664j115822J71657J125946M29969j549238k786039k009144n22544j76914
3282e806465m60348J75957R46093k53537k633588k796744P0111K679906K644796
3273e433819J751543K307001L184580K140072k14432j643299j879561k162100
3265a950015k435979j883265j341249k198762l299520j947156J852254M886428
$$ plain form
3325 166547 4158485 6002427 5202825 3512121 2188179 409520 -2340590 -4051232 -2731442
3316 -2731442 -172327 -347786 -4155174 -8278752 -9540392 -8008369 -5301980 -2201129
3308 -2201129 1042146 3941721 6456509 8963053 10769951 10289424 7529489 4656227
3300 4656227 2989147 1220967 -1908639 -4792552 -4777880 -1908198 1009318 1737947 625664
3291 625664 -490158 -318501 807445 1237414 -311824 -3097863 -5107007 -5629551 -5806465
3282 -5806465 -6266813 -6090856 -5144763 -5398300 -8031888 -10828632 -10758521 -8078615 -5433819
3273 -5433819 -3682276 -1375275 1809305 3949377 3734945 2091646 212085 -1950015
3265 -1950015 -4385994 -6269259 -7610508 -9809270 -13108790 -15055946 -13203692 -8317264
3257h317264M936915K995976P56482j420499k971077k314463M78037K387576J272532
3248b195785o34191Q9017K460433K187524j654138m781328l885757j263413p45483
3239a0423121j713878p77648K112011L466748K124926J115008K409709L556318
3231A870073J875424r01168j232106Q75625K311865J643975L45690l98439j181216
3222E209723k340412k870718k099486p57100J88359M99129K95788n6106K14300
3213a716523J224850J533378q8588k284145k453547m17512J296006J024828j74003
3204b055256o40681j91960M56313P30616K82719n14364k27716J711270L131391
3195B682332J607485j460941k388331r63223q49870l195844m056247o04289L845403
$$ plain form
3257 -8317264 -3380349 -384373 372109 -1048390 -4019467 -6333930 -5855893 -3468317 -2195785
3248 -2195785 -2829976 -2740959 -280526 1906998 252860 -4528468 -8414225 -9677638 -10423121
3239 -10423121 -12136999 -12914647 -10802636 -7335888 -5210962 -4095954 -1686245 1870073
3231 1870073 3745497 2844329 1612223 2487848 4799713 6443688 6789378 6390939 5209723
3222 5209723 2869311 -1407 -2100893 -2857993 -2669634 -2170505 -1874717 -1930823 -1716523
3213 -1716523 -491673 1041705 953117 -1331028 -3784575 -4202087 -2906081 -1881253 -2055256
3204 -2055256 -2695937 -2887897 -2431584 -1700968 -1418249 -1932613 -2160329 -449059 2682332
3195 2682332 4289817 2828876 440545 -522678 -1372548 -4568392 -8624639 -9228928 -5383525
3186e383525M465926J756837j12717J99591N24427q7920j39163Q48357J279842
3177C351655M82214k04344o3583k34609j471838k747268k915441k103723q57416
3168f764353N28461J380436R57813j25876l21013N89781J214869R88057J120194
3159d31631K321442L232365K318134J24107j573300k004590j661133r56079J86302
3150A555617J550016K288955J606367l39089k158937k138199M7862K679323L679659
3141H771574K707279Q33029j232033l131015l600800j576856J060623N65586l326932
3132A070455n660833k489514L051274M498579J040745j615218k7056K023343R6102
3123A987877l380112k875204J127870K592429m22128k493749M34246M191968K565109
$$ plain form
3186 -5383525 -917599 839238 726521 926112 1450539 1362619 1223456 2071813 3351655
3177 3351655 3833869 3629525 3565942 3331333 1859495 -887773 -3803214 -5906937 -6764353
3168 -6764353 -6235892 -4855456 -3897643 -4023519 -4344532 -3754751 -2539882 -1551825 -431631
3159 -431631 1889811 5122176 7440310 7564417 5991117 3986527 2325394 1369315 1555617
3150 1555617 3105633 5394588 7000955 6661866 4502929 2364730 2412592 5091915 8771574
3141 8771574 11478853 12311882 11079849 7948834 4348034 2771178 3831801 4397387 1070455
3132 1070455 -4590378 -7079892 -4028618 469961 1510706 -104512 -131568 1891775 1987877
3123 1987877 -1392235 -4267439 -3139569 -547140 -969268 -3463017 -3028771 1163197 3728306
3114C728306l069559n607283k272358K472111M058751K883849J154490o95855
3106B652452k212733j425663J812511L894597K191286n31161j01200K258690J427548
3097I966327l606481p589396o141479j552674R04445J24939l76150J669423M071412
3088b529634L743745J290481j2003R73949J835264N39106j432525j575960m11330
3079B421093n13380k155559k791469j199121N83016M69957q53522j634517j504982
3070g178484p73426P58590K517343K473297k06259l157016l451260j117793J729383
3061h405625L926365N356658N295833L137405J00165j942341k731625k900058
3053A836777k108291k20427Q16240q10120l353665l433900j092084L82585j97135
$$ plain form
3114 3728306 658747 -4948536 -7220894 -4748783 -690032 2193817 3348307 2652452
3106 2652452 439719 -985944 826567 4721164 6912450 6381289 6280089 8538779 9966327
3097 9966327 6359846 -1229550 -7371029 -8923703 -8019258 -7894319 -8270469 -6601046 -2529634
3088 -2529634 1214111 2504592 2492589 3466538 5301802 5840908 4408383 2832423 2421093
3079 2421093 1907713 -247846 -3039315 -4238436 -3655420 -3185463 -4038985 -5673502 -7178484
3070 -7178484 -7951910 -7193320 -4675977 -2202680 -2408939 -5565955 -9017215 -10135008 -8405625
3061 -8405625 -4479260 877398 6173231 9310636 9410801 7468460 4736835 1836777
3053 1836777 -271514 -491941 324299 -485821 -3839486 -7273386 -8365470 -7982885 -8180020
3044h180020l41198J416171K771147J499017q19870j399158n40139n70550j623986
3035g788586j314487J375012M179616M362238K069477j81216o88312k3756O61564
3026B651550J349827K186710J979926l36760l099809l265586q44972O69336n23734
3017G66488j778074m48984J701520J563358j54144n46200L00226q3496j617410
3008b96716j747317l02148J58563o73640k821K752184M155636K283406J11137
2999F438284O59033K025898N65168l225642n385986l956617r41096P65466L39513
2990b715979r36353j280556j36035J240668J376324N78066J46641O0115n40018
2981b207127r21460L73171K149760J410514j678710l243323j438550R50147J452476
$$ plain form
3044 -8180020 -8521218 -7105047 -4333900 -2834883 -3654753 -5053911 -5594050 -6164600 -7788586
3035 -7788586 -9103073 -7728061 -3548445 813793 2883270 2702054 2013742 1989986 2651550
3026 2651550 4001377 6188087 8168013 7831253 4731444 1465858 620886 1290222 766488
3017 766488 -1011586 -1460570 240950 1804308 1650164 1103964 1404190 1320694 -296716
3008 -296716 -2044033 -2346181 -2187618 -2861258 -2864079 -111895 4043741 6327147 6438284
2999 6438284 7097317 9123215 9688383 6462741 1076755 -2879862 -3820958 -3055492 -2715979
2990 -2715979 -3652332 -4932888 -5068923 -3828255 -2451931 -1873865 -1727224 -1667109 -2207127
2981 -2207127 -3128587 -2755416 -605656 804858 -873852 -4117175 -5555725 -4605578 -3153102
2972c153102J528507K600177K389514j000332m472411l780852J05377K717701
2964c065421K530804J491061N02050j087870k232380j007304J337651J420216
2956a11193q14689j736527J83789K185607J953037Q00565N42362N94968J92964
2947C790883M50632J813309K012755o24060l665880l395933j66563J981998Q91131
2938C088272j168678j163014O08392J523537O44642j07379J012514K787617K479979
2929I705882m28937l362194l802851k115477n77204o20974j857318k939077k513195
2920h511345j84040K523421L093329J005036j186329j042979N29273R44466m9858
2911b879026k31238J373418K796647J820626j072093l251294k770768j82801K206370
$$ plain form
2972 -3153102 -1624595 975582 3365096 2364764 -2107647 -5888499 -5783122 -3065421
2964 -3065421 -534617 956444 1458494 370624 -1861756 -2869060 -1531409 -111193
2956 -111193 -925882 -2662409 -2478620 -293013 1660024 2460589 3002951 3597919 3790883
2947 3790883 4241515 6054824 8067579 7443519 3777639 381706 215143 2197141 3088272
2938 3088272 1919594 756580 1364972 2888509 3533151 3425772 4438286 7225903 9705882
2929 9705882 9276945 5914751 2111900 -3577 -580781 -1201755 -3059073 -5998150 -8511345
2920 -8511345 -8695385 -6171964 -3078635 -2073599 -3259928 -4302907 -3773634 -2829168 -2879026
2911 -2879026 -3110264 -1736846 1059801 2880427 1808334 -1442960 -4213728 -4396529 -2190159
2902b190159K785012K196355J906169J587480l90450l550850m690739k100439
2894d447621J614178K883742J630322J78450n92054j305450j680874j106025o60261
2885c485593j458814j828247M18900L501304L421228K52872j507446K67495K307973
2876A889672J361073j125012k076477j429120r11106n64422N73239J857903J827340
2867A403090O81903k15386n64105j006529j539856j744961j867524k062906j337943
2858h254217R72162L191570K678927o80756l828384l781948o56997K855074M364454
2849c140115L683123K086849L78868j490416k934979k402873K89582K544055J803209
2840H17303r42986k565498k092507j105074l40342Q92038J809457M58105k007290
$$ plain form
2902 -2190159 594853 2791208 4697377 6284857 5894407 2343557 -2347182 -4447621
2894 -4447621 -2833443 50299 1680621 1859071 1267017 -38433 -1719307 -2825332 -3485593
2885 -3485593 -4944407 -6772654 -6353754 -2852450 568778 821650 -685796 -418301 1889672
2876 1889672 3250745 2125733 49256 -1379864 -2290970 -2855392 -2282153 -424250 1403090
2867 1403090 2084993 1869607 1305502 298973 -1240883 -2985844 -4853368 -6916274 -8254217
2858 -8254217 -7282055 -4090485 -1411558 -2092314 -5920698 -9702646 -10359643 -7504569 -3140115
2849 -3140115 543008 2629857 3008725 1518309 -1416670 -3819543 -3529961 -985906 817303
2840 817303 -125683 -2691181 -4783688 -5888762 -6229104 -5337066 -3527609 -3069504 -5076794
2831e076794j283619L627307P487924N506590J20647k639807j471000j83444q53326
2822E234478j274286K28169J522636K4185l308411n278663m261003j229884J890477
2813f452302L560886L055701Q66190j392620k200540j365919J12797J197605J584854
2804a033348J499511J099630L67039m76563r44642r92379j214210j737136j532002
2795d964100J65317K277745L097447K716296K603949K957642K482282R82592l5535
2786A2283635P3828J64247k58850l1236J056984J126215o26653k038189j444124
2777A0305857p89862k481839m903793m397938q47324J986339J596187n89492j875102
2768a996967j274336N24681K135594K013272k84024l024595l846522k416781l27178
$$ plain form
2831 -5076794 -6360413 -2733106 4754818 10261408 10382055 7742248 6271248 6087804 5234478
2822 5234478 3960192 4188361 5710997 5735182 2426771 -2851892 -7112895 -8342779 -6452302
2813 -6452302 -2891416 164285 1030475 -362145 -2562685 -3928604 -3815807 -2618202 -1033348
2804 -1033348 466163 1565793 1932832 1456269 511627 -480752 -1694962 -3432098 -4964100
2795 -4964100 -4798783 -2521038 576409 3292705 5896654 8854296 11336578 12319170 12283635
2786 12283635 12357463 12521710 12262860 12231624 13288608 14414823 13788170 11749981 10305857
2777 10305857 9515995 7034156 2130363 -2267575 -3114899 -1128560 467627 -121865 -1996967
2768 -1996967 -3271303 -2746622 -611028 1402244 1118220 -1906375 -5752897 -8169678 -8496856
2759h496856J253108K227959K329794J215118k50829p03181l65351o50559j607550
2750e048347j645374r9696J690473K287189J587689O5443j792099k870776j863358
2741g688856R73209L607633M232791K635376k68709k981821l720106j857667P48716
2732d319434J415420j94880j952990k214872j190867N00449K490146L607194K461349
2723F01515j70218j565634n47557J069964J296578K79046j064105k551641l603198
2714f255250k708010K25232K693043K620073J146386N77862R31312O26602m29558
2705e72308p54149J81913J336960J798300J474600M51400p66410q99740M01131
2696B651697J046493j024662m081823m065795m12345K441957R87117k395914k958924
$$ plain form
2759 -8496856 -7243748 -5015789 -2685995 -1470877 -1721706 -2424887 -2790238 -3440797 -5048347
2750 -5048347 -6693721 -6793417 -5102944 -2815755 -1228066 -1162623 -2954722 -5825498 -7688856
2741 -7688856 -6715647 -3108014 1124777 3760153 3491444 509623 -3210483 -5068150 -4319434
2732 -4319434 -2904014 -3098894 -5051884 -7266756 -8457623 -7957174 -5467028 -1859834 601515
2723 601515 431297 -1134337 -1681894 -611930 684648 963694 -100411 -2652052 -6255250
2714 -6255250 -8963260 -8738028 -6044985 -3424912 -2278526 -1700664 -769352 -142750 -572308
2705 -572308 -1326457 -1144544 192416 1990716 3465316 3916716 3150306 2250566 2651697
2696 2651697 3698190 2673528 -1408295 -5474090 -5886435 -3444478 -2457361 -4853275 -7812199
2687g812199m10257J140763k79843j657899L1356L012172L463848J263631k33482
2678a481910M19987R71722l00646j676463r91251Q78860J752519J537652J377116
2669B487586Q59241r16217k365774r94764K008845K329938j262320m502057l317452
2660e672974P05532L002494K221419Q48867O82767O90462m87970k249581k976249
2651c235233j889999N20580K893322L596341K023080m08849j502830q12872O037
2642A189577l17140r31667l34374J306682K374513J971049P94070j35338o25644
2633E291728r28884j130289j475840k468305l766016l695202j147350K343477
2625f976681L878603K627559N30386o36639j140998j600076j379672p4448J064576
$$ plain form
2687 -7812199 -8222456 -7081693 -7361536 -9019435 -8988079 -5975907 -2512059 -1248428 -1481910
2678 -1481910 -1061923 -90201 -390847 -2067310 -3058561 -2179701 -427182 1110470 2487586
2669 2487586 3346827 2430610 64836 -929928 1078917 3408855 2146535 -2355522 -5672974
2660 -5672974 -4967442 -1964948 256471 1105338 1788105 2478567 1990597 -258984 -3235233
2651 -3235233 -5125232 -4604652 -1711330 1885011 3908091 3499242 1996412 1183540 1189577
2642 1189577 872437 -59230 -393604 913078 3287591 5258640 6052710 5917372 5291728
2633 5291728 4362844 3232555 1756715 -711590 -4477606 -8172808 -9320158 -6976681
2625 -6976681 -3098078 -470519 59867 -576772 -1717770 -3317846 -4697518 -4771966 -3707390
2616c707390R81355P97917J956551L473593L320497J749598P37064N67471l03998
2607I572658j995905k660093j762738j193386k025865k579586j179039J095577
2599b728377K048461J309121Q7779q62371j518563j566887m56180J722231L999092
2590B034306M911260L275713m42415l691290m159289k511521j244317j038919
2582b866472m74232N90020K46029j906220l264281j913874N48497J672640J504546
2573e863347J400036J526253J587498K114113K839700J695377k081767n537880
2565b320017n436687k688950n23900M17376J880299L767752L805734J617903j23785
2556C95725N03851K161242K479630J010632q53391j602433p75976O31972R35484
$$ plain form
2616 -3707390 -2726035 -1928118 28433 3502026 6822523 8572121 9309185 9876656 9572658
2607 9572658 7576753 4916660 3153922 1960536 -65329 -2644915 -3823954 -2728377
2599 -2728377 -679916 629205 716984 -145387 -1663950 -3230837 -3687017 -1964786 2034306
2590 2034306 6945566 10221279 9778864 6087574 1928285 -583236 -1827553 -2866472
2582 -2866472 -3340704 -2750684 -2504655 -4410875 -7675156 -9589030 -9040533 -7367893 -5863347
2573 -5863347 -4463311 -2937058 -1349560 764553 3604253 5299630 3217863 -2320017
2565 -2320017 -7756704 -10445654 -10969554 -10552178 -8671879 -4904127 -1098393 519510 395725
2556 395725 899576 3060818 5540448 6551080 5697689 4095256 3319280 3951252 4886736
2547D886736k25737j187101o35465L29049Q7951o59315j13064J392835J808519
2538E684408N78559r61466k087511l142068l679678k723603r74805l12079q55084
2529h473327q45408L27714J316473J304857J034248J071335J247543J880601L167298
2520B031334L482884J175149j879136j860813J272585L142970J096862k429806
2512F032029m054021l466130j601747J505519M560819M196077l57136m486612
2504B328798l631066N82280L100218K430402J002857j3726j849141m317613m993922
2495e360913l044649p44777q6295k72314L46396J726123K580915K127544O77049
2486b050921o77537p95749L19116J342734J456658J533493K270647K322974L15149
$$ plain form
2547 4886736 4660999 3473898 2838433 3167482 3255433 2596118 2483054 3875889 5684408
2538 5684408 6262967 5301501 3213990 71922 -3607756 -6331359 -7306164 -7618243 -8473327
2529 -8473327 -9318735 -8991021 -7674548 -6369691 -5335443 -4264108 -3016565 -1135964 2031334
2520 2031334 5514218 6689367 4810231 2949418 4222003 7364973 8461835 6032029
2512 6032029 1978008 -1488122 -3089869 -1584350 2976469 7172546 6815410 2328798
2504 2328798 -1302268 -719988 2380230 4810632 5813489 5799763 3950622 -366991 -5360913
2495 -5360913 -8405562 -9150339 -9236634 -9508948 -9162552 -7436429 -4855514 -2727970 -2050921
2486 -2050921 -2728458 -3524207 -3205091 -1862357 -405699 1127794 3398441 5721415 6036564
2477F036564k211114k431940m39321R29222M89609K9251O50406P91007p18348
2468C125336k204202j717885j52382L44640k39783j44096J173354K404602K447184
2459E036768J406882k77241k127918l043139j988001L19086J677156R23577q26774
2450A100396k009104k555252l061734l025280j508048P57718J734801R53151L26630
2441g286722J183484K128157J440368J63493M46387J671627J213336r65128j803253
2432a808251k02633Q07386r40637k652888o73677L441030M761036J885141j768701
2423B847806l264830k985914j883016K66309K652836K928451P64099q59530P4225
2414E40436J507995O71903j705686l113969l240601l253846k580177J34754L409156
$$ plain form
2477 6036564 3825450 1393510 954189 1883411 2373020 2402271 3052677 3843684 3125336
2468 3125336 921134 -796751 -949133 -604493 -844276 -988372 184982 2589584 5036768
2459 5036768 6443650 6166409 4038491 995352 -992649 -673563 1003593 1927170 1100396
2450 1100396 -908708 -3463960 -6525694 -9550974 -11059022 -10301304 -8566503 -7613352 -7286722
2441 -7286722 -6103238 -3975081 -2534713 -2371220 -1924833 -253206 960130 -4998 -1808251
2432 -1808251 -2010884 -1203498 -2144135 -4797023 -5470700 -2029670 2731366 4616507 2847806
2423 2847806 -417024 -3402938 -5285954 -5019645 -2366809 561642 1325741 466211 540436
2414 540436 2048431 2720334 1014648 -2099321 -5339922 -8593768 -11173945 -11039191 -7630035
2405g630035L785665P73369j990412j463644J239809L078634K860233J495641
2397B149260J04228o45248l59317N43481P52828m23617j966897k377182j502813
2388c725277m32843l3710k21193k98584L93683J692414K301617J105110r87618
2379b06401j700410l84354J071919J139137P59956J141184J204272m22006k131831
2370D71466j151165J674538K232667r00865l893790k779023J198882L598036K548879
2361B999625L7380j722933k598654l080612k713991j024666J056593J791733O21818
2352d633707r34060q05504J048001K250131J070022q28247m66767J873006K716716
2343A289591O77378j293128o92281M28703q67767k987692k112519J247973K522739
$$ plain form
2405 -7630035 -3844370 -3071001 -5061413 -6525057 -5285248 -2206614 653619 2149260
2397 2149260 2253488 1608240 1248923 1792404 2545232 2121615 154718 -2222464 -3725277
2388 -3725277 -4158120 -4191830 -4413023 -4711607 -4317924 -2625510 -323893 781217 -206401
2379 -206401 -1906811 -2291165 -1219246 -80109 679847 1821031 3025303 2603297 471466
2370 471466 -679699 994839 3227506 2326641 -1567149 -4346172 -3147290 450746 2999625
2361 2999625 3037005 1314072 -1284582 -4365194 -7079185 -8103851 -7047258 -5255525 -4633707
2352 -4633707 -5567767 -6373271 -5325270 -3075139 -2005117 -2833364 -3300131 -1427125 1289591
2343 1289591 1966969 673841 -18440 410263 -457504 -3445196 -5557715 -4309742 -1787003
2334a787003N3110k527449k089563l29970k67485j565855j969987j211343p33496
2325a2429041p84019k02123J478474L470250M819648M845821L180797M66714j687014
2316C159507k330393j995853j372436m46821L60148r5804j619478j922134M71694
2307e791570L761057M901014L213770O40506p62573m39740O96245J025421j32736
2298G111394j266151n70604Q42103K32794j838695j568998J566996K657760j172465
2289E994134n233393l744479J436285L985623K572023R47015J00739k583679o194037
2280b719769n571634K22229N021627M196147R07118K50569J778904J931481K20921
2271F237593j337265k275766l089628k738635n52507J165260J01019k032952j950255
$$ plain form
2334 -1787003 -1733893 -4261342 -6350905 -6680875 -6948360 -8514215 -10484202 -11695545 -12429041
2325 -12429041 -13213060 -13415183 -11936709 -8466459 -3646811 1199010 4379807 4846521 3159507
2316 3159507 829114 -1166739 -2539175 -2985996 -2625848 -2721652 -4341130 -6263264 -5791570
2307 -5791570 -2030513 2870501 6084271 6724777 5962204 5522464 6218709 7244130 7111394
2298 7111394 5845243 5274639 6116742 6349536 4510841 2941843 4508839 7166599 5994134
2289 5994134 760741 -2983738 -1547453 2438170 5010193 5957208 6057947 3474268 -2719769
2280 -2719769 -8291403 -8069174 -3047547 1148600 2055718 2306287 4085191 6016672 6237593
2271 6237593 4900328 2624562 -465066 -3203701 -3756208 -2590948 -2489929 -4522881 -6473136
2262f473136J32762J442248J403622J638434K053674R36959j179329j546585M16352
2253a174999K020080J323223n05649j604245j741506j415693p56360j33131j32437
2244d120717m03144p8516N31459M10916r9752J75368P18414j57476j927470j775882
$$ plain form
2262 -6473136 -6340374 -4898126 -3494504 -1856070 197604 1134563 -44766 -1591351 -1174999
2253 -1174999 845081 2168304 1662655 58410 -1683096 -3098789 -3855149 -3988280 -4120717
2244 -4120717 -4523861 -4602377 -4070918 -3660002 -3759754 -3584386 -2865972 -3023448 -4950918 -6726800
$$ [...]
##END NTUPLES=NMR SPECTRUM
##END=
