##TITLE=31Pdec_DE-154_CCl4_TFAp
 CCl4,64 sc
 10.6.2026
##JCAMPDX= 6.0         $$ Bruker NMR JCAMP-DX V2.0
##DATA TYPE= NMR SPECTRUM
##DATA CLASS= NTUPLES
##ORIGIN= UXNMR, Bruker Analytische Messtechnik GmbH
##OWNER= root
$$ XWIN-NMR		Version 3.5
$$ Wed Jun 10 13:53:08 2026 Russian Standard Time (UT+4h)  she@DPX200
##.OBSERVE FREQUENCY= 81.013821
##.OBSERVE NUCLEUS= ^31P
##.ACQUISITION MODE= SIMULTANEOUS
##.ACQUISITION SCHEME= undefined
##.AVERAGES= 64
##.DIGITISER RES= 17
##SPECTROMETER/DATA SYSTEM= spect
##.PULSE SEQUENCE= zgpg30
##.SOLVENT NAME= CDCl3
##.SHIFT REFERENCE= (INTERNAL, CDCl3, 0, 197.392)
##AUDIT TRAIL= $$ (NUMBER, WHEN, WHO, WHERE, WHAT)
$$ ##TITLE= Audit trail, XWIN-NMR		Version 3.5
$$ ##JCAMPDX= 5.01
$$ ##ORIGIN= Bruker BioSpin GmbH
$$ ##OWNER= she
$$ F:/spectra/data/she/nmr/P31/2/pdata/1/auditp.txt
$$ ##AUDIT TRAIL=  $$ (NUMBER, WHEN, WHO, WHERE, WHAT)
(   1,<2026-06-10 13:51:58.31 +0400>,<she>,<DPX200>,
      <created by zg, POWCHK disabled, PULCHK disabled
       configuration hash MD5:
       00 E9 B6 7A A2 85 ED C7 34 08 36 98 17 FE 4E 26
       data hash MD5: 32K
       C6 FD 96 96 D8 25 E2 1C D4 99 6F A3 FF EF A4 AD>)
(   2,<2026-06-10 13:52:00.54 +0400>,<she>,<DPX200>,
      <Start of raw data processing
       efp BC_mod = 2 LB = 1.5 FT_mod = 6 PKNL = 1 PHC0 = 1612.111 PHC1 = 51.50064 SI = 64K 
       data hash MD5: 64K
       04 96 81 2C 63 FF 15 78 AC 96 2F 22 44 DE 25 1C>)
(   3,<2026-06-10 13:52:31.17 +0400>,<she>,<DPX200>,
      <pk PHC0 = 1.197278 PHC1 = 0 
       data hash MD5: 64K
       A2 16 32 E5 F8 32 DF 0C E0 B5 7C 46 91 66 E3 6F>)
$$ ##END=
$$ 
$$ hash MD5
$$ B1 DA 2B 1C A2 1A FA 92 6F 0E 80 76 EC F3 41 39
##$RELAX= 
##$RELAX= 
##$RELAX= 
##$RELAX= 
##$RELAX= 
##$RELAX= 
##$RELAX= 
##$RELAX= 
$$ Bruker specific parameters
$$ --------------------------
##$DU= <F:/spectra>
##$EXPNO= 2
##$NAME= <P31>
##$PROCNO= 1
##$TYPE= <nmr>
##$USER= <she>
##$AMP= (0..31)
100 100 100 100 100 100 100 100 100 100 100 100 100 100 100 100 100 100 
100 100 100 100 100 100 100 100 100 100 100 100 100 100 
##$AQSEQ= 0
##$AQ_mod= 1
##$AUNM= <au_zg>
##$AUTOPOS= <>
##$BF1= 81.014009
##$BF2= 200.13
##$BF3= 200.13
##$BF4= 200.13
##$BF5= 200.13
##$BF6= 200.13
##$BF7= 200.13
##$BF8= 200.13
##$BYTORDA= 1
##$CFDGTYP= 0
##$CFRGTYP= 5
##$CHEMSTR= <none>
##$CNST= (0..31)
1 1 145 1 1 1 1 1 1 1 1 1 1 1 1 1 1 1 1 1 1 1 1 1 1 1 1 1 1 1 1 1 
##$CPDPRG= <waltz16>
##$CPDPRG1= <>
##$CPDPRG2= <waltz16>
##$CPDPRG3= <>
##$CPDPRG4= <mlev>
##$CPDPRG5= <mlev>
##$CPDPRG6= <mlev>
##$CPDPRG7= <mlev>
##$CPDPRG8= <mlev>
##$CPDPRGB= <>
##$CPDPRGT= <>
##$D= (0..31)
0 1 0 0 0 0 0 0 0 0.06 0 0.03 2e-05 3e-06 0 0 0.0002 0 0 0 0 0 0 0 0 0 
0 0 0 0 0 0 
##$DATE= 1781085117
##$DBL= (0..7)
120 120 120 11 120 120 24 19 
##$DBP= (0..7)
150 150 150 150 150 150 150 150 
##$DBP07= 0
##$DBPNAM0= <>
##$DBPNAM1= <>
##$DBPNAM2= <>
##$DBPNAM3= <>
##$DBPNAM4= <>
##$DBPNAM5= <>
##$DBPNAM6= <>
##$DBPNAM7= <>
##$DBPOAL= (0..7)
0.5 0.5 0.5 0.5 0.5 0.5 0.5 0.5 
##$DBPOFFS= (0..7)
$$ [...]
##$SUBNAM2= <"">
##$SUBNAM3= <"">
##$SUBNAM4= <"">
##$SUBNAM5= <"">
##$SUBNAM6= <"">
##$SUBNAM7= <"">
##$SUBNAM8= <"">
##$SUBNAM9= <"">
##$SW= 400.765351723535
##$SWIBOX= (0..15)
0 1 3 0 0 0 0 0 0 0 0 0 0 0 0 0 
##$SW_h= 32467.5324675325
##$TD= 32768
##$TD0= 1
##$TE= 0
##$TE2= 300
##$TE3= 300
##$TEG= 300
##$TL= (0..7)
0 120 53 12 22 120 120 120 
##$TP= (0..7)
150 150 150 150 150 150 150 150 
##$TP07= 0
##$TPNAME0= <>
##$TPNAME1= <>
##$TPNAME2= <>
##$TPNAME3= <>
##$TPNAME4= <>
##$TPNAME5= <>
##$TPNAME6= <>
##$TPNAME7= <>
##$TPOAL= (0..7)
0.5 0.5 0.5 0.5 0.5 0.5 0.5 0.5 
##$TPOFFS= (0..7)
0 0 0 0 0 0 0 0 
##$TUNHIN= 0
##$TUNHOUT= 0
##$TUNXOUT= 0
##$USERA1= <user>
##$USERA2= <user>
##$USERA3= <user>
##$USERA4= <user>
##$USERA5= <user>
##$V9= 5
##$VALIST= <valist>
##$VCLIST= <CCCCCCCCCCCCCCC>
##$VD= 0
##$VDLIST= <DDDDDDDDDDDDDDD>
##$VPLIST= <PPPPPPPPPPPPPPP>
##$VTLIST= <TTTTTTTTTTTTTTT>
##$WBST= 1024
##$WBSW= 4
##$XGAIN= (0..3)
0 0 0 0 
##$XL= 0
##$YL= 0
##$YMAX_a= 20559
##$YMIN_a= -3382
##$ZGOPTNS= <>
##$ZL1= 120
##$ZL2= 120
##$ZL3= 120
##$ZL4= 120
##$ABSF1= 0
##$ABSF2= 0
##$ABSG= 0
##$ABSL= 0
##$ALPHA= 0
##$AQORDER= 0
##$ASSFAC= 0
##$ASSFACI= 0
##$ASSFACX= 0
##$ASSWID= 0
##$AUNMP= <proc_1d>
##$AZFE= 0.1
##$AZFW= 0.5
##$BCFW= 0
##$BC_mod= 2
##$BYTORDP= 0
##$COROFFS= 0
##$CY= -3
##$DATMOD= 1
##$DC= 0
##$DFILT= <>
##$DTYPP= 0
##$F1P= 0
##$F2P= 0
##$FCOR= 1
##$FTSIZE= 65536
##$FT_mod= 6
##$GAMMA= 0
##$GB= 0
##$INTBC= 1
##$INTSCL= 9.790993e-09
##$ISEN= 30
##$LB= 1.5
##$LEV0= 0
##$LPBIN= 0
##$MAXI= 10000
##$MC2= 0
##$MEAN= 0
##$ME_mod= 0
##$MI= 50
##$NCOEF= 0
##$NC_proc= -8
##$NLEV= 6
##$NOISF1= 182.463
##$NOISF2= 159.3651
##$NSP= 0
##$NTH_PI= 0
##$NZP= 0
##$OFFSET= 197.3918
##$PC= 4
##$PHC0= 1613.308
##$PHC1= 51.50064
##$PH_mod= 1
##$PKNL= yes
##$PPARMOD= 0
##$PSCAL= 0
##$PSIGN= 0
##$REVERSE= no
##$SF= 81.014063255964
##$SI= 65536
##$SIGF1= 159.3651
##$SIGF2= -187.1042
##$SINO= 113.3802
##$SIOLD= 16384
##$SREGLST= <1H.CDCl3>
##$SSB= 0
##$STSI= 65536
##$STSR= 0
##$SW_p= 32467.5324675325
##$SYMM= 0
##$S_DEV= 0
##$TDeff= 32768
##$TDoff= 0
##$TI= <>
##$TILT= no
##$TM1= 0
##$TM2= 0
##$TOPLEV= 0
##$USERP1= <user>
##$USERP2= <user>
##$USERP3= <user>
##$USERP4= <user>
##$USERP5= <user>
##$WDW= 1
##$XDIM= 65536
##$YMAX_p= 21617586
##$YMIN_p= -387919240
$$ End of Bruker specific parameters
$$ ---------------------------------
##NTUPLES= NMR SPECTRUM
##VAR_NAME=  FREQUENCY,     SPECTRUM/REAL,   SPECTRUM/IMAG
##SYMBOL=    X,             R,               I
##VAR_TYPE=  INDEPENDENT,   DEPENDENT,       DEPENDENT
##VAR_FORM=  AFFN,          ASDF,            ASDF
##VAR_DIM=   65536,         65536,           65536
##UNITS=     HZ,            ARBITRARY UNITS, ARBITRARY UNITS
##FACTOR=    0.49542278885378, 1,            1
##FIRST=     15991.5117654749, 0,            0
##LAST=      -16476.0207020576, 0,           0
##MIN=       -16476.0207020576, -387919240,  0
##MAX=       15991.5117654749, 21617586,     0
$$ Real data points
##PAGE= N=1
##DATA TABLE= (X++(R..R)), XYDATA
$$ [...]
##PAGE= N=2
##DATA TABLE= (X++(I..I)), XYDATA
7474B210441O63191j631259l940066l375540J14204K991087K598459K84283r47680
$$ 2210441 2873632 1242373 -2697693 -6073233 -5959029 -2967942 -369483 -85200 -1032880
7465a032880j20803J435920K141540J490565J17970q62259r76024p11913k82371
$$ -1032880 -1153683 282237 2423777 3914342 4032312 3170053 2194029 1482116 1199745
7456A199745R78809K852377L211087Q53741j761033j465195N96576L99072k462843
$$ 1199745 2178554 5030931 8242018 9095759 7334726 5869531 6466107 6865179 4402336
7447D402336l772594j385406J209935M93187j549518j043906J298826J612084
$$ 4402336 629742 -755664 454271 947458 -602060 -1645966 -347140 1264944
7439A264944o50052k136168j299620m65018j346760k161757r14796J210268J823106
$$ 1264944 614892 -1521276 -2820896 -3285914 -4632674 -6794431 -7709227 -6498959 -4675853
7430d675853Q04276k24505o02744q20385p94447J18485J528054J945779O15634
$$ -4675853 -3871577 -4096082 -4698826 -5519211 -6313658 -6195173 -4667119 -2721340 -2105706
7421b105706j430163k366451j237991J243894L192474L098645J315542k47338
$$ -2105706 -3535869 -5902320 -7140311 -5896417 -2703943 394702 1710244 1462906
7413A462906k05933R33049J779141J736810J053702r3263j513142k383963j921519
$$ 1462906 1256973 2190022 3969163 5705973 6759675 6666412 5153270 2769307 847788
7404H47788o52868J06455J74755O46514J681939J595328o91340l371231l636465
$$ 847788 194920 301375 476130 1122644 2804583 4399911 3708571 337340 -3299125
7395c299125j421514N91099Q23163O48296J578614K602417K032127N23421m5269
$$ -3299125 -4720639 -4129540 -3306377 -2658081 -1079467 1522950 3555077 4078498 4033229
7386D033229J41062o43678k027670j456316J443011L331418J679498j637838l390120
$$ 4033229 4174291 3530613 1502943 46627 1489638 4821056 6500554 4862716 1472596
7377A472596l378211l072817j961597J022653L648703K375743j738574l517808
$$ 1472596 -1905615 -4978432 -6940029 -5917376 -2268673 107070 -1631504 -5149312
7369e149312j103862J380153N98162p61151J123439M402298M112833j81331l839620
$$ -5149312 -6253174 -4873021 -4274859 -5036010 -3912571 489727 4602560 4421229 581609
7360E81609l809865j758704j56683J075920K757766M064461L587985J237306j799477
$$ 581609 -3228256 -4986960 -5143643 -4067723 -1309957 2754504 6342489 7579795 5780318
7351E780318l762565k968822M05458L227274K421001p54780k137486p34392p810
$$ 5780318 2017753 -951069 -545611 2681663 5102664 4347884 2210398 1476006 1468196
7342A468196j917569l464760j754341Q26551K94074k255465k093722J758511M940919
$$ 1468196 -449373 -3914133 -5668474 -4841923 -4547849 -6803314 -8897036 -7138525 -2197606
7333b197606M054958Q23340j366308k032453k740723l721476l556120j422691
$$ -2197606 1857352 2680692 1314384 -718069 -3458792 -7180268 -10736388 -12159079
7325a2159079J858903M607473N283377L403758L17326j502869p50771J450088
$$ -12159079 -10300176 -5692703 -409326 2994432 3311758 1808889 1058118 2508206
7317B508206K988447K872536J436937p16259k996411m420455m033405k044719
$$ 2508206 5496653 8369189 9806126 9089867 6093456 1673001 -2360404 -4405123
7309d405123j02O08591j59933q24940k16525J084406J367642j27587k192156k925741
$$ -4405123 -4405225 -3796634 -3956567 -4781507 -4998032 -3913626 -2545984 -2673571 -4865727 -7791468
7299g791468j665891N57824K023076J551190n57444k357331j755399J128236L701239
$$ -7791468 -9457359 -8899535 -6876459 -5325269 -5882713 -8240044 -9995443 -8867207 -5165968
7290e165968L715321J711022r6758n59481j70951L11756M44636k19988j613470
$$ -5165968 -1450647 260375 163617 -395864 -566815 -255059 189577 -30411 -1643881
7281a643881k563576j945018r7741J961363L953305N499270M944243J368823k790542
$$ -1643881 -4207457 -6152475 -6250216 -4288853 -335548 5163722 10107965 11476788 8686246
7272H686246l913020k049217p66986j707930k420814q15116J309512J262691m57019
$$ 8686246 4773226 2724009 1957023 249093 -2171721 -2986837 -1677325 -414634 -871653
7263h71653j537040j478163j309429j068276j67216O86643M83857J42279J211022
$$ -871653 -2408693 -3886856 -5196285 -6264561 -6431777 -5745134 -5261277 -5118998 -3907976
7254c907976K815857K609302P43141N4631J605116K674834O74315k917605m437203
$$ -3907976 -1092119 1517183 2260324 2314955 3920071 6594905 7269220 4351615 -85588
7245h5588k742697j00517J225346J372859J460451J350497J65523j568616j937907
$$ -85588 -2828285 -2928802 -1703456 -330597 1129854 2480351 2645874 1077258 -860649
7236h60649k75363J502854J282052l95223j301066q34138n55008j383610k173027
$$ -860649 -1136012 366842 1648894 1253671 -47395 -881533 -1436541 -2820151 -4993178
7227d993178j692173l86681O87959J295041J506122J060903J37200m19833m06675
$$ -4993178 -6685351 -7072032 -6384073 -5089032 -3582910 -2522007 -2384807 -2804640 -3211315
7218c211315n77259j085463j160330q78575j243969j734737l14454K763410M014144
$$ -3211315 -3788574 -4874037 -6034367 -6912942 -8156911 -9891648 -10206102 -7442692 -3428548
7209c428548J727990q78407l91736J490907J010274j376839k036496k17642J409185
$$ -3428548 -1700558 -2578965 -2970701 -1479794 -469520 -1846359 -3882855 -4100497 -2691312
7200b691312J734814K209957K777428J353871j754850l105899j204884J247306
$$ -2691312 -956498 1253459 4030887 5384758 3629908 524009 -680875 566431
7192E66431J651875P33418j2033q16545j892623k246037j972624k748904m276152
$$ 566431 2218306 2951724 2939691 2123146 230523 -2015514 -3988138 -6737042 -11013194
7183a1013194l452278O97081M407012M205195J769285P45467J171344M79697j719042
$$ -11013194 -14465472 -13768391 -9361379 -5156184 -3386899 -2641432 -1470088 -990391 -2709433
7174b709433l321705l182285j930224j25180J878017K990926K546942J577616
$$ -2709433 -6031138 -9213423 -11143647 -11268827 -9390810 -6399884 -3852942 -2275326
7166b275326J085186L08648j375025k483269j665468k00073K99501Q45015K744663
$$ -2275326 -1190140 -881492 -2256517 -4739786 -6405254 -6605327 -6305826 -5460811 -2716148
7157b716148M123619K387786j161031l011606k775869k821398l291287j955089
$$ -2716148 1407471 3795257 2634226 -377380 -3153249 -5974647 -9265934 -11221023
7149a1221023R38697K150860N86856j070156q56212J41910J018610K660479M577423
$$ -11221023 -10282326 -8131466 -7544610 -8614766 -9470978 -9329068 -8310458 -5649979 -1072556
7140a072556M009785L75770k780520k679175j122939r69370j721231j485508p24563
$$ -1072556 2937229 3312999 532479 -2146696 -3269635 -4239005 -5960236 -7445744 -8170307
7131h170307q09801q39556P51762K825008L002946J528641O45826Q51649O83051
$$ -8170307 -8980108 -9819664 -9067902 -6242894 -3239948 -1711307 -1065481 -213832 469219
7122D69219k15539o61195m69539p84051j663805j677796l27748J063799J311045
$$ 469219 253680 -407515 -877054 -1661105 -3324910 -5002706 -5330454 -4266655 -2955610
7113b955610O20535l16132r68694o71011O83574J588103L46701k161937k928782
$$ -2955610 -2335075 -2651207 -3619901 -4290912 -3607338 -2019235 -1672534 -3834471 -6763253
7104f763253o01577K727480M203798L295985J428200k28975j589019k980390m405104
$$ -6763253 -7364830 -4637350 -433552 2862433 4290633 4061658 2472639 -507751 -4912855
7095d912855n125643l940862o80132K648600L545222K148065J155162J981426
$$ -4912855 -10038498 -13979360 -14659492 -12010892 -8465670 -6317605 -5162443 -3181017
7087c181017K755716J484205m68295l36635J494270J731860p64685k991955k267087
$$ -3181017 -425301 1058904 590609 253974 1748244 3480104 2715419 -276536 -2543623
7078b543623k79897k65900j782660j630939M64328R76999j461943k972176j11307
$$ -2543623 -2823520 -3089420 -4872080 -6503019 -6038691 -5061692 -6523635 -9495811 -9607118
7069i607118M131686M032028n25432l824826k459698P17893J990639J911876K557411
$$ -9607118 -5475432 -1443404 -1968836 -5793662 -8253360 -7535467 -5544828 -3632952 -1075541
7060a075541L059359J355294j657197l187334k670609j781574j144085K3753J473276
$$ -1075541 1983818 3339112 1681915 -1505419 -4176028 -5957602 -7101687 -7077934 -5604658
7051e604658J983991J667685J616493J488523J47213j472630j155176P37191J336232
$$ -5604658 -3620667 -1952982 -336489 1152034 1299247 -173383 -1328559 -591368 744864
7042G44864j75513j270538m18718M90587k28516j010360M6801J669510J511281
$$ 744864 569351 -701187 -1119905 -629318 -857834 -1868194 -1821393 -151883 1359398
7033A359398p3519j132328j575537k619836l667814k737229J53856K618730L118195
$$ 1359398 1285879 153551 -1421986 -4041822 -7709636 -10446865 -10293009 -7674279 -4556084
7024d556084K423442J679711J040336O18327R21460J648482J496743j07503k093454
$$ -4556084 -2132642 -452931 587405 1205732 2127192 3775674 5272417 5164914 3071460
7015C071460l029580k517741j141231J32906M72936m6477l30927K25078O23580
$$ 3071460 41880 -2475861 -3617092 -3484186 -3011250 -3057727 -3388654 -3163576 -2539996
7006b539996j09275q62176J04087J991173K116131o556j722343j265650l34132
$$ -2539996 -2649271 -3511447 -3407360 -1416187 699944 693388 -1028955 -2294605 -2628737
6997b628737j101985k679353k606737n51558J613823K647694K848970K528877
$$ -2628737 -3730722 -6410075 -9016812 -9568370 -7954547 -5306853 -2457883 70994
6989G0994J459918p5320j120115j148121m53343M05626P71028O9586j079335o75626
$$ 70994 1530912 1455592 335477 -812644 -1265987 -860361 -89333 -19747 -1099082 -1774708
6979a774708K124874M766351L650169j054226m919758m329416m67956K645410
$$ -1774708 350166 5116517 8766686 7712460 2792702 -1536714 -2004670 640740
6971F40740K738138P71287j050761j359205k12637J190169J490402N65296l08976
$$ 640740 3378878 4150165 3099404 1740199 1527562 2717731 4208133 4773429 4464453
6962D464453k31517n4637j101341k913514l470219j801694O03467J525601N75954
$$ 4464453 4232936 4178299 3076958 163444 -3306775 -5108469 -4505002 -2979401 -2403447
6953b403447n92493m52734O35108J106267K96336p34373o37988N30544J584002
$$ -2403447 -2995940 -3448674 -2813566 -1707299 -1410963 -2145336 -2783324 -2252780 -668778
6944f68778J736292J086435j25979j612238k330160j090273J468024K797931J537651
$$ -668778 1067514 2153949 2027970 415732 -1914428 -3004701 -1536677 1261254 2798905
6935B798905k95792J66326K416869K880082j69007l860131m172459j005952J801333
$$ 2798905 2503113 2669439 5086308 7966390 7797383 3937252 -235207 -1241159 560174
6926E60174J237890j592744l297289k153882N50775K493454K605633J428320M5284
$$ 560174 1798064 205320 -3091969 -5245851 -4695076 -2201622 404011 1832331 1877615
6917A877615q67869j252510j344263j186720m62247J033677K792670L813249L533048
$$ 1877615 1009746 -242764 -1587027 -2773747 -3235994 -2202317 590353 4403602 7936650
6908G936650K275240P60643m16022q44379m90977P895l9908l19791l0744L32481
$$ 7936650 10211890 10972533 10556511 9712132 9221155 9229050 9189142 8869351 8838607 9171088
6898I171088p35814k920095l485519j263828O02196j297382n038174n393654j298793
$$ 9171088 8435274 5515179 2029660 765832 1368028 70646 -4967528 -10361182 -11659975
6889a1659975K635992K938827J626899J788840K540871J501278n65737j310110
$$ -11659975 -9023983 -6085156 -4458257 -2669417 -128546 1372732 806995 -503115
6881e03115j081963j791264k747719j650317Q69893J721878L64845n73190r1277
$$ -503115 -1585078 -3376342 -6124061 -7774378 -6904485 -5182607 -4817762 -5390952 -5482229
6872e482229k35825j747506k306566q58189J02892r83012j424825J275218M388011
$$ -5482229 -5718054 -7465560 -9772126 -10630315 -10527423 -11510435 -12935260 -11660042 -7272031
6863g272031L359579j230986m133515k512706R75697K583852J872237O45060j35966
$$ -7272031 -3912452 -5143438 -9276953 -11789659 -10813962 -8230110 -6357873 -5712813 -5848779
6854e848779p36695j159586p77740O58360K324008K907218K063717J074810J249382
$$ -5848779 -6585474 -7745060 -8522800 -7864440 -5540432 -2633214 -569497 505313 1754695
6845A754695J699889K29838k957907m409464j930051J742887K245814m19996k064280
$$ 1754695 3454584 3684422 726515 -3682949 -5613000 -3870113 -1624299 -2044295 -4108575
6836d108575k88331K617669L379898J760801l50102j806118k542824k385221j163139
$$ -4108575 -4396906 -1779237 1600661 3361462 3011360 1205242 -1337582 -3722803 -4885942
6827d885942N66338K024247L006676L483342L037899J457452o37664k370158l314851
$$ -4885942 -4319604 -2295357 711319 4194661 7232560 8690012 8052348 5682190 2367339
6818B367339l208528j746583N83160K110840J436786q11206k325667j359178J514098
$$ 2367339 -841189 -2587772 -2004612 106228 1543014 731808 -1593859 -2953037 -1438939
6809a438939L792670L333403O00380j637770j492769l88382j075778l484697m492123
$$ -1438939 2353731 5687134 6287514 4649744 3156975 2768593 1692815 -1791882 -6284005
6800f284005k396484M65859J099799J73518O79916L104932M552577K971952K7471
$$ -6284005 -8680489 -8214630 -7114831 -6941313 -6261397 -3156465 1396112 4368064 4395535
6791D395535j242324r3482J763406K619462K135266Q31114o13227j652026k212601
$$ 4395535 3153211 3059729 4823135 7442597 9577863 10408977 9795750 8143724 5931123
6782E931123k658481l000564k597525j283355k49554p64193k243391k759322j560394
$$ 5931123 3272642 272078 -2325447 -3608802 -3858356 -4622549 -6865940 -9625262 -11185656
6773a1185656K5094M88890j14585p55915p19556K40694J923486L114919K230827
$$ -11185656 -11160562 -10671672 -10786257 -11542172 -12261728 -12021034 -10097548 -6982629 -4751802
6764d751802l43958j741488r151K910767L487476J228790j159307j849428j581847
$$ -4751802 -5095760 -6837248 -6846399 -3935632 -448156 780634 -378673 -2228101 -3809948
6755c809948j154530n7739J467059J678849J89712p21716N00128K021405J491016
$$ -3809948 -4964478 -5022217 -3555158 -1876309 -1686597 -2408313 -1908185 113220 1604236
6746A604236k59942r56852q25690j768869l423548l267300o86374J936688K672747
$$ 1604236 1344294 387442 -438248 -2207117 -5630665 -8897965 -9584339 -7647651 -4974904
6737d974904K099682J298328J88853j116548j357320Q1786J765487J841819K47394
$$ -4974904 -2875222 -1576894 -1388041 -2504589 -3861909 -3780123 -2014636 -172817 74577
6728G4577j545236k271220j787241q22767j23050N21111K009942M018365M289191
$$ 74577 -1470659 -3741879 -5529120 -6351887 -6474937 -5953826 -3943884 74481 4363672
6719D363672J396956k517327l818469j829926Q78508K230393K136762N80917k512793
$$ 4363672 5760628 3243301 -575168 -2405094 -1526586 703807 2840569 3421486 908693
6710I08693n039004l828796O50776L800691K733594k55987j781690j805771j695978
$$ 908693 -4130311 -7959107 -7308331 -3507640 -774046 -1030033 -2811723 -4617494 -6313472
6701f313472r82377Q21433J774932M72873o33035J249610M059825L479236k64209
$$ -6313472 -7295849 -6474416 -4699484 -4226611 -4859646 -3610036 449789 3929025 3664816
6692C664816k723585k159135j502063k695441l570216k099881Q8441Q78053J260676
$$ 3664816 941231 -1217904 -2719967 -5415408 -8985624 -11085505 -10997064 -10119011 -8858335
6683h858335K917100M458457L285578O3325j714122n29734J248923Q66496j185973
$$ -8858335 -5941235 -1482778 1802800 1866125 152003 -377731 871192 1737688 551715
6674E51715k191859j044618L67131K1657j081777k33590K534591L513443L12983
$$ 551715 -1640144 -2684762 -2317631 -2295974 -3377751 -3611341 -1076750 2436693 2749676
6665B749676m032414m547320r79507K092902J771213J45482J39116J200809J159723
$$ 2749676 -1282738 -5830058 -6809565 -4716663 -2945450 -2799968 -2660852 -1460043 -300320
6656c00320K6868n65948k89736k4367L16454J510328K897172K704218P11628j147064
$$ -300320 -273452 -839400 -1129136 -1153503 -837049 673279 3570451 6274669 6986297 5839233
6646E839233j313474m23971p7876p82095j693875j770859p34328O89584J253827
$$ 5839233 4525759 4101788 4023912 3241817 1547942 -222917 -957245 -267661 986166
6637I86166L55981j094423j482829m57269M60151j75267j559427j437523P40796
$$ 986166 1342147 247724 -1235105 -1692374 -1232223 -1407490 -2966917 -4404440 -3663644
6628c663644K630523J932897l43327j213375j1966Q07858k81282j434163o69693
$$ -3663644 -1033121 899776 556449 -656926 -668892 138966 -142316 -1576479 -2246172
6619b246172M94358p76610l965035n562393l756657j25011L264671N712247O583828
$$ -2246172 -1751814 -2528424 -6493459 -12055852 -15812509 -15937520 -12672849 -6960602 -376774
6610c76774N025404J897745m30292j172986j727182k449509j686937P06316K007329
$$ -376774 4648630 6546375 6116083 4943097 3215915 766406 -920531 -214215 1793114
6601A793114Q51725j53598J187387K407502J52189l826658m772284k091567K1314
$$ 1793114 2644839 2491241 3678628 6086130 6238319 2411661 -2360623 -4452190 -4430876
6592d430876p74871j992873j055036Q16158J361401R35180J063097J520141J269947
$$ -4430876 -5205747 -7198620 -8253656 -7437498 -6076097 -5140917 -4077820 -2557679 -1287732
6583a287732Q36293J358060K170200J573726l42395j660715j484203j070750j617044
$$ -1287732 -451439 906621 3076821 4650547 4308152 2647437 1163234 92484 -1524560
6574a524560k306389j532858O44796K338991K094075N15617o79396o22140L20600
$$ -1524560 -3830949 -5363807 -4719011 -2380020 -285945 229672 -449724 -1071864 -751264
6565g51264J581850K653742K447030N7485l156336l988940j393110J320114M54027
$$ -751264 830586 3484328 5931358 5988843 2832507 -1156433 -2549543 -1229429 -775402
6556g75402k741618l405222K42222M359827M649165J629414r52206j187911l15554
$$ -775402 -3517020 -6922242 -6680020 -2320193 2328972 3958386 3006180 1818269 1502715
6547A502715J34576K82141Q59626J706520J835287N40195j581027k614298j026191
$$ 1502715 1637291 1919432 2779058 4485578 6320865 6861060 5280033 2665735 1639544
6538A639544K177913L892561K339328p58781k428499k021284j184052r78626q86079
$$ 1639544 3817457 7710018 10049346 9290565 6862066 4840782 3656730 2678104 1792025
6529A792025n75302o99760j338815j286114P9776J411439J122102k48596p23966
$$ 1792025 1216723 516963 -821852 -2107966 -2028190 -616751 505351 256755 -467211
6520d67211L45138J483914J235878M4285o04885l24808k97969j532855l218002
$$ -467211 -122073 1361841 2597719 2642004 2037119 1712311 1414342 -118513 -3336515
6511c336515l405649j427558R39909J381381q0174j067915q873J765773K018846
$$ -3336515 -6742164 -8169722 -7229813 -5848432 -5928606 -6996521 -7005394 -5239621 -3220775
6502c220775Q68665M98620J785281L001141K473105R21882l8049m39433j280805
$$ -3220775 -2352110 -1853490 -68209 2932932 5406037 6327919 6289870 5850437 4569632
6493D569632k051614j068733J547182L180164J925746q13716k070544r02101Q23276
$$ 4569632 2518018 1449285 2996467 6176631 8102377 7288661 5218117 4316016 5139292
6484E139292Q73940j015598l231740m089209l346750k021057q51815N03820K268422
$$ 5139292 6013232 4997634 1765894 -2323315 -5670065 -7691122 -8542937 -8039117 -5770695
6475e770695L245821K013234p64579k685298k448169q82098R89723K914265L860082
$$ -5770695 -2524874 -511640 -1276219 -3961517 -6409686 -7291784 -6302061 -3387796 472286
6466D72286J998106k144027m715368l092684K41590J057523o82888j417256K12477
$$ 472286 2470392 326365 -4389003 -7481687 -7240097 -6182574 -6865462 -8282718 -8070241
6457h070241J789927J625049J219565J982006K567693J414314m01872r73280n38170
$$ -8070241 -6280314 -4655265 -3435700 -1453694 1113999 2528313 2126441 1153161 614991
6448F14991n70900j146538j223014o74751j75661L29112J300371K169900J852112
$$ 614991 44091 -1102447 -2325461 -3000212 -3175873 -2846761 -1546390 623510 2475622
6439B475622N13811n69345q51294r70892j357803j508353q75076K87323J161191
$$ 2475622 2989433 2420088 1568794 597902 -759901 -2268254 -3143330 -2856007 -1694816
6430a694816J042987j27603j576000k284942k036943j411736n80025R81456L013869
$$ -1694816 -651829 -779432 -2355432 -4640374 -6677317 -8089053 -8669078 -7687622 -4673753
6421d673753L761220J859160j603573m005694l962680k349547p57522K63339J295918
$$ -4673753 -912533 946627 -656946 -4662640 -8625320 -10974867 -11732389 -11469050 -10173132
6412a0173132K746177L684502K534716n36331k751297j789727P53739J203126
$$ -10173132 -7426955 -3742453 -1207737 -1744068 -4495365 -6285092 -5531353 -4328227
6404d328227q74377j985202j64374K032576J817179M27048L82558J102608O89683
$$ -4328227 -5202604 -7187806 -7352180 -5319604 -3502425 -3075377 -2692819 -1590211 -900528
6395i00528M0309J182271K830965J902146j086962k433156j106073M0481o06257
$$ -900528 -860219 322052 3153017 5055163 3968201 1535045 428972 469453 -136804
6386a36804j338051j130152j421692k309124j189090K443489M639326K382951
$$ -136804 -1474855 -2605007 -4026699 -6335823 -7524913 -5081424 -442098 1940853
6378A940853j760735l463643k444723j299010q80640l07548J69263l07255r67050
$$ 1940853 180118 -3283525 -5728248 -7027258 -7907898 -8215446 -8046183 -8353438 -9320488
6369i320488n72983L52696R26627J854266L300509K921594n38257l670643k561502
$$ -9320488 -9893471 -9540775 -8614148 -6759882 -3459373 -537779 -1076036 -4746679 -7308181
6360g308181J006521K109277L32663l02003J352891K052994O42816K12342J877187
$$ -7308181 -6301660 -4192383 -3859720 -4161723 -2808832 -755838 -113022 99320 1976507
6351A976507J970082j494517m450923k876760O72035J185004j064885j822979
$$ 1976507 3946589 2452072 -1998851 -4875611 -4203576 -3018572 -4083457 -5906436
6343e906436o3463J143427M00188o9741J172631K232313J031528j589322l179702
$$ -5906436 -5969899 -4826472 -4426284 -4496025 -3323394 -1091081 -59553 -1648875 -4828577
6334d828577k436190O4705K561377L204578J642980m61607j522450k035582l040964
$$ -4828577 -7264767 -7200062 -4638685 -1434107 208873 -252734 -1775184 -3810766 -6851730
6325f851730l494745j564226J737863K956937Q59782j694261j685857J87116J063198
$$ -6851730 -10346475 -11910701 -10172838 -7215901 -6356119 -8050380 -9736237 -9549121 -8485923
6316h485923K0078j076191l51859J812305L455901L248018J646857K0148r04108
$$ -8485923 -8465845 -9542036 -9893895 -8081590 -4625689 -1377671 269186 289334 -614774
6307f14774j234552r66380k6627O49641k66970k112796k305202j10094J592529
$$ -614774 -1849326 -2815706 -2842333 -2192692 -2459662 -4572458 -6877660 -6987754 -5395225
6298e395225K93743k177806k280739R4901K157663K764943K964458K730359J073885
$$ -5395225 -5101482 -7279288 -9560027 -9465126 -7307463 -4542520 -1578062 1152297 2226182
6289B226182p86184n23883Q13715n8442k423081j704993K426961L793636j071857
$$ 2226182 1439998 916115 1729830 1671388 -751693 -2456686 -29725 3763911 2692054
6280B692054o640704o090556j081063J789164J072586O31333J652707J369352
$$ 2692054 -3948650 -10039206 -11120269 -9331105 -8258519 -7627186 -5974479 -4605127
6272d605127n21960o40278J898678L652715K616216Q27641k77717k145004m780661
$$ -4605127 -5127087 -5767365 -3868687 -215972 2400244 3227885 2950168 805164 -3975497
6263c975497n075916k060957P11196R84086J491958M252778N659285K063186l367969
$$ -3975497 -9051413 -11112370 -10401174 -9417088 -7925130 -3672352 1986933 4050119 682150
6254F82150m921717k888971j957976k806912j744294J665860L203866J354222
$$ 682150 -4239567 -7128538 -9086514 -11893426 -13637720 -11971860 -8767994 -7413772
6246g413772N7120J818355L303305J029147k747597l612722j427825O15292J197519
$$ -7413772 -7356652 -5538297 -2234992 -1205845 -3953442 -7566164 -8993989 -8378697 -7181178
6237g181178J430756J672068J280083P63079J174279J919526J711810R65512P15418
$$ -7181178 -5750422 -4078354 -2798271 -2035192 -860913 1058613 2770423 3735935 4451353
6228D451353J32474j910489l665849k497642K26322K25601l076487n047332k514909
$$ 4451353 4583827 2673338 -992511 -3490153 -3263831 -3038230 -6114717 -11162049 -13676958
6219a3676958J764818L618012L100828K542494J695998j125787m497033m702561
$$ -13676958 -11912140 -8294128 -5193300 -2650806 -954808 -2080595 -6577628 -11280189
6211a1280189j172147K357862K785934J035709k70278j35860Q35374J828612K035099
$$ -11280189 -12452336 -10094474 -7308540 -6272831 -6543109 -6678969 -5843595 -4014983 -1979884
6202a979884R52278n76284q46852M81188J869861K114220J657804J186166N32350
$$ -1979884 -1027606 -1603890 -2450742 -1969554 -99693 2014527 3672331 4858497 5390847
6193E390847k98255o84508q04534j698782k937953k322987N82477K763448J750385
$$ 5390847 5092592 4408084 3603550 1904768 -1033185 -3356172 -2773695 -10247 1740138
6184A740138n47651o54033J308092K371917J677632J087388J047966k62147k737818
$$ 1740138 1192487 538454 1846546 4218463 5896095 6983483 8031449 7769302 5031484
6175E031484l071033J83934L261963J948419k123775l384966n3753L416974K530225
$$ 5031484 1960451 2144385 5406348 7354767 5230992 1846026 1792273 5209247 7739472
6166G739472j295672l063000j144854Q09121o76795l887490m301321r09766K479648
$$ 7739472 6443800 3380800 2235946 3045067 2368272 -1519218 -5820539 -6730305 -4250657
6157d250657K588748P32056K0699O23535L40998j199400j824498l33996J738379
$$ -4250657 -1661909 -929853 -909154 -285619 55379 -1144021 -2968519 -3302515 -1564136
6148a564136K494343J894521R36266K14864j9740K54471L35091n40039j667506
$$ -1564136 930207 2824728 3760994 3975858 3956118 4210589 4545680 4005641 2338135
6139B338135j435429K42574J594822J491939O32446j95061j161736k065959j929013
$$ 2338135 902706 1145280 2740102 4232041 4864487 4669426 3507690 1441731 -487282
6130d87282q36891k67585n88750k90860J058014J351419p50569l060967k671147
$$ -487282 -1324173 -1591758 -2180508 -2471368 -1413354 -61935 -812504 -3873471 -6544618
6121f544618q7537J683694J179599m02843j297099o34994J312283K881868K156763
$$ -6544618 -6632155 -4948461 -3768862 -4171705 -5468804 -6103798 -4791515 -1909647 247116
6112B47116k38880j117302P64348K202139J8257l921234n325663l565035j491213
$$ 247116 8236 -1109066 -344718 1857421 1875678 -2045556 -7371219 -10936254 -12427467
6103a2427467k51286J583958L929697M425533K481856M90103K7408N6757j83318
$$ -12427467 -12678753 -11094795 -7165098 -2739565 -257709 232394 259802 316559 133241
6094A33241J94423R96370J80084k437046l733226j709613J194836J589290j47773
$$ 133241 327664 1324034 1504118 -932928 -4666154 -6375767 -5180931 -3591641 -3739414
6085c739414j117296l19159O47374M14651o66225j415752r04324P61880J969749
$$ -3739414 -4856710 -5175869 -4528495 -4113844 -4780069 -6195821 -7100145 -6338265 -4368516
6076d368516J005321j383235k319513n24318K008937L022707K679692J959140
$$ -4368516 -3363195 -4746430 -7065943 -7590261 -5581324 -2558617 121075 2080215
6068B080215N87901j499610k534391j063041J552715K867727K463904J447038
$$ 2080215 2668116 1168506 -1365885 -2428926 -876211 1991516 4455420 5902458
6060E902458J09366j785496l418987l738024l088617k262899r50184J036888K259275
$$ 5902458 6011824 4226328 807341 -2930683 -6019300 -8282199 -9232383 -8195495 -5936220
6051e936220J555885L00129L91856J067859L46323j200734j032058J324361L546999
$$ -5936220 -4380335 -4080206 -3688350 -2620491 -2274168 -3474902 -4506960 -3182599 364400
6042C64400L808771K400426K11137k012138l014209k076610o65392o89765j356251
$$ 364400 4173171 6573597 6784734 4772596 1758387 -318223 -983615 -1673380 -3029631
6033c029631l86897J856310K552952R34168o29472p09513p26900j634237j845249
$$ -3029631 -3416528 -1560218 992734 1926902 1297430 587917 -138983 -1773220 -3618469
6024c618469j80561J815066K427299K377474K929720L401003K572718Q98358o07589
$$ -3618469 -3799030 -1983964 443335 2820809 5750529 9151532 11724250 12622608 12015019
6015A2015019k103600l635903l682462j189310K043255L151564J681405m92314
$$ 12015019 9911419 6275516 2593054 1403744 3446999 6598563 8279968 7787654
6007G787654j924364k478374k151394r73944J27551j6072j267120k342529k318077
$$ 7787654 5863290 3384916 1233522 259578 387129 371057 -896063 -3238592 -5556669
5998e556669j161835O74857K282577K578365J594839Q47373J384046K150149J438863
$$ -5556669 -6718504 -6043647 -3761070 -1182705 412134 1259507 2643553 4793702 6232565
5989F232565n99760k083414j722204j27806R34069J44239j893493k567479N5627
$$ 6232565 5632805 3549391 1827187 1699381 2633450 2777689 884196 -1683283 -1627656
5980a627656L974672M524552J30776n007914n806125k341484J190925K332941
$$ -1627656 2347016 6871568 7002344 1994430 -3811695 -6153179 -4962254 -2629313
5972b629313K388365K978701L439361K416818J42003j926021k751563k356326
$$ -2629313 -240948 2737753 6177114 8593932 8735935 6809914 4058351 1702025
5964A702025j352094k52994P77666J405604P94013j144114k498389j343525Q64742
$$ 1702025 349931 96937 874603 2280207 3074220 1930106 -568283 -1911808 -1047066
5955a047066N87374k183023k934832O09849M181748K871058j512105l420647j847521
$$ -1047066 -459692 -2642715 -5577547 -4967698 -785950 2085108 573003 -2847644 -4695165
5946d695165m94351q35812o79962L81284p2440j754398p68213L517187N870713
$$ -4695165 -5189516 -6025328 -6705290 -6324006 -6396446 -8150844 -8919057 -5401870 468843
5937D68843K667680k393777l741847j503035L99478P86058J419418K566894K739916
$$ 468843 3136523 742746 -2999101 -4502136 -4102658 -3316600 -1897182 669712 3409628
5928C409628J953750J478061Q95703j169617l681802l782813r89349J820018K038641
$$ 3409628 5363378 6841439 7737142 6567525 2885723 -897090 -1886439 -66421 1972220
5919A972220N2509j844005j797774J44308J773242O36726k680192m539718k940347
$$ 1972220 2024729 180724 -1617050 -1472742 300500 937226 -1742966 -6282684 -9223031
5910i223031m10839k22671j737455k225081j352676m53186J012231M121229O583849
$$ -9223031 -9633870 -9856541 -11593996 -13819077 -15171753 -15624939 -14612708 -10491479 -3907630
5901c907630M736532n09381l998219l161220n62541R79952J638157J898802R77877
$$ -3907630 828902 319521 -3678698 -6839918 -7402459 -6422507 -4784350 -2885548 -1907671
5892a907671l25573P31937M068022N421134K454010j312238j804760l91748q28912
$$ -1907671 -2233244 -1501307 2566715 7987849 10441859 9129621 7324861 6933113 6104201
5883F104201k935785l686043k842871k890401l996660l424283k95735K761982
$$ 6104201 3168416 -517627 -3360498 -6250899 -10247559 -13671842 -13967577 -11205595
5875a1205595L574811K986331K439659J630139l4508j610010j812707q99223j35133
$$ -11205595 -7630784 -4644453 -2204794 -574655 -609163 -2219173 -4031880 -4931103 -5066236
5866e066236p0071j98663N8571N76280O10779l58398j735724k154341j085429
$$ -5066236 -5136307 -5334970 -5276399 -4700119 -4089340 -4447738 -6183462 -8337803 -9423232
5857i423232M37240J198640J248092J361678J818129K396379K743075K064322
$$ -9423232 -8985992 -7787352 -6539260 -5177582 -3359453 -963074 1780001 3844323
5849C844323l47326l263203l621517j60976M085282M867180J721986j900942l075971
$$ 3844323 3496997 233794 -3387723 -3548699 536583 5403763 7125749 5224807 2148836
5840B148836k104187r39429p04182j089257j101480k12757Q09782Q51928N85734
$$ 2148836 44649 -894780 -1598962 -2688219 -3789699 -4002456 -3192674 -2340746 -1755012
5831a755012K023852M893144N658885K312665j958526k925523j435100j556719
$$ -1755012 268840 5161984 10820869 13133534 11175008 8249485 6814385 5257666
5823E257666l672453l962786r33465K108578K333201J104759O33718N05424k08981
$$ 5257666 1585213 -2377573 -3311038 -1202460 1130741 2235500 2869218 3374642 3165661
5814C165661m78506M89331J092859l9700j401254j114722j12947j10444j77826
$$ 3165661 2687155 3176486 4269345 4229645 2828391 1713669 1600722 1490278 1312452
5805A312452J553620L920749L739230N62565k396247k506393p59437J06753q93976
$$ 1312452 2866072 6786821 10526051 11088616 8692369 6185976 5426539 5533292 4639316
5796D639316k179400j771579K53530J953404K447692L410702N765995O091387
$$ 4639316 2459916 688337 941867 2895271 5342963 8753665 14519660 20611047
5788B0611047K12316r116906j2827297o567161K780409N553936J287169k561923
$$ 20611047 20823363 11706457 -1120840 -7688001 -4907592 646344 1933513 -628410
5780f28410j797475L31030p2218k076956k766798j463814P31344K642961K864945
$$ -628410 -2425885 -2094855 -2167073 -4244029 -7010827 -8474641 -7743297 -5100336 -2235391
5771b235391O61818j812495j119217K351002M027241J683009j015461j57954K249548
$$ -2235391 -1573573 -3386068 -4505285 -2154283 1872958 3555967 2540506 2382552 4632100
5762D632100J574430j952839l571106j483605M62151j017206l359137j884292
$$ 4632100 6206530 4253691 682585 -801020 -338869 -1356075 -4715212 -6599504
5754f599504L128722O390786M509900J47450j878622o65227N70652o17756l167952
$$ -6599504 -3470782 2920004 7429904 7577354 5698732 5033505 5604157 4986401 1818449
5745A818449m749450m526276k839924m8161K931097M364068L597587K213373J863018
$$ 1818449 -2931001 -7457277 -10297201 -10345362 -7414265 -3050197 547390 2760763 4623781
5736D623781K003434J286633o965q05794j420391k680965l749922l163098j443239
$$ 4623781 6627215 7913848 7906883 7101089 5680698 2999733 -750189 -3913287 -5356526
5727e356526k87458K27493J019583J277590m07985k456382j557634J932679L576580
$$ -5356526 -5643984 -5416491 -4396908 -3119318 -3527303 -5983685 -7541319 -5608640 -2032060
5718b032060J083260k470906l322012j718726J10462J667052L198265L421236
$$ -2032060 -948800 -3419706 -6741718 -8460444 -8349982 -6682930 -3484665 -63429
5710f3429J272182j498532k116495k74464K084131L384610L161556J527365l91992
$$ -63429 1208753 -289779 -2406274 -2680738 -596607 2788003 5949559 7476924 7084932
5701G084932q84584j21050n16440k905170m431369k587088O42725J572063J81826
$$ 7084932 6200348 6079298 5562858 2657688 -1773681 -4360769 -3718044 -2145981 -1964155
5692a964155m96768O75351J861636J630622N26713m59348n42472J116673L824387
$$ -1964155 -2460923 -1785572 76064 1706686 2233399 1774051 1231579 2348252 6172639
5683F172639M459934J170036k915457l171215j61803J089219j417408m079799
$$ 6172639 10632573 11802609 8887152 5715937 5554134 6643353 5225945 1146146
5675A146146l483137p87293J189024J715437J138521o57350k681157k607179l18541
$$ 1146146 -2336991 -3124284 -1935260 -219823 918698 261348 -2419809 -5026988 -5345529
5666e345529J022479k44430j212286J024007M313051M531459J853130l4673N3750
$$ -5345529 -4323050 -4567480 -5779766 -4755759 -442708 4088751 5941881 5907208 5960958
5657E960958k45521j902351k587597q76026R67627L23181j928999k957248j971927
$$ 5960958 5715437 3813086 1225489 349463 1317090 1640271 -288728 -3245976 -5217903
5648e217903o74272m22397p40594n78442L22869J629424L018962M026778L829868
$$ -5217903 -5892175 -6314572 -7055166 -7633608 -7310739 -5681315 -2662353 1364425 5194293
5639E194293J953685p57106k507841k367468j386884j277851k122406k237016
$$ 5194293 7147978 6390872 3883031 1515563 128679 -1149172 -3271578 -5508594
5631e508594n10837J986452L295391K846677J743193J096618P86902j00005j960839
$$ -5508594 -6019431 -4032979 -737588 2109089 3852282 4948900 5735802 5635797 3674958
5622C674958l902558m412700l107288j521449j326779j898399j034096J495477
$$ 3674958 -227600 -4640300 -7747588 -9269037 -10595816 -12494215 -13528311 -12032834
5614a2032834K844359R41048j918634j582158K206673M982794L180601j410888
$$ -12032834 -9188475 -8247427 -10166061 -11748219 -9541546 -4558752 -1378151 -2789039
5606b789039m189671l349711j110433L0632J75857P35185J956369K933264L194387
$$ -2789039 -6978710 -10328421 -11438854 -11408222 -11232365 -10497180 -8540811 -5607547 -2413160
5597b413160K973746K217614O02214j333618k235936j619270o19985m41049p91934
$$ -2413160 560586 2778200 3380414 2046796 -189140 -1808410 -2428395 -2869444 -3661378
5588c661378o38704J43128Q31018J133126J317223J238373L51924j183553k364334
$$ -3661378 -4300082 -4156954 -3325936 -2192810 -875587 362786 714710 -468843 -2833177
5579b833177k528211j899799q14186O93835K229256K919564K555420K116077K425399
$$ -2833177 -5361388 -7261187 -8075373 -7381538 -5152282 -2232718 322702 2438779 4864178
5570D864178K789294J827873m48500k166355j541875R59480K814470J980203r38877
$$ 4864178 7653472 9481345 9032845 6866490 5324615 6284095 9098565 11078768 10139891
5561A0139891l435373l920764l111593k402980j855889o76929R82700J896902
$$ 10139891 6704518 2783754 -327839 -2730819 -4586708 -5263637 -4280937 -2384035
5553b384035J255180o04845k660952l527074j920652J753912M617131L877944
$$ -2384035 -1128855 -1733700 -4394652 -7921726 -9842378 -8088466 -3471335 406609
5545D06609L81153k067489j332213P64999J444637N04905l62097l84135k01580
$$ 406609 787762 -1279727 -2611940 -1846941 -402304 102601 -259496 -643631 -845211
5536h45211k52000k16124N1950K21612L00186R85066K747098M646894M475790
$$ -845211 -1097211 -1313335 -1261385 -1039773 -739587 245479 2992577 7639471 12115261
5527A2115261R00598m104162o082651k843026K219589L496643j95460m452567
$$ 12115261 13015859 8911697 2829046 -13980 2205609 5702252 5506792 1054225
5519A054225n036124k417384K50868J208604N68502j100119k564316j898362J122432
$$ 1054225 -3981899 -6399283 -6148415 -4939811 -4371309 -5471428 -8035744 -9934106 -8811674
5510h811674L737261L404774J303035N23215J689323K708665K272993J151026
$$ -8811674 -5074413 -1669639 -366604 156611 1845934 4554599 6827592 7978618
5502G978618J65498p77731j452415j154457j41432M72655N18767Q69544J536170
$$ 7978618 8144116 7366385 5913970 4759513 4618081 5090736 5609503 6479047 8015217
5493H015217J284413m98799k895327m588548m706905k776494N83496L112882K874368
$$ 8015217 9299630 8800831 5905504 1316956 -3389949 -6166443 -5582947 -2470065 404303
5484D04303P23639r65976j697837k603292l106541j206573K168772K792918p70374
$$ 404303 1127942 161966 -1535871 -4139163 -7245704 -8452277 -6283505 -3490587 -4260961
5475d260961l914836j998229K666702L705185m16454m424769l592963N16469L222579
$$ -4260961 -8175797 -10174026 -7507324 -3802139 -4218593 -8643362 -12236325 -11719856 -8497277
5466h497277K938397J815656J609471J601408P40396k58634r1666Q92457J032023
$$ -8497277 -5558880 -3743224 -2133753 -532345 208051 -50583 -142249 750208 1782231
5457A782231j75192j205601o74809N66769N29409j144578k641848k236758j20709
$$ 1782231 1607039 401438 -273371 293398 822807 -321771 -2963619 -5200377 -5321086
5448e321086K195414L411489L102943J730784M39617J82044O33264N16995p42575
$$ -5321086 -3125672 285817 3388760 5119544 5559161 5741205 6374469 6891464 6148889
5439F148889k323017l141515k912876j844102k33247J169366J377832M64604j55816
$$ 6148889 3825872 684357 -2228519 -4072621 -4305868 -3136502 -1758670 -1294066 -1449882
5430a449882M85164J527625J536839N48614j39182O9637K94761n25605k190017
$$ -1449882 -964718 562907 2099746 2648360 2509178 2578815 2873576 2347971 157954
5421A57954l361993l016419j612981n12304m1751J097396L550537N217164L348894
$$ 157954 -3204039 -6220458 -7833439 -8345743 -8387494 -7290098 -3739561 1477603 4826497
5412D826497j269867m478577l839417j400758j26058J12157Q59825J462990K13818
$$ 4826497 3556630 -921947 -4761364 -6162122 -6288180 -6176023 -5316198 -3853208 -3639390
5403c639390j929476k130997j30596J212349L69784p35665q5565J538122K412462
$$ -3639390 -5568866 -7699863 -7830459 -6618110 -6248326 -6983991 -7069556 -5531434 -3118972
5394c118972K395918J980332Q40403q01330j179159M51950J804670O51938j290915
$$ -3118972 -723054 1257278 2097681 1296351 117192 569142 2373812 3025750 1734835
5385A734835n96772K335112L337685M86025l139354l931640k236072n24255N59509
$$ 1734835 1138063 3473175 6810860 7296885 4157531 225891 -2010181 -2534436 -1974927
5376a974927J788443K489469J023715k152356m353847l917331j780415M55820
$$ -1974927 -186484 2302985 3326700 1174344 -3179503 -7096834 -8877249 -8421429
5368h421429K274206L522498L631904K550722J309274O68993M5473j331597k889187
$$ -8421429 -6147223 -2624725 1007179 3557901 4867175 5536168 5581641 4250044 1360857
5359A360857l266473j994370N1820J502938J367940l16173k172872k539012j462741
$$ 1360857 -1905616 -3899986 -3848166 -2345228 -977288 -1293461 -3466333 -6005345 -7468086
5350g468086q30921j688197k409311q96703K087444L559315K263991K64790m240
$$ -7468086 -8299007 -9987204 -12396515 -13293218 -11205774 -7646459 -5382468 -5117678 -5121918
5341e121918J098088J273893l62857j929189r83423K359108N026224M120473L61321
$$ -5121918 -4023830 -2749937 -3112794 -5041983 -6025406 -3666298 1359926 5480399 5841720
5332E841720k410760j590929J226062K488073R85635j443768k799291k649689
$$ 5841720 3430960 1840031 3066093 5554166 6539801 5096033 2296742 -352947
5324c52947j240635R29296K241554R30987j998466k928975l98492K098146N14464
$$ -352947 -1593582 -664286 1577268 2508255 509789 -2419186 -2817678 -719532 -205068
5315b05068l676541m891694j014839L504116L543027p2622k267899q44399J064179
$$ -205068 -3881609 -8773303 -9788142 -6284026 -2740999 -2813621 -5081520 -5925919 -4861740
5306d861740R1535k428953k587453L07042K592491J275694j853724k562519L93448
$$ -4861740 -4770205 -7199158 -9786611 -9479569 -6887078 -5611384 -7465108 -10027627 -9634179
5297i634179L889738M394213J802121j244432k756732k983470k847715k015024
$$ -9634179 -5744441 -1350228 451893 -792539 -3549271 -6532741 -9380456 -11395480
5289a1395480N39271M172952N988016L773263p81187l357698j981662P84757J598101
$$ -11395480 -10856209 -6683257 -695241 3078022 2296835 -1060863 -3042525 -2257768 -659667
5280f59667O25821J83576M38180n25040k500211k430722P60827L471657K003144
$$ -659667 -33846 149730 587910 62870 -2437341 -4868063 -4107236 -635579 1367565
5271A367565j986688l566211j265261J406463J430985J82941L48712J429953J017876
$$ 1367565 -619123 -4185334 -5450595 -4044132 -2613147 -2430206 -2081494 -651541 366335
5262C66335o05854l91070K464594M341366J941787k726278m767710k920149o65693
$$ 366335 -239519 -630589 1834005 6175371 8117158 5390880 623170 -2296979 -2962672
5253b962672p48069j782889j575024q28359j152713j551168K7196K745229L613041
$$ -2962672 -3710741 -5493630 -7068654 -7897013 -9049726 -10600894 -10573698 -7828469 -4215428
5244d215428J924297K35710P42032K908223M817753M836049K095517k398953n341001
$$ -4215428 -2291131 -2055421 -1313389 1594834 6412587 11248636 13344153 10945200 5604199
5235E604199m327360j316754j16086q22927m45216J037727J09354l502752m731376
$$ 5604199 1276839 -39915 -156001 -978928 -1424144 -386417 -277063 -3779815 -8511191
5226h511191q07422L698428L551616O09607m8202J444709J067128j256457j580041
$$ -8511191 -9318613 -5620185 -2068569 -1458962 -1507164 -62455 1004673 -251784 -1831825
5217a831825O46331J350462r39054k334432j73370K469886J745781j232454k738895
$$ -1831825 -1185494 164968 -774086 -3108518 -3281888 -812002 933779 -298675 -3037570
5208c037570j776770j01728J008069J280421L93954j142119j413168L97328K169780
$$ -3037570 -4814340 -4916068 -3907999 -2627578 -2233624 -3375743 -4788911 -4391583 -2221803
5199b221803J522544q95153k655788k732557j473180J012292L948571M731797
$$ -2221803 -699259 -1594412 -4250200 -6982757 -8455937 -7443645 -3495074 1236723
5191A236723J670555k731030m119932j701434J370752K737296K899710K386658
$$ 1236723 2907278 176248 -3943684 -5645118 -4274366 -1537070 1362640 3749298
5183C749298L50687k738927m056183k064651J013400K300457J837090J066814
$$ 3749298 4099985 1361058 -2695125 -4759776 -3746376 -1445919 391171 1457985
5175A457985j10131k103178l238699j882670J75350O2347j090804M22219M122862
$$ 1457985 1347854 -755324 -3994023 -5876693 -5701343 -5638996 -6729800 -6307581 -2184719
5166b184719M721785K2271m936219m696770p55138J730948J662018J696828K199162
$$ -2184719 2537066 2559337 -2376882 -7073652 -7828790 -6097842 -4435824 -2738996 -539834
5157e39834R71969j470101j882865j97109q8368k067365j387618M151856R115489
$$ -539834 432135 -1037966 -2920831 -3117940 -3206308 -5273673 -6661291 -2509435 6606054
5148F606054P509540J506144j872428o60863O56701j124372l888899m594745l555174
$$ 6606054 14115594 15621738 13749310 13088447 13745148 12620776 8731877 4137132 581958
5139E81958k699837k370522j604022l6970J607267K027828K21297k945038m386855
$$ 581958 -2117879 -4488401 -6092423 -6129393 -4522126 -2494298 -2273001 -5218039 -9604894
5130i604894j869493K649671M721632K643878q87471k607875k158805j134011
$$ -9604894 -11474387 -8824716 -4103084 -1459206 -2346677 -4954552 -7113357 -8247368
5122h247368n08360p1958O47448J647278K136741J153751o75953q39722J857850
$$ -8247368 -8755728 -8827686 -8180238 -6532960 -4396219 -3242468 -3918421 -4758143 -2900293
5113b900293M502210L019798k041670n402102l514751J260872M109490L222195
$$ -2900293 1601917 4621715 2580045 -2822057 -6336808 -5075936 -966446 2255749
5105B255749L09590k440297l867395l376467j060135J763823L380372L182759
$$ 2255749 2565339 125042 -3742353 -7118820 -8178955 -6415132 -3034760 147999
5097A47999J895627O29745J33428M77066R19304M16741j249925k999479l362548
$$ 147999 2043626 2673371 2806799 3283865 4203169 4619910 3369985 370506 -2992042
5088b992042j843220N88421K264967K266112J197599K87593j24884n45804j029973
$$ -2992042 -4835262 -4246841 -1981874 284238 1481837 1769430 1644546 1098742 68769
5079F8769j111168r33578r43315n87512N68876N84823k731862o832524n829666
$$ 68769 -1042399 -1975977 -2919292 -3506804 -2937928 -2353105 -5084967 -11917491 -17747157
5070a7747157R93278O527517N242576J003493N53812K931011J963642k872632
$$ -17747157 -16753879 -10226362 -4983786 -3980293 -3426481 -495470 1468172 -1404460
5062a404460n487382k789989J623706M097503M825808M022474N78457l596672
$$ -1404460 -6891842 -9681831 -8058125 -3960622 865186 4887660 5466117 1869445
5054A869445l998165o58407R26094j483289l264218j223026Q21944q10038k808848
$$ 1869445 -2128720 -2787127 -1861033 -3344322 -6608540 -7831566 -7009622 -7819660 -10628508
5045a0628508q59007K354883J645023j666437k105055O36471J552683j031081
$$ -10628508 -11487515 -9132632 -7487609 -9154046 -11259101 -10622630 -9069947 -10101028
5037a0101028k848275n90315L371240M681155K272011j349356l197899k497892
$$ -10101028 -12949303 -13539618 -10168378 -5487223 -3215212 -4564568 -7762467 -10260359
5029a0260359j138345j162886j712179l74707K091026J835088j687428l440276
$$ -10260359 -11398704 -12561590 -14273769 -14648476 -12557450 -10722362 -12409790 -15850066
5021a5850066o547M630583M615101N86927k083025j284537L70730P52759L41623
$$ -15850066 -15856613 -11226030 -6610929 -6024002 -8107027 -9391564 -9020834 -8268075 -7926452
5012g926452k06657p73729n80260N61993P75259j116102k812344j757852N78090
$$ -7926452 -8133109 -8906838 -9487098 -8925105 -8149846 -9265948 -12078292 -13836144 -13258054
5003a3258054J189191M82523P47205J353587m5362k618395l136694j085833J028953
$$ -13258054 -12068863 -11586340 -10839135 -9485548 -9530910 -12149305 -15285999 -16371832 -15342879
4994a5342879J959867K559980K982432K619469K146285K354911K039084J98434
$$ -15342879 -13383012 -10823032 -7840600 -5221131 -3074846 -719935 1319149 1517583
4986A517583j368748j123278j130995l245876m617281k133475J147871J55818
$$ 1517583 148835 -974443 -2105438 -5351314 -9968595 -12102070 -10954199 -10798381
4978a0798381l385387l111896J727456N076816L463326J26075j232553r83195
$$ -10798381 -14183768 -17295664 -15568208 -10491392 -7028066 -6901991 -8134544 -9117739
4970i117739n03559L12732J056591N38244n91948o10121j1923k87873l99579J150667
$$ -9117739 -9621298 -9308566 -8251975 -7713731 -8305679 -8915800 -8927723 -9215596 -9615175 -8464508
4960h464508K221960J32902k796375k550345m38898l37088r30012J641058N035356
$$ -8464508 -6242548 -6109646 -8906021 -11456366 -11895264 -12232352 -13162364 -11521306 -6485950
4951f485950L377033k033521l921125j058222M55497j335962j515157J257257
$$ -6485950 -3108917 -5142438 -9063563 -10121785 -9666288 -11002250 -12517407 -11260150
4943a1260150J698348j920372m208357k463795p43864r39059O77809M445540M648886
$$ -11260150 -9561802 -11482174 -15690531 -18154326 -18898190 -19837249 -19159440 -14713900 -10065014
4934a0065014l7794l143306j687559q62233k963627k476819K334839M189981j81484
$$ -10065014 -10102808 -13246114 -14933673 -15795906 -18759533 -21236352 -18901513 -14711532 -14893016
4925a4893016l001259Q09882M016386K04756m284049j925530K396654P35119l703711
$$ -14893016 -17894275 -17084393 -13068007 -12863251 -17147300 -19072830 -16676176 -15941057 -19644768
4916a9644768l542482q52488j774512m049575j810314K702139L444685J534815
$$ -19644768 -23187250 -24039738 -25814250 -29863825 -31674139 -28972000 -25527315 -23992500
4908b3992500J573967K333781Q50066j66615J540683J258028l481621n480938
$$ -23992500 -22418533 -20084752 -19234686 -19401301 -17860618 -16602590 -20084211 -25565149
4900b5565149j58895M175034J57987m743052j658822L123799L99074m070030j216103
$$ -25565149 -25724044 -21549010 -21391023 -26134075 -27792897 -24669098 -24270024 -28340054 -29556157
4891b9556157K604566k175729q004181l361403M101236Q60781o432483l953888
$$ -29556157 -26951591 -29127320 -37131501 -40492904 -36391668 -35530887 -41963370 -45917258
4883d5917258J050587n617550j3735616n798927M873324n874740k3711546j6564123
$$ -45917258 -44866671 -50484221 -64219837 -70018764 -65145440 -71020180 -94731726 -111295849
4875a11295849j34245j9003291n3139262j9184473R8160184J87054078J43474551
$$ -111295849 -111430094 -130433385 -183572647 -202757120 -104596936 82457142 225931693
4868B25931693J4851256o4285279m7530203p602832o801281k2639392j6396018
$$ 225931693 240782949 176497670 128967467 121364635 114563354 91923962 75527944
4861G5527944m36632j851173j1351574p692239J641246p15946p757073l956497
$$ 75527944 75091312 73240139 61888565 54196326 55837572 55121626 47364553 43408056
4853D3408056L989665O12781r002329r121275j331953P00810l965416m959963
$$ 43408056 47397721 48010502 39008173 29886898 28554945 29255755 25290339 20330376
4845B0330376p31424J200854k76004j3470J431836l87720l604567l530873k315964
$$ 20330376 19598952 20799806 20523802 20510332 21942168 21554448 17949881 14419008 12103044
4836A2103044m184164n653924j377515M798733N389649J690333K21915R36637
$$ 12103044 7918880 2264956 887441 5686174 11075823 12766156 12988071 13924708
4828A3924708n11519k592807p77166K534055J572852j801001j107598K731387
$$ 13924708 13413189 10820382 10043216 12577271 14150123 12349122 11241524 13972911
4820A3972911K834066j309961l187702p67478J023129j02392p82438J37663q16471
$$ 13972911 16806977 15497016 12309314 11541836 12564965 12462573 11680135 11817798 11001327
4811A1001327m204222n095916q46110M368201N510385K830285l2494p35213L28944
$$ 11001327 6797105 1701189 855079 5223280 10733665 13563950 13531456 12796243 13125187
4802A3125187Q81357j078994m110799l980778N6766K668916P0393l240312j018071
$$ 13125187 14006544 12927550 8816751 4835973 4892739 7561655 7632048 4391736 3373665
4793C373665M348520M995204l36142m752654l771848m86312Q78573L66290m62714
$$ 3373665 7722185 12717389 12381247 7628593 3856745 3370433 4249006 4615296 4152582
4784D152582j440617k032191r00307J222931J839996P47911K20496O91073J21744
$$ 4152582 2711965 679774 -220533 1002398 2842394 3590305 3810801 4501874 4623618
4775D623618j831369k935780k235558j092752r9992J255946J870326K04653j802566
$$ 4623618 2792249 -143531 -2379089 -3471841 -3571833 -2315887 -445561 -240908 -2043474
4766b043474p23777K211098K142396j494832l627742j630534R16286R07947N70193
$$ -2043474 -2767251 -556153 1586243 91411 -3536331 -5166865 -4250579 -3342632 -2772439
4757b772439K240398L368679J140149j887772j617453R79468J947692J010477
$$ -2772439 -532041 2836638 3976787 2089015 471562 1451030 3398722 4409199
4749D409199J155396K587527K133320r32014k874362r54259K291561K518581n19277
$$ 4409199 5564595 8152122 10285442 9353428 6479066 5524807 7816368 10334949 9815672
4740I815672l015061k457858n17312P2579n17137k64843P99495N67805j103452
$$ 9815672 6800611 4342753 3825441 3898020 3380883 3116040 3915535 4483340 3379888
4731C379888j442845P46388K607305J585031m11372l56942O92608k62784k503485
$$ 3379888 1937043 2683431 5290736 6875767 6464395 6107453 6800061 6537277 4033792
4722D033792k685243p72773N7071o21937J66835K676685L050418N1755j900374
$$ 4033792 1348549 575776 632847 10910 177745 2854430 5904848 5956603 4056229
4713D056229M56315L703944K962948o89764k455199j295191n56168j937801l106356
$$ 4056229 4512544 8216488 11179436 10489672 8034473 6739282 6183114 4245313 1138957
4704A138957j800940Q65148K271284J493631k81671j350394q45729P34590J840839
$$ 1138957 -661983 203165 2474449 3968080 3686409 2336015 1490286 2224876 4065715
4695D065715J056240j565199m085672l855390j14787M164078M576527P16607k483320
$$ 4065715 5121955 3556756 -528916 -4384306 -4499093 -335015 4241512 4958119 2474799
4686B474799j114857J945614J353253k034215k118863K486815N436083K060197
$$ 2474799 1359942 3305556 4658809 2624594 505731 2992546 8428629 10488826
4678A0488826l492805m536305j170649J437389J144818k5468j056420k845869
$$ 10488826 6996021 2459716 1289067 2726456 3871274 3845806 2789386 -56483
4670e6483m408178l174220L60431K500923J765411O99053J187257J606936L96715
$$ -56483 -4464661 -7638881 -7278450 -4777527 -3012116 -2313063 -1125806 481130 877845
4661H77845p79964P8528J604105J050242j278524k258870l02267K632227L640776
$$ 877845 97881 176409 1780514 2830756 1552232 -706638 -1008905 1623322 5264098
4652E264098K057520l96492j697395j247685o7110K56831r66913k734346l110576
$$ 5264098 7321618 6925126 5227731 3980046 3912936 4169767 3202854 468508 -2642068
4643b642068j218575J488050K504786J155635m86771l03926R51317Q23366j062786
$$ -2642068 -3860643 -2372593 132193 1287828 801057 497131 1448448 2271814 1209028
4634A209028k251541r75173J336351K119827Q83200q84497j870473j654227k44844
$$ 1209028 -1042513 -2017686 -681335 1438492 2321692 1437195 -433278 -2087505 -2332349
4625b332349J549473J968427J37728k260862k625475n97341J692251K371124J523938
$$ -2332349 -782876 1185551 1323279 -937583 -3563058 -4160399 -2468148 -97024 1426914
4616A426914K56737n20279k24715J122606K332208J902901j1963j467041j163371
$$ 1426914 1683651 1163372 938657 2061263 4393471 6296372 6284409 4817368 3653997
4607C653997r7339R7501l15898L52216K329926L455992J933705j004957k509440
$$ 3653997 3556658 3654159 3338261 3690477 6020403 9476395 11410100 10405143 7895703
4598G895703j749109n52290l48553l94509J13284J28147j311451k756173k195256
$$ 7895703 6146594 5594304 5245751 4851242 4964526 5092673 3781222 1025049 -1170207
4589a170207k17898J073612J434745J939182J775766p86461m108373l918635L85243
$$ -1170207 -1388105 -314493 1120252 3059434 4835200 4048739 -59634 -3978269 -3593026
4580c593026L968806L095740k6473j405963r13710n40677J557J822030L033743
$$ -3593026 375780 3471520 3445047 2039084 1125374 584697 586254 2408284 5442027
4571E442027R28669k910768l965313j176275J776153J865017Q982j460320j489785
$$ 5442027 6370696 3459928 -505385 -1681660 94493 1959510 1968492 508172 -981613
4562i81613Q2720K640611L900301J832707j800073k793408l32200J599137Q2778
$$ -981613 -898893 1741718 5642019 7474726 5674653 2881245 2549045 4148182 4230960
4553D230960k429167j832923J872126M946246M618866J425204k118207l562065
$$ 4230960 1801793 -31130 1840996 6787242 11406108 12831312 10713105 7151040
4545G151040k212969q2749j22041k466079l853448j986178J247823K613143J911525
$$ 7151040 4938071 4855322 4733281 2267202 -1586246 -3572424 -2324601 288542 2200067
4536B200067J229122J066261N3931j838586k646084j505496j68516m51228j819255
$$ 2200067 3429189 4495450 4549381 2710795 64711 -1440785 -1609301 -2060529 -3879784
4527c879784k584562k235668j368852k20676J282117K314491J468826j202078
$$ -3879784 -6464346 -8700014 -10068866 -10289542 -9007425 -6692934 -5224108 -6426186
4519f426186l354935k474501J314122N192724O462909M878231K132736j22112
$$ -6426186 -9781121 -12255622 -10941500 -5748776 714133 5592364 7725100 7602988
4511G602988j208044j153812n76368n89496j757972l042589k727360o55215J330593
$$ 7602988 6394944 5241132 4664764 4075268 2317296 -725293 -3452653 -4107868 -2777275
4502b777275J601932O21685l0934R4612k3908j075965k186002k019287o85657
$$ -2777275 -1175343 -553658 -584592 -489980 -513888 -1589853 -3775855 -5795142 -6480799
4493f480799K81817j2982o30100k91475O79587J067497Q81079J105428J469682
$$ -6480799 -6198982 -6211964 -6842064 -7133539 -6453952 -5386455 -4505376 -3399948 -1930266
4484a930266N77161j231224j510643N20219K183929J327041n2415J006411L207826
$$ -1930266 -1353105 -2584329 -4094972 -3574753 -1390824 -63783 -116198 890213 4098039
4475D098039K526494j560002m934646m355194j046080J961480L305936L110380
$$ 4098039 6624533 5064531 129885 -4225309 -5271389 -3309909 -3973 3106407
4467C106407J855174P52820J217591K721230K874070N73009k634426m948805n990386
$$ 3106407 4961581 5714401 6931992 9653222 12527292 13100301 10465875 5517070 -473316
4458d73316n431127k597366J282930L076984J820457M62988J506586L142768K202920
$$ -473316 -5904443 -8501809 -7218879 -4141895 -2321438 -1858450 -351864 2790904 4993824
4449D993824r35620l166101l024676j541486K24790J807938K228390Q70714r42411
$$ 4993824 4058204 892103 -2132573 -3674059 -3449269 -1641331 587059 1457773 515362
4440E15362j482692j185459j548424k263688j930109r07384o51126o90171O04193
$$ 515362 -967330 -2152789 -3701213 -5964901 -7895010 -8802394 -9453520 -10143691 -9539498
4431i539498K338335J635403j538350l471003j898247R62927K246649K396253
$$ -9539498 -7201163 -5565760 -7104110 -10575113 -12473360 -11510433 -9263784 -6867531
4423f867531K968102K981863O19814k768021l606741q90118K555112L895755L262517
$$ -6867531 -3899429 -917566 -297752 -3065773 -6672514 -7562632 -5007520 -1111765 2150752
4414B150752K303156J575929M81876j221851k871419l461573k245335P21124M066897
$$ 2150752 4453908 6029837 6511713 5289862 2418443 -1043130 -3288465 -2567341 1499556
4405A499556N588363M047324N55891k309015k903469j733130k79484P87103J716235
$$ 1499556 7087919 11135243 11691134 9382119 6478650 4745520 4466036 5253139 6969374
4396F969374K380471J855956k41644k592718l173551j477952Q10663J594770M66510
$$ 6969374 9349845 11205801 10964157 8371439 5197888 3719936 4530599 6125369 6591879
4387F591879j174743j726747o80546J382630L286021L582956J331198k565010
$$ 6591879 5417136 3690389 3009843 4392473 7678494 11261450 12592648 10027638
4379A0027638n269934m481624j071178J764390K088492P50064p98517k290466
$$ 10027638 4757704 276080 -795098 969292 3057784 3807848 3009331 718865
4371G18865l264456j995382J972243N474230M597392l52929n040453o138005l956126
$$ 718865 -2545591 -4540973 -2568730 2905500 7502892 7149963 2109510 -4028495 -7984621
4362g984621k71798L581723N925011N012084J555267j272635j777885j605489
$$ -7984621 -8256419 -4674696 1250315 6262399 7817666 6545031 4767146 3161657
4354C161657k292947k427285m21486J987888J927622q3903p52114J133057L060981
$$ 3161657 868710 -1558575 -1980061 7827 1935449 1851546 1099432 2232489 5293470
4345E293470K411299k78259k404061k446913j267676o95322j263294j603621m24211
$$ 5293470 7704769 7426510 5022449 2575536 1307860 612538 -650756 -2254377 -2678588
4336b678588J375717J766466O51663J54901J384775K704121K149662M7232j786051
$$ -2678588 -1302871 463595 1115258 1270159 2654934 5359055 7508717 7555949 5769898
4327E769898k168526j179940k5413n87712l265474n149845l023021J472516L150815
$$ 5769898 3601372 2421432 2396019 1808307 -1457167 -6607012 -9630033 -8157517 -5006702
4318e006702P70258r46554J189961L785940K661292m13520j214319K2425K13558
$$ -5006702 -4236444 -5182998 -3993037 -207097 2454195 2040675 826356 848781 1062339
4309A062339n70435p6109R27899j28643k281022k254024l70724J4959j343406
$$ 1062339 491904 415795 1343694 1215051 -1065971 -3319995 -3690719 -3675760 -5019166
4300e019166j299861P35843J763913O36783l61954o9551R7806q2606R27370K475616
$$ -5019166 -6319027 -5583184 -3819271 -3182488 -3544442 -3613993 -3516187 -3598793 -2671423 -195807
4290a95807J885753n87985j657411o58898m12949j536653j188023J151916K024658
$$ -195807 1689946 1101961 -555450 -1214348 -1627297 -3163950 -4351973 -3200057 -1175399
4281a175399n4056k155906k337841k234191k327192l29100L222807L665990k23944
$$ -1175399 -1229455 -3385361 -5723202 -7957393 -10284585 -10613685 -7390878 -3724888 -3948832
4272c948832l024715p94369K933563L348404J376555O5787j024716k884771l110459
$$ -3948832 -6973547 -7767916 -4834353 -1485949 -109394 -43607 -1068323 -3953094 -7063553
4263g063553j82633K358246J277761n94618P43555L502883L564058J523827O02921
$$ -7063553 -7246186 -4887940 -3610179 -4204797 -3461242 41641 3605699 5129526 5732447
4254E732447N53357o59922j883656j114127j42442j294392k273486l5718K901228
$$ 5732447 6285804 5625882 3742226 2628099 2485657 1191265 -1082221 -1117939 1783289
4245A783289K145951r77018j789564j31850L73621q99019j634514j683164k276399
$$ 1783289 3929240 2952222 1162658 1030808 1404429 505410 -1129104 -2812268 -5088667
4236e088667k104443J01839J570204K7474r59211K028168M579100R31889n197145
$$ -5088667 -7193110 -7091271 -5521067 -5493593 -6452804 -4424636 154464 1086353 -4110792
4227d110792n651369j165130O06835j248005l19922M269950N803143K093131r93499
$$ -4110792 -9762161 -10927291 -10320456 -11568461 -11888383 -7618433 -1815290 277841 -715658
4218g15658k23353P71109J36463R05210L080136K201214j746126l408865k053842
$$ -715658 -939011 -167902 -31439 873771 3953907 6155121 4408995 1000130 -1053712
4209a053712k570966m823121l063537J946661K419250k033571k562726K630463
$$ -1053712 -3624678 -8447799 -11511336 -9564675 -7145425 -9178996 -11741722 -9111259
4201i111259M309044o39626l199943L51114J158035m190935n657256K98602J454950
$$ -9111259 -4802215 -5441841 -8641784 -8290670 -7132635 -11323570 -16980826 -16682224 -15227274
4192a5227274o797927r320074M30008K055109j7030641k9009257j959017M3821003
$$ -15227274 -22025201 -31345275 -30915267 -28860158 -45890799 -74900056 -76859073 -33038070
4184c3038070N5381554K1158212j4029209j4837620J586239L945755n686635o994178
$$ -33038070 22343484 43501696 29472487 14634867 16221106 20166861 14480226 7486048
4176G486048N36983K573938j514613q41812M190191L407879l180967n699584k068861
$$ 7486048 8023031 10596969 9082356 8240544 12430735 15838614 12657647 6958063 4889202
4167D889202O06618K75347J280219L133254J145205k879456k681783P46069Q89473
$$ 4889202 5495820 5771167 7051386 10184640 11329845 8450389 5768606 6514675 7404148
4158G404148j982130j627363J826574J962082j367895j114252L941353O213240
$$ 7404148 5422018 3794655 5621229 7583311 6215416 5101164 9042517 15255757
4150A5255757J941093l073169l567734j910508j632977j719937r74704j170224
$$ 15255757 17196850 14123681 10555947 8645439 7012462 5292525 4317821 3147597
4142C147597k376989j366845K216861M031594K201866L73023Q33108P56035j493681
$$ 3147597 770608 -596237 1620624 5652218 7854084 8227107 9060215 9816250 8322569
4133H322569k501497j22976K092718J072236n43415P4730L39459k479613m912382
$$ 8322569 5821072 5698096 7790814 8863050 8319635 8394365 8733824 6254211 1341829
4124A341829k365762K752625M322438J789470o2027N20939K61604k570716n040752
$$ 1341829 -1023933 1728692 6051130 7840600 7778573 8299512 8561116 5990400 949648
4115I49648m363725j711825M10723J434718J760275J103272l42458q21491J053156
$$ 949648 -3414077 -5125902 -4715179 -3280461 -1520186 -416914 -759372 -1580863 -527707
4106e27707M057879N378975L606504n6562l340376m957234n015314m042099k400952
$$ -527707 3530172 8909147 12515651 12459089 9118713 4161479 -853835 -4895934 -7296886
4097g296886p16030J81255N06345J769077M440866O161758M236187k89352l245178
$$ -7296886 -8012916 -7831661 -7325316 -5556239 -1115373 5046385 9282572 8993220 5748042
4088E748042k463427k35374J56574j511201k982725k679709r98592O11496R31555
$$ 5748042 3284615 3049241 3205815 1694614 -1288111 -3967820 -4966412 -4354916 -3423361
4079c423361N4202m06273Q70798K843264L308934K163769J379520J445897N21947
$$ -3423361 -3369159 -3775432 -2904634 -61370 3247564 5411333 6790853 8236750 8758697
4070H758697j816300k890315j016597J240400O72655j623723k147480o45890k20962
$$ 8758697 6942397 4052082 3035485 4275885 4948540 3324817 1177337 531447 310485
4061C10485j913304k810977o76866K434981L100224J209871m29296k70199M09323
$$ 310485 -1602819 -4413796 -5090662 -2655681 444543 1654414 1225118 954919 1364242
4052A364242J87403k47816L38435J142936J95722k259070l298577j293539J362603
$$ 1364242 1551645 1303829 1642264 2785200 2980922 721852 -2576725 -3870264 -2507661
4043b507661J418847m73764p45009J679539L851053L273825J105570m12035j145919
$$ -2507661 -1088814 -1562578 -2307587 -628048 3223005 6496830 7602400 7190365 6044446
4034F044446j780201j556213J73783J669582Q32992j324985j881605k33911J421241
$$ 6044446 4264245 2708032 2881815 4551397 5384389 4059404 2177799 1943888 3365129
4025C365129J715692J595818J750083J044002j318181l846629m349897k492817
$$ 3365129 5080821 6676639 8426722 9470724 8152543 4305914 -43983 -2536800
4017b536800J61471J845489J631374k78475k386290k690334o36136J977958K819001
$$ -2536800 -2375329 -529840 1101534 823059 -1563231 -4253565 -4889701 -2911743 -92742
4008i2742J635627L51161M35935R29338j86362k877130m503444l107825k96415
$$ -92742 1542885 1894046 2329981 3259319 3072957 195827 -4307617 -7415442 -7711857
3999g711857O70108p25883j726166m30374J725800K638925K526291K497979J996315
$$ -7711857 -7041749 -7767632 -9493798 -9924172 -8198372 -5559447 -3033156 -535177 1461138
3990A461138M0313k211183k721972j678332q37561m16429O63606J906540J713366
$$ 1461138 1501451 -709732 -3431704 -5110036 -5947597 -6364026 -5700420 -3793880 -2080514
3981b080514O53253R15608K150442J537299j038846j890889M64619K166124j11519
$$ -2080514 -1427261 -511653 1638789 3176088 2137242 246353 710972 2877096 2765577
3972B765577l566723l445772j86745J989268J754061J156628N63850j620031m185821
$$ 2765577 -801146 -4246918 -4433663 -2444395 -690334 466294 1030144 -589887 -4775708
3963d775708l431387N38798K741868O11392k034379j002050K239429L781526L052749
$$ -4775708 -8207095 -7668297 -4926429 -4315037 -6349416 -7351466 -5112037 -1330511 1722238
3954A722238J553934j137803n429810p830351m265928L206743P769907O308757
$$ 1722238 3276172 2138369 -3291441 -11121792 -15387720 -12180977 -4411070 1897687
3946A897687K438401N36605P82583J242319J114484J82878j852855l753098l206498
$$ 1897687 4336088 4872693 5655276 6897595 8012079 8194957 6342102 2589004 -617494
3937f17494n57660P06403j061681l073789k531313o64808K32435Q63441K630502
$$ -617494 -1175154 -468751 -1530432 -4604221 -7135534 -7800342 -7567907 -6704466 -4073964
3928d073964L724672J621845j944201k724336j70075J979767J360236l65232r78708
$$ -4073964 -349292 1272553 -671648 -3395984 -3566059 -1586292 -226056 -591288 -1569996
3919a569996n77208q9497M07150R53665J330552J837718K514150J802455j393040
$$ -1569996 -2147204 -2236701 -1829551 -875886 454666 2292384 4806534 6608989 5215949
3910E215949m518606l602071Q34551L594186J644354k224052m012854l345801
$$ 5215949 697343 -2904728 -2070177 1524009 3168363 944311 -3068543 -6414344
3902f414344j669652R52915M294800N833062L547400o51000l101206k783782j242543
$$ -6414344 -8083996 -7131081 -2836281 2996781 6544181 5893181 2791975 8193 -1234350
3893a234350K86475J153819L59320j787651k522179k62900J901893l3201m541527
$$ -1234350 -947875 205944 565264 -1222387 -3744566 -4007466 -2105573 -2138774 -6680301
3884f680301n848006j790630L371375M833949K622689j17872j301337p78517O76585
$$ -6680301 -12528307 -14318937 -10947562 -6113613 -3490924 -3608796 -4910133 -5688650 -5012065
3875e012065J608319P49662j079808j407903O27084L033437L788008L034312J504001
$$ -5012065 -3403746 -2654084 -3733892 -5141795 -4514711 -1481274 2306734 5341046 6845047
3866F845047j045744m156605n392580l059857Q79024K801225J758029r2317r16522
$$ 6845047 5799303 1642698 -3749882 -6809739 -5930715 -3129490 -1371461 -1463778 -2380300
3857b380300j028711j250997j389629j011244l88088J78388J107857K717288M102850
$$ -2380300 -3409011 -4660008 -6049637 -7060881 -7448969 -7270581 -6162724 -3445436 657414
3848F57414L785947J568074r36544k013040j641069r79443m41797N79005J952830
$$ 657414 4443361 6011435 5074891 3061851 1420782 441339 -458 578547 2531377
3839B531377K257722Q74006o90244r52606p39355j414037j891573j61441K563322
$$ 2531377 4789099 5663105 4972861 4020255 3280900 1866863 -24710 -186151 2377171
3830B377171K545755q37331l429657k095659O41735M26085k587085m467611l409025
$$ 2377171 4922926 4085595 655938 -1439721 -797986 -371901 -2958986 -7426597 -10835622
3821a0835622j392429j64503R95433K656150L306710J682549r13500k281133k003502
$$ -10835622 -12228051 -12392554 -11397121 -8740971 -5434261 -3751712 -4665212 -6946345 -8949847
3812h949847j006137L60846K109463L312552K918985J663773J397257K280793
$$ -8949847 -9955984 -9595138 -7485675 -4173123 -1254138 409635 1806892 4087685
3804D087685K293552K19510k318553l008295j994979j245132j234857l22916K054216
$$ 4087685 6381237 6600747 4282194 1273899 -721080 -1966212 -3201069 -3523985 -1469769
3795a469769L525487J720671k059299m102766k905124n36114P80390J262205J746326
$$ -1469769 2055718 3776389 1717090 -2385676 -5290800 -5826914 -5046524 -3784319 -2037993
3786b037993J340526j044342l915978m333859j736225J386388K945416L461864
$$ -2037993 -697467 -1741809 -5657787 -9991646 -11727871 -10341483 -7396067 -3934203
3778c934203M073695M192807K661571O2402j907232k809173l430723l559822j855200
$$ -3934203 139492 4332299 6993870 7056272 5149040 2339867 -1090856 -4650678 -6505878
3769f505878J390332L246392J526461j842975k761835j01706K933693L082863
$$ -6505878 -5115546 -1869154 -342693 -2185668 -4947503 -5049209 -2115516 967347
3761I67347R76264l97361K8787N07512l39557j339198o53387J280018K042571
$$ 967347 1943611 1546250 1575037 2082549 1742992 403794 -249593 1030425 3072996
3752C072996L20840k374019l446793k016378N72313K534629L012314J757594j161218
$$ 3072996 3393836 1019817 -2426976 -4443354 -3871041 -1336412 1675902 3433496 2272278
3743B272278m424471n308745k252511K529956M810221L234468P48117K68932Q80776
$$ 2272278 -2152193 -7460938 -9713449 -7183493 -2373272 861196 1609313 1878245 2759021
3734B759021J44995j441074j167538J164022K346967M09200k432703l018020j551846
$$ 2759021 2904016 1462942 295404 1459426 3806393 4215593 1782890 -1235130 -2786976
3725b786976o78418j348351j779138m25283J737946K466112R60919j203590j786833
$$ -2786976 -3465394 -4813745 -6592883 -7018166 -5280220 -2814108 -1853189 -3056779 -4843612
3716d843612m40738P41412j73543k133826k243769P1970J896598Q94138j251860
$$ -4843612 -5284350 -4542938 -4716481 -6850307 -9094076 -9022106 -7125508 -6231370 -7483230
3707g483230j400137L96371J357786M57259m72199k87847j91944p97197m10140
$$ -7483230 -8883367 -8486996 -7129210 -6671951 -7144150 -7431997 -7623941 -8421138 -8831278
3698h831278J771731L104194R28059k888188l973656j472794J147072J468405
$$ -8831278 -7059547 -3955353 -3027294 -5915482 -9889138 -11361932 -10214860 -8746455
3690h746455J016181J697431K468121J654727J81712j65285O1327n35225q21613
$$ -8746455 -7730274 -6032843 -3564722 -1909995 -1728283 -1893568 -1832241 -2367466 -3189079
3681c189079J241826M153803L963234L18073k432462j558934L53455K53378m47218
$$ -3189079 -1947253 2206550 6169784 6487857 4055395 2496461 2849916 3103294 2656076
3672B656076P77992K222370N12843l045571l701340o99403J391951j18298k018735
$$ 2656076 3434068 5656438 6169281 3123710 -577630 -1277033 114918 -3380 -2022115
3663b022115o21874K472727L188730J106580n94659q8298J281540J756102J217458
$$ -2022115 -2643989 -171262 3017468 4124048 3529389 3441091 4722631 6478733 7696191
3654G696191L18434o06317j349009j617758j263017l31145P00237N52015j756623
$$ 7696191 8014625 7408308 6059299 4441541 3178524 2847379 3547616 4099631 2343008
3645B343008m746510n028815j473151K549757K994473K10652j916520j196277
$$ 2343008 -2403502 -7432317 -8905468 -6355711 -3361238 -3150586 -5067106 -6263383
3637f263383Q41766J928374J623787N02046j048264k288838k042654k38832J520185
$$ -6263383 -5421617 -3493243 -1869456 -1367410 -2415674 -4704512 -6747166 -6985998 -5465813
3628e465813J846866J233847J098919J841353K570203K366009J257287J02476
$$ -5465813 -3618947 -2385100 -1286181 555172 3125375 5491384 6748671 6851147
3620F851147k68572R3327L30223j31993r03525j345795j395144j141285l40593
$$ 6851147 6582575 6675902 7006125 6874132 5970607 4624812 3229668 2088383 1747790
3611A747790P73878J013972j22741r91546L13764K885054L723999J759551p48789
$$ 1747790 2521668 3535640 3412899 2421353 2735117 5620171 9344170 11103721 10354932
3602A0354932j481651r69699j069779j881852j764950P2022K324530L027554J553752
$$ 10354932 8873281 7903582 6833803 4951951 3187001 3259023 5583553 8611107 10164859
3593A0164859q85184k358798j827744J32060K030447K638706J498400r67116l216378
$$ 10164859 9279675 6920877 5093133 5225193 7255640 9894346 11392746 10425630 7209252
3584G209252l204651m81470K492731K375453j418307n881666p339903m620647
$$ 7209252 4004601 3523131 6015862 8391315 6973008 1091342 -6248561 -10869208
3576a0869208L82776M324421M792422K257084l17827o98674J23180j90775j616414
$$ -10869208 -10486432 -6162011 -1369589 887495 569668 -129006 -5826 -196601 -1813015
3567a813015j910909l01067J335668J502006R86324P35587M5019j564386k520697
$$ -1813015 -3723924 -4024991 -2689323 -1187317 -200993 534594 579613 -984773 -3505470
3558c505470j240695J230026K533635K060689Q86682n13136k414445m103592m098115
$$ -3505470 -4746165 -3516139 -982504 1078185 1964867 1451731 -962714 -5066306 -9164421
3549i164421k299793k42428J091978K168893L237013L371477K052740M44571j11744
$$ -9164421 -11464214 -11706642 -10614664 -8445771 -5208758 -1837281 215459 660030 548286
3540E48286j14654j060392k854957l518964j868049P39999K184908K090306J283132
$$ 548286 433632 -626760 -3481717 -7000681 -8868730 -8128731 -5943823 -3853517 -2570385
3531b570385k77775k847400m495740k414923K341864M582681J769210j744244
$$ -2570385 -2848160 -5695560 -10191300 -12606223 -10264359 -5681678 -3912468 -5656712
3523e656712p37053K943431L240698n27737k736145o32757J567448J30116k131116
$$ -5656712 -6393765 -3450334 -209636 -737373 -3473518 -4106275 -2538827 -2408711 -4539827
3514d539827j067207J903487K754443J464672P13677L82384j399786l303144k309741
$$ -4539827 -5607034 -3703547 -949104 515568 1229245 1611629 211843 -3091301 -5401042
3505e401042N40964J233235m91443p64807J540724K908494J443515j19154K47452
$$ -5401042 -4860078 -3626843 -4118286 -4883093 -3342369 -433875 1009640 890486 1137938
3496A137938L55698j516940k765645q41002J990598K161687M06563q5141R52252
$$ 1137938 1493636 -23304 -2788949 -3629951 -1639353 522334 928897 843756 1796008
3487A796008J310301O81743O62709J215433P70801n60404j180175j130751j908833
$$ 1796008 3106309 3788052 4450761 5666194 6436995 5876591 4696416 3565665 1656832
3478A656832l337128l700291k952227k678573k746831j254323J685229L375663
$$ 1656832 -1680296 -5380587 -8332814 -11011387 -13758218 -15012541 -13327312 -9951649
3470i951649K688748J679987J869224J991702J027913L78919Q41428L22138k508570
$$ -9951649 -7262901 -5582914 -3713690 -1721988 -694075 -315156 526272 848410 -1660160
3461a660160m645374k418296K641618N329245L673374P64979m20929m50788p26560
$$ -1660160 -6305534 -8723830 -6082212 -752967 2920407 3685386 3264457 2813669 2087109
3452B087109o97949K70117P37594o94123k711612l131438k283627k025590k086121
$$ 2087109 1389160 1659277 2396871 1702748 -1008864 -4140302 -6423929 -8449519 -10535640
3443a0535640l44703L014761M622662K547354o03051j259213J83520O18340o42804
$$ -10535640 -10880343 -7865582 -3242920 -695566 -1298617 -2557830 -2374310 -1755970 -2398774
3434b398774j141132K88594J609904J281149Q80670J894136K384729J74l309362
$$ -2398774 -3539906 -3251312 -1641408 -360259 520411 2414547 4799276 4799450 1490088
3425A490088l400155l18157J475725m7622j461434L82682L251378L249630Q89789
$$ 1490088 -1910067 -2228224 -752499 -800121 -2261555 -1878873 1372505 4622135 5511924
3416E511924l89028m0679m91649k023277j954159M92342K460441J942676N41370
$$ 5511924 5122896 5082217 4590568 2567291 613132 1105474 3565915 5508591 6049961
3407F049961q711q32289k964547m183000k013097J819953L241846J288670j227251
$$ 6049961 6041250 5208961 2244414 -1938586 -3951683 -2131730 1110116 2398786 1171535
3398A171535k007252j365154j59336J532918L147133L379445K013816L08522r13196
$$ 1171535 -835717 -2200871 -2360207 -827289 2319844 5699289 7713105 8021627 7108431
3389G108431j884897k311106j181647J075436K157107P89471j324114j648864
$$ 7108431 5223534 2912428 1730781 2806217 4963324 5752795 4428681 2779817
3381B779817Q9496J951098K099084K74518k276291l662169k819236o63552P90600
$$ 2779817 2869313 4820411 6919495 7194013 4917722 1255553 -1563683 -2227235 -1436635
3372a436635O21742m53441j569552k438720k572232j429781K60908R70006O67859
$$ -1436635 -814893 -1268334 -2837886 -5276606 -7848838 -9278619 -9017711 -8047705 -7379846
3363g379846R50077K232407K739888J306965o68710j377945j059359q99229r71465
$$ -7379846 -6429769 -4197362 -1457474 -150509 -819219 -2197164 -3256523 -4155752 -5127217
3354e127217p40636k87683L18651J516504K890528K928542J452434M24245Q15665
$$ -5127217 -5867853 -6155536 -5836885 -4320381 -1429853 1498689 2951123 3375368 4191033
3345D191033Q64400o07022j585996k42674J443275P67831j017343j019636l3423
$$ 4191033 5055433 4448411 2862415 2619741 4063016 4830847 3813504 2793868 2760445
3336B760445r52445k825443j737436K113387L499051j00388m403440m331259n00705
$$ 2760445 1808000 -1017443 -2754879 -641492 2857559 2757171 -1646269 -5977528 -6478233
3327f478233K818318L319360J660490q26055k859302l166799j697650J86943J641329
$$ -6478233 -3659915 -340555 1319935 493880 -2365422 -5532221 -7229871 -7042928 -5401599
3318e401599K828308L118763J446528q21244o37191J784042K333303p63333l820684
$$ -5401599 -2573291 545472 1992000 1170756 533565 2317607 4650910 3887577 66893
3309F6893l412611j427889j007655j119366M24222J733406Q228k256139j95597
$$ 66893 -3345718 -4773607 -5781262 -6900628 -6476406 -4743000 -4734772 -6990911 -7186508
3300g186508N185144P625632M657819N27328p94465l08034k14459l20757l14408
$$ -7186508 -2001364 5624268 10282087 10809415 10014950 9706916 9492457 9171700 8857292
3291H857292j310641k736874j629881K293015M598820K275728j489656k202253
$$ 8857292 7546651 4809777 3179896 5472911 10071731 12347459 10857803 8655550
3283H655550o76309o40513k192098k429265j223543j320652k878145k770482k44182
$$ 8655550 7979241 7338728 5146630 2717365 1493822 173170 -2704975 -5475457 -5719639
3274e719639J158841p61283k954127j541679K421914M600433L223766L62506j758138
$$ -5719639 -4560798 -5322081 -8276208 -9817887 -7395973 -2795540 428226 790732 -967406
3265i67406k708008k197336M49956M026832N074879J837860k725886m084277j706594
$$ -967406 -3675414 -5872750 -5422794 -1395962 3678917 5516777 2790891 -1293386 -2999980
3256b999980Q16505J226650J398078L371444N136904L241786j527374m460580
$$ -2999980 -2183475 -956825 441253 3812697 8949601 12191387 10664013 6203433
3248F203433l284958j067827j272651k630144j656008J324562K210450o42734
$$ 6203433 2918475 1850648 577997 -2052147 -3708155 -2383593 -173143 -815877
3240h15877l451549j970483K630945N261633L506128K20640q77293J2783j1418
$$ -815877 -4267426 -6237909 -3606964 1654669 5160797 5381437 4504144 4516927 4505509
3231D505509j866958l283946k325597n1762J310332J362790J212583J061112j4688
$$ 4505509 2638551 -645395 -2970992 -3022754 -1712422 -349632 862951 1924063 1909375
3222A909375j933863k982969j951843K17413J664821J786303J467726J578009
$$ 1909375 -24488 -3007457 -4959300 -4741887 -3077066 -1290763 176963 1754972
3214A754972J881451J394965m24349k794702m002606l020771o63288J290839K010165
$$ 1754972 3636423 5031388 4607039 1812337 -2190269 -5211040 -5874328 -4583489 -2573324
3205b573324K108079K332448K446599J573198p07514l526408m839957l159618
$$ -2573324 -465245 1867203 4313802 5887000 5179486 1653078 -3186879 -6346497
3197f346497J41538J366889j144812m155148l261210J060179M083567L661460
$$ -6346497 -6204959 -4838070 -5982882 -10138030 -13399240 -12339061 -8255494 -4594034
3189d594034K830256M178682N316736K981056j139641k682750j176469p4162p89009
$$ -4594034 -1763778 2414904 7731640 10712696 9573055 6890305 5713836 5639674 4850665
3180D850665j111566l4634K76863j050074j210746J527069M011116K651857o98917
$$ 4850665 3739099 3704465 3981328 2931254 1720508 3247577 7258693 9910550 9211633
3171I211633j424964N74288P96118k513334n309538l767947Q7271J498113l97168
$$ 9211633 7786669 8360957 9157075 6643741 1334203 -2433744 -2346473 -848360 -1245528
3162a245528k115976j218898P31627J017436m78383j434126j26782K543038L947889
$$ -1245528 -3361504 -4580402 -3848775 -2831339 -3309722 -4743848 -4870630 -2327592 1620297
3153A620297K483578n69792k296398j439683K90555P17598p3157o79284r92638
$$ 1620297 4103875 3534083 1237685 -201998 88557 806155 732998 53714 -938924
3144i38924j873411k695756j702564Q22279K229267J390889N35907J537128K594014
$$ -938924 -2812335 -5508091 -7210655 -6388376 -4159109 -2768220 -2232313 -695185 1898829
3135A898829J104639j778334k550196o09638J084957P28979l7289N85396J699630
$$ 1898829 3003468 1225134 -1325062 -1934700 -849743 -120764 -158053 427343 2126973
3126B126973J623670N86532j59911m04192n53868l55926M48840J173138J248768
$$ 2126973 3750643 4337175 4177264 3773072 3219204 2863278 3312118 4485256 5734024
3117E734024J292023J776095J668981l6605k262428k991979j949108n97931N7365
$$ 5734024 7026047 8802142 10471123 10434518 8172090 5180111 3231003 2633072 2690437
3108B690437J80258O3350j15365R4904O19226K67304j427144k533079j055260
$$ 2690437 2870695 2934045 2818680 2913584 3532810 3800114 2372970 -160109 -1215369
3099a215369J543563J739849j073870l681346l598901j830719k03180J195736
$$ -1215369 328194 2068043 994173 -2687173 -6286074 -8116793 -8319973 -7124237
3091g124237K376351J980104k61432j770422m82447J684522J590577j63327l12263
$$ -7124237 -4747886 -2767782 -3029214 -4799636 -5282083 -3597561 -2006984 -2170311 -2482574
3082b482574J598603K351843J54626k570432k790756q59938O78866N88506l31514
$$ -2482574 -883971 1467872 1622498 -947934 -3738690 -4598628 -3919762 -3331256 -3662770
3073c662770q78851m82155O49620J510195J146574M1151l68370P8460J3812q37973
$$ -3662770 -4541621 -5023776 -4374156 -2863961 -1717387 -1676236 -2044606 -1966146 -1952334 -2790307
3063b790307o98429J277098K887343J778885q55888j785903k18897J503874J368645
$$ -2790307 -3488736 -2211638 675705 2454590 1598702 -187201 -406098 1097776 2466421
3054B466421k46021j810547k034078k75339K398556K946965l31609m371037m240255
$$ 2466421 2220400 409853 -1624225 -1899564 498992 3445957 3114348 -1256689 -5496944
3045e496944J47366L613706L054868J427849K219858L706258K440315l46253o14837
$$ -5496944 -5349578 -1735872 1318996 2746845 4966703 8672961 11113276 10767023 10152186
3036A0152186J532245J836609j080147l499480k739797j221303k088072m204186
$$ 10152186 11684431 13521040 12440893 8941413 6201616 4980313 2892241 -1311945
3028a311945m477347k744937j184457m06104P58585K382951L188483K836213K051063
$$ -1311945 -5789292 -8534229 -9718686 -10124790 -9366205 -6983254 -3794771 -958558 1092505
3019A092505P30237j638584l760844l352405n96378J714083K256792K863712M760905
$$ 1092505 1822742 184158 -3576686 -6929091 -7525469 -5811386 -3554594 -690882 4070023
3010D070023N610727K717716k327480m978387l296540J81605K133957J766034
$$ 4070023 9680750 12398466 10070986 5092599 1796059 1977664 4111621 5877655
3002E877655O6010j946654l095199k068629P00568K350418O30734k947648m729634
$$ 5877655 5943665 3997011 901812 -1166817 -466249 1884169 2514903 -432745 -5162379
2993e162379l392327j076371n5592j30807R3268R39195J670673J743602J131862
$$ -5162379 -8554706 -9631077 -9686669 -9817476 -9724208 -8785013 -7114340 -5370738 -4238876
2984d238876J11865o79334p42002o51792j400286k395096j722766P01357K136089
$$ -4238876 -4127011 -4806345 -5548347 -6200139 -7600425 -9995521 -11718287 -11016930 -8880841
2975h880841Q55349p21510P88310M480453O019913L587332J10580j040614j07626
$$ -8880841 -8025492 -8747002 -7958692 -3478239 2541674 6129006 6239586 5198972 5091346
2966E091346M26917o35284k386701l339300k743562j152517j20413m81627r34959
$$ 5091346 5518263 4882979 2496278 -843022 -3586584 -4739101 -4859514 -5341141 -6276100
2957f276100L48346K792899L866088K565581M28975j179335k349156k620575o37455
$$ -6276100 -5927754 -3134855 731233 3296814 3725789 2546454 197298 -2423277 -3060732
2948c060732K738875L799435P26782l267419m020408j740531M09131J302777K200342
$$ -3060732 -321857 3477578 4204360 936941 -3083467 -4823998 -4414867 -3112090 -911748
2939i11748L158049K560897J99026k079107l072380l215832k697523r68181J419420
$$ -911748 2246301 4807198 5006224 2927117 -145263 -3361095 -6058618 -7026799 -5607379
2930e607379K630741J909831M94137k78710k84696J97671R94187J419666P44066
$$ -5607379 -2976638 -1066807 -572670 -851380 -1136076 -938405 55782 1475448 2219514
2921B219514l47335k93989Q85508J189714n84390k832156k829573M0722L312136
$$ 2219514 1872179 1578190 2463698 3653412 3069022 236866 -2592707 -2551985 760151
2912G60151L792803J114418j400879n79656K090068K070718j562350m338903l151907
$$ 760151 4552954 5667372 4266493 3686837 5776905 7847623 6285273 1946370 -1205537
2903a205537j051576j708729k694477J65503M182877K721172l627298o451820
$$ -1205537 -2257113 -3965842 -6660319 -6494816 -2311939 409233 -3218065 -9669885
2895i669885j956643L273766K591742j033653q97796K828732M699630L192825
$$ -9669885 -11626528 -8352762 -5761020 -6794673 -7692469 -4863737 -164107 3028718
2887C028718J807560K138031J810459l55839j982963j099118R70362J826556P24278
$$ 3028718 4836278 6974309 8784768 8428929 6445966 5346848 6317210 8143766 8868044
2878H868044j569375l665617l979277j971873R12192K820200L479817L336290
$$ 8868044 7298669 3633052 -346225 -2318098 -1405906 1414294 4894111 8230401
2870H230401J942918p81684k845037k213905R7927J267242M05375j024716j727714
$$ 8230401 10173319 9391635 6546598 4332693 4430620 5697862 6103237 5078521 3350807
2861C350807j375691P1228J532299O24705k912634n062471k254211K903532M580127
$$ 3350807 1975116 2046344 3578643 4203348 1290714 -3771757 -6025968 -3122436 1457691
2852A457691J705802j325219j663288r28494o13327M19504K233778K223062l83606
$$ 1457691 3163493 1838274 174986 -753508 -1366835 -947331 1286447 3509509 3125903
2843C125903k268455q82808J773074K813530K666518K680591J596903j960730
$$ 3125903 857448 -25360 1747714 4561244 7227762 9908353 11505256 9544526
2835I544526n628341n687976k217212J192874K045376P86847r72123j711667m00531
$$ 9544526 3916185 -1771791 -3989003 -2796129 -750753 36094 -936029 -2647696 -3048227
2826c048227K146786L196775J329545j372633k231008j518327q83928k8260K093233
$$ -3048227 -901441 2295334 3624879 2252246 21238 -1497089 -2381017 -2409277 -316044
2817c16044M175408M111440K829858L038172M415949L682226j41722l915080m795493
$$ -316044 3859364 7970804 10800662 13838834 18254783 21937009 21795287 17880207 13084714
2808A3084714l617481k639916k350829j958154j210943l23128O61219J453895
$$ 13084714 9467233 6827317 4476488 2518334 1307391 984263 1645482 3099377
2800C099377J520746J006582N33987p2703j388687k645278k276903n46612M33716
$$ 3099377 4620123 5626705 6160692 6087989 4699302 2054024 -222879 -769491 -335775
2791c35775q5621m08063N91009J593969J308996O63000P66784O19424r31602k470211
$$ -335775 -421396 -829459 -238450 1355519 2664515 3327515 4094299 4713723 3782121 1311910
2781A311910j898479j52669j76470k301573l460282j683324J091737K043565J298429
$$ 1311910 -586569 -739238 -915708 -3217281 -6677563 -8360887 -7269150 -5225585 -3927156
2772c927156Q03072P30860m26719k420895k599588K45127L505141M074314K529171
$$ -3927156 -3124084 -2393224 -2819943 -5240838 -7840426 -7595299 -4090158 -15844 2513327
2763B513327J561630J241262q02660m296027n315460k229600Q62521j42231k884237
$$ 2513327 4074957 5316219 4513559 217532 -5097928 -7327528 -6465007 -6607238 -9491475
2754i491475k071553K161595M530436L041395J708836L368628M924999K820565
$$ -9491475 -11563028 -9401433 -4870997 -1829602 -120766 3247862 8172861 10993426
2746A0993426q92419k021113r24977j260669l639993m984096l678222j366726
$$ 10993426 10101007 8079894 7154917 5894248 2254255 -2729841 -6408063 -7774789
2738g774789M57079K020616L008434K166031O5387p73182L67527J284369O40361
$$ -7774789 -7317710 -5297094 -2288660 -122629 -57242 -830424 -462897 821472 1461833
2729A461833K5806O67994Q94761q62035k852225k498382m57102O06667J66086
$$ 1461833 1487639 2155633 3050394 2188359 -663866 -3162248 -3619350 -3012683 -2846597
2720b846597j20483J56169l16132j552796j605626L36585K439558K835609J963781
$$ -2846597 -2967080 -2810911 -3127043 -4679839 -6285465 -5948880 -3509322 -673713 1290068
2711A290068J209204P15213j37398j121264j407517r36796m76461m98472p08389
$$ 1290068 2499272 3214485 3077087 1955823 548306 -388490 -864951 -1363423 -2071812
2702b071812n72402J12832J017602J409913P16271r10425k738285l974397l848726
$$ -2071812 -2644214 -2531382 -1513780 -103867 612404 -298021 -3036306 -7010703 -10859429
2693a0859429j834203J291544L220195K459059O53706P57439K828113L812030
$$ -10859429 -12693632 -11402088 -8181893 -5722834 -5069128 -4311689 -1483576 2328454
2685B328454K049942m51193j474140j812489k955855l705461j956572J433094
$$ 2328454 4378396 3927203 2453063 640574 -2315281 -6020742 -7977314 -6544220
2677f544220L521684L340501K287896J078383o25536j828048r02657R59409N32213
$$ -6544220 -3022536 317965 2605861 3684244 3058708 1230660 328003 1287412 1819625
2668A819625k247943l399623q26852K312458K549419J269175J699075L168478
$$ 1819625 -428318 -3827941 -4654793 -2342335 207084 1476259 3175334 6343812
2660F343812K305834j256057m256507m646524l637592k675647j503327j6206O34077
$$ 6343812 8649646 7393589 3137082 -1509442 -5147034 -7822681 -9326008 -9342214 -8708137
2651h708137m976n98196j1557J144402J834202J982143J682670N20993j206359
$$ -8708137 -8713113 -9311309 -9322866 -8178464 -6344262 -4362119 -2679449 -2158456 -3364815
2642c364815j854644l84816J799288K318953Q71011l67201L77359K053028K087087
$$ -3364815 -5219459 -5604275 -3804987 -1486034 -615023 -982224 -604865 1448163 3535250
2633C535250j9464j612566m20862J806580J382647j710568l305588j319494Q11911
$$ 3535250 3515786 1903220 1482358 3288938 4671585 2961017 -344571 -1664065 -852154
2624h52154k67962j853555P23040N728230O332730N84644n288135n401016j466312
$$ -852154 -1120116 -2973671 -2250631 3477599 9810329 10394973 5106838 -294178 -1760490
2615a760490J235894J328029J180049J883922K224518J454388J0315j800387l476576
$$ -1760490 -524596 803433 1983482 3867404 6091922 7546310 7556625 5756238 2279662
2606B279662l590808j529750J001942K183832K549148L190649L069643Q16058
$$ 2279662 -1311146 -2840896 -1838954 344878 2894026 6084675 9154318 9970376
2598I970376k054728k823352j750615j494480k706728l284377k025317j17332
$$ 9970376 7915648 5092296 3341681 1847201 -859527 -4143904 -6169221 -6286553
2590f286553J239982J947891J541030m39831k110836m30584M106140O820840M576767
$$ -6286553 -5046571 -3098680 -1557650 -1997481 -4108317 -4538901 -432761 6388079 10964846
2581A0964846j55398k763163k079622n26115j80249q81682j551543j569680r38705
$$ 10964846 10809448 8046285 5966663 5440548 5260299 4378617 2827074 1257394 318689
2572C18689j12537M72585J078944K213475L181994K250127r48521m119139m464926
$$ 318689 206152 678737 1757681 3971156 7153150 9403277 8454756 4335617 -129309
2563a29309j758916J358177J932294n05893l242797k835009Q58959L753903K246990
$$ -129309 -1888225 -530048 1402246 896353 -2346444 -5181453 -4322494 -568591 1678399
2554A678399j736108k869895L14867L311336J956564j989523l781100k072969
$$ 1678399 -57709 -2927604 -2612737 698599 2655163 665640 -3115460 -5188429
2546e188429L68395J139556N69987q9325l76443j37679P93057J719393J179266
$$ -5188429 -4820034 -3680478 -3110491 -3199816 -3576259 -3713938 -2920881 -1201488 -22222
2537b2222j130946l108616j941838K536534O645228O099853R63277l826943m107679
$$ -22222 -1153168 -4261784 -6203622 -3667088 2978140 9077993 10041270 6214327 2106648
2528B106648j446106l86406j890484k852875j951905j735829l413153l709955
$$ 2106648 660542 274136 -1616348 -4469223 -6421128 -8156957 -11570110 -15280065
2520a5280065L5196M757679N456194K174447o55941p15540J94276K36061o7684
$$ -15280065 -15244869 -10487190 -5030996 -2856549 -3512490 -4228030 -4033754 -3797693 -3865377
2511c865377N7960J94206J62538N48571J133292P85753n65764j592229j495193
$$ -3865377 -3807417 -3613211 -3450673 -2902102 -1768810 -983057 -1548821 -3141050 -4636243
2502d636243o69304N80448K218869L406784L110153J799881P70495K0370j129507
$$ -4636243 -5305547 -4725099 -2506230 900554 4010707 5810588 6581083 6601453 5471946
2493E471946j726085k32061K053795J734716j614692l988980k151874J923880
$$ 5471946 3745861 3513800 5567595 7302311 5687619 1698639 -453235 1470645
2485A470645L672195J542733j692471k474949j76097K362709J787911j728375
$$ 1470645 5142840 6685573 4993102 2518153 2342056 4704765 6492676 4764301
2477D764301m083831k265669J282984J875897n45258j366507J503906M393388
$$ 4764301 680470 -1585199 -302215 1573682 1028424 -338083 1165823 5559211
2469E559211L502730K57182j557045j350906j504087l234453n291201n776850
$$ 5559211 9061941 9319123 7762078 6411172 4907085 1672632 -3618569 -9395419
2461i395419l515131J112480N223436N112819O91112l496833l564056p62310J260952
$$ -9395419 -12910550 -11798070 -6574634 -1461815 -770703 -4267536 -7831592 -8593902 -7332950
2452g332950J469078J115022M95524p55885j586757j005223n23543j867617l309923
$$ -7332950 -5863872 -4748850 -4253326 -5009211 -6595968 -7601191 -8124734 -9992351 -13302274
2443a3302274j920538J216396K029591l17477k278662j632222l17603j47264N11876
$$ -13302274 -15222812 -14006416 -11976825 -12294302 -14572964 -16205186 -16522789 -16670053 -16158177
2434a6158177L287420N891520M811118N49853k628357j931916R86441K539955
$$ -16158177 -12870757 -6979237 -2168119 -1618266 -4246623 -6178539 -5192098 -2652143
2426b652143J428964k65715Q5441K297390L564720K147252l98785j691732j911307
$$ -2652143 -1223179 -1488894 -1403453 893937 4458657 6605909 6207124 4515392 2604085
2417B604085k819034m265046m146607j804096Q57180J971245J424329k35010k325349
$$ 2604085 -214949 -4479995 -8626602 -10430698 -9573518 -7602273 -6177944 -6412954 -8738303
2408h738303l053857o08869L624729N285262K194164k377587l399565O9884M303750
$$ -8738303 -11792160 -12401029 -8776300 -3491038 -1296874 -3674461 -7074026 -7004142 -2700392
2399b700392N341443K575337j493549l733854k786960N8678K244440K360329J026380
$$ -2700392 2641051 5216388 3722839 -11015 -2797975 -2739297 -494857 1865472 2891852
2390B891852l42899r07419p28468o09708j379416k473896j955562O72359K647732
$$ 2891852 2548953 1641534 913066 303358 -1076058 -3549954 -5505516 -4833157 -2185425
2381b185425J202581k010927k657826J50902K738684K505823J195602J013460
$$ -2185425 -982844 -2993771 -5651597 -5500695 -2762011 -256188 939414 1952874
2373A952874Q33535j251456m088260m898725k984769J49107K854953L736632J915175
$$ 1952874 2786409 1534953 -2553307 -7452032 -10436801 -10287694 -7432741 -3696109 -1780934
2364a780934j083984j785327O18623K375084O50644j568592J56857M375553N416546
$$ -1780934 -2864918 -4650245 -4031622 -1656538 -1005894 -2574486 -2417629 1957924 7374470
2355G374470J667929k551600l648841k749573j987936j086266L69723P90531o94696
$$ 7374470 9042399 6490799 2841958 92385 -1895551 -2981817 -2612094 -1821563 -2516259
2346b516259j957485r49414Q39360O17123j349596k247011r59261O16723N88303
$$ -2516259 -4473744 -5423158 -4583798 -3966675 -5316271 -7563282 -8522543 -7905820 -7317517
2337g317517m95861q19611K49322J655282K212987K029251K062312K484250K318703
$$ -7317517 -7813378 -8632989 -8383667 -6728385 -4515398 -2486147 -423835 2060415 4379118
2328D379118J205194N51927J630011L109252K294158j102731m177025m331230
$$ 4379118 5584312 6136239 7766250 10875502 13169660 12066929 7889904 3558674
2320C558674k042648M83346J904144K048809R91521q45683k347515k541448j476261
$$ 3558674 1516026 1999372 3903516 5952325 6943846 6098163 3750648 1209200 -267061
2311b67061J90336J806139K517318J480589q71464k574766k113718j92389J232453
$$ -267061 -76725 1729414 4246732 5727321 4855857 2281091 167373 -25016 1207437
2302A207437J251871O40535N44386J149983J514301N32083j571475k856554j705653
$$ 1207437 2459308 3099843 3644229 4794212 6308513 6840596 5269121 2412567 706914
2293G06914P40106J555899j09535j745859j072429O49475O29692j179895k032744
$$ 706914 1447020 3002919 2893384 1147525 75096 724571 1354263 174368 -1858376
2284a858376m48561J733951J960402J59831j519014j324818M97142K267013K500174
$$ -1858376 -2306937 -572986 1387416 1547247 28233 -1296585 -799443 1467570 3967744
2275C967744J203777k39158p09806p69576j819763l806176m658681k610668J471658
$$ 3967744 5171521 4932363 4222557 3452981 1633218 -2172958 -6831639 -9442307 -7970649
2266g970649M785903N363621L524890Q48476j348135k324386j745482o1649J368273
$$ -7970649 -3184746 2178875 5703765 6552241 5204106 2879720 1134238 1072589 2440862
$$ [...]
##END NTUPLES=NMR SPECTRUM
##END=
