##TITLE=31Pdec_DE-14sh-TFA
  CDCl3
  24 sc
 4.10.2023
##JCAMPDX= 6.0         $$ Bruker NMR JCAMP-DX V2.0
##DATA TYPE= NMR SPECTRUM
##DATA CLASS= NTUPLES
##ORIGIN= UXNMR, Bruker Analytische Messtechnik GmbH
##OWNER= root
$$ XWIN-NMR		Version 3.5
$$ Wed Oct  4 16:17:31 2023 Russian Standard Time (UT+4h)  she@DPX200
##.OBSERVE FREQUENCY= 81.013821
##.OBSERVE NUCLEUS= ^31P
##.ACQUISITION MODE= SIMULTANEOUS
##.ACQUISITION SCHEME= undefined
##.AVERAGES= 24
##.DIGITISER RES= 16
##SPECTROMETER/DATA SYSTEM= spect
##.PULSE SEQUENCE= zgpg30
##.SOLVENT NAME= CDCl3
##.SHIFT REFERENCE= (INTERNAL, CDCl3, 0, 248.564)
##AUDIT TRAIL= $$ (NUMBER, WHEN, WHO, WHERE, WHAT)
$$ ##TITLE= Audit trail, XWIN-NMR		Version 3.5
$$ ##JCAMPDX= 5.01
$$ ##ORIGIN= Bruker BioSpin GmbH
$$ ##OWNER= she
$$ F:/spectra/data/she/nmr/P31/1/pdata/1/auditp.txt
$$ ##AUDIT TRAIL=  $$ (NUMBER, WHEN, WHO, WHERE, WHAT)
(   1,<2023-10-04 16:16:18.51 +0400>,<she>,<DPX200>,
      <created by zg, POWCHK disabled, PULCHK disabled
       configuration hash MD5:
       00 E9 B6 7A A2 85 ED C7 34 08 36 98 17 FE 4E 26
       data hash MD5: 32K
       DC 3A 0B 41 49 6B 0B CF 6D D0 EB 9B 38 52 44 5B>)
(   2,<2023-10-04 16:16:20.73 +0400>,<she>,<DPX200>,
      <Start of raw data processing
       efp BC_mod = 2 LB = 5 FT_mod = 6 PKNL = 1 PHC0 = -10709.64 PHC1 = 195.2863 SI = 64K 
       data hash MD5: 64K
       F7 7E 5E C9 4D EF CE FA F4 08 C2 04 4E D9 A0 E7>)
(   3,<2023-10-04 16:16:41.45 +0400>,<she>,<DPX200>,
      <pk PHC0 = 94.10638 PHC1 = -209 
       data hash MD5: 64K
       EA 7E 6A 12 DD 1F 75 2E 1D A4 40 89 25 FE 1A F8>)
(   4,<2023-10-04 16:16:45.81 +0400>,<she>,<DPX200>,
      <abs ABSG = 5 
       data hash MD5: 64K
       96 90 4D 2B AB EF 15 AB 59 2A 1C 94 CD 30 DE 4C>)
$$ ##END=
$$ 
$$ hash MD5
$$ 9A 07 43 97 B0 B0 92 47 C3 9F 62 C3 71 A1 59 9D
##$RELAX= 
##$RELAX= 
##$RELAX= 
##$RELAX= 
##$RELAX= 
##$RELAX= 
##$RELAX= 
##$RELAX= 
##$RELAX= 
$$ Bruker specific parameters
$$ --------------------------
##$DU= <F:/spectra>
##$EXPNO= 1
##$NAME= <P31>
##$PROCNO= 1
##$TYPE= <nmr>
##$USER= <she>
##$AMP= (0..31)
100 100 100 100 100 100 100 100 100 100 100 100 100 100 100 100 100 100 
100 100 100 100 100 100 100 100 100 100 100 100 100 100 
##$AQSEQ= 0
##$AQ_mod= 1
##$AUNM= <au_zg>
##$AUTOPOS= <>
##$BF1= 81.014009
##$BF2= 200.13
##$BF3= 200.13
##$BF4= 200.13
##$BF5= 200.13
##$BF6= 200.13
##$BF7= 200.13
##$BF8= 200.13
##$BYTORDA= 1
##$CFDGTYP= 0
##$CFRGTYP= 5
##$CHEMSTR= <none>
##$CNST= (0..31)
1 1 145 1 1 1 1 1 1 1 1 1 1 1 1 1 1 1 1 1 1 1 1 1 1 1 1 1 1 1 1 1 
##$CPDPRG= <waltz16>
##$CPDPRG1= <>
##$CPDPRG2= <waltz16>
##$CPDPRG3= <>
##$CPDPRG4= <mlev>
##$CPDPRG5= <mlev>
##$CPDPRG6= <mlev>
##$CPDPRG7= <mlev>
##$CPDPRG8= <mlev>
##$CPDPRGB= <>
##$CPDPRGT= <>
##$D= (0..31)
0 1 0 0 0 0 0 0 0 0 0 0.03 2e-05 3e-06 0 0 0 0 0 0 0 0 0 0 0 0 0 0 0 0 
0 0 
##$DATE= 1696421778
##$DBL= (0..7)
120 120 120 11 120 120 24 19 
##$DBP= (0..7)
150 150 150 150 150 150 150 150 
##$DBP07= 0
##$DBPNAM0= <>
##$DBPNAM1= <>
$$ [...]
##$SUBNAM3= <"">
##$SUBNAM4= <"">
##$SUBNAM5= <"">
##$SUBNAM6= <"">
##$SUBNAM7= <"">
##$SUBNAM8= <"">
##$SUBNAM9= <"">
##$SW= 501.771253377433
##$SWIBOX= (0..15)
0 1 3 0 0 0 0 0 0 0 0 0 0 0 0 0 
##$SW_h= 40650.406504065
##$TD= 32768
##$TD0= 1
##$TE= 0
##$TE2= 300
##$TE3= 300
##$TEG= 300
##$TL= (0..7)
0 120 53 12 22 120 120 120 
##$TP= (0..7)
150 150 150 150 150 150 150 150 
##$TP07= 0
##$TPNAME0= <>
##$TPNAME1= <>
##$TPNAME2= <>
##$TPNAME3= <>
##$TPNAME4= <>
##$TPNAME5= <>
##$TPNAME6= <>
##$TPNAME7= <>
##$TPOAL= (0..7)
0.5 0.5 0.5 0.5 0.5 0.5 0.5 0.5 
##$TPOFFS= (0..7)
0 0 0 0 0 0 0 0 
##$TUNHIN= 0
##$TUNHOUT= 0
##$TUNXOUT= 0
##$USERA1= <user>
##$USERA2= <user>
##$USERA3= <user>
##$USERA4= <user>
##$USERA5= <user>
##$V9= 5
##$VALIST= <valist>
##$VCLIST= <CCCCCCCCCCCCCCC>
##$VD= 0
##$VDLIST= <DDDDDDDDDDDDDDD>
##$VPLIST= <PPPPPPPPPPPPPPP>
##$VTLIST= <TTTTTTTTTTTTTTT>
##$WBST= 1024
##$WBSW= 4
##$XGAIN= (0..3)
0 0 0 0 
##$XL= 0
##$YL= 0
##$YMAX_a= 1649
##$YMIN_a= -2643
##$ZGOPTNS= <>
##$ZL1= 120
##$ZL2= 120
##$ZL3= 120
##$ZL4= 120
##$ABSF1= 248.5645
##$ABSF2= -253.2056
##$ABSG= 5
##$ABSL= 3
##$ALPHA= 0
##$AQORDER= 0
##$ASSFAC= 0
##$ASSFACI= 0
##$ASSFACX= 0
##$ASSWID= 0
##$AUNMP= <proc_1d>
##$AZFE= 0.1
##$AZFW= 0.5
##$BCFW= 0
##$BC_mod= 2
##$BYTORDP= 0
##$COROFFS= 0
##$CY= -3
##$DATMOD= 1
##$DC= 0
##$DFILT= <>
##$DTYPP= 0
##$F1P= 0
##$F2P= 0
##$FCOR= 1
##$FTSIZE= 65536
##$FT_mod= 6
##$GAMMA= 0
##$GB= 0
##$INTBC= 1
##$INTSCL= 6.047779e-11
##$ISEN= 30
##$LB= 5
##$LEV0= 0
##$LPBIN= 0
##$MAXI= 10000
##$MC2= 0
##$MEAN= 0
##$ME_mod= 0
##$MI= 50
##$NCOEF= 0
##$NC_proc= -10
##$NLEV= 6
##$NOISF1= 182.463
##$NOISF2= 159.3651
##$NSP= 0
##$NTH_PI= 0
##$NZP= 0
##$OFFSET= 248.5645
##$PC= 4
##$PHC0= -10615.53
##$PHC1= -13.7137
##$PH_mod= 1
##$PKNL= yes
##$PPARMOD= 0
##$PSCAL= 0
##$PSIGN= 0
##$REVERSE= no
##$SF= 81.0140089999694
##$SI= 65536
##$SIGF1= 159.3651
##$SIGF2= -187.1042
##$SINO= 113.3802
##$SIOLD= 16384
##$SREGLST= <1H.CDCl3>
##$SSB= 0
##$STSI= 65536
##$STSR= 0
##$SW_p= 40650.406504065
##$SYMM= 0
##$S_DEV= 0
##$TDeff= 32768
##$TDoff= 0
##$TI= <>
##$TILT= no
##$TM1= 0
##$TM2= 0
##$TOPLEV= 0
##$USERP1= <user>
##$USERP2= <user>
##$USERP3= <user>
##$USERP4= <user>
##$USERP5= <user>
##$WDW= 1
##$XDIM= 65536
##$YMAX_p= 446422273
##$YMIN_p= -86375252
$$ End of Bruker specific parameters
$$ ---------------------------------
##NTUPLES= NMR SPECTRUM
##VAR_NAME=  FREQUENCY,     SPECTRUM/REAL,   SPECTRUM/IMAG
##SYMBOL=    X,             R,               I
##VAR_TYPE=  INDEPENDENT,   DEPENDENT,       DEPENDENT
##VAR_FORM=  AFFN,          ASDF,            ASDF
##VAR_DIM=   65536,         65536,           65536
##UNITS=     HZ,            ARBITRARY UNITS, ARBITRARY UNITS
##FACTOR=    0.620285442955139, 1,           1
##FIRST=     20137.2065510682, 0,            0
##LAST=      -20513.1999529968, 0,           0
##MIN=       -20513.1999529968, -86375252,   0
##MAX=       20137.2065510682, 446422273,    0
$$ Real data points
##PAGE= N=1
##DATA TABLE= (X++(R..R)), XYDATA
$$ [...]
43082B153381j151850j087093r47099q13494o80055m63652p6624M86396J052681
$$ 2153381 1001531 -85562 -1032661 -1846155 -2526210 -2989862 -3066486 -2580090 -1527409
43073a527409J309982J074645N08989o3721n39981j045899j556270j755322j409933
$$ -1527409 -217427 857218 1366207 1302486 762505 -283394 -1839664 -3594986 -5004919
43064e004919o78279J46006J039046K131202L234363L767897L283346J956713
$$ -5004919 -5683198 -5537192 -4498146 -2366944 867419 4635316 7918662 9875375
43056I875375M71340n51163r79242j098050j192695j261147j155034r11238p72717
$$ 9875375 10346715 9795552 8816310 7718260 6525565 5264418 4109384 3198146 2425429
43047B425429q34184q23282l62708O24412J857869K938107L514776L346075K432114
$$ 2425429 1591245 767963 405255 1029667 2887536 5825643 9340419 12686494 15118608
43038A5118608J115826j06597r34871j378452j594303j760659k067019k602079
$$ 15118608 16234434 16127837 15192966 13814514 12220211 10459552 8392533 5790454
43030E790454l160259l296547k685136j387667K34639J760016K831701L214996
$$ 5790454 2630195 -666352 -3351488 -4739155 -4504516 -2744500 87201 3302197
43022C302197K890856K079617J100492K12109m11770o54370n04001j04180L18923
$$ 3302197 6193053 8272670 9373162 9585271 9173501 8519131 8015130 7910950 8229873
43013H229873N85113N97304L03284k89630j041988j691016k008792j971842j736020
$$ 8229873 8814986 9412290 9715574 9425944 8383956 6692940 4684148 2712306 976286
43004I76286j413528r24470j61045P06236J222631J054335L49405l93599p83292
$$ 976286 -437242 -1361712 -1522757 -816521 406110 1460445 1809850 1416251 632959
42995F32959p84168n64187k42510J62155O16748R93244J130543R85229O98294
$$ 632959 -151209 -715396 -957906 -795751 -179003 814241 1944784 2930013 3628307
42986C628307M48636K35499j00995o18003j164189j612932k037993k490710k739976
$$ 3628307 4076943 4312442 4211447 3593444 2429255 816323 -1221670 -3712380 -6452356
42977f452356k495434j867755j356176j312147j588758j779951j650586j266715
$$ -6452356 -8947790 -10815545 -12171721 -13483868 -15072626 -16852577 -18503163 -19769878
42969a9769878q46348n64617m02738j29008M84529J396486K324705L007138L294265
$$ -19769878 -20616226 -21180843 -21583581 -21712589 -21228060 -19831574 -17506869 -14499731 -11205466
42960a1205466L040706K175347R59728n4617m74364l45312O2885N50415J000992
$$ -11205466 -8164760 -5989413 -5029685 -5084302 -5558666 -5903978 -5841093 -5290678 -4289686
42951d289686J377875J861028K699431L674774L985567L058090J346167p9767
$$ -4289686 -2911811 -1050783 1648648 5323422 9308989 12367079 13713246 13633479
42943A3633479p15256j006475j512067k095734k170839j470678l09089P71913
$$ 13633479 12918223 11911748 10399681 8303947 6133108 4662430 4353341 5125254
42935E125254J361026J265998N22960n86115j645309k345808k641171k680185
$$ 5125254 6486280 7752278 8275238 7689123 6043814 3698006 1056835 -1623350
42927a623350k615034k481734k251082j956070j705233j549172j408877j202620
$$ -1623350 -4238384 -6720118 -8971200 -10927270 -12632503 -14181675 -15590552 -16793172
42919a6793172r68843p43809l73291L53758J318782J993103J921626J260863O95941
$$ -16793172 -17762015 -18505824 -18879115 -18525357 -17206575 -15213472 -13291846 -12030983 -11335042
42910a1335042P76124J403682K028519K278738K277373K317715K376681K124637
$$ -11335042 -10558918 -9155236 -7126717 -4847979 -2570606 -252891 2123790 4248427
42902D248427J397770M66020k60967o50077q24274q37377n96148j31937K43236
$$ 4248427 5646197 6112217 5851250 5201173 4376899 3539522 2943374 2811437 3054673
42893C054673J90718k94266q70230j190004j179471r51234n31684J62038J009882
$$ 3054673 3245391 2951125 2080895 890891 -288580 -1239814 -1771498 -1609460 -599578
42884e99578J526626J258617L40312n79700j032277j108614j041672p26563K0635
$$ -599578 927048 2185665 2525977 1946277 914000 -194614 -1236286 -1962849 -1942214
42875a942214R11466J318705J000931L80216L892l2757l5241k99997q69463j513566
$$ -1942214 -1030748 287957 1288888 1669104 1672996 1640239 1604998 1305001 435538 -1078028
42865a078028j843549j620602j080914p85558r81200j246750r76239j38119O52572
$$ -1078028 -2921577 -4542179 -5623093 -6408651 -7389851 -8636601 -9612840 -9750959 -9098387
42856i098387Q16811M00271n5957j05728K09566M77954L25660k88252j078749
$$ -9098387 -8281576 -7881305 -7937262 -8042990 -7833424 -7355470 -7029810 -7318062 -8396811
42847h396811j619596j535757o98843N95598J701644K071742J700199J040406
$$ -8396811 -10016407 -11552164 -12251007 -11655409 -9953765 -7882023 -6181824 -5141418
42839e141418M86232N3403m31502r99823j477972j646977j398126q11510j21643
$$ -5141418 -4655186 -4601783 -5033285 -6033108 -7511080 -9158057 -10556183 -11367693 -11489336
42830a1489336M66239R29579J318110J553091J518866J324113J220115J218638
$$ -11489336 -11023097 -10093518 -8775408 -7222317 -5703451 -4379338 -3159223 -1940585
42822a940585J066305P00649M32082M71631N45462K67834k87111p10175q57142
$$ -1940585 -874280 -173631 258451 730082 1275544 1543378 1256267 546092 -311050
42813c11050j006845j436354k101710k746282l096172k944430k281045j396227
$$ -311050 -1317895 -2754249 -4855959 -7602241 -10698413 -13642843 -15923888 -17320115
42805a7320115o76544k54379R928K35938M20891O14205R35164J354276J694692
$$ -17320115 -17996659 -18251038 -18241110 -18005172 -17584281 -16970076 -16034912 -14680636 -12985944
42796a2985944J948606K354756K988662L454625L219298K215025R62574R9567
$$ -12985944 -11037338 -8682582 -5693920 -2239295 980003 3195028 4157602 4257169
42788D257169j37960r718N2331j50142m62646o36988o33252n77229m97174l15028
$$ 4257169 4119209 4109491 4161822 4011680 3549034 2912046 2278794 1701565 1204391 889363
42778H89363j39703l40636j139503k208091k837432k525996j365477P9659J178729
$$ 889363 749660 409024 -730479 -2938570 -5776002 -8301998 -9667475 -9587816 -8409087
42769h409087J574741J279091N53634k47248p58022p10499j62795M10989M91499
$$ -8409087 -6834346 -5555255 -5001621 -5248869 -6006891 -6717390 -6880185 -6469196 -5977697
42760e977697O4407l59788l60716o4337J50304K18195M21943R19055J458168J598660
$$ -5977697 -5913290 -6273078 -6633794 -6698131 -6547827 -6329632 -5907689 -4988634 -3530466 -1931806
42750a931806J098262J08104q87769j364768j165757o47332k97714k04481l1750
$$ -1931806 -833544 -725440 -1613209 -2977977 -4143734 -4791066 -5088780 -5293261 -5325011
42741e325011M88543J231135J876439K215082K134907J516340L84233r17946j955606
$$ -5325011 -4836468 -3605333 -1728894 486188 2621095 4137435 4521668 3603722 1648116
42732A648116k624439l144353l590205l655246l037292j899844p22821K42531
$$ 1648116 -976323 -4120676 -7710881 -11366127 -14403419 -16303263 -17026084 -16783553
42724a6783553J125832K033333K770827L130344L244807L391879L521116L262984
$$ -16783553 -15657721 -13624388 -10853561 -7723217 -4478410 -1086531 2434585 5697569
42716E697569K464300J486804Q42285O66920O78251N45980J81967k44853m38861
$$ 5697569 8161869 9648673 10490958 11157878 11836129 12382109 12564076 12319223 11880362
42707A1880362j92799L53751O84893L20208o65939j633177j956830j580537r72484
$$ 11880362 11687563 12041314 12726207 13046415 12380476 10747299 8790469 7209932 6237448
42698F237448o23989o72234r65751j360918j850684k405554k791281k667802j900737
$$ 6237448 5613459 4941225 3975474 2614556 763872 -1641682 -4432963 -7100765 -9001502
42689i001502o99012O01849J809943K850265L568922L759546L413115K767424
$$ -9001502 -9700514 -9098665 -7288722 -4438457 -869535 2890011 6303126 9070550
42681I070550K001077J010542l28918j725660k517654k272196j242200j11588
$$ 9070550 11071627 12082169 11753251 10027591 7509937 5237741 3995541 3883953
42673C883953O49640J040845J190400J009121L53862n74089j231594j211359o18208
$$ 3883953 4533593 5574438 6764838 7773959 8127821 7553732 6322138 5110779 4492571
42664D492571P8124M75947M79644K20928j15787l89042n21914n03567m01131l73321
$$ 4492571 4570695 5046642 5526286 5747214 5631427 5242385 4720471 4216904 3815773 3442452
42654C442452n96765j047450j340640r65189J56975J400096J894005J304072Q9926
$$ 3442452 2845687 1798237 457597 -507592 -350617 1049479 2943484 4247556 4337482
42645D337482r93685j539204j626535j504072j307277j083440r35837j003011
$$ 4337482 3343797 1804593 178058 -1326014 -2633291 -3716731 -4652568 -5655579
42637e655579j284104j583165j709850j692579j685157j676473j448476q83959
$$ -5655579 -6939683 -8522848 -10232698 -11925277 -13610434 -15286907 -16735383 -17619342
42629a7619342j58840N08365J169729J998068K865794L307243K976510K015033
$$ -17619342 -17778182 -17269817 -16100088 -14102020 -11236226 -7928983 -4952473 -2937440
42621b937440R30899K42243K35870Q42881J615769J993961J778984J279656Q70464
$$ -2937440 -2006541 -1764298 -1528428 -685547 930222 2924183 4703167 5982823 6853287
42612F853287N29832o6p03195j219925j311893j146227j015363r85792r85939
$$ 6853287 7383119 7383053 6679858 5459933 4148040 3001813 1986450 1000658 14719
42603A4719j067407j332251j664519j792208j652635j466616j342952j016906
$$ 14719 -1052688 -2384939 -4049458 -5841666 -7494301 -8960917 -10303869 -11320775
42595a1320775j88868R84584J966820K379742K254828J767922J026112K43265
$$ -11320775 -11509643 -10525059 -8558239 -6178497 -3923669 -2155747 -1129635 -886370
42587h86370j65810L1542N30380Q16798Q17055R18815J315209J662926J578063
$$ -886370 -1052180 -1020638 -490258 326540 1143595 2062410 3377619 5040545 6618608
42578F618608J226675J140289J523365J978492J926846J155556m1988j123396
$$ 6618608 7845283 8985572 10508937 12487429 14414275 15569831 15527843 14404447
42570A4404447j670334j626584j246686q25303n18093m13114n99926j015546j341891
$$ 14404447 12734113 11107529 9860843 9035540 8517447 8104333 7504407 6488861 5146970
42561E146970j288504r63298p49781p88419p93065m67197Q7685N19956O58622
$$ 5146970 3858466 2895168 2145387 1356968 563903 96706 184391 704347 1362969
42552A362969O50289P38712J030441J427943J691216J610183J208630P40607M19385
$$ 1362969 2013258 2751970 3782411 5210354 6901570 8511753 9720383 10460990 10880375
42543A0880375K18403R593k24325m66253q43986j483584k174258k431734k029844
$$ 10880375 11098778 11108371 10884046 10417793 9573807 8090223 5915965 3484231 1454387
42534A454387j315845q34580p06265n18606J78745J374664K582117L228351L050669
$$ 1454387 138542 -696038 -1402303 -1920909 -1742164 -367500 2214617 5442968 8493637
42525H493637K209624J107818J09197o21025j091051j372901j515529j511388
$$ 8493637 10703261 11811079 11920276 11299251 10208200 8835299 7319770 5808382
42517E808382j338381j074581r42792j120522j458848j513716r80604l9130Q54824
$$ 5808382 4470001 3395420 2452628 1332106 -126742 -1640458 -2621062 -2660192 -1805368
42508a805368J459446J851045K047535J781529Q29070n54909j749267k332535
$$ -1805368 -345922 1505123 3552658 5334187 6163257 5608348 3859081 1526546
42500A526546k400903k308089k242051k139865j899769j531218j118869p54309
$$ 1526546 -874357 -3182446 -5424497 -7564362 -9464131 -10995349 -12114218 -12868527
42492a2868527n19801m56196n18290o24537p82012j102557j634389k186178k351970
$$ -12868527 -13388328 -13844524 -14362814 -14987351 -15769363 -16871920 -18506309 -20692487 -23044457
42483b3044457j741444k65534J689406L358326M024173L525418K373554J310662
$$ -23044457 -24785901 -25051435 -23362029 -20003703 -15979530 -12454112 -10080558 -8769896
42475h769896P36221N58876M88860L26700j081m92324j050571j505086j733901
$$ -8769896 -8033675 -7474799 -6985939 -6659239 -6660320 -7152644 -8203215 -9708301 -11442202
42466a1442202j711848j391794o52649M96114J700515K421743K399884J922415
$$ -11442202 -13154050 -14545844 -15198493 -14702379 -13001864 -10580121 -8180237 -6257822
42458f257822J574999J695294K043160K009302J210964p0673j082616j275736
$$ -6257822 -4682823 -2987529 -944369 1064933 2275897 2205224 1122608 -153128
42450a53128p57184n2654M59792P43547Q20949N61327j15306r42781j386953j061094
$$ -153128 -910312 -962966 -503174 240373 1061322 1622649 1507343 564562 -822391 -1883485
42440a883485n0658J136869J915015J971228J376571M11124o67393j656577k303423
$$ -1883485 -1934143 -797274 1117741 3088969 4465540 4876664 4209271 2552694 249271
42431B49271k351212j785139r41054k49476J26415L48437O38002J029119J375129
$$ 249271 -2101941 -3887080 -4828134 -5077610 -4951195 -4602758 -3964756 -2935637 -1560508
42422a560508J523988J450411J234600R41371N60458J01842k91588m34892l32263
$$ -1560508 -36520 1413891 2648491 3589862 4150320 4252162 3960574 3525682 3193419
42413C193419k12975k72385m76995p28478j124230j865451k875662l643840l548786
$$ 3193419 2980444 2708059 2231064 1502586 378356 -1487095 -4362757 -8006597 -11555383
42404a1555383k362184m80750J278217K173344K000203J165303L03932j87972
$$ -11555383 -13917567 -14398317 -13120100 -10946756 -8946553 -7781250 -7477318 -7665290
42396g665290k86327j63589k9607o3635k72902l70016K0154R29481J960600K730407
$$ -7665290 -7951617 -8115206 -8144813 -8208448 -8481350 -8851366 -8831212 -7901731 -5941131 -3210724
42386c210724L245872L681604L929247L648285K786753J806314J235603J099935
$$ -3210724 35148 3716752 7645999 11294284 14081037 15887351 17122954 18222889
42378A8222889R28072K85581q10751j991467k906322l423533l555021l350560
$$ 18222889 19150961 19436542 18625791 16634324 13728002 10304469 6749448 3398888
42370C398888k925355k497025k276621k306664k445104k490178k278672j713945
$$ 3398888 473533 -2023492 -4300113 -6606777 -9051881 -11542059 -13820731 -15534676
42362a5534676q13184K46873J202974J852726K105210J945551J472081R54505
$$ -15534676 -16347860 -16100987 -14898013 -13045287 -10940077 -8994526 -7522445 -6567940
42354f567940O99525Q04374J137049J540434J870983J837992J131701q0038j030531
$$ -6567940 -5868415 -5064041 -3926992 -2386558 -515575 1322417 2454118 2374080 1343549
42345A343549j050627k89838N30543R83150J214993J402213J349121P97048j61834
$$ 1343549 292922 3084 533627 1516777 2731770 4133983 5483104 6280152 6118318
42336F118318j178454j938894k182874j670371m34401J015796K013479K285765
$$ 6118318 4939864 3000970 818096 -852275 -1286676 -270880 1742599 4028364
42328D028364K056889J648024J143523M54580m36851j360570k050632k369804
$$ 4028364 6085253 7733277 8876800 9331380 8894529 7533959 5483327 3113523
42320C113523k451077k523044k560350k269372j536927p19452k75978k24617j98540
$$ 3113523 662446 -1860598 -4420948 -6690320 -8227247 -8946699 -9222677 -9447294 -9645834
42311i645834L4156L72595O69285R03382R97800P40019M9565q19825j456255j579843
$$ -9645834 -9611678 -9239083 -8569798 -7666416 -6668616 -5928597 -5879032 -6698857 -8155112 -9734955
42301i734955j167536m88842l6814j48907n74071o57489j02586O88559J190774
$$ -9734955 -10902491 -11391333 -11428147 -11577054 -12151125 -12808614 -12911200 -12222641 -11031867
42292a1031867J362913J395677J157603L82937o71455j261638r85539k51972K06563
$$ -11031867 -9668954 -8273277 -7115674 -6732737 -7404192 -8665830 -9651369 -9903341 -9696778
42283i696778L4450o08613j281800j453351p53990O46533K022098K682501K550390
$$ -9696778 -9662328 -10270941 -11552741 -13006092 -13760082 -13113549 -11091451 -8408950 -5858560
42274e858560K053925J608301J385292J430195J706466K038416K245797K364294
$$ -5858560 -3804635 -2196334 -811042 619153 2325619 4364035 6609832 8974126
42266H974126K559608K815413K880009K538421J778560P03433m96679j448496
$$ 8974126 11533734 14349147 17229156 19767577 21546137 22249570 21752891 20304395
42258B0304395j746231j377564q44276o87744r96644j504176j991711k355073
$$ 20304395 18558164 17180600 16336324 15648580 14651936 13147760 11156049 8800976
42250H800976k400997j948165j209265p62527r22881j307354j265332o66779j3912
$$ 8800976 6399979 4451814 3242549 2480022 1557141 249787 -1015545 -1682324 -1696236
42241a696236K39038K11104K97412N51846O43201M00058J13272J33597L13294
$$ -1696236 -1457198 -1246094 -948682 -396836 246365 646423 759695 893292 1206586
42232A206586O6955r92114k587966l960998m420257l751999k281862o69639M47730
$$ 1206586 1273541 281427 -2306539 -6267537 -10687794 -14439793 -16721655 -17391294 -16943564
42223a6943564Q00484N76738J80764j01134k29958l04245l75071l25773Q0383
$$ -16943564 -16143080 -15566342 -15385578 -15486712 -15716670 -16020915 -16395986 -16721759 -16641376
42214a6641376R28577J865485K229044J654869N14193m36605q46213j028766j416848
$$ -16641376 -15712799 -13847314 -11618270 -9963401 -9449208 -9885813 -10732026 -11760792 -13177640
42205a3177640j982621k320895k116850j353812k01301J069269K108387K648147
$$ -13177640 -15160261 -17481156 -19598006 -20951818 -21153119 -20083850 -17975463 -15327316
42197a5327316K661182K232380J337812j7803j442052k220962j915510p73755
$$ -15327316 -12666134 -10433754 -9095942 -9113745 -10555797 -12776759 -14692269 -15466024
42189a5466024N28088J397029J522092Q67995k33161j130420j347648j059870
$$ -15466024 -14937936 -13540907 -12018815 -11150820 -11383981 -12514401 -13862049 -14921919
42181a4921919q32860q67984p78973k10633N96168J068238R67276N76890L18774
$$ -14921919 -15754779 -16622763 -17401736 -17612369 -17016201 -15947963 -14980687 -14403797 -14085023
42172a4085023L92583P37803J114258J191741P73071M5686m96916m90456k3886
$$ -14085023 -13692440 -12954637 -11840379 -10648638 -9875567 -9829881 -10326797 -10817253 -10841139
42163a0841139M92430P00372N11889R2438k44816j92090L45398J138535J784768
$$ -10841139 -10348709 -9648337 -9136448 -9044010 -9288826 -9480916 -9135518 -7996983 -6212215
42154f212215K008935J821622J422172J004219O48101L39109N2450j84574l33831
$$ -6212215 -4203280 -2381658 -959486 44733 692834 1031943 1084393 899819 565988
42145E65988m56025p11012j163789j612348j713003j306237n46444L01840J078808
$$ 565988 109963 -601049 -1764838 -3377186 -5090189 -6396426 -6942870 -6641030 -5562222
42136e562222J679372J934308J736192J269672R23879Q78946Q82896N41782k30629
$$ -5562222 -3882850 -1948542 -212350 1057322 1981201 2860147 3743043 4284825 4054196
42127D054196j147763j871201k256366k293700j988910j413577p82960l46206
$$ 4054196 2906433 1035232 -1221134 -3514834 -5503744 -6917321 -7700281 -8046487
42119h046487j94731k32996k93195j99400K03854Q97902J537853J655191J156949
$$ -8046487 -8241218 -8474214 -8767409 -8966809 -8762955 -7865053 -6327200 -4672009 -3515060
42110c515060N08237K51365M05510N17893K76619j39995l64378k74354N737L85424
$$ -3515060 -3006823 -2755458 -2349948 -1832055 -1555436 -1695431 -2059809 -2334163 -2328426 -1943002
42100a943002Q92562J499994J996310K052202J402397O0328j553181k781513l185214
$$ -1943002 -1050440 449554 2445864 4498066 5900463 5960791 4407610 1626097 -1559117
42091a559117k833545k093733j212730k15070Q87845J981465K913360L498787
$$ -1559117 -4392662 -6486395 -7699125 -7914195 -7026350 -5044885 -2131525 1367262
42083A367262L491944K773724J600914M65723l44832q65176j120614r85814n17140
$$ 1367262 4859206 7632930 9233844 9699567 9354735 8489559 7368945 6383131 5865991
42074E865991j35245k00678n63543p86339o93196m51904k31731p8530o4555k36335
$$ 5865991 5730746 5530068 4966525 4180186 3486990 3035086 2803355 2724825 2660270 2423935
42064B423935m04109l01057k4360j9941m88895j047652j142429o23204K27424
$$ 2423935 2019826 1718769 1694409 1674468 1185573 137921 -1004508 -1627712 -1400288
42055a400288J028109J464918J303109N22062n62854j484151j952837j960164
$$ -1400288 -372179 1092739 2395848 2917910 2355056 870905 -1081932 -3042096
42047c042096j652484j221658q21976m44898N4121O60329J025548Q01318J16772
$$ -3042096 -4694580 -5916238 -6738214 -7183112 -7128991 -6468662 -5443114 -4641796 -4525024
42038d525024m94484o73662n56219m75429n53517o92889p97792q32178p42402
$$ -4525024 -5019508 -5693170 -6249389 -6724818 -7278335 -7971224 -8769016 -9601194 -10343596
42029a0343596m90763j57041J04752K09493J58342o4298m85828r92539j282631
$$ -10343596 -10834359 -10991400 -10886648 -10677155 -10518813 -10583111 -11068939 -12061478 -13344109
42020a3344109j080972l96088N00029J343786K053691K608974K865227K633752
$$ -13344109 -14425081 -14821169 -14321140 -12977354 -10923663 -8314689 -5449462 -2815710
42012b815710J954405J170601O57383N20578N99674O80882O16578L07106k65148
$$ -2815710 -861305 309296 966679 1487257 2086931 2767813 3384391 3691497 3426349
42003C426349r31188j375786j389289j067947p08028n07799m26636l44190k83872
$$ 3426349 2495161 1119375 -269914 -1337861 -2045889 -2553688 -2980324 -3324514 -3608386
41994c608386l94117p10221j025894j068392p63928k70759K09063N70629Q06579
$$ -3608386 -4002503 -4712724 -5738618 -6807010 -7570938 -7841697 -7632634 -7062005 -6255426
41985f255426J003402J343721J959139K707753L211881L209192K796727K277766
$$ -6255426 -5252024 -3908303 -1949164 758589 3970470 7179662 9976389 12254155
41977A2254155J880023J691077J702072J739391J461990O49661n17556j630245
$$ 12254155 14134178 15825255 17527327 19266718 20728708 21378369 20860813 19230568
41969A9230568k472118l097882l524676l595697l235289k655936k191689k021507
$$ 19230568 16758450 13660568 10135892 6540195 3304906 648970 -1542719 -3564226
41961c564226k101674k230433k121817j590593p80313o2017M16238R12948J643044
$$ -3564226 -5665900 -7896333 -10018150 -11608743 -12389056 -12451073 -12034835 -11121887 -9478843
41952i478843K298703K312146J583577O79440K27226L12519N76060P25037P79264
$$ -9478843 -7180140 -4867994 -3284417 -2604977 -2377751 -2065232 -1489172 -764135 15129
41943A5129R10664J219110J657569K060858K248468K179756J980973J730801J281573
$$ 15129 925793 2144903 3802472 5863330 8111798 10291554 12272527 14003328 15284901
41934A5284901M69789m92376j063251r47909m75424k16942l24405m67585l90949
$$ 15284901 15754690 15262314 14199063 13251154 12775730 12558788 12234383 11766798 11375849
41925A1375849k81887n18289j239366k245544l150480l552009l265349k554678
$$ 11375849 11093962 10575673 9336307 7090763 3940283 388274 -2877075 -5431753
41917e431753j972324j774727j620648j042942q8345P61127J202100J330512J265756
$$ -5431753 -7404077 -9178804 -10799452 -11842394 -11930739 -11169612 -9967512 -8637000 -7371244
41908g371244R01857J68050o90724j246435j190168m79398O07616J502084J690375
$$ -7371244 -6469387 -6301337 -6992061 -8238496 -9428664 -9908062 -9300446 -7798362 -6107987
41899f107987J218197P04412P05074J192564J769340K183635K412189K386725
$$ -6107987 -4889790 -4185378 -3480304 -2287740 -518400 1665235 4077424 6464149
41891F464149J940636J047045o3668j043356j601090j622029j268235r23009q94104
$$ 6464149 8404785 9451830 9388162 8344806 6743716 5121687 3853452 2930443 2036339
41882B036339j188079j649129k186054k670223k717066j884950j90414J746710
$$ 2036339 848260 -800869 -2986923 -5657146 -8374212 -10259162 -10449576 -8702866
41874h702866L165580L679199L328777K340760J013199k15092q00943m08903P14115
$$ -8702866 -5537286 -1858087 1470690 3811450 4824649 4609557 3808614 3399711 4113826
41865D113826J743378J842294Q34623p29397k165875l151921l604235l384849
$$ 4113826 5857204 7699498 8534121 7804724 5638849 2486928 -1117307 -4502156
41857d502156k438407j104590K9432O19343P20931N08317R0961l74537o35856
$$ -4502156 -6940563 -8045153 -8015721 -7396378 -6675447 -6167130 -6076169 -6450706 -7086562
41848g086562m87105J69631J343789K783520L810964L694500K356798N14707r80560
$$ -7086562 -7573667 -7404036 -6060247 -3276727 534237 4228737 6585535 7100242 6119682
41839F119682j747688j822643j406761q92899q01613j309332j975241k246714
$$ 6119682 4371994 2549351 1142590 249691 -551922 -1861254 -3836495 -6083209
41831f083209k140460k130648k434345k729523k601138j991461j140821l16499
$$ -6083209 -8223669 -10354317 -12788662 -15518185 -18119323 -20110784 -21251605 -21568104
41823b1568104K77453M81265K41680k90216p49218o94882P3469J203716J919842
$$ -21568104 -21290651 -20809386 -20567706 -20857922 -21607140 -22302022 -22228553 -21024837 -19104995
41814a9104995J710051Q94364L16710M59507J056934J593285J897642K085308
$$ -19104995 -17394944 -16500580 -16183870 -15724363 -14667429 -13074144 -11176502 -9091194
41806i091194K155363J965294J563500J246913J170787J099751P50558L04469
$$ -9091194 -6935831 -4970537 -3407037 -2160124 -989337 110414 860972 1165441
41798A165441L31379J119513K249581K984779K986841K488662J858663J249149
$$ 1165441 1496820 2616333 4865914 7850693 10837534 13326196 15184859 16434008
41790A6434008O74546J51524l62895r55202j521692j730325j392094p27744j05236
$$ 16434008 17108554 17260078 16897183 15941981 14420289 12689964 11297870 10570126 10464890
41781A0464890L16614M86141K15264o13423j666474k331826k311815j804429j118751
$$ 10464890 10781504 11267645 11482909 10869486 9203012 6871186 4559371 2754942 1636191
41772A636191m27261N9034L6181n56881j353071j892269k003279j734800j107907
$$ 1636191 1208930 1267964 1304145 747264 -605807 -2498076 -4501355 -6236155 -7344062
41763g344062j62512Q38395J471534J471687R40151K54804k22335m23368n73899
$$ -7344062 -7506574 -6668179 -5196645 -3724958 -2784807 -2530003 -2752338 -3175706 -3749605
41754c749605q44007j054922r02735m40923q8796j14064l78413p02235j176298
$$ -3749605 -4593612 -5648534 -6551269 -6992192 -7080988 -7195052 -7573465 -8275700 -9451998
41745i451998j879131k518660k660808k220708j506419q82929n95607p56538j183577
$$ -9451998 -11331129 -13849789 -16510597 -18731305 -20237724 -21120653 -21716260 -22472798 -23656375
41736b3656375j330019p31546M23426J430999J823561J741100J527988J289027
$$ -23656375 -24986394 -25717940 -25294514 -23863515 -22039954 -20298854 -18770866 -17481839
41728a7481839J015540Q74183J059410J434753J588464J307367Q55811P07430
$$ -17481839 -16466299 -15592116 -14532706 -13097953 -11509489 -10202122 -9346311 -8638881
41720h638881J057568J652442K059696K031712J602552R52785L14148m8195J6015
$$ -8638881 -7581313 -5928871 -3869175 -1837463 -234911 717874 1032022 983827 999842
41711I99842L18413M29250J45092k64456m20863k95510q7905K18237Q43748J740628
$$ 999842 1318255 1747505 1892597 1628141 1207278 911768 823863 1042100 1885848 3626476
41701C626476K425967K408239J611486L33445j000497j964295k259072j907745
$$ 3626476 6052443 8460682 10072168 10405613 9405116 7440821 5181749 3274004
41693C274004j217068m37847M15355J329224K072062K381609K235729J755639
$$ 3274004 2056936 1619089 2034444 3363668 5435730 7817339 10053068 11808707
41685A1808707R68150r3884j110752j582625j334161p75077n33570q51514j385978
$$ 11808707 12776857 12682973 11572221 9989596 8655435 7880358 7346788 6495274 5109296
41676E109296j591738j272138p40965m43816m79310n80189n27929m02294l32817
$$ 5109296 3517558 2245420 1504455 1060639 581329 1140 -526789 -929083 -1261900
41667a261900j64596M24142J475053K549021L012551K507218J205003l03123j398820
$$ -1261900 -1426496 -1002354 472699 3021720 6034271 8541489 9746492 9443369 8044549
41658H044549j829203j769641j525750j245084r33312o00604k43042K47256R75142
$$ 8044549 6215346 4445705 2919955 1674871 741559 140955 -102087 145169 1120311
41649A120311J833008K517528K760637K443782J530179J00872j455620k487981
$$ 1120311 2953319 5470847 8231484 10675266 12205445 12306317 10850697 8362716
41641H362716k560689j912826j303172j325314j916017k549336k802051k608339
$$ 8362716 5802027 3889201 2586029 1260715 -655302 -3204638 -6006689 -8615028
41633h615028k023956r92289M74665J987013K898033K815962J887297N59768p55785
$$ -8615028 -10638984 -11631273 -11156608 -9169595 -6271562 -3455600 -1568303 -1008535 -1764320
41624a764320j716494j987834j445931m26409M50063P89291O82903M57379K96292
$$ -1764320 -3480814 -5468648 -6914579 -7340988 -6890925 -6101634 -5418731 -4961352 -4665060
41615d665060J71949N1081M5670L19095Q44842J285405J195396M31499o46335
$$ -4665060 -4493111 -4442030 -4396360 -4077265 -3232423 -1947018 -751622 -320123 -966458
41606i66458j438849j573749j096214k76977O53236J587342K476940L238163L681577
$$ -966458 -2405307 -3979056 -5075270 -5352247 -4699011 -3111669 -634729 2603434 6285011
41597F285011L531239K593229R73197q75458k357396l054081k940128k356665
$$ 6285011 9816250 12409479 13382676 12507218 10149822 7095741 4155613 1798948
41589A798948j749259j372618j228205j249221j442051j795420k146781k246679
$$ 1798948 49689 -1322929 -2551134 -3800355 -5242406 -7037826 -9184607 -11431286
41581a1431286j926041j146679J9871J334250K370196K743443K436429J834196
$$ -11431286 -13357327 -14504006 -14484135 -13149885 -10779689 -8036246 -5599817 -3765621
41573c765621J406942J369638J586601J705533J408669O59516k36306q29541p87311
$$ -3765621 -2358679 -989041 597560 2303093 3711762 4371278 4134972 3305431 2518120
41564B518120j3309J296263K595651L177293K710894J607085O40214J79504n5673
$$ 2518120 2504811 3801074 6396725 9574018 12284912 13891997 14532211 14711715 14656042
41555A4656042n16965j344217k371866l326024l890606l825284l222380k511016
$$ 14656042 14139077 12794860 10422994 7096970 3206364 -618920 -3841300 -6352316
41547f352316k044146j793093j570179j384533j381896j554404j729428j777519
$$ -6352316 -8396462 -10189555 -11759734 -13144267 -14526163 -16080567 -17809995 -19587514
41539a9587514j630434j160625k90485P59968J541738J763288J499950J028951
$$ -19587514 -21217948 -22378573 -22669058 -21909090 -20367352 -18604064 -17104114 -16075163
41531a6075163O05541L82397L37311K30396j62355o81788q47403m20770K69519
$$ -16075163 -15469622 -15087225 -14749914 -14519518 -14681873 -15363661 -16211064 -16631834 -16362315
41522a6362315P35277Q85273R31083Q88431N56072K2611j94473K62084J109224
$$ -16362315 -15627038 -14741765 -13810682 -12922251 -12366179 -12343568 -12538041 -12275957 -11166733
41513a1166733J790289K136500K343398K400889J978537J001075K196l63955l3936
$$ -11166733 -9376444 -7239944 -4896546 -2495657 -517120 483955 486151 122196 88260
41504H8260M44177N26342J50777l27221m97766j96943M11163R92709J307423J313846
$$ 88260 532437 1058779 1209556 882335 384569 187626 598789 1591498 2898921 4212767
41494D212767J057741N95641O4201l53036o46983j023441j583859k109068k312525
$$ 4212767 5270508 5866149 5930350 5577314 4930331 3906890 2323031 213963 -2098562
41485b098562k139448j620466o42509P98479K237503L033681L046992K703668
$$ -2098562 -4238010 -5858476 -6500985 -5702506 -3465003 -431322 2615670 5319338
41477E319338K370339J996639J419954O54564k38736j218511k036055k288030
$$ 5319338 7689677 9686316 11106270 11760834 11522098 10303587 8267532 5979502
41469E979502j928011j438389j241171j193305r35952m96887k14274k38224m44975
$$ 5979502 4051491 2613102 1371931 178626 -757326 -1254213 -1468487 -1706711 -2151686
41460b151686p12192r24149p85951k4195J174174K214998K672980K624651K388386
$$ -2151686 -2863878 -3788027 -4573978 -4598173 -3423999 -1209001 1463979 4088630 6477016
41451F477016K148541J885311J478765P96664j87970j296111k240971k852297
$$ 6477016 8625557 10510868 11989633 12786297 12598327 11302216 9061245 6208948
41443F208948l141939l179649l003395k632503k087040j428079q26223m73261
$$ 6208948 3067009 -112640 -3116035 -5748538 -7835578 -9263657 -10089880 -10563141
41435a0563141l23287o8859M58501J008569J261230J338374J672798K390846L105782
$$ -10563141 -10886428 -10955287 -10496786 -9488217 -8226987 -6888613 -5215815 -2824969 280813
41426B80813L362555L056735K368898J503573N75436l91408j386584k220288k480886
$$ 280813 3643368 6700103 9069001 10572574 11148010 10756602 9370018 7149730 4668844
41417D668844j936740r81227l87673n13530r61878j129539q65691m34926k0071
$$ 4668844 2732104 1750877 1363204 849674 -112204 -1241743 -2107434 -2542360 -2562431
41408b562431N01064J305272K277282K941518K762359J600745j07885j690977
$$ -2562431 -2061367 -756095 1521187 4462705 7225064 8825809 8717924 7026947
41400G026947k733600l187415l125803k608232j746615o77427N41128J810036
$$ 7026947 4293347 1105932 -2019871 -4628103 -6374718 -7052145 -6511017 -4700981
41392d700981K805292L186741L014066K669178K302789J661606N85746o20151
$$ -4700981 -1895689 1291052 4305118 6974296 9277085 10938691 11524437 10904286
41384A0904286j500426j896457j899848j600034j123341p48450p11750r50556
$$ 10904286 9403860 7507403 5607555 4007521 2884180 2135730 1423980 473424
41376D73424j189022j189613q24425q3302Q14402J478053J712933J699616J637678
$$ 473424 -715598 -1905211 -2729636 -2812938 -1998536 -520483 1192450 2892066 4529744
41367D529744J393175P52872j09230p29735q98286q53866r22257j144173j285492
$$ 4529744 5922919 6675791 6566561 5836826 4938540 4084674 3162417 2018244 732752
41358G32752j088976n23980J24312M81646M97988N21483Q35370J277939J510824
$$ 732752 -356224 -880204 -755892 -274246 223742 745225 1580595 2858534 4369358
41349D369358J490570J386077J148087N30562m46003j389329j986307k285362
$$ 4369358 5859928 7246005 8394092 8924654 8478651 7089322 5103015 2817653
41341B817653k414765k284760j777516j076119n71623m50264m95701l22200K31045
$$ 2817653 402888 -1881872 -3659388 -4735507 -5307130 -5757394 -6253095 -6575295 -6344250
41332f344250R30785J365449J335729R96799O03132K22345k07929o62000j044612
$$ -6344250 -5413465 -4048016 -2712287 -1715488 -1112356 -890011 -1097940 -1759940 -2804552
41323b804552j359890j640573j703327j207215p6285J252181K112353K133758
$$ -2804552 -4164442 -5805015 -7508342 -8715557 -8791842 -7539661 -5427308 -3293550
41315c293550J507519Q15895N63083P34910Q07006L06120o26003j343925j369232
$$ -3293550 -1786031 -970136 -407053 327857 1134863 1440983 814980 -528945 -1898177
41306a898177q01928n2253O25294J188746J537788J428100P52076j68314p04395
$$ -1898177 -2700105 -2752358 -2127064 -938318 599470 2027570 2779646 2611332 1906937
41297A906937m39064M39336J334254J815500J877471J658647J185163N49122Q2438
$$ 1906937 1467873 1907209 3241463 5056963 6934434 8593081 9778244 10327366 10409804
41288A0409804L6474J93872J06893l13580p30631q82397q45143p65296o41946
$$ 10409804 10446278 10640150 10747043 10433463 9702832 8820435 7975292 7209996 6568050
41279F568050m85367m38263o05786r40082j351754j721680j769366j224453k75070
$$ 6568050 6082683 5644420 5038634 4098552 2746798 1025118 -744248 -1968701 -2243771
41270b243771M42440N20483K42066J67356M49419P65045P46230K64496n43307
$$ -2243771 -1801331 -1280848 -1038782 -871426 -422007 343038 1089268 1353764 810457
41261H10457j293589j549789j260602r02403r39469j237794j267566q01546j33235
$$ 810457 -483132 -2032921 -3293523 -4195926 -5135395 -6373189 -7640755 -8442301 -8575536
41252h575536L54430N57353N91194O23493P88555J047581J125512Q13176L31077
$$ -8575536 -8221106 -7663753 -7072559 -6449066 -5660511 -4612930 -3487418 -2674242 -2343165
41243b343165J28170K82203L82201R8472m07635p91871r91629j163509j331536
$$ -2343165 -2214995 -1932792 -1550591 -1452119 -1859754 -2651625 -3643254 -4806763 -6138299
41234f138299j341333j088224o01482L7426O82808J070975R67014M13369k45046
$$ -6138299 -7479632 -8567856 -9169338 -9131912 -8449104 -7378129 -6411115 -5997746 -6242792
41225f242792n85352l28669N41562J707764K579914K612823J682753J55965j390078
$$ -6242792 -6828144 -7156813 -6615251 -4907487 -2327573 285250 1968003 2123968 733890
41216G33890k477159k858799k546283j799110j020317n68153o16185j106037j739105
$$ 733890 -1743269 -4602068 -7148351 -8947461 -9967778 -10535931 -11152116 -12258153 -13997258
41207a3997258k072202j818665j143214n36774k91770j87847J94521R39942J728164
$$ -13997258 -16069460 -17888125 -19031339 -19568113 -19859883 -20047730 -19853209 -18913267 -17185103
41198a7185103K229412K362486K153773J576428O66109l37063j103840j411446
$$ -17185103 -14955691 -12593205 -10439432 -8863004 -8196895 -8533958 -9637798 -11049244
41190a1049244j163515l70934P26455J642156J984137J808990J478378J222212
$$ -11049244 -12212759 -12583693 -11857238 -10215082 -8230945 -6421955 -4943577 -3721365
41182c721365J064062J119414J600286K379866K862088K566778J694470Q50077
$$ -3721365 -2657303 -1537889 62397 2442263 5304351 7871129 9565599 10415676
41174A0415676L06871j72556q15607j448486j726220j538699j048207m72509k871
$$ 10415676 10722547 10549991 9734384 8285898 6559678 5020979 3972772 3500263 3497392
41165C497392J39697k15296r49527j574023j531715o89479M61238J167594J044105
$$ 3497392 3637089 3421793 2472266 898243 -633472 -1322951 -861713 305881 1349986
41156A349986L48616l40681o37207n18531j37935L62591Q49473J137869J034073
$$ 1349986 1698602 1357921 720714 202183 64248 426839 1276312 2414181 3448254
41147C448254M88026k50998o78909m23694K99648P61199M24630m86868j303505
$$ 3448254 3936280 3685282 3006373 2582679 2882327 3643526 4068156 3581288 2277783
41138B277783j699624j918201k225679k460904k269892j566859n78483M12047
$$ 2277783 578159 -1340042 -3565721 -6026625 -8296517 -9863376 -10441859 -10029812
41130a0029812J164985J454330J211576P23495M81458P25917J216123J507120
$$ -10029812 -8864827 -7410497 -6198921 -5475426 -4993968 -4268051 -3051928 -1544808
41122a544808J397666J068050Q43892Q95679J139502J339303J269602Q46940J97315
$$ -1544808 -147142 920908 1764800 2660479 3799981 5139284 6408886 7255826 7453141
41113G453141l99859p07864o91164m19967J39181J031266J926388K088514J057786
$$ 7453141 7053282 6345418 5654254 5234287 5373468 6404734 8331122 10419636 11477422
41104A1477422o82741k026599k288060j705410r04565k19603K93440N39142M79213
$$ 11477422 10794681 8768082 6480022 4774612 3870047 3650444 3943884 4483026 4962239
41095D962239M08503P24476J357074J707549J282728K40474p80984j258526j143168
$$ 4962239 5370742 6095218 7452292 9159841 10442569 10683043 9902059 8643533 7500365
41086G500365p51115m25129k79684j88334L1631M29000Q60588J036215O38021
$$ 7500365 6749250 6324121 6044437 5856103 5887734 6316734 7177322 8213537 8851558
41077H851558m31110j794525k710863k629533j661044m24150N21574J004108J122828
$$ 8851558 8420448 6625923 3915060 1285527 -375517 -799667 -278093 726015 1848843
41068A848843J033606Q67687O80050L97598r1460p61234j427304j880168j937613
$$ 1848843 2882449 3750136 4430186 4827784 4736324 3975090 2547786 667618 -1269995
41059a269995j417370k67713J195334K327791K586223J953898R69335L51175M76985
$$ -1269995 -2687365 -2955078 -1759744 568047 3154270 5108168 6077503 6428678 6905663
41050F905663J075619J479324J333881R98955J044768J426949J486247Q12885
$$ 6905663 7981282 9460606 10794487 11793442 12838210 14265159 15751406 16564291
41042A6564291k42647j091307j612887k047333k404848k372738j781327q52706
$$ 16564291 16321644 15230337 13617450 11570117 9165269 6792531 5011204 4158498
41034D158498P5190Q62397J534537K088000K406384K300082J625153M74932p15344
$$ 4158498 4233688 5096085 6630622 8718622 11125006 13425088 15050241 15525173 14809829
41025A4809829j371242j203810m63688K44546M50278J89603r0707l1281K71848
$$ 14809829 13438587 12234777 11771089 12015635 12465913 12655516 12564809 12533528 12805376
41016A2805376M61236L83990J69579j08821n43920j077302j387806j303323j060310
$$ 12805376 13266612 13650602 13820181 13711360 13167440 12090138 10702332 9399009 8338699
41007H338699q88544n85237J29747J001849J433948J272533R77004R14793Q53718
$$ 8338699 7450155 6864918 6994665 7996514 9430462 10702995 11679999 12594792 13448510
40998A3448510L23501p77328k077148l004532l060303k111771o44186M72417P05824
$$ 13448510 13772011 12994683 10917535 7913003 4852700 2740929 2096743 2569160 3274984
40989C274984K74514k61459o24528q52643r25283o97191j87197L40069O61381
$$ 3274984 3549498 3288039 2663511 1810868 885585 188394 1197 341266 1002647
40980A002647Q18935J009774J357845J818232K198992K239751J765785Q43328
$$ 1002647 1821582 2831356 4189201 6007433 8206425 10446176 12211961 13055289
40972A3055289k36346j157147j748956j958424j717415r56227J76613J173795
$$ 13055289 12818943 11661796 9912840 7954416 6237001 5280774 5457387 6631182
40964F631182J434114P81219l56767j369840j969440k169182j948287j241124
$$ 6631182 8065296 8846515 8489748 7119908 5150468 2981286 1032999 -208125
40956b08125k57682M84250N84674Q5803o51716j199965j181674m62170N82824
$$ -208125 -465807 18443 603117 688920 37204 -1162761 -2344435 -2806605 -2223781
40947b223781J224182J067099M91011K29009O10251J364283K005848K159070J606113
$$ -2223781 -999599 67500 558511 787520 1397771 2762054 4767902 6926972 8533085
40938H533085L61228j186106k378226k699112k121682j108120l09758j61368o11079
$$ 8533085 8894313 7708207 5329981 2630869 509187 -598933 -908691 -1070059 -1681138
40929a681138j206958j466729j142866k02930J200520K601248L264444K659515
$$ -1681138 -2888096 -4354825 -5497691 -5700621 -4500101 -1898853 1365591 4025106
40921D025106R53785j037226k387180k588204j773952n78491L59070R08675J381934
$$ 4025106 4978891 3941665 1554485 -1033719 -2807671 -3386162 -3027092 -2118417 -736483
40912g36483J896211K071323J576525P17169J12086o9308j58255l56313m89398
$$ -736483 1159728 3231051 4807576 5524745 5636831 5567523 5409268 5052955 4563557
40903D563557m21253k84793j58076J33215O78826J200221J302841Q43859n4440
$$ 4563557 4142304 3857511 3699435 3832650 4511476 5711697 7014538 7858397 7803957
40894G803957j117673j909482j996435j387204o34507k55374j90802p6780J14455
$$ 7803957 6686284 4776802 2780367 1393163 758656 503282 312480 235700 350155
40885C50155N5568l42703o73092m97513J44066Q33095J239297J345544J300268
$$ 350155 405723 63020 -610072 -1107585 -963519 -130424 1108873 2454417 3754685
40876C754685J209102J070265Q07849L53525k23402o60351o92573l70918q9498
$$ 3754685 4963787 6034052 6841901 7195426 6972024 6311673 5619100 5248182 5158684
40867E158684j74142n05121o95244n90737l85272k36762m4294K77181N51923N74249
$$ 5158684 4984542 4479421 3784177 3193440 2808168 2571406 2527112 2804293 3356216 3930465
40857C930465L99265K00711L2596k1096L19065J153901J970623K019788J171262
$$ 3930465 4329730 4530441 4563037 4541941 4861006 6014907 7985530 10005318 11176580
40848A1176580M6218p32272j037981r37610l79718N26071J262075J301948O22996
$$ 11176580 11222798 10490526 9452545 8514935 8135217 8661288 9923363 11225311 11848307
40839A1848307l94088j386598k101684k294796j905118j283513r43065j041219
$$ 11848307 11454219 10067621 7965937 5671141 3766023 2482510 1539445 498226
40831D98226j286223j351420j215353j089669j153861j376884j508192j258939
$$ 498226 -787997 -2139417 -3354770 -4444439 -5598300 -6975184 -8483376 -9742315
40823i742315n68974L35909J201044J972025K690078L264443L479911L187976
$$ -9742315 -10311289 -9975380 -8774336 -6802311 -4112233 -847790 2632121 5820097
40815E820097K417287J372515L87562k46302n13690o25690o52808l94764K13320
$$ 5820097 8237384 9609899 9997461 9751159 9237469 8611779 7958971 7564207 7777527
40806G777527P70218P99899M07064K08175N32912R47829P30340l05914j586724
$$ 7777527 8547745 9347644 9754708 9962883 10495795 11443624 12173964 11868050 10281326
40797A0281326k327621k226972j629678j077050p81631o06229m68416n31639r14355
$$ 10281326 7953705 5726733 4097055 3020005 2238374 1632145 1163729 632090 -282265
40788b82265j432532j827292k092369k326261k363975j881437r00210J05027P35451
$$ -282265 -1714797 -3542089 -5634458 -7960719 -10324694 -12206131 -13106341 -13001314 -12265863
40779a2265863J086987J463279J839710J889695J542689J249887J505211K195194
$$ -12265863 -11178876 -9715597 -7875887 -5986192 -4443503 -3193616 -1688405 506789
40771E06789K642289K329702J395406L16764o60027j518294k064620j947121j159820
$$ 506789 3149078 5478780 6874186 7190950 6530923 5012629 2948009 1000888 -158932
40762a58932j95083M61328P29198P06565L86668j32829m46392k24268L31917P41200
$$ -158932 -354015 107313 836511 1543076 1929744 1796915 1350523 1126255 1458172 2199372
40752B199372Q48758Q67918R11228Q31179N18173N7677m00871o52061l60793O49406
$$ 2199372 3048130 3916048 4827276 5658455 6176628 6234305 5833434 5181373 4820580 5469986
40742E469986J980429K872823K945117K448065J727686Q06217l16056j276360
$$ 5469986 7450415 10323238 13268355 15716420 17444106 18250323 17934267 16657907
40734A6657907j592270j169893l70324L22632N78443L65181L7887J32792Q09074
$$ 16657907 15065637 13895744 13525420 13848052 14426495 14791676 14829563 14962355 15771429
40725A5771429J544713J611866Q56229j60572p82947q53529o65038n04101l75147
$$ 15771429 17316142 18928008 19784237 19623665 18840718 17987189 17322151 16818050 16442903
40716A6442903j27611K60285N84150N87251J93784m29780r81116j160454q08892
$$ 16442903 16315292 16575577 17159727 17746978 17940762 17510982 16529866 15369412 14560520
40707A4560520m2358P73154J295544J464395J425939J277927J034716P84528O57495
$$ 14560520 14518162 15291316 16586860 18051255 19477194 20755121 21789837 22574365 23231860
40698B3231860O08548M45242J52528J060K19905P27264J318763J956369K661891
$$ 23231860 23840408 24285650 24438178 24439238 24659143 25386407 26705170 28661539 31323430
40689C1323430L213567L205744K492672J461035P71626Q19099J419753J992273
$$ 31323430 34536997 37742741 40235413 41696448 42468074 43287173 44706926 46699199
40681D6699199K066272J675293J289086J368048J966417K721410L196407L269705
$$ 46699199 48765471 50440764 51729850 53097898 55064315 57785725 60982132 64251837
40673F4251837L228705L459878M042694M732547N356772O056297P030440Q243747
$$ 64251837 67480542 70940420 74983114 79715661 85072433 91128730 98159170 106402917
40665A06402917R608762J1287916J3468444J5891930J7998178J9617107K1163952
$$ 106402917 116011679 127299595 140768039 156659969 174658147 194275254 215439206
40658B15439206K2986003K4832158K6210440K7009381K7420383K7327426K6062573
$$ 215439206 238425209 263257367 289467807 316477188 343897571 371224997 397287570
40651C97287570K2805304J7119650R209749j03665r607348j8063278k4533866
$$ 397287570 420092874 437212524 446422273 446318608 436711260 418647982 394114116
40644C94114116k8518410k9994991k9447866k7717866k5591974k3429669k1178155
$$ 394114116 365595706 335600715 306152849 278434983 252843009 229413340 208235185
40637B08235185j8735806j6310139j4437026j3552720j3432870j3183660j2056473
$$ 208235185 189499379 173189240 158752214 145199494 131766624 118582964 106526491
40630A06526491j0248423q601904p505296o488799n052623l462343k375413j974911
$$ 106526491 96278068 87676164 80170868 73682069 68629446 65167103 62791690 60816779
40622F0816779j883685j755596j525524j172477o99723m06150p81247j946232
$$ 60816779 58933094 57177498 55651974 54479497 53779774 53373624 52592377 50646145
40614E0646145l398530m412284m555794l834469k583093j302510l96239O2241
$$ 50646145 47247615 42835331 38279537 34445068 31861975 30559465 30163226 30225467
40606C0225467K37031K48758J63774K09241O84363J535398K237242K254055J516157
$$ 30225467 30462498 30711256 30875030 31084271 31768634 33304032 35541274 37795329 39311486
40597C9311486M07999n23249p86923j47972J161560K527707L419459L753125L798766
$$ 39311486 39719485 39196236 38409313 38261341 39422901 41950608 45370067 49123192 52921958
40588E2921958L911235M416118N481744O851824P858702P980203P334727O417488
$$ 52921958 56833193 61249311 66731055 73582879 81441581 89421784 96756511 103173999
40580A03173999N439956M219544K702512J253731K84810j77643l93862n64707
$$ 103173999 108613955 112833499 115536011 116789742 117074552 116896909 116503047 115938340
40572A15938340p69034j094640j569293j980182j985630j469510o44961K42035
$$ 115938340 115169306 114074666 112505373 110525191 108539561 107070051 106425090 106667125
40564A06667125J169883K220945L339354M365703N271305O209008P300846Q474385
$$ 106667125 107837008 110057953 113397307 117763010 123034315 129243323 136544169 145018554
40556A45018554R567430J0551139J1609506J3020152J4966390J7405294K0042755
$$ 145018554 154585984 165137123 176746629 189766781 204733171 222138465 242181220
40549B42181220K2426454K4128883K4922914K4801266K3761043K1512183J7477124
$$ 242181220 264607674 288736557 313659471 338460737 362221780 383733963 401211087
40542D01211087J1264501L245176n401800j3287997j9458057k3530631k5500383
$$ 401211087 412475588 415720764 410318964 397030967 377572910 354042279 328541896
40535C28541896k5648434k4551336k2880092k1063358j9216012j7375779j5658267
$$ 328541896 302893462 278342126 255462034 234398676 215182664 197806885 182148618
40528A82148618j4159203j2859151j1687008j0570423r396670q070616o691461
$$ 182148618 167989415 155130264 143443256 132872833 123476163 115405547 108714086
40521A08714086n562298m927682m743116m728508m581258m137251l430013k611436
$$ 108714086 103151788 98224106 93480990 88752482 84171224 80033973 76603960 73992524
40513G3992524j720073n49775J096409L017836M676483N723663O332465O944631
$$ 73992524 72272451 71722676 72819085 75836921 80513404 86237067 92569532 99514163
40505I9514163P775373Q520135Q368438O412172K451699k469819o668952r162700
$$ 99514163 107289536 115809671 124178109 130590281 133041980 130572161 123903209 114740509
40497A14740509j0192014j0376738r855440q579138o964229n645989m778076m118890
$$ 114740509 104548495 94171757 84316317 75737179 68772950 63126961 58348885 54229995
40489E4229995l674657l660978l845896l564094k564442j348205m62973P2681
$$ 54229995 50555338 46894360 43048464 39484370 36919928 35571723 35108750 35181431
40481C5181431L88775K96337l54490j149039j434475j086164n78151l38487l68667
$$ 35181431 35570206 35866543 35512053 34363014 32928539 31842375 31264224 30925737 30557070
40472C0557070m93327o40537p51827o57198k38007L54442P70273P62293L85296
$$ 30557070 30063743 29423206 28671379 28014181 27776174 28130616 28900889 29663182 30048478
40463C0048478j01534n14410r00270j383483j900619k198141k121904j807064
$$ 30048478 29946944 29432534 28532264 27148781 25248162 23050021 20928117 19121053
40455A9121053j520656j394701j371750j328091j171798q91606o05449n22451
$$ 19121053 17600397 16205696 14833946 13505855 12334057 11442451 10837002 10314551
40447A0314551p71270j266641j760542j968977j648125p10418N81480J615618
$$ 10314551 9543281 8276640 6516098 4547121 2898996 2188578 2770058 4385676
40439D385676J837832J242857L92892q5084L0313N67620J290707K072115K769577
$$ 4385676 6223508 7466365 7859257 7774173 7804486 8372106 9662813 11734928 14504505
40430A4504505L105065K815657J926510P78899k61508j082494j788668k454224
$$ 14504505 17609570 20425227 22351737 23130636 22869128 21786634 19997966 17543742
40422A7543742k976735l143267k784056j893247o74088N25808J361976J600196
$$ 17543742 14567007 11423740 8639684 6746437 6072349 6598157 7960133 9560329
40414I560329J145867J16479j051138j729995j562470q16571j65856q6452n24509
$$ 9560329 10706196 10822675 9771537 8041542 6479072 5662501 5496645 5410193 4885684
40405D885684j097294j468519j510909j258127q19303l28349P7077K87159L29256
$$ 4885684 3788390 2319871 808962 -449165 -1268468 -1596817 -1519740 -1232581 -903325
40396i03325M80466J127567K345321L656933M386828M277045L632034K838707
$$ -903325 -422859 704708 3050029 6706962 11093790 15370835 19002869 21841576
40388B1841576J895714N33447j236882k818689l423740k869577j885301j394307
$$ 21841576 23737290 24270737 23033855 20215166 16791426 13921849 12036548 10642241
40380A0642241j497222j470347q56878j43324l9849m55665p04564n36078l65940
$$ 10642241 9145019 7674672 6817794 6674470 6634621 6178956 5474392 4938314 4572374
40371D572374m86227o29459m67401m1322N27083J309532K262522K998929L186919
$$ 4572374 4086147 3456688 2989287 2947965 3475048 4784580 7047102 10046031 13232950
40362A3232950K924881K470368J878445J184208O51715M91913N52190O28663Q75424
$$ 13232950 16157831 18628199 20506644 21690852 22342567 22834480 23386670 24015333 24890757
40353B4890757J505686K232541K447446J947861J144574N38375K78855K28191
$$ 24890757 26396443 28628984 31076430 33024291 34168865 34707240 34986095 35214286
40345C5214286J62190j14789n79319q63137n47776L67523J478298K451824L264904
$$ 35214286 35376476 35261687 34682368 33819231 33271455 33638978 35117276 37569100 40834004
40336D0834004L940444M291506M052437L165892J909203Q11777L64776O17242
$$ 40834004 44774448 49065954 53118391 56284283 58193486 59005263 59370039 59987281
40328E9987281J076815J199051R83049R29478J435577K407856L452440M272209
$$ 59987281 61064096 62263147 63246196 64175674 65611251 68019107 71471547 75743756
40320G5743756M897251N671863O902811Q258561Q602393O809979K883655j936842
$$ 75743756 80641007 86312870 93215681 101474242 110076635 116886614 119770269 117833427
40312A17833427o170354q960888j0073318r619919q122790o495167n483159n110733
$$ 117833427 111663073 102702185 92628867 83008948 74886158 68390991 62907832 57797099
40304E7797099m874532m429558l906511l612631l604275l565072l020021j718127
$$ 57797099 52922567 48493009 44586498 40973867 37369592 33804520 30784499 29066372
40296B9066372Q9219J764027K745324K911822K527248J937879J329641O33749
$$ 29066372 29155591 30919618 33664942 36576764 39104012 41041891 42371532 43005281
40288D3005281l96807j899633l615908m979146n539437n224855m218731k782260
$$ 43005281 42608474 40708841 37092933 32113787 26574350 21349495 17130764 14348504
40280A4348504j241404Q6607J092452J837456K220777J913585Q11618o46266j858500
$$ 14348504 13107100 13193707 14286159 16123615 18344392 20257977 21069595 20423329 18564829
40271A8564829k628617l113818l349587l172311k615524k046547j750712j556383
$$ 18564829 15936212 12822394 9472807 6300496 3684972 1638425 -112287 -1668670
40263a668670j033858j7768J143290J847057J765711J172233P08303P50714J046461
$$ -1668670 -2702528 -2720296 -1577006 270051 2035762 3207995 3916298 4667012 5713473
40254E713473J054485N71359j13819o05832p37377n34986r5821M05795P63945
$$ 5713473 6767958 7339317 7225498 6619666 5882289 5347303 5251482 5657277 6421222
40245F421222R23528J015628J116385J082991P54575K25633k45783n81545r75741
$$ 6421222 7344750 8360378 9476763 10559754 11314329 11539962 11294179 10712634 9736893
40236I736893j591708k269759k619307k368693j575828n37021M22371J061819
$$ 9736893 8145185 5875426 3256119 887426 -688402 -1225423 -803052 258767
40228B58767J252714J028590O23284L55752L88441O07186P77723Q04834P96674
$$ 258767 1511481 2540071 3163355 3519107 3907548 4514734 5292457 6097291 6893965
40219F893965Q80635J003218R47806N63338k7405m73005m75975l2982N88427J030447
$$ 6893965 7774600 8777818 9725624 10288962 10261557 9788552 9312577 9279595 9868022 10898469
40209A0898469R69456K32351r68814j947028j998014j122651j11059K77776P6110
$$ 10898469 11867925 12100276 11131462 9184434 7186420 6063769 5952710 6230486 6306596
40200F306596j37619n9869Q3255K5174j85534m09135o62621r44806j039380p28238
$$ 6306596 6168977 6109108 6192363 6217537 6032003 5622868 4960247 4015441 2976061 2247823
40190B247823r7269N27517Q39320O30148j83073j359844k294989k496504k109743
$$ 2247823 2150554 2678071 3517391 4147539 3964466 2604622 309633 -2186871 -4296614
40181d296614j714764j593970j470786j028697l92670P0024K06346J40908N4328
$$ -4296614 -6011378 -7605348 -9076134 -10104831 -10497501 -10427477 -10221131 -10080223 -10025895
40172a0025895J06336M39816J018786J537296J715702J629917J516355J321235
$$ -10025895 -9919559 -9479743 -8460957 -6923661 -5207959 -3578042 -2061687 -740452
40164g40452P70088q0164p19197q10916o86322r40272j667055k352524k476551
$$ -740452 29636 -50528 -769725 -1580641 -2266963 -3207235 -4874290 -7226814 -9703365
40155i703365k007996j316509p84362n28203l57535K4847O84197J321919J588635
$$ -9703365 -11711361 -13027870 -13812232 -14340435 -14697970 -14673123 -13988926 -12667007 -11078372
40146a1078372J508035J458958J744188K312676K900155L273566L298515K935836
$$ -11078372 -9570337 -8111379 -6367191 -4054515 -1154360 2119206 5417721 8353557
40138H353557K275334J492034P25516Q8879k13827L4247P79598J632632K180602
$$ 8353557 10628891 12120925 12846441 12935320 12721493 12755740 13535338 15167970 17348572
40129A7348572K258264J862920J008528j67208j299896k024830k268622k186899
$$ 17348572 19606836 21469756 22478284 22311076 21011180 18986350 16717728 14530829
40121A4530829j916837j573159j378625j510546j791870j778803j253245m72161
$$ 14530829 12613992 11040833 9662208 8151662 6359792 4580989 3327744 2855583
40113B855583J42946M13527M25902L07812J22651r6195l26685n43383o65978n89987
$$ 2855583 2998529 3412056 3837958 4145770 4268421 4172226 3845541 3302158 2636180 2046193
40103B046193l39292j29794k06617o42265j302579j904521k053250j379004J55267
$$ 2046193 1706901 1577107 1370490 728225 -574354 -2478875 -4532125 -5911129 -5755862
40094e755862K062056L557804M045050L408657J981623L65009p98218j129482
$$ -5755862 -3693806 -136002 3909048 7317705 9299328 9664337 8866119 7736637
40086G736637p48501j53000K04018K08059o798l04610o41981j031022j523287
$$ 7736637 6988136 6835136 7039154 7247213 7240415 6935805 6293824 5262802 3739515
40077C739515k162873k824980l146712k806045j932455j091343p24374o68845
$$ 3739515 1576642 -1248338 -4395050 -7201095 -9133550 -10224893 -10949267 -11618112
40069a1618112l69111M50120J456961K089971K139937J870264J637640J516839
$$ -11618112 -11987223 -11537103 -10080142 -7990171 -5850234 -3979970 -2342330 -825491
40061h25491J308909Q41787K20762k15901k11291J11008K90313p1494r39773j870487
$$ -825491 483418 1325205 1545967 1330066 1118775 1229783 1520096 1448602 508829 -1361658
40051a361658k339783k018385q61261Q43842K470478L308826L051765K052229
$$ -1361658 -3701441 -5719826 -6581087 -5737245 -3266767 42059 3093824 5146053
40043E146053J016204M26865K84981L19501L00221J29642k10871o54961j009297
$$ 5146053 6162257 6589122 6874103 7193604 7493825 7623467 7412596 6757635 5748338
40034E748338j048135p31084k86467P738J32948L34790P72564J251915J416391
$$ 5748338 4700203 3969119 3682652 3690390 3823338 4158128 4930692 6182607 7598998
40025G598998J157071O88617K32070j82639n25545n90129k21067L66231P10581
$$ 7598998 8756069 9444686 9676756 9494117 8968572 8378443 8157376 8523607 9234188
40016I234188N50066j4863p70074j570284k224524k447721k108183j395055n74259
$$ 9234188 9784254 9769391 8999317 7429033 5204509 2756788 648605 -746450 -1320709
40007a320709L13372J312159K182611K442917J872132Q18047r8232m97319m13966
$$ -1320709 -1007337 304822 2487433 4930350 6802482 7620529 7522297 7024978 6611012
39998F611012j12283J06975j3440n82038j440637k238107k705501k835828k763625
$$ 6611012 6498729 6605704 6592264 6010226 4569589 2331482 -374019 -3209847 -5973472
39989e973472k528743k033611j208444j40657R57792J840694K297381K266809
$$ -5973472 -8502215 -10535826 -11744270 -11884927 -10927135 -9086441 -6789060 -4522251
39981d522251J965540J797562J969130K179960J833030O40523j011714k338321
$$ -4522251 -2556711 -759149 1209981 3389941 5222971 5863494 4851780 2513459
39973B513459k767103k296588j358885m18954L30701R88952J731487K586344L386541
$$ 2513459 -253644 -2550232 -3909117 -4328071 -3997370 -3008418 -1276931 1309413 4695954
39964D695954L863177L730954K777016J060808r09212k344723k683738j960004
$$ 4695954 8559131 12290085 15067101 16127909 15218697 12873974 10190236 8230232
39956H230232o96575M53909R58726N52592n88427j838243k502023k316883j567475
$$ 8230232 7533657 7987566 8946292 9498884 8910457 7072214 4570191 2253308 685833
39947F85833p71487l30242l64751o64062p83654m05909K99580P89102O84166J16717
$$ 685833 -85654 -415896 -780647 -1444709 -2228363 -2634272 -2334692 -1545590 -861424 -744707
39937g44707m76739p80827p90983p14423p40874q07778n71423K45522J440310
$$ -744707 -1221446 -2002273 -2793256 -3507679 -4248553 -5056331 -5627754 -5382232 -3941922
39928c941922K423204K773412K523973J853999P96166n30122j622860j887232
$$ -3941922 -1518718 1254694 3778667 5632666 6428832 5898710 4275850 2388618
39920B388618j231462j94217M98348L96510m88085j690879k536489k636816k181778
$$ 2388618 1157156 962939 1461287 1857797 1369712 -321167 -2857656 -5494472 -7676250
39911g676250j581883r10011L3511J162346K004128K280832K262924K332302K423710
$$ -7676250 -9258133 -10168144 -10134633 -8972287 -6968159 -4687327 -2424403 -92101 2331609
39902B331609K137934J267907K1630j129031j620943j007668O47758K563629L689261
$$ 2331609 4469543 5737450 5759080 4630049 3009106 2001438 2649196 5212825 8902086
39893H902086L491223K233116N44642j077041k342329l048045l117215k700651
$$ 8902086 12393309 14626425 15171067 14094026 11751697 8703652 5586437 2885786
39885B885786k084196j472434r06518l63786J21599M32251M34802R3298m62969
$$ 2885786 801590 -670844 -1577362 -1941148 -1819549 -1387298 -952496 -859198 -1322167
39876a322167j011190j396123j595770j628929j480160j185129r28938r28616
$$ -1322167 -2333357 -3729480 -5325250 -6954179 -8434339 -9619468 -10548406 -11477022
39868a1477022j186468j457419j529419j469170j497507j659193j732228j473135
$$ -11477022 -12663490 -14120909 -15650328 -17119498 -18617005 -20276198 -22008426 -23481561
39860b3481561q41720M9307J079540K117569K962493L429622L494793L286656
$$ -23481561 -24323281 -24273974 -23194434 -21076865 -18114372 -14684750 -11189957 -7903301
39852g903301K968395K680168K497909K308601J803534Q05950l88453j197919
$$ -7903301 -4934906 -2254738 243171 2551772 4355306 5161256 4772803 3574884
39844C574884j322161r29873k45249P54179K021013L062368L243826K458381J236403
$$ 3574884 2252723 1322850 1077601 1831780 3852793 6915161 10158987 12617368 13853771
39835A3853771J71904n34574r44068j090951j013102q88517q98548r90931r60772
$$ 13853771 14025675 13491101 12547033 11456082 10442980 9554463 8655915 7664984 6704212
39826F704212p75039o57266p85660j019941j034368o81939j27461L82214P77849
$$ 6704212 5929173 5271907 4486247 3466306 2431938 1749999 1622538 2004752 2782601
39817B782601J131488J421709J446450R96709O1066j150976k308102l041650l039001
$$ 2782601 3914089 5335798 6782248 7778957 7840023 6689047 4380945 1339295 -1699706
39808a699706k208438q05731O46769J626553J877531J536133J061201R48740J358387
$$ -1699706 -3908144 -4713875 -4067106 -2440553 -563022 973111 2034312 2983052 4341439
39799D341439J971540K278277K041403J468481R57744P30572O88138N42345P4732
$$ 4341439 6312979 8591256 10632659 12101140 13058884 13789456 14477594 15019939 15094671
39790A5094671o62513j376518j808425j979486k113446k342801k595789k767821
$$ 15094671 14432158 13055640 11247215 9267729 7154283 4811482 2215693 -552128
39782e52128k849772k813410k511150j838177r30616n5433O74456J327865J883665
$$ -552128 -3401900 -6215310 -8726460 -10564637 -11495253 -11550686 -10876230 -9548365 -7664700
39773g664700K095454J752173J026415M50667M96563J168785J992723K387224
$$ -7664700 -5569246 -3817073 -2790658 -2339991 -1843428 -674643 1318080 3705304
39765C705304K077908J210839J49066p67312j289256j259237p09630N8135O40178
$$ 3705304 5783212 6994051 7143117 6375805 5086549 3827312 3117682 3175817 3815995
39756C815995Q29652O77317K60382m50071j401809k274194k641020k299524j357332
$$ 3815995 4645647 5322964 5583346 5133275 3731466 1457272 -1183748 -3483272 -4840604
39747d840604p8434J207701K105125K292804J768339Q59535m8471p20557j041431
$$ -4840604 -4919038 -3711337 -1606212 686592 2454931 3314466 3265995 2545438 1504007
39738A504007r92590p68891p54679j192576j903678k442006k486373j999997j095751
$$ 1504007 511417 -257474 -1012153 -2204729 -4108407 -6550413 -9036786 -11036783 -12132534
39729a2132534Q3847J338614K383756K920637K759431J956599Q83647M5405l09097
$$ -12132534 -12048687 -10710073 -8326317 -5405680 -2646249 -689650 193997 239402 -69695
39720f9695l47337l16347j31262N18440J680333K942258L735760L680317K656388
$$ -69695 -417032 -733379 -864641 -346201 1334132 4276390 8012150 11692467 14348855
39711A4348855Q10366j375428l200721m148079m177688l601757k767804j915900
$$ 14348855 15159221 13783793 10583072 6434993 2257305 -1344452 -4112256 -6028156
39703f028156j196803o58464k20549K48805Q07849J386022J815416J940291J771166
$$ -6028156 -7224959 -7883423 -8103972 -7855167 -7047318 -5661296 -3845880 -1905589 -134423
39694a34423J498870J248753Q75324J82293o83784j315036j563245j696762j909967
$$ -134423 1364447 2613200 3488524 3670817 2987033 1671997 108752 -1588010 -3497977
39685c497977j960680j519241o53240K95534J128887J791913K118245J949140
$$ -3497977 -5458657 -6977898 -7631138 -7335604 -6206717 -4414804 -2296559 -347419
39677c47419J460352J016375O75327J57850o32480j365598j677546j551827j182039
$$ -347419 1112933 2129308 2804635 2962485 2330005 964407 -713139 -2264966 -3447005
39668c447005o94358j80275J82713K55135J07478n4123n8066K07882Q07267J661641
$$ -3447005 -4141363 -4321638 -4138925 -3883790 -3776312 -3830435 -3888501 -3680619 -2873352 -1211711
39658a211711K523782L139736L381129L197619K593294J733402R12730K82202
$$ -1211711 1312071 4451807 7832936 11030555 13623849 15357251 16269981 16552183
39650A6552183k71819q53945j315920j466646j407082j431244j644044j891847
$$ 16552183 16280364 15426419 14110499 12643853 11236771 9805527 8161483 6269636
39642F269636k055558k188826k319039k306358k004299j442528p61924n2115O79114
$$ 6269636 4214078 2025252 -293787 -2600145 -4604444 -6046972 -6808896 -6861011 -6181897
39633f181897J452989K295299L175552L893907M127128L722412K898322J998448
$$ -6181897 -4728908 -2433609 741943 4635850 8762978 12485390 15383712 17382160
39625A7382160J054431j98009j756737k993463l125965k069954o31939K03688
$$ 17382160 18436591 18238582 16481845 13488382 10362417 8292463 7660524 7864212
39617G864212L9784q67297j986040k736969k605501j468971J32381J337046J692535
$$ 7864212 7903996 7036699 5050659 2313690 -291811 -1760782 -1628401 -291355 1401180
39608A401180J403630Q68377K34133n08672j279985j963436k533629k938644k983836
$$ 1401180 2804810 3673187 3907320 3398648 2118663 155227 -2378402 -5317046 -8300882
39599h300882k512779j612602n07607O25277J605946K212960K433507K601340
$$ -8300882 -10813661 -12426263 -12933870 -12308593 -10702647 -8489687 -6056180 -3454840
39591c454840K986857L327392L089998K202802J203089N76939K35405k17577r36023
$$ -3454840 -467983 2859409 5949407 8152209 9355298 9932237 10167642 9950065 9014042
39582I014042j729615k328449k550339k338359j872899j613120j987692k925848
$$ 9014042 7284427 4955978 2405639 67280 -1805619 -3418739 -5406431 -8332279
39574h332279l772875l780810k737316j131186L05911J231700J854843K475415
$$ -8332279 -12105154 -15885964 -18623280 -19754466 -19448555 -18216855 -16362012 -13886597
39566a3886597K979908K930963K128418R13014j40431p03237q01633n93789k07143
$$ -13886597 -10906689 -7975726 -5847308 -4934294 -5074725 -5777962 -6579595 -7173384 -7380527
39557g380527K28034N34268N61568K91341j65272o72223j138998j456306j419518
$$ -7380527 -7152493 -6618225 -6056657 -5765316 -5930588 -6602811 -7741809 -9198115 -10617633
39548a0617633q76297l6777N00954K37154p11485j705364k186816k085613j689870
$$ -10617633 -11493930 -11530707 -11029753 -10792599 -11504084 -13209448 -15396264 -17481877 -19171747
39539a9171747j325811j180287j214967j155784p22648M5332Q28426J427886J924072
$$ -19171747 -20497558 -21677845 -22892812 -24048596 -24771244 -24725912 -23897486 -22469600 -20545528
39530b0545528K361457K560289K463906K447706K949675L860605M570508M623884
$$ -20545528 -18184071 -15623782 -13159876 -10712170 -7762495 -3901890 668618 5292502
39522E292502M101572L355186K605689J862152J040294Q6648q62791j406417j157280
$$ 5292502 9394074 12749260 15354949 17217101 18257395 18344043 17481252 16074835 14917555
39513A4917555k26182O96538Q79328J55521j008168j932960k185020j779462j091394
$$ 14917555 14691373 15387911 16267239 16422760 15414592 13481632 11296612 9517150 8425756
39504H425756n44793l03084k42199j88176q5853O2456K69218M79461N22127K72962
$$ 8425756 7880963 7577879 7335680 7147504 7061651 7124107 7393325 7872786 8394913 8667875
39494H667875j60396n03563n66543l99986k32479k81684n89545j011265j376128
$$ 8667875 8507479 8003916 7437373 7037387 6804908 6523224 5933679 4922414 3546286
39485C546286j625273j727336j526538q62158J14343R14197J118977P17911j2565
$$ 3546286 1921013 193677 -1332861 -2195019 -2080676 -1166479 -47502 670409 657844
39476F57844p77777j270778j125224j99397J085743J969854K043903J591322J176656
$$ 657844 -119933 -1390711 -2515935 -2715332 -1629589 340265 2384168 3975490 5152146
39467E152146J041728J012607Q65365N85149K67792n7302l88087o03936n29755
$$ 5152146 6193874 7206481 8071846 8656995 8924787 8867485 8479398 7875462 7345707
39458G345707k30626j36170o82543j779224k754012k919676k150278q85065L00610
$$ 7345707 7115081 6978911 6296368 4517144 1763132 -1156544 -3306822 -4191887 -3891277
39449c891277J047410J297240J219902J015052O65614l6433j083827j991179k175426
$$ -3891277 -2843867 -1546627 -326725 688327 1353941 1317508 233681 -1757498 -3932924
39440c932924j574483o78497K5735M09873N51617N74823P18931J204701J818726
$$ -3932924 -5507407 -6185904 -6160169 -5750296 -5198679 -4623856 -3904925 -2700224 -881498
39431h81498J927592J199914J14723n58169o37765n58763o24450o45909l81893
$$ -881498 1046094 2246008 2360731 1802562 1164797 606034 -18416 -664325 -1046218
39422a046218L4468L02624L59765L79590N01772P30385J004970J214071J197111
$$ -1046218 -1011750 -709126 -349361 30229 532001 1262386 2267356 3481427 4678538
39413D678538Q88996M65653K33907L36019O05040P33958N74194K57356J9992o8587
$$ 4678538 5567534 6033187 6267094 6603113 7208153 7942111 8516305 8773661 8793653 8725066
39403H725066j38171k62318k98924j23148N7889j58234q71311j690481k132603
$$ 8725066 8586895 8324577 8025653 7902505 7960394 7802160 6930849 5240368 3107765
39394C107765k078871j752172j392875j111942r69772j008765j199214j465169
$$ 3107765 1028894 -723278 -2116153 -3228095 -4197867 -5206632 -6405846 -7871015
39386g871015j757147k000044j995817j533144o64805K05200O01253L60971k44723
$$ -7871015 -9628162 -11628206 -13624023 -15157167 -15821972 -15616772 -15015519 -14654548 -14899271
39377a4899271p33610p50415k46479N95766J550141K426089L015693L106703K662147
$$ -14899271 -15632881 -16383296 -16629775 -16034009 -14483868 -12057779 -9042086 -5935383 -3273236
39368c273236J958877J436341J344827J544747J654654J395436Q17152K17767
$$ -3273236 -1314359 121982 1466809 3011556 4666210 6061646 6878798 7096565
39360G096565j61464l50264n28169p18913p20458l93353R2032M19756M80620M05882
$$ 7096565 6935101 6584837 6056668 5337755 4617297 4223944 4315976 4735732 5216352 5622234
39350E622234K48822j86981j071312k164476k862415k699626j780932o64571J75242
$$ 5622234 5871056 5684075 4612763 2448287 -414128 -3113754 -4894686 -5559257 -5384015
39341e384015O98736J087621J306310J067396K60052p72974j519267j761929j646818
$$ -5384015 -4685279 -3597658 -2291348 -1223952 -963900 -1736874 -3256141 -5018070 -6664888
39332f664888j395771j128483r08287p53659n80795k99984P25J23625M1259p2362
$$ -6664888 -8060659 -9189142 -10097429 -10851088 -11431883 -11731867 -11731142 -11607517 -11566258 -11638620
39322a1638620j47390l39949p06167r45416o99700j5162P29820J313029J822415
$$ -11638620 -11786010 -12125959 -12832126 -13777542 -14477242 -14492404 -13762584 -12449555 -10627140
39313a0627140K283629K411756J929059R92582R6060m23111o28061p67914j005732
$$ -10627140 -8343511 -5931755 -4002696 -3010114 -2914054 -3337165 -3965226 -4733140 -5738872
39304e738872j388375j878961k272851k220255j558201o13333J9222O0749k20159
$$ -5738872 -7127247 -9006208 -11279059 -13499314 -15057515 -15670848 -15651626 -15590877 -15811036
39295a5811036m03535l65798k13880M6686N27061J171154J688896J848110J705220
$$ -15811036 -16214571 -16580369 -16794249 -16747563 -16220502 -15049348 -13360452 -11512342 -9807122
39286i807122J492527J378028J370012J345983J127835O41052P4799k00885L0382
$$ -9807122 -8314595 -6936567 -5566555 -4220572 -3092737 -2451685 -2376886 -2577771 -2547389
39277b547389N93538J031067R11285P6511j265220k650561l678222m268889m527927
$$ -2547389 -1953851 -922784 -11499 65012 -1200208 -3850769 -7528991 -11797880 -16325807
39268a6325807m384973l598526k204717p26527K65173O67354P58073P66900P82667
$$ -16325807 -20710780 -24309306 -26514023 -27240550 -26975377 -26308023 -25549950 -24783050 -24000383
39259b4000383R56930J443703K098088K527362K562640K477089K603718K880752
$$ -24000383 -23043453 -21599750 -19501662 -16974300 -14411660 -11934571 -9330853 -6450101
39251f450101K905827K353309J256266j7926r69782j239936q27913o3439O63766
$$ -6450101 -3544274 -1190965 65301 47375 -922407 -2162343 -2990256 -3053695 -2389929
39242b389929J123392J235454J002698N45433R7509j73506l30779n76081j011913
$$ -2389929 -1266537 -31083 971615 1517048 1614557 1441051 1110272 534191 -477722
39233d77722j552525k028771k292150k232649j807132j106065l33829L47319R37741
$$ -477722 -2030247 -4059018 -6351168 -8583817 -10390949 -11497014 -11830843 -11483524 -10545783
39224a0545783J499620J939404K005011J598761J028139P88101J069671J601183
$$ -10545783 -9046163 -7106759 -5101748 -3502987 -2474848 -1686747 -617076 984107
39216I84107J974086J947269J415432L94063p39193j252416p07839M52706J323704
$$ 984107 2958193 4905462 6320894 6714957 5975764 4723348 4015509 4468215 5791919
39207E791919J546085J560146J806351K077056J869513J062320n2086j195639
$$ 5791919 7338004 8898150 10704501 12781557 14651070 15713390 15661304 14465665
39199A4465665k237704k995543l222309k857932k142672j443149j009965q36132
$$ 14465665 12227961 9232418 6010109 3152177 1009505 -433644 -1443609 -2279741
39191b279741o74953k73061L54383R86760J554727K189706K775956K737860J608652
$$ -2279741 -2954694 -3227755 -2873372 -1886612 -331885 1857821 4633777 7371637 8980289
39182H980289l01355k115244l220138l615103l503584k927430j919363p20182
$$ 8980289 8678934 6563690 3343552 -271551 -3775135 -6702565 -8621928 -9342110
39174i342110L71307J246024J948354K472886K705919K559091K135748J744722
$$ -9342110 -8970803 -7724779 -5776425 -3303539 -597620 1961471 4097219 5841941
39166E841941J636974J643196J216381L8384j479856k513901k617401k019190
$$ 5841941 7478915 9122111 10338492 10376876 8897020 6383119 3765718 1746528
39158A746528j199927m34961K37213Q51023J392223J688761J467838P48316R0886
$$ 1746528 546601 111640 348853 1199876 2592099 4280860 5748698 6497014 6587900
39149F587900Q9497O00635Q88789O26855K88946L38532N14884L29774j11543l32522
$$ 6587900 6677397 7278032 8166821 8793676 9082622 9421154 9936038 10265812 10154269 9821747
39139I821747l35974o51468j506603k421063k759880k358535j474821m17771N95828
$$ 9821747 9485773 8834305 7327702 4906639 2146759 -211776 -1686597 -2104368 -1508540
39130a508540J415186J970203K242288K174757J734360J082322N09482J37433
$$ -1508540 -93354 1876849 4119137 6293894 8028254 9110576 9620058 9757491
39122I757491j60576m87461p60835r28467j158845j630098k216795k555334k392371
$$ 9757491 9596915 9109454 8348619 7420152 6261307 4631209 2414414 -140920 -2533291
39113b533291j759960q67743K5269O50570Q28688O32454L76149L38280M97408
$$ -2533291 -4293251 -5160994 -5135725 -4485155 -3656467 -3024013 -2647864 -2309584 -1812176
39104a812176N97308M69088K28308J30256K75989M98452N09873J34841n47554
$$ -1812176 -1214868 -745780 -517472 -387216 -111227 387225 897098 1031939 484385
39095D84385j228809j584080j553317j389730j340869j322255j042113m26283
$$ 484385 -744424 -2328504 -3881821 -5271551 -6612420 -7934675 -8976788 -9403071
39087i403071K62081P47879R81373R77606O59551N4070n16773o73789l49819K41803
$$ -9403071 -9140990 -8393111 -7411738 -6434132 -5774581 -5720511 -6237284 -6911073 -7260892 -7019089
39077g019089R05818J519822J872891J738985J175203N56259K34892K79763N51134
$$ -7019089 -6113271 -4593449 -2720558 -981573 193630 749889 984781 1264544 1815678
39068A815678Q63818J025867Q84143M46168j12763o16254r95168j222606j261816
$$ 1815678 2679496 3705363 4589506 5035674 4922911 4306657 3311489 2088883 827067
39059H27067j137025r62083q19543o49713l03527L08446J106427J836938K208880
$$ 827067 -309958 -1272041 -2091584 -2741297 -3044824 -2736378 -1629951 206987 2415867
39050B415867K108302J663910J050223K95902o08529j487245k036838k110848
$$ 2415867 4524169 6188079 7238302 7534204 6925675 5438430 3401592 1290744
39042A290744j816563j339447q08903l21298O5544L62919N22709L12530m44480
$$ 1290744 -525819 -1865266 -2674169 -2995467 -2929923 -2567004 -2044295 -1731765 -2176245
39033b176245j471309k134639k058468j448369p17365m3012N36264Q59751Q11255
$$ -2176245 -3647554 -5782193 -7840661 -9289030 -10006395 -10049407 -9513143 -8653392 -7842137
39024g842137O28376P01345J056014J334189J362255J452257J930032K535944
$$ -7842137 -7213761 -6512416 -5456402 -4122213 -2759958 -1307701 622331 3158275
39016C158275K590273J790626O28392j39424l25281m12487q25429j356291j508624
$$ 3158275 5748548 7539174 8167566 8028142 7702861 7290374 6464945 5108654 3600030
39007C600030j257154j164106j699607k666857l391960l323701k376190q90759
$$ 3600030 2342876 1178770 -520837 -3187694 -6579654 -9903355 -12279545 -13170304
38999a3170304N56392J441710J637825J504332J519176J795550K010639J763975
$$ -13170304 -12613912 -11172202 -9534377 -8030045 -6510869 -4715319 -2704680 -940705
38991i40705R25585l02914j514492k259809k231771j434682k03768R91216J829055
$$ -940705 -15120 -318034 -1832526 -4092335 -6324106 -7758788 -7962556 -6971340 -5142285
38982e142285K270827K425934K317869J865720J119688L71159j25389m67049r40406
$$ -5142285 -2871458 -445524 1872345 3738065 4857753 5228912 5103523 4636474 3696068
38973C696068j547685j902679j672557r71867k44737J16473p453m45979q44024
$$ 3696068 2148383 245704 -1426853 -2398720 -2643457 -2526984 -2534437 -2980416 -3824440
38964c824440r26521p62180o49640o79473n74969o5243P49248J506359J873565
$$ -3824440 -4750961 -5513141 -6162781 -6842254 -7417223 -7482466 -6733218 -5226859 -3353294
38955c353294J630235P32341m71830j323039j473882j303557j397094j718528
$$ -3353294 -1723059 -990718 -1462548 -2785587 -4259469 -5563026 -6960120 -8678648
38947h678648j669978r42725Q7363Q99739J413612J857919K313654K595906K455972
$$ -8678648 -10348626 -11291351 -11203988 -10304249 -8890637 -7032718 -4719064 -2123158 332814
38938C32814J764896O27322n66295j323173j414661j015714m81366j35982k59996
$$ 332814 2097710 2725032 2158737 835564 -579097 -1594811 -2076177 -2212159 -2472155
38929b472155r47371j776002j909001r09426O08639J484017J221950M57919J51119
$$ -2472155 -3419526 -5195528 -7104529 -8013955 -7405316 -5921299 -4699349 -4241430 -4090311
38920d090311N85241J321010J870862K076842J890803J189511L4950j083252j577630
$$ -4090311 -3505070 -2184060 -313198 1763644 3654447 4843958 4878908 3795656 2218026
38911B218026j365563r47854q11984r03548q01949l17508K39533L74535j11477
$$ 2218026 852463 -95391 -907375 -1810923 -2612872 -2930380 -2690847 -2316312 -2427789
38902b427789r71526j776807k297804k610981k805196k655578j793202l00430
$$ -2427789 -3399315 -5176122 -7473926 -10084907 -12890103 -15545681 -17338883 -17639313
38894a7639313J056292J457694Q95548J99230J45434P05379J252193J346209J139854
$$ -17639313 -16583021 -15125327 -14229779 -14030549 -13885115 -13179736 -11927543 -10581334 -9441480
38885i441480J068395J344473J842978K358194K775276K936357K530540J377708
$$ -9441480 -8373085 -7028612 -5185634 -2827440 -52164 2884193 5414733 6792441
38877F792441j58683j292897j530120j149350q27247q83588j067562r87080n11269
$$ 6792441 6633758 5340861 3810741 2661391 1834144 950556 -117006 -1104086 -1615355
38868a615355K13433Q73875J064709N19346n58334j526685j835278j489614r32778
$$ -1615355 -1401922 -528047 536662 1056008 497674 -1029011 -2864289 -4353903 -5286681
38859e286681n54356l98888k76208l3756K87035N04346M77642K25798j21961m02785
$$ -5286681 -5841037 -6239925 -6516133 -6549889 -6262854 -5758508 -5280866 -5055068 -5177029 -5579814
38849e579814l83188K22407J472584K926902L860333L861614L135243K184023
$$ -5579814 -5963002 -5740595 -4268011 -1341109 2519224 6380838 9516081 11700104
38841A1700104J324945N68238j68194q28490j154048q61791k1621P68322Q29146
$$ 11700104 13025049 13593287 13425093 12596603 11442555 10580764 10559143 11327465 12156611
38832A2156611J18332p10869j079078j073380j097068j192195j045406n48939
$$ 12156611 12274943 11564074 10484996 9411616 8314548 7122353 6076947 5528008
38824E528008L560L00253L03202R3805l21784r17135j504652j820685j705986
$$ 5528008 5531568 5831821 6135023 6228828 5907044 4989909 3485257 1664572 -41414
38815d1414j188847m91724L9650J68842J0747m6560K83241R47429J681090K239580
$$ -41414 -1230261 -1721985 -1682335 -1513493 -1502746 -1549306 -1266065 -318636 1362454 3602034
38805C602034K471340K300425J731040Q13625m06190j797012k997141l549341
$$ 3602034 6073374 8373799 10104839 10918464 10512274 8715262 5718121 2168780
38797B168780l291996k504682j592965p73600j48725J39151N5486j58289k14577
$$ 2168780 -1123216 -3627898 -5220863 -5994463 -6143188 -6004037 -5948551 -6106840 -6321417
38788f321417r9387P2167M11970J124186K020123K556189K484246K121869J790296
$$ -6321417 -6420804 -6348637 -5936667 -4812481 -2792358 -236169 2248077 4369946 6160242
38779F160242J339281N49113k88066o43567m91209l19827m11235n37019m53834
$$ 6160242 7499523 8048636 7760570 7117003 6625794 6305967 5894732 5357713 4903879
38770D903879k66487r0586K75495J024171J921069K541283K779395K816079K679431
$$ 4903879 4637392 4546806 4822301 5846472 7767541 10308824 13088219 15904298 18583729
38761A8583729K178124J270264J95202q35025j828590k773532l384970l280271
$$ 18583729 20761853 22032117 22227319 21392294 19563704 16790172 13405202 10124931
38753A0124931k401668j201295l77496l53257r25557j458514j505676j207295
$$ 10124931 7723263 6521968 6144472 5791215 4865658 3407144 1901468 694173
38745F94173j001796j039335j039837o89378p056O78977R77955O84445l7922p02256
$$ 694173 -307623 -1346958 -2386795 -3076173 -3083229 -2404252 -1426297 -741852 -779774 -1482030
38735a482030q93325o55001l63369k42817k02090j45018j77131l86235o16351
$$ -1482030 -2375355 -3030356 -3393725 -3636542 -3838632 -3983650 -4160781 -4547016 -5163367
38726e163367o11776k73637L12892R67931J448763J556356J334398J029789P45861
$$ -5163367 -5775143 -6048780 -5735888 -4767957 -3319194 -1762838 -428440 601349 1347210
38717A347210K86489n18443j475375k166494k297565j771934o25146Q32079J917966
$$ 1347210 1633699 1115256 -360119 -2526613 -4824178 -6596112 -7221258 -6389179 -4471213
38708d471213J995047J097983l2432o29529n21757r1380J97444J54714r6720k85248
$$ -4471213 -2476166 -1378183 -1410615 -2040144 -2561901 -2653281 -2455837 -2301123 -2397843 -2683091
38698b683091k01464J81678P47792J338929J797502J996992J931919J734508J502889
$$ -2683091 -2884555 -2702877 -1955085 -616156 1181346 3178338 5110257 6844765 8347654
38689H347654J150704N35450l01574j151222j861182k385841k616350k365300
$$ 8347654 9498358 10033808 9732234 8581012 6719830 4333989 1717639 -647661
38681f47661j620681o78985R6207N73168Q25329R11958Q37919O93023O58084Q04044
$$ -647661 -2268342 -2947327 -2851120 -2277952 -1452623 -540665 297254 990277 1648361 2452405
38671B452405R68876R03055N04988j21350p88167j328767j598891j474561r31014
$$ 2452405 3421281 4324336 4829324 4707974 3919807 2591040 992149 -482412 -1413426
38662a413426j33954N80339Q69557O16978P3700k67076p2511M84617Q56446O57062
$$ -1413426 -1547380 -967041 -97484 519494 593194 326118 253607 738224 1594670 2251732
38652B251732j476p52565j397655j913045k146261j796567p77648N84295J808970
$$ 2251732 2250256 1497691 100036 -1813009 -3959270 -5755837 -6533485 -5949190 -4140220
38643d140220K590675K822176K491586J716755P67653j15535q86199j570802k067087
$$ -4140220 -1549545 1272631 3764217 5480972 6248625 6133090 5246891 3676089 1609002
38634A609002k207871j978101j508436q51925P8192J278989K460189L185300L234112
$$ 1609002 -598869 -2576970 -4085406 -4937331 -4859139 -3580150 -1119961 2065339 5299451
38625E299451K790612K223364J665196Q73274m19513k054795l458447m097452
$$ 5299451 8090063 10313427 11978623 12851897 12432384 10377589 6919142 2821690
38617B821690l843469k943738j823526r22121m67167k53731K04665J147402K272131
$$ 2821690 -1021779 -3965517 -5789043 -6711164 -7178331 -7432062 -7227397 -6079995 -3807864
38608c807864L062201L284406L055757K579880K004953J438774Q99047K76307
$$ -3807864 -745663 2538743 5594500 8174380 10179333 11618107 12517154 12793461
38600A2793461n18881j416027k280149l024749l495807l410059k656892j581535
$$ 12793461 12274580 10858553 8578404 5553655 2057848 -1352211 -4009103 -5590638
38592e590638p11954k18691J49539O38549J238220J829245K290548K412490J992404
$$ -5590638 -6302592 -6521283 -6371744 -5733195 -4494975 -2665730 -375182 2037308 4029712
38583D029712J164672M33475J98465L42705M05210Q0097n42812j148666j500627
$$ 4029712 5194384 5627859 5826324 6169029 6574239 6654336 6111524 4962858 3462231
38574C462231j590183j539257j380413j006208m02504J51353K55720k53684j210273
$$ 3462231 1872048 332791 -1047622 -2053830 -2456334 -2304981 -2049261 -2302945 -3513218
38565c513218k285730l106284l324991k861818k072923j418532r18726j95118
$$ -3513218 -5798948 -8905232 -12230223 -15092041 -17164964 -18583496 -19502222 -19697340
38557a9697340Q68772J775509J888994J103078p5210r47211j046748l83554N35794
$$ -19697340 -18828568 -17053059 -15164065 -14060987 -14136197 -15083408 -16130156 -16513710 -15977916
38548a5977916J067538R90715O35995L96249L15605L02919M78259R72734J511491
$$ -15977916 -14910378 -13919663 -13283668 -12887419 -12571814 -12268895 -11790636 -10817902 -9306411
38539i306411J590880J141332P26292R29905J706290K466091K686801K280906
$$ -9306411 -7715531 -6574199 -5847907 -4918002 -3211712 -745621 1941180 4222086
38531D222086J423086K39360j176406k496544l137190k691453j365227J67008
$$ 4222086 5645172 5884532 4708126 2211582 -925608 -3617061 -4982288 -4815280
38523d815280J379031K269462L113652L977849M550127M373057L218036J342898
$$ -4815280 -3436249 -1166787 1946865 5924714 10474841 14847898 18065934 19408832
38515A9408832n85873j959069k676567l035796l184304k916859k111455j109999
$$ 19408832 18822959 16863890 14187323 11151527 7967223 5050364 2938909 1828910
38507A828910m32786k49991l41847m54048m52888k26545K68791Q42243J183600
$$ 1828910 1396124 1146133 804286 350238 -102650 -329195 -60404 781839 1965439
38498A965439J212894J153423J203839J273668J104069N69888j52861o60219o29361
$$ 1965439 3178333 4331756 5535595 6809263 7913332 8483220 8330359 7670140 7040779
38489G040779j94405M6566l93326j294207j900664j729189j021766l42871N3010
$$ 7040779 6846374 6892940 6499614 5205407 3304743 1575554 553788 210917 263927
38480B63927L00961N41852O93218N99519K68361q7979k11527j3623L35605N56183
$$ 263927 564888 1106740 1799958 2399477 2667838 2579859 2368332 2354709 2690314 3246497
38470C246497N16060L06661P1013j44867l29277m13567l74000l84017p12269j392062
$$ 3246497 3762557 4069218 4140231 3995364 3666087 3252520 2878520 2494503 1782234 390172
38460C90172k042946k109365j333709q827J257879K056471K448130K727601K977115
$$ 390172 -1652774 -3762139 -5095848 -5104675 -3846796 -1790325 657805 3385406 6362521
38451F362521K949789K403464J460560N73065J49660K29537M72124M36011o8326
$$ 6362521 9312310 11715774 13176334 13749399 13899059 14128596 14600720 15036731 14968405
38442A4968405q08152j293610j181467n91461m6993o1369p05771j546759k050870
$$ 14968405 14160253 12866643 11685176 11093715 11046722 10985353 10279582 8732823 6681953
38433F681953k100979k082479k397770k932784l120417k557288j443591l39087
$$ 6681953 4580974 2498495 100725 -2832059 -5952476 -8509764 -9953355 -10292442
38425a0292442M10105Q59253J140358J184587Q98513M77497L04588M85167O49364
$$ -10292442 -9882337 -9023084 -7882726 -6698139 -5799626 -5322129 -5017541 -4532374 -3883010
38416c883010L57936l57613r91234j078121n88911J80860R28589J445767J549428
$$ -3883010 -3525074 -3882687 -4873921 -5952042 -6540953 -6360093 -5431504 -3985737 -2436309
38407b436309J140277L74555l49110o70175n24925j17737L10015O32458P91105
$$ -2436309 -1296032 -921477 -1270587 -1940762 -2465687 -2583424 -2273409 -1640951 -849846
38398h49846O91016K39222m91449j206384j581062j515875j167794p69821m93935
$$ -849846 -158830 80392 -411057 -1617441 -3198503 -4714378 -5882172 -6651993 -7145928
38389g145928m32104n33325n16506l0040R57127K019938K666731K790751K607094
$$ -7145928 -7578032 -8111357 -8627863 -8657903 -7700776 -5680838 -3014107 -223356 2383738
38380B383738K240561J590651O06529m91082j316385j534295r85482K01996J540071
$$ 2383738 4624299 6214950 6821479 6330397 5014012 3479717 2494235 2696231 4236302
38371D236302K384454K380832J710620Q81473L45417K95135O28295R86956R69537
$$ 4236302 6620756 9001588 10712208 11593681 11939098 12234233 12862528 13849484 14819021
38362A4819021M71713k24570p87683j172379j525943j899900k233410k509594
$$ 14819021 15290734 15066164 14278481 13106102 11580159 9680259 7446849 4937255
38354D937255k682717k504276j721517n08041N72695J158604J421110J668139
$$ 4937255 2254538 -249738 -1971255 -2479296 -1906601 -747997 673113 2341252
38346B341252J858838J743402J285238O37012j69266j123247j847461j747985
$$ 2341252 4200090 5943492 7228730 7865742 7696476 6573229 4725768 2977783
38338B977783p42841M72885J139784J199288J105996J098535J022739P87146N71322
$$ 2977783 2234942 2707827 3847611 5046899 6152895 7251430 8274169 9061315 9632637
38329I632637M76832L00689j33508o23242q11973o91791o63184j053103j684275
$$ 9632637 10109469 10410158 10276650 9653408 8841435 8149644 7486460 6433357 4749082
38320D749082j984009j511805l92222P52577J316344J187974P57512N11501O47646
$$ 4749082 2765073 1253268 861046 1613623 2929967 4117941 4875453 5386954 6034600
38311F034600R79623J086866O11449m10898j488176k090887k175910k162227k369668
$$ 6034600 7014223 8101089 8712538 8301640 6813464 4722577 2546667 384440 -1985228
38302a985228k660667k684210k261327j430839l44409P11383J397387J664401
$$ -1985228 -4645895 -7330105 -9591432 -11022271 -11366680 -10655297 -9257910 -7593509
38294g593509J868965K306370K757187K773333K314180J779738J454071J253640
$$ -7593509 -5724544 -3418174 -660987 2112346 4426526 6206264 7660335 8913975
38286H913975J040692Q25005N53389L8816p20434j422381j850107k124660k364101
$$ 8913975 9954667 10779672 11333061 11371877 10651443 9229062 7378955 5254295 2890194
38277B890194k372658j984377j490880j313944j357793j146175o39141m40768
$$ 2890194 517536 -1466841 -2957721 -4271665 -5629458 -6775633 -7414774 -7855542
38269g855542r59710j712978j822604j049118N231O66013Q20622P23477M95834
$$ -7855542 -8815252 -10528230 -12350834 -13399952 -13394721 -12728708 -11908086 -11184609 -10688775
38260a0688775P6569m51889p55763n27401K41895J282770K228023K758594K740646
$$ -10688775 -10612206 -11064095 -11819858 -12347259 -12105364 -10822594 -8594571 -5835977 -3095331
38251c095331K350601J979561J863619J823448J480225P07082k50464j064852
$$ -3095331 -744730 1234831 3098450 4921898 6402123 7109205 6858741 5793889
38243E793889j554729j609578j128113k00712P77940J373559J466666J243991
$$ 5793889 4239160 2629582 1501469 1300757 2078697 3452256 4918922 6162913
38235F162913R25577O51489N51499O86301Q86349Q41888M25519k14741r23782
$$ 6162913 7088490 7739979 8291478 8977779 9864128 10706016 11131535 10916794 9993012
38226I993012j711913k553576l193911l347476l012951k431209j782283j063514
$$ 9993012 8281099 5727523 2533612 -813864 -3826815 -6258024 -8040307 -9103821
38218i103821k14486P82524J865218K774996L038290K339094R91815j72496n33328
$$ -9103821 -9318307 -8535783 -6670565 -3895569 -857279 1481815 2473630 2301134 1767806
38209A767806j78392L85153Q07076J017643R72952N88177p0653p53075j249123
$$ 1767806 1589414 1974567 2781643 3799286 4772238 5360415 5289762 4536687 3287564
38200C287564j521586j592801j439569j049629m72834K25205R54083J498014J542854
$$ 3287564 1765978 173177 -1266392 -2316021 -2788855 -2563650 -1609567 -111553 1431301
38191A431301R14393k21281j418508k194319k270324j723793r53709l98024k10896
$$ 1431301 2345694 2124413 705905 -1488414 -3758738 -5482531 -6436240 -6834264 -7045160
38182g045160k49103l51043n00633o96662q29100p90626o00641l22267K9159L75707
$$ -7045160 -7294263 -7645306 -8145939 -8842601 -9671701 -10462327 -11062968 -11385235 -11356076 -10980369
38172a0980369M93949K32983k09002l88013l1589P16730J450847J819752J724556
$$ -10980369 -10486420 -10253437 -10462439 -10850452 -10882041 -10165311 -8714464 -6894712 -5170156
38163e170156J308376P75677K00035m37337r97260j128045o25401K36971R26254
$$ -5170156 -3861780 -3086103 -2886068 -3323405 -4320665 -5448710 -6074111 -5837140 -4910886
38154d910886J158780J001405N34085k60362j163854j594219j113461K0865J059134
$$ -4910886 -3752106 -2750701 -2216616 -2476978 -3640832 -5235051 -6348512 -6327647 -5268513
38145e268513J512384J514049J427143J329136J038879N12754k5400l79771o25218
$$ -5268513 -3756129 -2242080 -814937 514199 1553078 2065832 2040432 1660661 1035443
38136A035443r32382j255058j359967j147358p76573m42254j89029k2511l4399
$$ 1035443 103061 -1151997 -2511964 -3659322 -4435895 -4878149 -5067178 -5089689 -5124088
38127e124088k64005n41206o29454m59475q7275M68204J134037J606812J547122
$$ -5124088 -5388093 -5929299 -6558753 -7018228 -7105503 -6637299 -5503262 -3896450 -2349328
38118b349328R85669L06878k12194o01755q76330q26950l61712J57499K15687
$$ -2349328 -1363659 -1056781 -1268975 -1870730 -2747060 -3574010 -3935722 -3778223 -3562536
38109c562536k65738q47556j063077q47815n28676n32094j048299j808449k202240
$$ -3562536 -3828274 -4675830 -5738907 -6586722 -7115398 -7647492 -8695791 -10504240 -12706480
38100a2706480j775515o49309O19094J535223J933515J881111J567845J274760
$$ -12706480 -14481995 -15131304 -14512210 -12976987 -11043472 -9162361 -7594516 -6319756
38092f319756J182850J122785P22281p4147p95663q97780l13865N65552J346678
$$ -6319756 -5136906 -4014121 -3291840 -3365987 -4161650 -5059430 -5373295 -4807743 -3461065
38083c461065J911914K327241K648091K821470K685413K093405J125517J21156
$$ -3461065 -1549151 778090 3426181 6247651 8933064 11026469 12151986 12273142
38075A2273142o11263j070385j424380j656979j547242j038275m55770k44883
$$ 12273142 11661879 10591494 9167114 7510135 5962893 4924618 4468848 4223965
38067D223965n40024j040385j273209r92054l97326M2273P4237n6205Q0496N59392
$$ 4223965 3683941 2643556 1370347 378293 -19033 23240 97477 41272 121768 681160
38057F81160J060652J316374J300474R38427L5807j239836k135101k005175j124772
$$ 681160 1741812 3058186 4358660 5297087 5332894 4093058 1957957 -47218 -1171990
38048a171990m20529m25344q40175j092655r07410k64920P32179J706894K094429
$$ -1171990 -1592519 -2017863 -2858038 -3950693 -4858103 -5123023 -4390844 -2683950 -589521
38039e89521J729647J138278R29852J058345R95088N09127q3533m34813n96489
$$ -589521 1140126 2278404 3208256 4266601 5261689 5770816 5687283 5252470 4655981
38030D655981q36613j234461j575671j563776j108774m80659j41129l07466p11731
$$ 4655981 3819368 2584907 1009236 -554540 -1663314 -2143973 -2285102 -2592568 -3304299
38021c304299q94407o70542j82713L88684R38443J318161J381874J198306R98829
$$ -3304299 -4198706 -4869248 -5051961 -4663277 -3724834 -2406673 -1024799 173507 1172336
38012A172336Q46034N40762o6788q34398j458372j692149j399482o11143L44273
$$ 1172336 2018370 2559132 2492344 1657946 199574 -1492575 -2892057 -3503200 -3158927
38003c158927R45731R03984M22717n9255k97664l22579k05836P8176N52735J092861
$$ -3158927 -2213196 -1309212 -886495 -945750 -1243414 -1565993 -1771829 -1693653 -1140918 -48057
37993d8057J423770J293469O94544j07008q31910j431439j962248k293644k164876
$$ -48057 1375713 2669182 3363726 3256718 2424808 993369 -968879 -3262523 -5427399
37984e427399j558730p93499j62305L15102O88617Q68007Q05728P03118P88907
$$ -5427399 -6986129 -7779628 -7941933 -7626831 -6938214 -6070207 -5264479 -4561361 -3772454
37975c772454R77504R60343N96495M3570m53559p35317p25977m51778r8651P6067
$$ -3772454 -2794950 -1834607 -1238112 -1194542 -1648101 -2383418 -3109395 -3561173 -3659824 -3583757
37965c583757m7294l60631o37761p13447o06669m92739m78944m08423m3883N15983
$$ -3583757 -3631051 -3991682 -4629443 -5342890 -5949559 -6442298 -6921242 -7329665 -7373548 -6857565
$$ [...]
##END NTUPLES=NMR SPECTRUM
##END=
