##TITLE=31Pdec_DE-14HK2HCl
  D2O
  24 sc
 23.10.2023
##JCAMPDX= 6.0         $$ Bruker NMR JCAMP-DX V2.0
##DATA TYPE= NMR SPECTRUM
##DATA CLASS= NTUPLES
##ORIGIN= UXNMR, Bruker Analytische Messtechnik GmbH
##OWNER= root
$$ XWIN-NMR		Version 3.5
$$ Mon Oct 23 16:40:06 2023 Russian Standard Time (UT+4h)  she@DPX200
##.OBSERVE FREQUENCY= 81.013821
##.OBSERVE NUCLEUS= ^31P
##.ACQUISITION MODE= SIMULTANEOUS
##.ACQUISITION SCHEME= undefined
##.AVERAGES= 24
##.DIGITISER RES= 16
##SPECTROMETER/DATA SYSTEM= spect
##.PULSE SEQUENCE= zgpg30
##.SOLVENT NAME= D2O
##.SHIFT REFERENCE= (INTERNAL, D2O, 0, 248.564)
##AUDIT TRAIL= $$ (NUMBER, WHEN, WHO, WHERE, WHAT)
$$ ##TITLE= Audit trail, XWIN-NMR		Version 3.5
$$ ##JCAMPDX= 5.01
$$ ##ORIGIN= Bruker BioSpin GmbH
$$ ##OWNER= she
$$ F:/spectra/data/she/nmr/P31/1/pdata/1/auditp.txt
$$ ##AUDIT TRAIL=  $$ (NUMBER, WHEN, WHO, WHERE, WHAT)
(   1,<2023-10-23 16:39:13.98 +0400>,<she>,<DPX200>,
      <created by zg, POWCHK disabled, PULCHK disabled
       configuration hash MD5:
       00 E9 B6 7A A2 85 ED C7 34 08 36 98 17 FE 4E 26
       data hash MD5: 32K
       8C 56 65 DB 03 26 E7 45 11 02 0D A9 08 14 9F 1C>)
(   2,<2023-10-23 16:39:15.96 +0400>,<she>,<DPX200>,
      <Start of raw data processing
       efp BC_mod = 2 LB = 5 FT_mod = 6 PKNL = 1 PHC0 = -10651.45 PHC1 = 76.0864 SI = 64K 
       data hash MD5: 64K
       4C BB 49 AC 3F 8A EE 3E D8 A6 FC 73 57 A2 E4 9D>)
(   3,<2023-10-23 16:39:31.60 +0400>,<she>,<DPX200>,
      <pk PHC0 = -28.57035 PHC1 = 0 
       data hash MD5: 64K
       5E 03 81 73 B8 0E F6 7D A4 FF 02 C8 71 85 80 2E>)
$$ ##END=
$$ 
$$ hash MD5
$$ CB 0F CA 04 69 E6 D0 7D 81 9B E7 D8 D9 D3 DF FF
##$RELAX= 
##$RELAX= 
##$RELAX= 
##$RELAX= 
##$RELAX= 
##$RELAX= 
##$RELAX= 
##$RELAX= 
##$RELAX= 
$$ Bruker specific parameters
$$ --------------------------
##$DU= <F:/spectra>
##$EXPNO= 1
##$NAME= <P31>
##$PROCNO= 1
##$TYPE= <nmr>
##$USER= <she>
##$AMP= (0..31)
100 100 100 100 100 100 100 100 100 100 100 100 100 100 100 100 100 100 
100 100 100 100 100 100 100 100 100 100 100 100 100 100 
##$AQSEQ= 0
##$AQ_mod= 1
##$AUNM= <au_zg>
##$AUTOPOS= <>
##$BF1= 81.014009
##$BF2= 200.13
##$BF3= 200.13
##$BF4= 200.13
##$BF5= 200.13
##$BF6= 200.13
##$BF7= 200.13
##$BF8= 200.13
##$BYTORDA= 1
##$CFDGTYP= 0
##$CFRGTYP= 5
##$CHEMSTR= <none>
##$CNST= (0..31)
1 1 145 1 1 1 1 1 1 1 1 1 1 1 1 1 1 1 1 1 1 1 1 1 1 1 1 1 1 1 1 1 
##$CPDPRG= <waltz16>
##$CPDPRG1= <>
##$CPDPRG2= <waltz16>
##$CPDPRG3= <>
##$CPDPRG4= <mlev>
##$CPDPRG5= <mlev>
##$CPDPRG6= <mlev>
##$CPDPRG7= <mlev>
##$CPDPRG8= <mlev>
##$CPDPRGB= <>
##$CPDPRGT= <>
##$D= (0..31)
0 1 0 0 0 0 0 0 0 0 0 0.03 2e-05 3e-06 0 0 0 0 0 0 0 0 0 0 0 0 0 0 0 0 
0 0 
##$DATE= 1698064753
##$DBL= (0..7)
120 120 120 11 120 120 24 19 
##$DBP= (0..7)
150 150 150 150 150 150 150 150 
##$DBP07= 0
##$DBPNAM0= <>
##$DBPNAM1= <>
##$DBPNAM2= <>
##$DBPNAM3= <>
##$DBPNAM4= <>
##$DBPNAM5= <>
##$DBPNAM6= <>
##$DBPNAM7= <>
##$DBPOAL= (0..7)
0.5 0.5 0.5 0.5 0.5 0.5 0.5 0.5 
##$DBPOFFS= (0..7)
$$ [...]
##$SUBNAM2= <"">
##$SUBNAM3= <"">
##$SUBNAM4= <"">
##$SUBNAM5= <"">
##$SUBNAM6= <"">
##$SUBNAM7= <"">
##$SUBNAM8= <"">
##$SUBNAM9= <"">
##$SW= 501.771253377433
##$SWIBOX= (0..15)
0 1 3 0 0 0 0 0 0 0 0 0 0 0 0 0 
##$SW_h= 40650.406504065
##$TD= 32768
##$TD0= 1
##$TE= 0
##$TE2= 300
##$TE3= 300
##$TEG= 300
##$TL= (0..7)
0 120 53 12 22 120 120 120 
##$TP= (0..7)
150 150 150 150 150 150 150 150 
##$TP07= 0
##$TPNAME0= <>
##$TPNAME1= <>
##$TPNAME2= <>
##$TPNAME3= <>
##$TPNAME4= <>
##$TPNAME5= <>
##$TPNAME6= <>
##$TPNAME7= <>
##$TPOAL= (0..7)
0.5 0.5 0.5 0.5 0.5 0.5 0.5 0.5 
##$TPOFFS= (0..7)
0 0 0 0 0 0 0 0 
##$TUNHIN= 0
##$TUNHOUT= 0
##$TUNXOUT= 0
##$USERA1= <user>
##$USERA2= <user>
##$USERA3= <user>
##$USERA4= <user>
##$USERA5= <user>
##$V9= 5
##$VALIST= <valist>
##$VCLIST= <CCCCCCCCCCCCCCC>
##$VD= 0
##$VDLIST= <DDDDDDDDDDDDDDD>
##$VPLIST= <PPPPPPPPPPPPPPP>
##$VTLIST= <TTTTTTTTTTTTTTT>
##$WBST= 1024
##$WBSW= 4
##$XGAIN= (0..3)
0 0 0 0 
##$XL= 0
##$YL= 0
##$YMAX_a= 1664
##$YMIN_a= -1456
##$ZGOPTNS= <>
##$ZL1= 120
##$ZL2= 120
##$ZL3= 120
##$ZL4= 120
##$ABSF1= 0
##$ABSF2= 0
##$ABSG= 0
##$ABSL= 0
##$ALPHA= 0
##$AQORDER= 0
##$ASSFAC= 0
##$ASSFACI= 0
##$ASSFACX= 0
##$ASSWID= 0
##$AUNMP= <proc_1d>
##$AZFE= 0.1
##$AZFW= 0.5
##$BCFW= 0
##$BC_mod= 2
##$BYTORDP= 0
##$COROFFS= 0
##$CY= -3
##$DATMOD= 1
##$DC= 0
##$DFILT= <>
##$DTYPP= 0
##$F1P= 0
##$F2P= 0
##$FCOR= 1
##$FTSIZE= 65536
##$FT_mod= 6
##$GAMMA= 0
##$GB= 0
##$INTBC= 1
##$INTSCL= 6.047779e-11
##$ISEN= 30
##$LB= 5
##$LEV0= 0
##$LPBIN= 0
##$MAXI= 10000
##$MC2= 0
##$MEAN= 0
##$ME_mod= 0
##$MI= 50
##$NCOEF= 0
##$NC_proc= -8
##$NLEV= 6
##$NOISF1= 182.463
##$NOISF2= 159.3651
##$NSP= 0
##$NTH_PI= 0
##$NZP= 0
##$OFFSET= 248.5645
##$PC= 4
##$PHC0= -10680.02
##$PHC1= 76.0864
##$PH_mod= 1
##$PKNL= yes
##$PPARMOD= 0
##$PSCAL= 0
##$PSIGN= 0
##$REVERSE= no
##$SF= 81.0140089999694
##$SI= 65536
##$SIGF1= 159.3651
##$SIGF2= -187.1042
##$SINO= 113.3802
##$SIOLD= 16384
##$SREGLST= <1H.CDCl3>
##$SSB= 0
##$STSI= 65536
##$STSR= 0
##$SW_p= 40650.406504065
##$SYMM= 0
##$S_DEV= 0
##$TDeff= 32768
##$TDoff= 0
##$TI= <>
##$TILT= no
##$TM1= 0
##$TM2= 0
##$TOPLEV= 0
##$USERP1= <user>
##$USERP2= <user>
##$USERP3= <user>
##$USERP4= <user>
##$USERP5= <user>
##$WDW= 1
##$XDIM= 65536
##$YMAX_p= 334067548
##$YMIN_p= -7895211
$$ End of Bruker specific parameters
$$ ---------------------------------
##NTUPLES= NMR SPECTRUM
##VAR_NAME=  FREQUENCY,     SPECTRUM/REAL,   SPECTRUM/IMAG
##SYMBOL=    X,             R,               I
##VAR_TYPE=  INDEPENDENT,   DEPENDENT,       DEPENDENT
##VAR_FORM=  AFFN,          ASDF,            ASDF
##VAR_DIM=   65536,         65536,           65536
##UNITS=     HZ,            ARBITRARY UNITS, ARBITRARY UNITS
##FACTOR=    0.620285442955139, 1,           1
##FIRST=     20137.2065510682, 0,            0
##LAST=      -20513.1999529968, 0,           0
##MIN=       -20513.1999529968, -7895211,    0
##MAX=       20137.2065510682, 334067548,    0
$$ Real data points
##PAGE= N=1
##DATA TABLE= (X++(R..R)), XYDATA
$$ [...]
$$ plain form
41730 -3168542 -3028118 -2966010 -2904354 -2774624 -2567803 -2339434 -2109778 -1766550 -1131119 -134522
41720 -134522 1104980 2359523 3396610 4043410 4246258 4086432 3674599 3028511 2132833
41711 2132833 1125486 317800 -35472 64255 424386 861113 1287481 1669623 1979944
41702 1979944 2183518 2227660 2067170 1741632 1404012 1222421 1251979 1417867 1594678 1673650
41692 1673650 1591579 1355979 1045246 751605 523852 380788 354864 482322 757304 1131013
41682 1131013 1560505 2039340 2580866 3180140 3777936 4250024 4457429 4340970 3967068
41673 3967068 3470549 2961609 2486318 2040030 1596156 1151385 767688 536469 465670 431293
41663 431293 286057 4842 -304252 -503042 -500253 -273895 96573 420129 497089 274468
$$ packed form
41730c168542J40424O2108O1656J29730K06821K28369K29656L43228O35431R96597
41720a34522J239502J254543J037087O46800K02848j59826m11833o46088q95678
41711B132833j007347q07686l53272R9727L60131M36727M26368L82142L10321
41702A979944K03574M4142j60490l25538l37620j81591K9558J65888J76811P8972
41692A673650q2071k35600l10733k93641k27753j43064k5924J27458K74982L73709
41682A131013M29492M78835N41526N99274N97796M72088K07405j16459l73902
41673C967068m96519n08940m75291m46288m43874m44771l83697k31219p0799l4377
41663D31293j45236k81215l09094j98790K789K26358L70468L23556P6960k22621
$$ plain form
41653 274468 -126072 -538640 -872294 -1107843 -1255264 -1362881 -1523578 -1806777 -2177684 -2503347
41643 -2503347 -2632224 -2468307 -2015712 -1397885 -808609 -376320 -52183 336016 896980
41634 896980 1559800 2154217 2576605 2847551 3029590 3141865 3164623 3075830 2845322 2426607
41624 2426607 1811818 1093603 424001 -103709 -503471 -827244 -1096411 -1319917 -1523204
41615 -1523204 -1703770 -1783062 -1662113 -1331654 -892578 -464069 -101131 195332 423995 563973
41605 563973 601355 558760 489428 432162 370953 258428 94716 -32476 -13304 170611 398174
41594 398174 469091 227053 -330448 -1034755 -1657969 -2068700 -2272921 -2313765 -2194211 -1931928
41584 -1931928 -1621550 -1358162 -1124281 -836478 -496344 -205585 -18309 124918 266525
$$ packed form
41653B74468m00540m12568l33654k35549j47421j07617j60697k83199l70907l25663
41643b503347j28877J63917M52595O17827N89276M32289L24137L88199N60964
41634H96980O62820N94417M22388K70946J82039J12275K2758q8793k30508m18715
41624B426607o14789p18215o69602n27710l99762l23773k69167k23506k03287
41615a523204j80566p9292J20949L30459M39076M28509L62938K96463K28663J39978
41605E63973L7382m2595o9332n7266o1209j12525j63712j27192J9172J83915K27563
41594C98174P0917k42038n57501p04307o23214m10731k04221m0844J19554K62283
41584a931928L10378K63388K33881K87803L40134K90759J87276J43227J41607
$$ plain form
41575 266525 319212 174541 -105914 -297039 -226606 63209 391539 642858 865514 1177786
41565 1177786 1609499 2058636 2393153 2559727 2579716 2482293 2294994 2087154 1959518 1966394
41555 1966394 2077930 2226956 2355856 2412215 2357510 2218087 2083951 2004505 1908580 1685283
41545 1685283 1347379 1071372 1057358 1365640 1892184 2473184 2987181 3366808 3560838 3543434
41535 3543434 3377867 3222887 3215715 3351081 3519332 3653482 3768532 3838597 3717172 3250491
41525 3250491 2443999 1471381 549109 -154632 -537589 -588042 -407336 -147338 99358 323371
41515 323371 531038 713330 878137 1028537 1065199 773971 -9910 -1217050 -2541160
41506 -2541160 -3606413 -4142269 -4075263 -3543133 -2821336 -2164379 -1674085 -1320793 -1064706
$$ packed form
41575B66525N2687j44671k80455j91125P0433K89815L28330K51319K22656L12272
41565A177786M31713M49137L34517J66574J9989r7423j87299k07840j27636O876
41555A966394J11536J49026J28900N6359n4705j39423j34136p9446r5925k23297
41545A685283l37904k76007j4014L08282N26544N81000N13997L79627J94030j7404
41535C543434j65567j54980p172J35366J68251J34150J15050P0065j21425m66681
41525C250491q06492r72618r22272p03741l82957n0453J80706K59998K46696K24013
41515C23371K07667J82292J64807J50400L6662k91228p83881j207140j324110
41506b541160j065253n35856O7006N32130P21797O56957M90294L53292K56087
$$ plain form
41497 -1064706 -899056 -778185 -593257 -288959 29611 177750 80897 -164866 -420417 -629622
41487 -629622 -794458 -887580 -859181 -720706 -560783 -448933 -341713 -106244 354292 987737
41477 987737 1599923 1994526 2131690 2146357 2197922 2313779 2392179 2325063 2072985 1640566
41467 1640566 1052909 384715 -236991 -705846 -1000508 -1156525 -1192976 -1086116 -795871 -299254
41457 -299254 379354 1144648 1856511 2415420 2822740 3140347 3400260 3570673 3592714 3417640
41447 3417640 3010925 2355053 1473517 458668 -523218 -1273721 -1658834 -1701853 -1565918
41438 -1565918 -1411299 -1271421 -1086854 -840666 -617213 -525671 -606772 -836225 -1194108 -1694709
41428 -1694709 -2334454 -3017715 -3558578 -3794094 -3720197 -3506803 -3363754 -3397884 -3597549 -3910148
$$ packed form
41497a064706J65650J20871J84928L04298L18570J48139r6853k45763k55551k09205
41487f29622j64836r3122K8399J38475J59923J11850J07220K35469M60536O33445
41477I87737O12186L94603J37164J4667N1565J15857P8400o7116k52078m32419
41467A640566n87657o68194o21706m68855k94662j56017l6451J06860K90245M96617
41457b99254O78608P65294P11863N58909M07320L17607K59913J70413K2041j75074
41447C417640m06715o55872q81536j014849r81886p50503l85113m3019J35935
41438a565918J54619J39878J84567K46188K23453R1542q1101k29453l57883n00601
41428a694709o39745o83261n40863k35516P3897K13394J43049l4130j99665l12599
$$ plain form
41418 -3910148 -4291802 -4706387 -5133097 -5574372 -6005168 -6306330 -6302809 -5901282 -5165208 -4240025
41408 -4240025 -3243455 -2255409 -1368799 -684180 -249993 -47057 -39333 -206009 -504114 -822013
41398 -822013 -1005665 -950541 -670737 -274089 132625 508889 850210 1114278 1214648 1105511
41388 1105511 854543 608454 486943 516416 648198 810308 940139 1001408 1001011 987632
41378 987632 1011905 1075020 1119086 1072405 905456 652534 400457 265338 353264 699820
41368 699820 1235495 1837970 2439470 3066669 3757805 4465329 5080103 5547575 5916388 6251885
41358 6251885 6527429 6626239 6439859 5949079 5227996 4408062 3646708 3090855 2813517 2755083
41348 2755083 2739758 2588530 2247821 1818542 1463324 1289254 1305032 1450372 1641290 1817069
$$ packed form
41418c910148l81654m14585m26710m41275m30796l01162L521M01527P36074R25183
41408d240025R96570R88046Q86610O84619M34187K02936P724j66676k98105l17899
41398h22013j83652N5124K79804L96648M06714L76264L41321K64068J00370j09137
41388A105511k50968k46089j21511K9473J31782J62110J29831O1269l97j3379
41378I87632K4273O3115M4066m6681j66949k52922k52077j35119Q7926L46556
41368F99820N35675O02475O01500O27199O91136P07524O14774M67472L68813L35497
41358F251885K75544R8810j86380m90780p21083q19934p61354n55853k77338n8434
41348B755083j5325j51228l40709m29279l55218j74070J5778J45340J90918J75779
$$ plain form
41338 1817069 1996376 2293676 2833931 3615156 4461479 5123045 5412782 5252497 4640579
41329 4640579 3636385 2381381 1088147 -36574 -876259 -1423525 -1728927 -1833632 -1741476
41320 -1741476 -1447428 -988743 -459024 37285 440287 739340 943039 1080646 1234823
41311 1234823 1520475 1977945 2492320 2863981 2980711 2904944 2787302 2721104 2694739 2654073
41301 2654073 2572596 2462911 2346173 2218906 2045943 1796340 1495586 1224963 1051481 974112
41291 974112 952480 949818 902872 685375 190516 -525655 -1241241 -1740911 -1954298 -1913547
41281 -1913547 -1650893 -1205728 -693434 -282637 -85760 -103012 -268609 -513683 -783196 -1033547
41271 -1033547 -1243841 -1431774 -1650959 -1947122 -2276437 -2469722 -2344210 -1896155 -1342578
$$ packed form
41338A817069J79307K97300N40255P81225Q46323O61566K89737j60285o11918
41329D640579j004194j255004j293234j124721q39685n47266l05402j04705R2156
41320a741476K94048M58685N29719M96309M03002K99053K03699J37607J54177
41311A234823K85652M57470N14375L71661J16730p5767j17642o6198k6365m0666
41301B654073q1477j09685j16738j27267j72963k49603l00754k70623j73482p7369
41291I74112k1632k662m6946k17497m94859p16171p15586m99670k13387M0751
41281a913547K62654M45165N12294M10797J96877j7252j65597k45074k69513k50351
41271a033547k10294j87933k19185k96163l29315j93285J25512M48055N53577
$$ plain form
41262 -1342578 -925059 -706975 -611021 -601379 -731480 -1021495 -1386496 -1714513 -1949896 -2075507
41252 -2075507 -2077760 -1968906 -1799408 -1612942 -1420596 -1238567 -1106519 -1037567 -986928 -902685
41242 -902685 -779061 -634729 -472855 -293797 -116388 49189 227396 443047 678557 898512
41232 898512 1110938 1381034 1777281 2291969 2794742 3089402 3084976 2928590 2904938 3158793
41222 3158793 3550109 3805623 3759713 3416085 2857773 2194535 1568361 1105926 835124 689740
41212 689740 599746 543670 530810 585269 738265 981274 1233342 1414647 1552135 1748347
41202 1748347 2037110 2337202 2569680 2752087 2933094 3084449 3106535 2905897 2423072 1621876
41192 1621876 519635 -770386 -2069204 -3207703 -4048817 -4466526 -4387077 -3890146 -3219245
$$ packed form
41262a342578M17519K18084R5954R642j30101k90015l65001l28017k35383j25611
41252b075507k253J08854J69498J86466J92346J82029J32048O8952N0639Q4243
41242i02685J23624J44332J61874J79058J77409J65577J78207K15651K35510K19955
41232H98512K12426K70096L96247N14688N02773K94660m426j56386k3652K53855
41222C158793L91316K55514m5910l43628n58312o63238o26174m62435k70802j45384
41212F89740q9994n6076j2860N4459J52996K43009K52068J81305J37488J96212
41202A748347K88763L00092K32478J82407J81007J51355K2086k00638m82825q01196
41192A621876j102241j290021j298818j138499q41114m17709P9449M96931O70901
$$ plain form
41183 -3219245 -2625223 -2192155 -1844118 -1511430 -1241290 -1135385 -1234103 -1501153 -1874358 -2259914
41173 -2259914 -2495848 -2418667 -2013279 -1449060 -925824 -515175 -180092 100480 285557 328289
41163 328289 229678 51620 -87937 -68247 121467 335290 401603 307803 209898 261830 480579
41152 480579 765878 987288 1054112 980337 910450 1019396 1349436 1786074 2211487 2620128
41142 2620128 3046378 3435408 3641164 3525433 3033204 2228631 1316483 583147 224119
41133 224119 205335 321227 383774 336158 218465 82287 -61316 -250963 -534187 -889703
41123 -889703 -1203003 -1359464 -1360183 -1314550 -1326634 -1423445 -1582414 -1778765 -1998841 -2248073 -2555949
41112 -2555949 -2934244 -3312777 -3547120 -3515483 -3206634 -2724829 -2236076 -1892267 -1737949 -1649006
$$ packed form
41183c219245N94022M33068L48037L32688K70140J05905r8718k67050l73205l85556
41173b259914k35934P7181M05388N64219N23236M10649L35083K80572J85077M2732
41163C28289r8611j78058j39557J9690J89714K13823O6313r3800r7905N1932K18749
41152D80579K85299K21410O6824p3775o9887J08946L30040M36638M25413M08641
41142B620128M26250L89030K05756j15731m92229q04573r12148p33336l59028
41133B24119j8784J15892O2547m7616j17693j36178j43603j89647k83224l55516
41123h89703l13300j56461p19M5633j2084r6811j58969j96351k20076k49232l07876
41112b555949l78295l78533k34343L1637L08849M81805M88753L43809J54318Q8943
$$ plain form
41102 -1649006 -1396124 -825994 -2630 831943 1438923 1742391 1847217 1920112 2036483 2118900
41092 2118900 2016940 1646139 1055559 390820 -176170 -503002 -534850 -349288 -117298 19054
41082 19054 33058 -22054 -101617 -196069 -295075 -368619 -383429 -306278 -86672 331709 957428
41071 957428 1709291 2431233 2949827 3136455 2951984 2459314 1790063 1077326 400901 -212141
41061 -212141 -738303 -1117020 -1272339 -1184707 -938342 -692843 -615003 -835339 -1422652 -2328788
41051 -2328788 -3339505 -4142204 -4515324 -4464899 -4156467 -3727806 -3205185 -2592937 -1979586
41042 -1979586 -1506674 -1244823 -1133602 -1046063 -891892 -653750 -349181 8257 395113 740980
41032 740980 936125 893459 597987 94716 -545493 -1223172 -1796739 -2131588 -2198078 -2106918
$$ packed form
41102a649006K52882N70130Q23364Q34573O06980L03468J04826P2895J16371Q2417
41092B118900j01960l70801n90580o64739n66990l26832l1848J85562K31990J36352
41082A9054J4004n5112p9563r4452r9006p3544j4810P7151K19606M18381O25719
41071I57428P51863P21942N18594J86628j84471m92670o69251p12737o76425o13042
41061b12141n26162l78717j55319Q7632K46365K45499P7840k20336n87313r06136
41051b328788j010717q02699l73120N0425L08432M28661N22621O12248O13351
41042a979586M72912K61851J11221Q7539J54171K38142L04569L57438L86856L45867
41032G40980J95145m2666k95472n03271o40209o77679n73567l34849o6490R1160
$$ plain form
41022 -2106918 -2023130 -2042084 -2147125 -2261630 -2316972 -2282927 -2170163 -2021479 -1887531 -1795117
41012 -1795117 -1738746 -1705719 -1700665 -1732003 -1770413 -1731497 -1519644 -1107492 -578311 -82937 258149
41001 258149 426035 497058 577580 731119 937619 1109231 1167121 1132683 1142486 1342050 1738916
40990 1738916 2164307 2402443 2374047 2193059 2040646 1993656 1989171 1942077 1851652 1764710 1664589
40979 1664589 1450405 1033100 414534 -337020 -1144581 -1926283 -2579731 -3019125 -3237513
40970 -3237513 -3311668 -3340771 -3376400 -3379187 -3221422 -2773664 -2050145 -1263801 -682073 -410999
40960 -410999 -347425 -331820 -293129 -242320 -202265 -195534 -260162 -425979 -692174 -1053745 -1509208
40949 -1509208 -1994018 -2343528 -2400591 -2172301 -1837264 -1594471 -1540861 -1681028 -1980601 -2375542
$$ packed form
41022b106918Q3788j8954j05041j14505n5342L4045J12764J48684J33948R2414
41012a795117N6371L3027N054l1338l8410L8916K11853M12152N29181M95374L41086
41001B58149J67886P1023Q0522J53539K06500J71612N7890l4438R803J99564L96866
40990A738916M25391K38136k8396j80988j52413m6990m485m7094r0425q6942j00121
40979A664589k14184m17305o18566p51554q07561p81702o53448m39394k18388
40970c237513p4155k9103l5629k787J57765M47758P23519P86344N81728K71074
40960d10999O3574J5605L8691N0809M0055O731o4628j65817k66195l61571m55463
40949a509208m84810l49510n7063K28290L35037K42793N3610j40167k99573l94941
$$ plain form
40939 -2375542 -2779053 -3133096 -3449011 -3778286 -4151033 -4543292 -4875624 -5039074 -4971488 -4742109
40929 -4742109 -4522163 -4419104 -4351700 -4129396 -3641726 -2926422 -2073955 -1149911 -241239 496148
40919 496148 919152 1025675 959363 890206 922801 1103668 1446879 1911786 2384912 2726689
40909 2726689 2844777 2728168 2447269 2146661 1998867 2096675 2371645 2653297 2832768 2959236
40899 2959236 3175699 3583937 4172945 4836307 5426217 5812701 5935053 5811396 5491969
40890 5491969 5007522 4370672 3614904 2815060 2073261 1490399 1129442 976857 941444 914940
40880 914940 844027 741911 643210 565363 505590 453910 411226 408835 494867 669042 835884
40869 835884 865468 721574 510333 391680 461715 720021 1100276 1488833 1739665 1738295
$$ packed form
40939b375542m03511l54043l15915l29275l72747l92259l32332j63450O7586K29379
40929d742109K19946J03059O7404K22304M87670P15304Q52467R24044R08672P37387
40919D96148M23004J06523o6312o9157L2595J80867L43211M64907M73126L41777
40909B726689J18088j16609k80899l00608j47794R7808K74970K81652J79471J26468
40899B959236K16463M08238N89008O63362N89910L86484J22352j23657l19427
40890E491969m84447o36850p55768p99844p41799n82862l60957j52585l5413k6504
40880I14940p0913j02116r8701p7847n9773n1680m2684k391Q6032J74175J66842
40869H35884K9584j43894k11241j18653P0035K58306L80255L88557K50832j370
$$ plain form
40859 1738295 1484986 1102805 749887 525483 452178 517405 706350 999394 1358720 1728057
40849 1728057 2045146 2260460 2357381 2355143 2273581 2083422 1713540 1144063 494999 -17796
40839 -17796 -249098 -240153 -151070 -92248 -50509 29277 139648 217078 230710 227633 282764 421681
40827 421681 602295 760441 857729 887698 858461 789369 717974 686134 710292 778863 884519
40816 884519 1041530 1258621 1508472 1739177 1907742 1995061 2008355 1988529 1995118 2048908 2092208
40805 2092208 2039069 1875096 1685112 1569389 1547490 1558369 1546085 1526782 1561531 1669710
40795 1669710 1791646 1854598 1856654 1843974 1806427 1654667 1334601 919637 540861 258725
40785 258725 60575 -42735 1743 200965 470010 693661 793403 732109 512501 192874
$$ packed form
40859A738295k53309l82181l52918k24404p3305O5227J88945K93044L59326L69337
40849A728057L17089K15314R6921k238q1562j90159l69882n69477o49064n12795
40839a7796k31302Q945Q9083N8822M1739P9786J10371P7430J3632l077N5131J38917
40827D21681J80614J58146R7288K9969k9237o9092p1395l1840K4158O8571J05656
40816H84519J57011K17091K49851K30705J68565Q7319J3294j9826O589N3790M3300
40805B092208n3139j63973j89984j15723k1899J0879j2284j9303L4749J08179
40795A669710J21936O2952K056j2680l7547j51760l20066m14964l78776k82136
40785B58725j98150j03310M4478J99222K69045K23651R9742o1294k19608l19627
$$ plain form
40775 192874 -146107 -478148 -838634 -1242475 -1645151 -2005348 -2326207 -2596788 -2750640 -2739990
40765 -2739990 -2611708 -2448182 -2255624 -1966368 -1537486 -1002966 -453523 -20383 149149
40756 149149 -8084 -367088 -668444 -718192 -521043 -215092 80345 325900 507440 571219
40746 571219 431171 38374 -555079 -1201094 -1729907 -2025234 -2040896 -1777397 -1269156 -584294
40736 -584294 191301 978045 1708747 2327065 2798337 3110915 3248194 3177142 2903974 2547753
40726 2547753 2321211 2393098 2741803 3141235 3316573 3151884 2756648 2318378 1909614 1483504
40716 1483504 1041989 714919 624406 738833 930331 1125978 1315778 1443248 1397847 1137047
40706 1137047 740257 316453 -81685 -430153 -682527 -787820 -733568 -565335 -406556 -450834
$$ packed form
40775A92874l38981l32041l60486m03841m02676l60197l20859k70581j53852J0650
40765b739990J28282J63526J92558K89256M28882N34520N49443M33140J69532
40756A49149j57233l59004l01356m9748J97149L05951K95437K45555J81540O3779
40746E71219j40048l92797n93453o46015n28813k95327j5662K63499N08241O84862
40736e84294P75595P86744P30702O18318M71272L12578J37279p1052k73168l56221
40726B547753k26542P1887L48705L99432J75338j64689l95236m38270m08764m26110
40716A483504m41515l27070r0513J14427J91498J95647J89800J27470m5401k60800
40706A137047l96790m23804l98138l48468k52374j05293N4252J68233J58779m4278
$$ plain form
40696 -450834 -841844 -1504828 -2149036 -2494770 -2475587 -2195864 -1756224 -1192224 -548303 75900
40686 75900 566571 840350 856806 644720 328060 76110 -6327 68774 227715 413737
40676 413737 602430 767047 854090 795024 541742 98149 -481077 -1124008 -1765903 -2340477
40666 -2340477 -2776429 -3035719 -3150626 -3195563 -3221594 -3243209 -3288290 -3422139 -3694931 -4081256
40656 -4081256 -4498782 -4886631 -5247638 -5609772 -5959742 -6223249 -6305023 -6146499 -5762109 -5241392
40646 -5241392 -4709679 -4250508 -3841761 -3384768 -2825447 -2243275 -1796074 -1576878 -1544742 -1585758
40636 -1585758 -1602686 -1542892 -1395861 -1207401 -1068812 -1039776 -1078256 -1079375 -993567 -890915 -908871
40625 -908871 -1148054 -1600706 -2138222 -2558299 -2687134 -2485748 -2071811 -1626723 -1266690 -985711
$$ packed form
40696d50834l91010o62984o44208l45734J9183K79723M39640N64000O43921O24203
40686G5900M90671K73779J6456k12086l16660k51950q2437P5101J58941J86022
40676D13737J88693J64617Q7043n9066k53282m43593n79226o42931o41895n74574
40666b340477m35952k59290j14907m4937k6031k1615m5081j33849k72792l86325
40656d081256m17526l87849l61007l62134l49970k63507q1774J58524L84390N20717
40646e241392N31713M59171M08747M56993N59321N82172M47201K19196L2136m1016
40636a585758j6928N9794J47031J88460J38589K9036l8480j119Q5808J02652j7956
40625i08871k39183m52652n37516m20077j28835K01386M13937M45088L60033K80979
$$ plain form
40615 -985711 -700815 -342097 90738 545736 987452 1441188 1948526 2468907 2850864 2940441
40605 2940441 2724856 2341743 1938531 1560152 1204731 949268 939808 1228629 1667923 2012189
40595 2012189 2118459 2024776 1854728 1686361 1511540 1280698 963867 580631 183267 -189557
40585 -189557 -532441 -830039 -1005318 -951914 -646871 -223857 90751 139443 -44049 -260649
40575 -260649 -309976 -159007 38863 94075 -51501 -297350 -486059 -503621 -310176 65489
40565 65489 543459 1037902 1504983 1933008 2287058 2492730 2482366 2232430 1753770 1086027
40555 1086027 326303 -363790 -815243 -924770 -681677 -151328 558198 1340718 2126812
40546 2126812 2870732 3507965 3954476 4157485 4124111 3895048 3518629 3055750 2572422 2112239
$$ packed form
40615i85711K84896L58718M32835M54998M41716M53736N07338N20381L81957Q9577
40605B940441k15585l83113m03212l78379l55421k55463r460K88821M39294L44266
40595B012189J06270r3683j70048j68367j74821k30842l16831l83236l97364l72824
40585a89557l42884k97598j75279N3404L05043M23014L14608M8692j83492k16600
40575b60649m9327J50969J97870N5212j45576k45849j88709j7562J93445L75665
40565F5489M77970M94443M67081M28025L54050K05672j0364k49936m78660o67743
40555A086027p59724o90093m51453j09527K43093N30349P09526P82520P86094
40546B126812P43920O37233M46511K03009l3374k29063l76419m62879m83328m60183
$$ plain form
40536 2112239 1709382 1434853 1370130 1495303 1649064 1653736 1455783 1099648 600680 -77502
40526 -77502 -915219 -1771767 -2461172 -2873252 -3020800 -3007539 -2963995 -2975982 -3036879 -3069194 -3006599
40515 -3006599 -2858419 -2696059 -2581535 -2505975 -2389398 -2140032 -1717725 -1144152 -470523 238380
40505 238380 896780 1421315 1784383 2015462 2131977 2105241 1922760 1648435 1384336 1203955
40495 1203955 1157801 1294642 1605946 1978260 2289254 2554336 2897080 3354530 3787166 4017971
40485 4017971 3998188 3795446 3484182 3115049 2746372 2415055 2072054 1611411 984386 250089
40475 250089 -491166 -1168109 -1722829 -2071064 -2129851 -1887196 -1423625 -867111 -341213 56579
40465 56579 269202 306621 259068 266552 454813 873593 1468366 2109018 2675176 3135880
$$ packed form
40536B112239m02857k74529o4723J25173J53761M672j97953l56135m98968o78182
40526g7502q37717q56548o89405m12080j47548J3261M3544j1987o0897l2315O2595
40515c006599J48180J62360J14524P5560J16577K49366M22307N73573O73629P08903
40505B38380O58400N24535L63068K31079J16515k6736j82481k74325k64099j80381
40495A203955m6154J36841L11304L72314L10994K65082L42744M57450M32636K30805
40485D017971j9783k02742l11264l69133l68677l31317l43001m60643o27025p34297
40475B50089p41255o76943n54720l48235n8787K42655M63571N56514N25898L97792
40465E6579K12623L7419m7553P484J88261M18780N94773O40652N66158M60704
$$ plain form
40455 3135880 3534040 3883937 4119233 4182372 4143823 4172599 4374099 4690938 4964805 5053213
40445 5053213 4890005 4508267 4045094 3664955 3415029 3179808 2820824 2330609 1806505
40436 1806505 1319233 883682 535882 341341 296493 281860 155995 -119104 -452790 -701486
40426 -701486 -768994 -660119 -441407 -142474 272772 803835 1323448 1660257 1761382 1707231
40416 1707231 1575434 1374944 1127571 923384 845220 895277 1037377 1257672 1538775 1822657
40406 1822657 2050519 2207351 2294014 2306188 2290509 2367942 2620227 2965487 3208318 3210541
40396 3210541 2971480 2562557 2046792 1462262 827110 147530 -539531 -1128820 -1502355
40387 -1502355 -1646150 -1680017 -1745108 -1870659 -1955937 -1866253 -1541446 -1025010 -393354 342198
$$ packed form
40455C135880L98160L49897K35296O3139l8549K8776K01500L16839K73867Q8408
40445E053213j63208l81738m63173l80139k49926k35221l58984m90215n24104
40436A806505m87272m35551l47800j94541m4848j4633j25865k75099l33686k48696
40426g01486o7508J08875K18712K98933M15246N31063N19613L36809J01125n4151
40416A707231j31797k00490k47373k04187p8164N0057J42100K20295K81103K83882
40406A822657K27862J56832Q6663J2174j5679P7433K52285L45260K42831K223
40396C210541k39061m08923n15765n84530o35152o79580o87061n89289l73535
40387a502355j43795l3867o5091j25551q5278Q9684L24807N16436O31656P35552
$$ plain form
40377 342198 1239738 2306920 3391083 4225517 4587668 4391879 3652938 2433128 862529
40368 862529 -832033 -2383121 -3593008 -4393659 -4821156 -4956613 -4882078 -4655709 -4305099
40359 -4305099 -3853243 -3368845 -2983979 -2828345 -2922193 -3147760 -3350652 -3461025 -3494447 -3465657
40349 -3465657 -3375262 -3293593 -3368932 -3672800 -4068735 -4312045 -4276864 -4022367 -3640725 -3126276
40339 -3126276 -2431561 -1583843 -683728 175899 932086 1524145 1924326 2209210 2538332
40330 2538332 3019701 3610781 4162346 4536378 4680757 4642700 4550376 4548250 4691801 4899795
40320 4899795 5033877 5006875 4777553 4278221 3446268 2356312 1243156 333479 -307619
40311 -307619 -730171 -974859 -1081860 -1178022 -1432559 -1897605 -2463462 -2990099 -3416985 -3731176
$$ packed form
40377C42198Q97540J067182J084163Q34434L62151j95789p38941j219810j570599
40368H62529j694562j551088j209887q00651m27497j35457P4535K26369L50610
40359d305099M51856M84398L84866J55634r3848k25567k02892j10373l3422K8790
40349c465657R0395Q1669p5339l03868l95935k43310L5181K54497L81642N14449
40339c126276O94715Q47718R00115Q59627P56187N92059M00181K84884L29122
40330B538332M81369N91080N51565L74032J44379l8057r2324k126J43551K07994
40320D899795J34082k7002k29322m99332q31953j089956j113156r09677o41098
40311c07619m22552k44688j07001r6162k54537m65046n65857n26637m26886l14191
$$ plain form
40301 -3731176 -3917408 -3994410 -4036806 -4092262 -4104887 -3967280 -3621939 -3080394 -2394622 -1672842
40291 -1672842 -1088325 -787667 -770170 -886508 -949686 -830510 -494127 -14157 464314 849842
40281 849842 1202384 1647281 2178731 2606506 2725366 2495922 2034495 1470251 858843 220240
40271 220240 -383543 -831491 -1013599 -930504 -722550 -584229 -645619 -936283 -1427812 -2057535
40261 -2057535 -2710639 -3239095 -3541211 -3614931 -3529819 -3378151 -3262314 -3276474 -3441269 -3659034
40251 -3659034 -3774966 -3701609 -3476212 -3200500 -2945333 -2722163 -2531582 -2418544 -2468139 -2738856
40241 -2738856 -3187196 -3648144 -3902735 -3805395 -3383162 -2809405 -2251907 -1737642 -1182153 -543454
40231 -543454 95996 614489 973932 1222783 1407216 1522355 1535509 1417424 1161476 811930
$$ packed form
40301c731176j86232p7002m2396n5456j2625J37607L45341N41545O85772P21780
40291a672842N84517L00658J7497j16338o3178J19176L36383M79970M78471L85528
40281H49842L52542M44897N31450M27775J18860k29444m61427n64244o11408o38603
40271B20240o03783m47948j82108Q3095K07954J38321o1390k90664m91529o29723
40261b057535o53104n28456l02116p3720Q5112J51668J15837j4160j64795k17765
40251c659034j15932P3357K25397K75712K55167K23170J90581J13038m9595k70717
40241b738856m48340m60948k54591R7340M22233N73757N57498N14265N55489O38699
40231e43454O39450N18493L59443K48851J84433J15139J3154j18085k55948l49546
$$ plain form
40221 811930 465609 201612 4380 -209879 -486982 -785888 -1038022 -1222459 -1371130 -1518940
40211 -1518940 -1654752 -1716719 -1658188 -1539605 -1517703 -1686897 -1947820 -2099193 -2060972 -1937893
40201 -1937893 -1844298 -1732721 -1437247 -850386 -35540 789701 1360142 1521179 1351578 1112654
40191 1112654 1027291 1108899 1217117 1237635 1163638 1038135 892594 756730 679932 707066
40181 707066 834180 994182 1090660 1060282 909418 679419 380334 -11360 -484803 -966482
40171 -966482 -1385111 -1731666 -2023537 -2237835 -2320549 -2247923 -2046500 -1766748 -1469845 -1229116
40161 -1229116 -1109534 -1143200 -1334015 -1658392 -2031016 -2301759 -2349492 -2192587 -1975579 -1836996
40151 -1836996 -1802230 -1788990 -1684859 -1432444 -1086172 -793670 -680522 -729152 -786432 -701003
$$ packed form
40221H11930l46321k63997j97232k14259k77103k98906k52134j84437j48671j47810
40211a518940j35812o1967N8531J18583K1902j69194k60923j51373L8221J23079
40201a937893R3595J11577K95474N86861Q14846Q25241N70441J61037j69601k38924
40191A112654q5363Q1608J08218K0518p3997j25503j45541j35864p6798K7134
40181G07066J27114J60002R6478l0378j50864k29999k99085l91694m73443m81679
40171i66482m18629l46555k91871k14298q2714P2626K01423K79752K96903K40729
40161a229116J19582l3666j90815l24377l72624k70743m7733J56905K17008J38583
40151a836996L4766J3240J04131K52415L46272K92502J13148m8630n7280Q5429
$$ plain form
40141 -701003 -444953 -112595 164288 291350 243415 69696 -118552 -187994 -57569 221995
40131 221995 464458 478695 245627 -53354 -212100 -180094 -42033 131918 337310 546558
40121 546558 655818 562224 256518 -185322 -670372 -1133494 -1556462 -1973241 -2428218 -2900491
40111 -2900491 -3288347 -3487591 -3463037 -3229094 -2798391 -2186876 -1446498 -649848 154996 948381
40101 948381 1707039 2398119 3002434 3514240 3910972 4145405 4184643 4056138 3848462 3652576
40091 3652576 3481974 3251506 2867102 2357502 1893435 1643207 1613977 1656430 1614908 1448385
40081 1448385 1221266 1023960 913329 889887 903736 901491 890374 939656 1090824 1273647
40071 1273647 1344247 1223165 991387 850823 996211 1506708 2315121 3250293 4126196 4832466
$$ packed form
40141g01003K56050L32358K76883J27062m7935j73719j88248o9442J30425K79564
40131B21995K42463J4237k33068k98981j58746L2006J38061J73951K05392K09248
40121E46558J09260r3594l05706m41840m85050m63122m22968m16779m54977m72273
40111b900491l87856j99244K4554K33943M30703O11515P40378P96650Q04844P93385
40101I48381P58658O91080O04315N11806L96732K34433L9238j28505k07676j95886
40091C652576j70602k30468l84404n09600m64067k50228k9230M2453m1522j66523
40081A448385k27119j97306j10631k3442J3849k245j1117M9282J51168J82823
40071A273647P0600j21082k31778j40564J45388N10497Q08413R35172Q75903P06270
$$ plain form
40061 4832466 5360364 5738955 5955034 5960639 5759922 5446258 5113172 4738906 4200168 3415406
40051 3415406 2456859 1514452 767529 294604 70979 12758 21129 13212 -62820 -223902
40041 -223902 -445336 -655576 -763781 -718507 -530151 -213979 269259 962323 1784689 2504756
40031 2504756 2888046 2867385 2544950 2057283 1494878 943353 513610 265306 128740 -33494
40021 -33494 -273374 -490902 -525864 -306556 74946 408043 501246 326799 50425 -101949
40011 -101949 -21604 232509 524449 738261 805697 715451 529999 353854 258168 267762 431680
40000 431680 841611 1528491 2377563 3195025 3830000 4192114 4208884 3867075 3298121 2736664
39990 2736664 2353869 2160021 2069894 2015680 1994601 2064343 2305075 2728143 3200448 3514028
$$ packed form
40061D832466N27898L78591K16079N605k00717l13664l33086l74266n38738p84762
40051C415406r58547r42407p46923m72925k23625n8221Q371p917p6032j61082
40041b23902k21434k10240j08205M5274J88356L16172M83238O93064Q22366P20067
40031B504756L83290k0661l22435m87667n62405n51525m29743k48304j36566j62234
40021c3494k39880k17528l4962K19308L81502L33097R3203j74447k76374j52374
40011a01949Q0345K54113K91940K13812O7436r0246j85452j76145r5686R594J63918
40000D31680M09931O86880Q49072Q17462O34975L62114J6770l41809n68954n61457
39990B736664l82795j93848r0127n4214k1079O9742K40732M23068M72305L13580
$$ plain form
39980 3514028 3559509 3385671 3072524 2619616 2008487 1306396 626549 21100 -503540 -882219
39970 -882219 -992378 -779357 -314610 302961 1063630 2039230 3283102 4740963 6218250
39961 6218250 7423712 8104303 8194836 7830259 7190547 6354808 5331116 4192330 3115274
39952 3115274 2268824 1697430 1328269 1059115 813989 543202 224407 -114829 -396068
39943 -396068 -537501 -515705 -392427 -290977 -333228 -563816 -914486 -1254994 -1493585 -1616536
39933 -1616536 -1622025 -1449186 -1018147 -341246 437601 1120946 1558304 1689876 1553730 1279236
39923 1279236 1032162 915560 921112 988434 1091079 1240301 1422177 1565557 1576901 1399574
39913 1399574 1058004 665230 367178 241880 253348 329979 483646 819744 1424028 2261645
$$ packed form
39980C514028M5481j73838l13147m52908o11129p02091o79847o05449n24640l78679
39970h82219j10159K13021M64747O17571P60669R75600J243872J457861J477287
39961F218250J205462O80591R0533l64577o39712q35739j023692j138786j077056
39952C115274q46450n71394l69161k69154k45126k70787l18795l39236k81239
39943c96068j41433K1796J23278J01450m2251k30588l50670l40508k38591j22951
39933a616536n489J72839M31039O76901P78847O83345M37358J31572j36146k74494
39923A279236k47074j16602N552O7322J02645J49222J81876J43380J1344j77327
39913A399574l41570l92774k98052j25298J1468P6631J53667L36098O04284Q37617
$$ plain form
39903 2261645 3184848 4005624 4554691 4720714 4491162 3968892 3326482 2721991 2245791
39894 2245791 1932616 1801752 1865570 2097119 2412506 2715948 2970559 3210491 3483017 3803872
39884 3803872 4176740 4617356 5117524 5594670 5910992 5949016 5661249 5069674 4253114 3330653
39874 3330653 2423651 1625273 1014756 672596 633178 824531 1099376 1333790 1464996 1450030
39864 1450030 1263124 959111 669169 474611 318575 91579 -223144 -533742 -732133
39855 -732133 -740117 -498723 -16202 549738 948929 1051924 977857 958243 1090769 1269701
39845 1269701 1336318 1232751 1000405 694407 350821 12153 -270335 -474738 -629697 -790637
39835 -790637 -1000086 -1256040 -1494037 -1611365 -1550441 -1366824 -1176314 -1021905 -843264 -612148
$$ packed form
39903B261645R23203Q20776N49067J66023k29552n22270o42410o04491m76200
39894B245791l13175j30864O3818K31549L15387L03442K54611K39932K72526L20855
39884C803872L72868M40616N00168M77146L16322L8024k87767n91575q16560r22461
39874C330653r07002p98378o10517l42160l9418J91353K74845K34414J31206j4966
39864A450030j86906l04013k89942j94558j56036k26996l14723l10598j98391
39855g32133p984K41394M82521N65940L99191J02995p4067j9614J32526J78932
39845A269701O6617j03567k32346l05998l43586l38668k82488k04403j54959j60940
39835g90637k09449k55954k37997j17328O0924J83617J90510J54409J78641K31116
$$ plain form
39825 -612148 -442891 -495090 -790363 -1210458 -1679847 -2255870 -2993479 -3796950 -4480333 -4937603
39815 -4937603 -5185644 -5268556 -5202520 -5016525 -4768137 -4484379 -4135719 -3705099 -3250946 -2864593
39805 -2864593 -2578613 -2341310 -2068175 -1695355 -1196561 -586695 68639 654150 1042237
39796 1042237 1169101 1106783 1055609 1226450 1697548 2379375 3110246 3761653 4250090 4501276
39786 4501276 4469948 4200872 3812075 3369236 2795574 1962671 889121 -192302 -1005436
39777 -1005436 -1454053 -1644171 -1712249 -1703728 -1636524 -1603890 -1733865 -2056424 -2462479 -2796015
39767 -2796015 -2956975 -2932001 -2776939 -2569504 -2325845 -1948057 -1301481 -377811 634306
39758 634306 1451722 1856712 1783815 1334769 757595 356562 327150 632735 1042121 1293019
$$ packed form
39825f12148J69257n2199k95273m20095m69389n76023p37609q03471o83383m57270
39815d937603k48041q2912O6036J85995K48388K83758L48660M30620M54153L86353
39805b864593K85980K37303K73135L72820M98794O09866O55334N85511L88087
39796A042237J26864o2318n1174J70841M71098O81827P30871O51407M88437K51186
39786D501276l1328k69076l88797m42839n73662q32903j073550j081423q13134
39777a005436m48617j90118o8078Q521O7204L2634j29975l22559m06055l33536
39767b796015j60960K4974J55062K07435K43659L77788O46576R23670J012117
39758F34306Q17416M04990p2897m49046n77174m01033k9412L05585M09386K50898
$$ plain form
39748 1293019 1243286 922073 480680 85244 -175125 -293318 -283689 -158172 35723 215199
39738 215199 347277 503320 784154 1210439 1726743 2292608 2918591 3613478 4331344 4970618
39728 4970618 5409669 5572847 5497776 5305831 5055743 4660250 4023161 3242775 2586593 2244177
39718 2244177 2177451 2232230 2308800 2374380 2390755 2322601 2194413 2069670 1974732 1883079 1766069
39707 1766069 1630347 1524511 1536564 1748933 2140481 2545626 2764845 2727391 2525808 2308518
39697 2308518 2172578 2135521 2146475 2112720 1963822 1717135 1463989 1285837 1197636 1157361
39687 1157361 1094161 937893 677514 409526 286427 383750 628801 866371 974382 924040
39677 924040 784552 700390 814627 1143153 1512887 1665444 1458651 981990 485534 198680
$$ packed form
39748A293019m9733l21213m41393l95436k60369j18193R629J25517J93895J79476
39738B15199J32078J56043K80834M26285N16304N65865O25983O94887P17866O39274
39728D970618M39051J63178p5071j91945k50088l95493o37089p80386o56182l42416
39718B244177o6726N4779P6570O5580J6375o8154j28188j24743r4938r1653j17010
39707A766069j35722j05836J2053K12369L91548M05145K19219l7454k01583k17290
39697B308518j35940l7057J0954l3755j48898k46687k53146j78152q8201m0275
39687A157361o3200j56268k60379k67988j23099R7323K45051K37570J08011n0342
39677I24040j39488q4162J14237L28526L69734J52557k06793m76661m96456k86854
$$ plain form
39667 198680 197371 410492 720462 1039475 1304205 1451963 1453930 1364287 1285167 1260490 1230439
39656 1230439 1108519 883108 629860 448177 403442 506893 719541 973038 1190312 1273982
39646 1273982 1085101 490163 -522971 -1786907 -3039563 -4056761 -4692277 -4845665 -4477350
39637 -4477350 -3670307 -2614552 -1485349 -352170 772014 1813164 2601454 2964168 2854797
39628 2854797 2398016 1804745 1225565 678249 116846 -454155 -972751 -1417107 -1845250
39619 -1845250 -2294782 -2679197 -2844947 -2735129 -2456276 -2175964 -1991488 -1910518 -1909816 -1956996
39609 -1956996 -1980421 -1870667 -1547809 -1024470 -393830 234574 778972 1187402 1435469 1540172
39599 1540172 1555832 1524014 1418286 1156809 691764 94638 -449804 -743184 -688043 -334955
$$ packed form
39667A98680j309K13121L09970L19013K64730J47758J967q9643p9120k4677l0051
39656A230439j21920k25411k53248j81683m4735J03451K12648K53497K17274Q3670
39646A273982j88881n94938j013134j263936j252656j017198o35516j53388L68315
39637d477350Q07043J055755J129203J133179J124184J041150P88290L62714j09371
39628B854797m56781n93271n79180n47316n61403n71001n18596m44356m28143
39619a845250m49532l84415j65750J09818K78853K80312J84476Q0970P02m7180
39609a956996k3425J09754L22858N23339O30640O28404N44398M08430K48067J04703
39599A540172J5660l1818j05728k61477m65045n97126n44442k93380N5141L53088
$$ plain form
39589 -334955 162731 648403 1043728 1353669 1602511 1777912 1849237 1829988 1790803 1794363
39579 1794363 1835272 1865073 1863494 1855930 1864307 1879573 1905489 2007316 2281755 2767248 3387629
39568 3387629 3979884 4375040 4474048 4282177 3893383 3442663 3061486 2855553 2892551 3188837
39558 3188837 3709448 4388646 5146003 5883163 6490650 6886555 7048946 6997760 6751928 6317171
39548 6317171 5700757 4914114 3973963 2935274 1917458 1052907 391920 -115510 -536121
39539 -536121 -885113 -1150555 -1337444 -1450126 -1462547 -1351449 -1144320 -893488 -614028 -293980
39529 -293980 33630 278866 377976 360723 315308 306204 342226 402585 464344 505020 497430
39518 497430 411932 224258 -78594 -501581 -1047570 -1701765 -2394591 -2999772 -3411350 -3633529
$$ packed form
39589c34955M97686M85672L95325L09941K48842J75401P1325j9249l9185L560
39579A794363M0909K9801j579p564Q377J5266K5916J01827K74439M85493O20381
39568C387629N92255L95156R9008j91871l88794m50720l81177k05933L6998K96286
39558C188837N20611O79198P57357P37160O07487L95905J62391n1186k45832m34757
39548F317171o16414p86643r40151j038689j017816q64551o60987n07430m20611
39539e36121l48992k65442j86889j12682j2421J11098K07129K50832K79460L20048
39529b93980L27610K45236R9110j7253m5415r104L6022O0359O1759M0676p590
39518D97430q5498j87674l02852m22987n45989o54195o92826o05181m11578k22179
$$ plain form
39508 -3633529 -3763024 -3862910 -3878350 -3703414 -3315788 -2816439 -2343430 -1976198 -1723113 -1564755
39498 -1564755 -1482665 -1456429 -1452363 -1414722 -1263879 -925171 -397948 193469 654542 872929
39488 872929 921539 976891 1120189 1248980 1211270 998879 763006 648865 667729 739756
39478 739756 803753 847297 873926 902062 984568 1171569 1439688 1692676 1845217 1884142 1849918
39467 1849918 1798893 1794748 1885921 2043661 2137448 2013294 1607100 978289 259225 -398135
39457 -398135 -852806 -1023658 -947437 -770532 -655742 -690500 -875792 -1173811 -1545882 -1956312
39447 -1956312 -2358419 -2677759 -2812800 -2682338 -2304939 -1829058 -1452749 -1285197 -1272667 -1251163
39437 -1251163 -1075115 -723939 -320628 -54460 -54355 -297110 -621413 -841624 -871177 -754832
$$ packed form
39508c633529j29495r9886j5440J74936L87626M99349M73009L67232K53085J58358
39498a564755Q2090K6236M066L7641J50843L38708N27223N91417M61073K18387
39488H72929M8610N5352J43298J28791l7710k12391k35873j14141J8864P2027
39478G39756O3997M3544K6629K8136Q2506J87001K68119K52988J52541L8925l4224
39467A849918n1025m145R1173J57740R3787j24154m06194o28811p19064o57360
39457c98135m54671j70852P6221J76905J14790l4758j85292k98019l72071m10430
39447a956312m02107l19340j35041J30462L77399M75881L76309J67552J2530K1504
39437a251163J76048L51176M03311K66168J05k42755l24303k20211k9553J16345
$$ plain form
39427 -754832 -590718 -427923 -248849 -49803 84282 9377 -374071 -1053528 -1913669 -2773341
39417 -2773341 -3428762 -3734932 -3689789 -3406191 -2967123 -2344522 -1504722 -554910 287698 865496
39407 865496 1159383 1213366 1070836 809673 553409 383984 290799 259681 363022 685757
39397 685757 1182113 1680070 2034363 2225808 2313573 2351672 2372126 2401770 2458781 2541092 2620966
39386 2620966 2636904 2512244 2230417 1888273 1615562 1423877 1189502 815116 359439 -30216
39376 -30216 -264617 -338708 -256390 -15870 326175 647346 851915 943571 995223 1078694 1233248
39365 1233248 1459604 1711407 1913594 2018562 2034948 1984192 1845792 1569008 1125739 525467
39355 525467 -211768 -1058972 -1943714 -2725714 -3236813 -3361926 -3109403 -2630156 -2159473 -1893211
$$ packed form
39427g54832J64114J62795J79074J99046J34085p4905l83448o79457q60141q59672
39417b773341o55421l06170M5143K83598M39068O22601Q39800R49812Q42608N77798
39407H65496K93887N3983j42530k61163k56264j69425r3185l1118J03341L22735
39397F85757M96356M97957L54293J91445Q7765L8099K0454K9644N7011Q2311P9874
39386B620966J5938j24660k81827l42144k72711j91685k34375l74386m55677l89655
39376c0216k34401p4091Q2318K40520L42045L21171K04569R1656N1652Q3471J54554
39365A233248K26356K51803K02187J04968J6386n0756j38400k76784m43269o00272
39355E25467p37235q47204q84742p82000n11099j25113K52523M79247M70683K66262
$$ plain form
39345 -1893211 -1878826 -2018068 -2180982 -2315709 -2450640 -2611432 -2760687 -2824978 -2770769 -2639842
39335 -2639842 -2498240 -2349280 -2115250 -1726277 -1222435 -746333 -436719 -352568 -491294 -826121
39325 -826121 -1298585 -1821393 -2339466 -2861882 -3376217 -3744754 -3757821 -3318197 -2538458 -1647498
39315 -1647498 -847253 -273424 -20174 -114999 -458868 -835893 -1016485 -877104 -463735 26918
39305 26918 345266 317354 -82537 -751342 -1512455 -2155617 -2488867 -2419943 -1992944 -1319875
39295 -1319875 -485204 456331 1409189 2224315 2786514 3100081 3275445 3436710 3636523
39286 3636523 3838674 3971253 4002077 3970677 3958026 4038172 4246774 4552875 4839596 4949499
39276 4949499 4795605 4430105 3995027 3629815 3435998 3467835 3685846 3942413 4090353 4116585
$$ packed form
39345a893211J4385j39242j62914j34727j34931j60792j49255o4291N4209J30927
39335b639842J41602J48960K34030L88973N03842M76102L09614Q4151j38726l34827
39325h26121m72464n22808n18073n22416n14335l68537j3067M39624P79739Q90960
39315a647498Q00245N73829K53250r4825l43869l77025j80592J39381M13369M90653
39305B6918L18348k7912l99891o68805p61113o43162l33250O8924M26999O73069
39295a319875Q34671R41535R52858Q15126N62199L13567J75364J61265J99813
39286C636523K02151J32579L0824l1400j2651Q0146K08602L06101K86721J09903
39276D949499j53894l65500m35078l65212j93817L1837K18011K56567J47940K6232
$$ plain form
39266 4116585 4120419 4167020 4230161 4287647 4391894 4594320 4841015 4990613 4919984 4591053
39256 4591053 4040747 3336070 2533167 1675614 847027 207967 -73146 57980 521264
39247 521264 1198779 1993977 2791944 3446816 3861457 4032418 3981938 3706852 3240684 2696640
39237 2696640 2175318 1681272 1210379 870348 806684 1020190 1356149 1681606 1987107 2301454
39227 2301454 2597099 2817173 2927680 2906649 2743154 2486917 2242966 2069912 1926417 1761336
39217 1761336 1610778 1545365 1545330 1489213 1270809 897520 483198 176254 83662 221196 519059
39206 519059 884542 1259773 1618249 1929169 2149416 2239434 2165049 1896714 1443259 899861
39196 899861 443976 253466 393157 749005 1073569 1138209 884648 440244 -13378 -376792
$$ packed form
39266D116585L834M6601O3141N7486J04247K02426K46695J49598p0629l28931
39256D591053n50306p04677q02903q57553q28587o39060k81113J31126M63284
39247E21264O77515P95198P97967O54872M14641J70961n0480k75086m66168n44044
39237B696640n21322m94046m70893l40031o3664K13506L35959L25457L05501L14347
39227B301454K95645K20074J10507k1031j63495k56237k43951j73054j43495j65081
39217A761336j50558o5413l5n6117k18404l73289m14322l06944r2592J37534K97863
39206E19059L65483L75231L58476L10920K20247R0018p4385k68335m53455n43398
39196H99861m55885j90510J39691L55848L24564O4640k53561m44404m53622l63414
$$ plain form
39186 -376792 -652299 -881775 -1108540 -1383500 -1759728 -2258142 -2843004 -3430168 -3918849 -4238521
39176 -4238521 -4389568 -4427694 -4383136 -4202241 -3797561 -3155127 -2363052 -1531011 -718017 40141
39166 40141 668206 1069298 1214384 1179529 1069538 919236 691845 357712 -68567 -574909
39156 -574909 -1182992 -1887515 -2587597 -3132679 -3440875 -3533500 -3452452 -3194644 -2749388 -2158020
39146 -2158020 -1504764 -878803 -375143 -100096 -127207 -447371 -976409 -1586564 -2111032 -2370456
39136 -2370456 -2273318 -1900026 -1445899 -1073144 -838379 -735454 -743075 -822133 -920014 -997079
39126 -997079 -1016814 -917584 -658906 -311106 -28205 111905 189497 322406 513871 672148
39116 672148 728529 660313 438140 58734 -362677 -632674 -659160 -528147 -358115 -136631
$$ packed form
39186c76792k75507k29476k26765k74960l76228m98414n84862n87164m88681l19672
39176d238521j51047l8126M4558J80895M04680O42434P92075Q32041Q12994P58158
39166D0141O28065M01092J45086l4855j09991j50302k27391l34133m26279n06342
39156e74909o08083p04523p00082n45082l08196r2625Q1048K57808M45256N91368
39146b158020O53256O25961N03660K75047k7111l20164n29038o10155n24468k59424
39136b370456R7138L73292M54127L72755K34765J02925p621p9058r7881p7065
39126i97079j9735R9230K58678L47800K82901J40110P7592J32909J91465J58277
39116F72148N6381o8216k22173l79406m21411k69997k6486J31013J70032K21484
$$ plain form
39106 -136631 235183 769979 1331358 1728552 1815160 1511373 824923 -97296 -994582 -1654081
39096 -1654081 -2063346 -2366413 -2665116 -2910324 -3012704 -3010273 -3057533 -3249340 -3515556 -3714223
39086 -3714223 -3782264 -3758463 -3699112 -3624336 -3517399 -3302091 -2823787 -1942576 -699958 643830
39076 643830 1779871 2541012 2921286 2986386 2843588 2661088 2602148 2692155 2799722 2790547
39066 2790547 2677148 2592818 2643667 2814250 2996394 3071909 2970980 2690317 2282871 1826508
39056 1826508 1384316 981587 622311 340035 231907 412580 901498 1558813 2158366
39047 2158366 2527765 2608794 2416354 2009818 1524400 1164491 1096157 1343108 1806412 2359961
39037 2359961 2895942 3317254 3564698 3669390 3727296 3793263 3828201 3766949 3601166 3364846
$$ packed form
39106a36631L71814N34796N61379L97194Q6608l03787o86450r22219q97286o59499
39096a654081m09265l03067k98703k45208j02380K431m7260j91807k66216j98667
39086c714223o8041K3801N9351P4776J06937K15308M78304Q81211J242618J343788
39076F43830J136041P61141L80274O5100j42798j82500n8940R0007J07567r175
39066B790547j13399q4330N0849J70583J82144P5515j00929k80663m07446m56363
39056A826508m42192m02729l59276k82276j08128J80673M88918O57315N99553
39047B158366L69399Q1029j92440m06536m85418l59909o8334K46951M63304N53549
39037B359961N35981M21312K47444J04692N7906O5967L4938o1252j65783k36320
$$ plain form
39027 3364846 3069629 2702079 2276742 1845174 1440311 1047298 653053 302018 70489
39018 70489 -11427 13939 90650 214906 428036 752263 1142454 1491403 1674487 1614212
39008 1614212 1345229 1029349 872310 982772 1297029 1642374 1871857 1946673 1923083 1892056
38998 1892056 1922958 2029793 2175249 2317596 2457559 2628078 2840358 3063369 3266309 3457772
38988 3457772 3657445 3837471 3921864 3859057 3687893 3524620 3486503 3622792 3897384 4214421
38978 4214421 4460585 4550976 4469931 4286595 4125210 4095820 4223765 4429614 4589180 4642961
38968 4642961 4662005 4792735 5122146 5606599 6141448 6672489 7202179 7704658 8102064 8357603
38958 8357603 8552254 8822638 9232654 9737482 10262855 10783301 11323463 11919533 12593568
$$ packed form
39027C364846k95217l67550m25337m31568m04863l93013l94245l51035k31529
39018G0489q1916K5366P6711J24256K13130L24227L90191L48949J83084o0275
39008A614212k68983l15880j57039J10462L14257L45345K29483P4816k3590l1027
38998A892056L0902J06835J45456J42347J39963J70519K12280K23011K02940J91463
38988C457772J99673J80026Q4393o2807j71164j63273l8117J36289K74592L17037
38978D214421K46164R0391q1045j83336j61385k9390J27945K05849J59566N3781
38968D642961J9044J30730L29411M84453N34849N31041N29690N02479L97406K55539
38958H357603J94651K70384M10016N04828N25373N20446N40162N96070O74035
$$ plain form
38949 12593568 13343111 14141934 14964286 15814934 16719459 17679878 18663969 19657378 20707516
38940 20707516 21879427 23154996 24394140 25423322 26181352 26785782 27455037 28354519 29493943
38931 29493943 30740495 31913244 32890977 33692728 34507083 35644559 37417314 40009777
38923 40009777 43427064 47564805 52364287 57942753 64578438 72545680 81969108 92876662
38915 92876662 105399607 119870758 136700221 156186106 178417770 203159302 229554769
38908 229554769 255869140 279757046 299196427 313487100 323409827 330207437 334067548
38901 334067548 333367751 325482077 308685812 283691300 253596612 222373703 193161252
38894 193161252 167503357 145634146 127143893 111455982 98027039 86417910 76316412
$$ packed form
38949A2593568P49543P98823Q22352Q50648R04525R60419R84091R93409J050138
38940B0707516J171911J275569J239144J029182P58030O04430O69255Q99482J139424
38931B9493943J246552J172749R77733Q01751Q14355J137476J772755K592463
38923D0009777L417287M137741M799482N578466O635685P967242R423428J0907554
38915I2876662J2522945J4471151J6829463J9485885K2231664K4741532K6395467
38908B29554769K6314371K3887906J9439381J4290673R922727O797610L860111
38901C34067548o99797p885674j6796265k4994512l0094688l1222909k9212451
38894A93161252k5657895k1869211j8490253j5687911j3428943j1609129j0101498
$$ plain form
38887 76316412 67513072 59849496 53182403 47381030 42336133 37944703 34068465 30525151
38879 30525151 27169430 24010896 21228318 19024374 17445170 16332225 15429396 14524467
38871 14524467 13513951 12380579 11143065 9837004 8531351 7325085 6285674 5391828
38863 5391828 4580473 3868705 3388548 3262936 3471977 3883869 4397596 4991551 5619055
38854 5619055 6123929 6333042 6239788 6050442 6013038 6207042 6523132 6832525 7113430 7375569
38844 7375569 7520150 7380447 6930986 6385922 6029641 5974682 6123898 6328930 6513541 6653146
38834 6653146 6723875 6722474 6694192 6683273 6660207 6540204 6287343 5974646 5718541 5562000
38824 5562000 5439306 5245871 4912945 4416676 3770908 3059151 2441962 2056247 1884330
$$ packed form
38887G6316412q803340p663576o667093n801373n044897m391430l876238l543314
38879C0525151l355721l158534k782578k203944j579204j112945r02829r04929
38871A4524467j010516j133372j237514j306061j305653j206266j039411q93846
38863E391828q11355p11768m80157j25612K09041M11892N13727N93955O27504
38854E619055N04874K09113r3254j89346l7404J94004L16090L09393K80905K62139
38844G375569J44581j39703m49461n45064l56281n4959J49216K05032J84611J39605
38834F653146P0729j401k8282j0919k3066j20003k52861l12697k56105j56541
38824E562000j22694j93435l32926m96269o45768p11757o17189l85715j71917
$$ plain form
38815 1884330 1763947 1545635 1205893 799984 368823 -57367 -402761 -562416 -489670 -253050
38805 -253050 -16933 34124 -193751 -619113 -1037720 -1308315 -1472205 -1654251 -1881825 -2064648
38795 -2064648 -2126111 -2062087 -1857879 -1444101 -806037 -97822 426743 618340 550403 426067
38785 426067 370438 321467 138955 -183956 -461030 -496263 -294092 -40513 96474 84614
38775 84614 -26953 -173928 -257522 -152331 183540 633750 1019265 1266140 1452661 1708114
38765 1708114 2088623 2526330 2866908 2975825 2843464 2581027 2297918 2004453 1652174
38756 1652174 1231108 783781 348871 -54410 -394655 -639496 -814756 -1011767 -1310459
38747 -1310459 -1711714 -2152412 -2558754 -2866818 -3017845 -2976046 -2767628 -2490932 -2267212 -2159811
$$ packed form
38815A884330j20383k18312l39742m05909m31161m26190l45394j59655P2746K36620
38805b53050K36117N1057k27875m25362m18607k70595j63890j82046k27574j82823
38795b064648o1463O4024K04208M13778O38064P08215N24565J91597o7937j24336
38785D26067n5629m8971j82512l22911k77074l5233K02171K53579J36987j1860
38775H4614j11567j46975q3594J05191L35871M50210L85515K46875J86521K55453
38765A708114L80509M37707L40578J08917j32361k62437k83109k93465l52279
38756A652174m21066m47327m34910m03281l40245k44841j75260j97011k98692
38747a310459m01255m40698m06342l08064j51027M1799K08418K76696K23720J07401
$$ plain form
38737 -2159811 -2125266 -2040813 -1790772 -1344513 -771157 -192233 288656 640118 915041 1212780
38727 1212780 1613992 2129526 2691263 3188606 3535881 3725920 3809453 3807467 3668623 3356493
38717 3356493 2973533 2744561 2848119 3279532 3873602 4410992 4690874 4581003 4089912
38708 4089912 3395113 2743899 2295216 2057911 1962116 1955765 2032611 2197453 2415404 2584112
38698 2584112 2563482 2264390 1731086 1139265 704129 560924 688500 927897 1101662 1143965
38688 1143965 1109219 1054982 959788 784105 567884 411009 373664 444588 588817 761933
38678 761933 876643 825178 568669 170300 -278193 -731624 -1185401 -1638645 -2082499 -2485394
38668 -2485394 -2767181 -2825501 -2614086 -2164228 -1517199 -698434 192445 922605 1248731 1108993
$$ packed form
38737b159811L4545Q4453K50041M46259N73356N78924M80889L51462K74923K97739
38727A212780M01212N15534N61737M97343L47275J90039Q3533j986j38844l12130
38717C356493l82960k28972J03558M31413N94070N37390K79882j09871m91091
38708D089912o94799o51214m48683k37305r5795o351P6846J64842K17951J68708
38698B584112k0630k99092n33304n91821m35136j43205J27576K39397J73765M2303
38688A143965l4746n4237r5194j75683k16221j56875l7345P0924J44229J73116
38678G61933J14710n1465k56509l98369m48493m53431m53777m53244m43854m02895
38668b485394k81787n8320K11415M49858O47029Q18765Q90879P30160L26126j39738
$$ plain form
38658 1108993 652468 96459 -386689 -663911 -634674 -295256 234164 803315 1340433 1842613
38648 1842613 2292615 2633912 2816311 2825512 2677277 2426321 2176120 2023407 1967989 1912327
38638 1912327 1777520 1598298 1484323 1513009 1683219 1941933 2208155 2378956 2367764 2170288
38628 2170288 1881944 1631418 1486934 1411122 1293714 1045593 695923 405306 362496 654599
38618 654599 1233017 1976578 2751957 3431793 3922710 4209048 4335380 4319341 4113562 3686420
38608 3686420 3113707 2547680 2102194 1796957 1601162 1491918 1466781 1530389 1678146 1872212
38598 1872212 2028436 2051888 1907112 1653999 1406246 1243687 1152168 1048021 873045 661110
38588 661110 486439 348497 155394 -151520 -499366 -761823 -918946 -1088166 -1392114 -1825504
$$ packed form
38658A108993m56525n56009m83148k77222K9237L39418N29420N69151N37118N02180
38648A842613M50002L41297J82399R201j48235k50956k50201j52713n5418n5662
38638A912327j34807j79222j13975K8686J70210K58714K66222J70801j1192j97476
38628B170288k88344k50526j44484p5812j17408k48121l49670k90617m2810K92103
38618F54599N78418P43561P75379O79836M90917K86338J26332j6039k05779m27142
38608C686420n72713n66027m45486l05237j95795j09244k5137O3608J47757J94066
38598A872212J56224K3452j44776k53113k47753j62559r1519j04147j74976k11935
38588F61110j74671j37942j93103l06914l47846k62457j57123j69220l03948m33390
$$ plain form
38578 -1825504 -2246142 -2466164 -2369575 -1998207 -1541456 -1213358 -1128088 -1298915 -1710019 -2309172
38568 -2309172 -2928974 -3307162 -3249512 -2755711 -1976613 -1103327 -322893 201880 414076 428771
38558 428771 454983 628482 937558 1292000 1609234 1821950 1854321 1643120 1193928 611327
38548 611327 70170 -259526 -293253 -68800 284755 624139 871557 1058390 1300635 1704801
38538 1704801 2273800 2904798 3474357 3905216 4157213 4204844 4059479 3789138 3483017 3208804
38528 3208804 3020170 2967605 3055012 3205262 3320243 3371838 3391923 3380358 3277399 3038809
38518 3038809 2693685 2310625 1942388 1619413 1362387 1180037 1079010 1082777 1200053 1358972
38508 1358972 1426164 1337818 1182883 1111486 1181144 1336230 1515312 1713234 1931048 2125489
$$ packed form
38578a825504m20638k20022R6589L71368M56751L28098Q5270j70827m11104n99153
38568b309172o19802l78188N7650M93801P79098Q73286P80434N24773K12196J4695
38558D28771K6212J73499L09076L54442L17234K12716L2371k11201m49192n82601
38548F11327n41157l29696l3727K24453L53555L39384K47418J86833K42245M04166
38538A704801N68999O30998N69559M30859K51997M7631j45365k70341l06121k74213
38528C208804j88634n2565Q7407J50250J14981N1595K0085j1565j02959k38590
38518C038809l45124l83060l68237l22975k57026j82350j01027L767J17276J58919
38508A358972O7192q8346j54935p1397O9658J55086J79082J97922K17814J94441
$$ plain form
38498 2125489 2244388 2288011 2313532 2397896 2610081 2991404 3530083 4161259 4816591 5476288
38488 5476288 6156482 6837494 7407822 7686963 7526479 6926724 6074817 5244979 4616045
38479 4616045 4158553 3699355 3107252 2430573 1869070 1611197 1675614 1890754 2035368 2017943
38469 2017943 1925026 1897834 1981120 2103183 2170460 2137633 2001435 1795637 1620571 1619550 1860174
38458 1860174 2247842 2603771 2828187 2948647 3016137 3019784 2939304 2835564 2824511 2953145
38448 2953145 3133670 3215912 3119642 2906206 2747136 2827179 3244647 3963593 4841756 5707928
38438 5707928 6427610 6915979 7117037 7003504 6617716 6100534 5636752 5332062 5137619
38429 5137619 4907588 4526984 3976546 3306929 2608969 2013106 1641864 1496453 1412997 1193751
$$ packed form
38498B125489J18899M3623K5521Q4364K12185L81323N38679O31176O55332O59697
38488E476288O80194O81012N70328K79141j60484n99755q51907q29838o28934
38479D616045m57492m59198n92103o76679n61503k57873O4417K15140J44614j7425
38469B017943r2917k7192Q3286J22063O7277l2827j36198k05798j75066j021K40624
38458A860174L87668L55929K24416J20460O7490L647q0480j03740j1053J28634
38448B953145J80525Q2242r6270k13436j59070Q0043M17468P18946Q78163Q66172
38438E707928P19682M88369K01058j13533l85788n17182m63782l04690j94443
38429E137619k30031l80604n50438o69617o97960n95863l71242j45411q3456k19246
$$ plain form
38419 1193751 792227 339623 809 -148113 -109541 84472 358738 574117 583880 319699
38409 319699 -188422 -845721 -1512503 -2030404 -2310056 -2415087 -2513228 -2717436 -3001021 -3278824
38399 -3278824 -3524295 -3766408 -4001548 -4166143 -4204095 -4125775 -3984656 -3814295 -3601897 -3316305
38389 -3316305 -2954934 -2565652 -2221016 -1966560 -1798156 -1689653 -1620912 -1559259 -1433501 -1168983
38379 -1168983 -761068 -292978 126564 426905 582683 600770 527246 441337 400703 384582
38369 384582 307366 96641 -238664 -602910 -865450 -929971 -774310 -436674 20240 518002
38359 518002 961565 1290023 1550300 1868777 2298982 2723168 2959015 2954403 2827212 2721625
38349 2721625 2687714 2706675 2748300 2739936 2525072 1943787 983243 -181954 -1313618 -2255977
$$ packed form
38419A193751m01524m52604l38814j48922L8572J94013K74266K15379R763k64181
38409C19699n08121o57299o66782n17901k79652j05031r8141k04208k83585k77803
38399c278824k45471k42113k35140j64595l7952P8320J41119J70361K12398K85592
38389c316305L61371L89282L44636K54456J68404J08503O8741O1653J25758K64518
38379a168983M07915M68090M19542L00341J55778J8087p3524q5909m0634j6121
38369C84582p7216k10725l35305l64246k62540o4521J55661L37636M56914M97762
38359E18002M43563L28458K60277L18477M30205M24186K35847m612j27191j05587
38349B721625l3911J8961M1625q364k14864n81285r60544j165197j131664r42359
$$ plain form
38339 -2255977 -2960503 -3417920 -3631446 -3676406 -3736791 -4007925 -4533245 -5167450 -5724633 -6130386
38329 -6130386 -6395175 -6485400 -6310227 -5852573 -5247508 -4692677 -4312679 -4124108 -4075274 -4075459
38319 -4075459 -4027724 -3893398 -3712333 -3518811 -3255530 -2819115 -2185503 -1450527 -753081 -197546
38309 -197546 161119 319371 335617 297632 247955 154978 -35302 -345860 -777016 -1329409
38299 -1329409 -1974103 -2594231 -2979269 -2908307 -2279298 -1191926 95372 1315008 2313137
38290 2313137 3038607 3459895 3554413 3379036 3086550 2833045 2692839 2676892 2781601 2968742
38280 2968742 3129272 3138184 2960364 2666090 2335938 1988282 1611146 1220367 850544 514864
38270 514864 218665 5935 -56114 41652 217035 375548 508660 686297 964411 1335484
$$ packed form
38339b255977p04526m57417k13526m4960o0385k71134n25320o34205n57183m05753
38329f130386k64789r0225J75173M57654O05065N54831L79998J88571M8834j85
38319d075459M7735J34326J81065J93522K63281M36415O33612P34976O97446N55535
38309a97546L58665J58252J6246l7985m9677r2977j90280l10558m31156n52393
38299a329409o44694o20128l85038P0962O29009J087372J287298J219636R98129
38290B313137P25470M21288R4518j75377k92486k53505j40206j5947J04709J87141
38280B968742J60530Q912j77820k94274l30152l47656l77136l90779l69823l35680
38270E14864k96199k12730o2049R7766J75383J58513J33112J77637K78114L71073
$$ plain form
38260 1335484 1764454 2221175 2651539 2954564 3029927 2835467 2372340 1644252 691357 -331042
38250 -331042 -1166027 -1596290 -1583127 -1276178 -904974 -644714 -531647 -471035 -337934 -93399
38240 -93399 186675 378790 391394 210108 -69554 -241445 -88827 450860 1224304 1983946
38230 1983946 2552968 2865500 2909893 2708793 2351692 1990099 1777284 1816811 2131462 2618918
38220 2618918 3044490 3163686 2915574 2480253 2113059 1930466 1872540 1842155 1825167 1857790
38210 1857790 1911997 1861584 1584928 1092493 531271 60399 -256092 -428628 -458956 -328891
38200 -328891 -64466 241236 489670 632764 659433 572427 413427 276117 235493 259601
38190 259601 232006 78246 -153032 -346989 -439163 -458981 -474391 -517795 -563600 -556674 -456004
$$ packed form
38260A335484M28970M56721M30364L03025P5363j94460m63127p28088r52895j022399
38250c31042q34985m30263J3163L06949L71204K60260J13067O0612J33101K44535
38240i3399K80074J92115J2604j81286k79662j71891J52618N39687P73444P59642
38230A983946N69022L12532M4393k01100l57101l61593k12815L9527L14651M87456
38220B618918M25572J19196k48112m35321l67194j82593n7926l0385j6988L2623
38210A857790N4207n0413k76656m92435n61222m70872l16491j72536l0328J30065
38200c28891K64425L05702K48434J43094K6669q7006j59000j37310m0624K4108
38190B59601k7595j53760k31278j93957r2174j9818j5410m3404m5805O926J00670
$$ plain form
38179 -456004 -267515 -49720 120761 211616 274173 411003 689012 1078483 1477601 1793544
38169 1793544 1999338 2125611 2217274 2304617 2405263 2540032 2737214 3011168 3329380 3607615
38159 3607615 3755558 3738358 3594495 3399541 3223828 3118875 3112625 3188464 3271484 3260858
38149 3260858 3095730 2795699 2441632 2124366 1910034 1834492 1901071 2067596 2250209 2372302
38139 2372302 2423798 2453637 2485763 2461779 2301482 2014614 1706111 1449339 1192589 833519
38129 833519 369645 -72475 -362851 -485103 -516561 -528657 -535365 -519533 -478784 -450887 -514466
38118 -514466 -753436 -1187666 -1729909 -2228327 -2557991 -2667260 -2559809 -2280339 -1928792 -1639199
38108 -1639199 -1497051 -1483950 -1525778 -1577179 -1627856 -1648394 -1591778 -1468499 -1377885 -1427556 -1631412
$$ packed form
38179d56004J88489K17795J70481R0855O2557J36830K78009L89471L99118L15943
38169A793544K05794J26273R1663Q7343J00646J34769J97182K73954L18212K78235
38159C607615J47943j7200j43863j94954j75713j04953o250P5839Q3020j0626
38149C260858j65128l00031l54067l17266k14332p5542O6579J66525J82613J22093
38139B372302N1496K9839L2126k3984j60297k86868l08503k56772k56750l59070
38129H33519m63874m42120k90376j22252l1458j2096o708J5832M0749K7897o3579
38118e14466k38970m34230n42243m98418l29664j09269J07451K79470L51547K89593
38108a639199J42148J3101m1828n1401n0677k0538N6616J23279R0614m9671k03856
$$ plain form
38097 -1631412 -1903122 -2132367 -2246091 -2213381 -2033151 -1740786 -1421804 -1197994 -1165474 -1311531
38087 -1311531 -1495221 -1556396 -1478471 -1425402 -1585261 -1980621 -2448278 -2784725 -2882651 -2752952
38077 -2752952 -2479721 -2170217 -1893269 -1617569 -1223684 -612311 193779 1063771 1861903
38068 1861903 2517676 3002242 3270028 3259151 2968839 2528599 2151418 1974896 1944413 1884400
38058 1884400 1696028 1454433 1291306 1213138 1078674 754926 266543 -212589 -493239 -494166
38048 -494166 -264154 86396 466511 825296 1112965 1258446 1221587 1074138 1005414 1215797
38038 1215797 1772873 2540360 3235835 3587740 3488340 3024192 2360804 1605341 793523 -17021
38028 -17021 -710826 -1211121 -1571761 -1907453 -2229040 -2399224 -2271360 -1834328 -1202351 -516220
$$ packed form
38097a631412k71710k29245j13724L2710J80230K92365L18982K23810L2520j46057
38087a311531j83690o1175P7925N3069j59859l95360m67657l36447r7926J29699
38077b752952K73231L09504K76948K75700L93885O11373Q06090Q69992P98132
38068A861903O55773M84566K67786j0877k90312m40240l77181j76522l0483o0013
38058A884400j88372k41595j63127p8168j34464l23748m88383m79132k80650r27
38048d94166K30012L50550L80115L58785K87669J45481l6859j47449o8724K10383
38038A215797N57076P67487O95475L51905r9400m64148o63388p55463q11818q10544
38028a7021o93805n00295l60640l35692l21587j70184J27864M37032O31977O86131
$$ plain form
38018 -516220 90425 468883 506266 243531 -113058 -359129 -458692 -508209 -556720 -520438
38008 -520438 -288816 129377 597930 972104 1197443 1298316 1304045 1212487 1021871 767996
37998 767996 503367 250403 12365 -165281 -195607 -52420 159893 293865 308819 282467
37988 282467 272042 220504 24690 -344580 -820030 -1307254 -1749124 -2141748 -2511589 -2865403
37978 -2865403 -3150107 -3278610 -3205351 -2960453 -2612785 -2232865 -1886699 -1602371 -1315900 -912043
37968 -912043 -369623 178218 580211 815967 941621 935457 708434 274386 -188715 -487444
37958 -487444 -560015 -445698 -179646 220323 700782 1168367 1530116 1703880 1609156 1199104
37948 1199104 515839 -303824 -1083428 -1671069 -1983233 -2032320 -1925989 -1814636 -1800429 -1867883
$$ packed form
38018e16220O06645L78458L7383k62735l56589k46071r9563m9517m8511L6282
38008e20438K31622M18193M68553L74174K25339J00873N729r1558j90616k53875
37998G67996k64629k52964k38038j77646l0326J43187K12313J33972J4954k6352
37988B82467j0425n1538j95814l69270m75450m87224m41870l92624l69841l53814
37978b865403k84704j28503P3259K44898L47668L79920L46166K84328K86471M03857
37968i12043N42420N47841M01993K35756J25654o164k27023m34048m63101k98729
37958d87444p2571J14317K66052L99969M80459M67585L61749J73764r4724m10052
37948A199104o83265q19663p79604n87641l12164m9087J06331J11353J4207o7454
$$ plain form
37938 -1867883 -1901381 -1799791 -1598461 -1460773 -1516860 -1717793 -1876620 -1835901 -1553347 -1052105
37928 -1052105 -384136 322814 866453 1102637 1058031 858706 568634 152890 -418368 -1098832
37918 -1098832 -1805463 -2465465 -2994909 -3279597 -3232807 -2873716 -2324526 -1726007 -1166857 -694370
37908 -694370 -372484 -297755 -533683 -1027276 -1606092 -2067882 -2277202 -2201417 -1902655 -1514192
37898 -1514192 -1183162 -984829 -887936 -820519 -755299 -705541 -658851 -569437 -428636 -297751
37888 -297751 -234428 -208588 -138913 -23054 6536 -204449 -667531 -1231820 -1731623 -2110587
37878 -2110587 -2376878 -2494088 -2399624 -2126923 -1824200 -1609384 -1452357 -1236319 -895602 -458223
37868 -458223 3744 417874 742965 1016972 1352610 1824421 2364822 2820379 3104727 3251764
$$ packed form
37938a867883l3498J01590K01330J37688n6087k00933j58827M0719K82554N01242
37928a052105O67969P06950N43639K36184m4606j99325k90072m15744n71258o80464
37918a098832p06631o60002n29444k84688M6790L59091N49190N98519N59150M72487
37908f94370L21886P4729k35928m93593n78816m61790k09320P5785K98762L88463
37898a514192L31030J98333R6893O7417O5220M9758M6690Q9414J40801J30885
37888b97751O3323K5840O9675J15859K9590k10985m63082n64289m99803l78964
37878b110587k66291j17210R4464K72701L02723K14816J57027K16038L40717M37379
37868d58223M61967M14130L25091K74007L35638M71811N40401M55557K84348J47037
$$ plain form
37858 3251764 3334536 3396602 3467000 3577076 3733534 3910558 4082197 4228979 4312318 4294843
37848 4294843 4201020 4106346 4043391 3969975 3865993 3814979 3932592 4225122 4554643 4737319
37838 4737319 4655469 4293979 3708086 2970757 2149999 1337638 676534 308510 275038 499950
37828 499950 882577 1363436 1873801 2283609 2480928 2502764 2530294 2731498 3119958 3551769
37818 3551769 3823677 3783195 3399520 2764687 2022706 1294129 673471 273953 221035 572245
37808 572245 1249865 2055395 2742143 3096802 3011688 2523012 1777495 950358 203993 -282604
37798 -282604 -309190 240112 1264826 2467347 3554903 4434627 5203835 5962986 6661323
37789 6661323 7118649 7165766 6757354 5987201 5032126 4073886 3238919 2584820 2122409 1824962
$$ packed form
37858C251764Q2772O2066P0398J10076J56458J77024J71639J46782Q3339j7475
37848D294843r3823r4674o2955p3416j03982n1014J17613K92530L29521J82676
37838D737319q1850l61490n85893p37329q20758q12361o61104l68024l3472K24912
37828D99950L82627M80859N10365M09808J97319K1836K7530K01204L88460M31811
37818C551769K71908m0482l83675o34833p41981p28577o20658l99518n2918L51210
37808E72245O77620Q05530O86748L54659q5114m88676p45517q27137p46365m86597
37798b82604k6586N49302J024714J202521J087556Q79724P69208P59151O98337
37789F661323M57326M7117m08412p70153r55075r58240q34967o54099m62411k97447
$$ plain form
37779 1824962 1616969 1402539 1150222 935772 864276 962724 1189015 1528774 2015145 2635450
37769 2635450 3274159 3782694 4073653 4128448 3964015 3639677 3266120 2950609 2727676 2560318
37759 2560318 2387825 2146837 1779829 1282558 748175 324970 113353 107166 210860 283252
37749 283252 194062 -90767 -454123 -695425 -684711 -447397 -108858 204373 402488 431961
37739 431961 299512 95409 -50926 -67101 8335 65929 10314 -190657 -513666 -902011
37729 -902011 -1268934 -1505328 -1525834 -1326909 -989212 -608886 -221539 216912 787007 1525292
37719 1525292 2342890 3015884 3309408 3161784 2738396 2278871 1907580 1616482 1390886
37710 1390886 1271528 1273970 1306373 1217506 914962 411854 -224465 -930127 -1646881 -2305471
$$ packed form
37779A824962k07993k14430k52317k14450p1496R8448K26291L39759M86371O20305
37769B635450O38709N08535K90959N4795j64433l24338l73557l15511k22933j67358
37759B560318j72493k40988l67008m97271n34383m23205k11617o187J03694P2392
37749B83252q9190k84829l63356k41302J0714K37314L38539L13231J98115K9473
37739D31961j32449k04103j46335j6175P5436N7594n5615k00971l23009l88345
37729i02011l66923k36394k0506J98925L37697L80326L87347M38451N70095P38285
37719A525292Q17598O72994K93524j47624m23388m59525l71291k91098k25596
37710A390886j19358K442L2403q8867l02544n03108o36319p05662p16754o58590
$$ plain form
37700 -2305471 -2846219 -3258498 -3571731 -3791042 -3864746 -3748051 -3491410 -3228208 -3066948 -3024979
37690 -3024979 -3071635 -3189152 -3359102 -3519064 -3575146 -3461770 -3190085 -2864308 -2648190 -2652138
37680 -2652138 -2810335 -2911266 -2798992 -2516985 -2221304 -2009792 -1900706 -1915618 -2066182 -2273675
37670 -2273675 -2423709 -2527846 -2729916 -3107900 -3550433 -3873366 -3981684 -3873577 -3583313
37661 -3583313 -3209223 -2925232 -2844259 -2883475 -2853050 -2668676 -2395393 -2096141 -1748061 -1344853
37651 -1344853 -992399 -829655 -886390 -1067564 -1256446 -1393555 -1471935 -1499579 -1472364 -1362462
37641 -1362462 -1133411 -783214 -370940 12067 291206 417758 354546 107308 -208076 -375761
37631 -375761 -224009 221577 754730 1169447 1403477 1504771 1513698 1428469 1259816 1058006
$$ packed form
37700b305471n40748m12279l13233k19311p3704J16695K56641K63202J61260M1969
37690c024979m6656j17517j69950j59962n6082J13376K71685L25777K16118l948
37680b652138j58197j00931J12274K82007K95681K11512J09086j4912j50564k07493
37670b273675j50034j04137k02070l77984m42533l22933j08318J08107K90264
37661c583313L74090K83991Q0973l9216L0425J84374K73283K99252L48080M03208
37651a344853L52454J62744n6735j81174j88882j37109p8380k7644K7215J09902
37641a362462K29051L50197M12274L83007K79139J26552o3212k47238l15384j67685
37631c75761J51752M45586N33153M14717K34030J01294Q927q5229j68653k01810
$$ plain form
37621 1058006 883232 796905 880893 1194866 1673695 2113214 2318005 2262705 2083615 1929710
37611 1929710 1855868 1846288 1886517 1981847 2121309 2256245 2339350 2392285 2512827 2779206 3144861
37600 3144861 3466099 3653389 3764009 3919130 4156698 4399322 4545788 4553996 4441988 4243857
37590 4243857 3966002 3565694 2986276 2245942 1480143 852113 414435 88131 -226108
37581 -226108 -560357 -909313 -1292231 -1740191 -2234840 -2688940 -2992261 -3083619 -3007449 -2909157
37571 -2909157 -2932339 -3073880 -3148200 -2937159 -2395093 -1697799 -1089869 -696220 -475824 -326863
37561 -326863 -212091 -185785 -315552 -588378 -899954 -1145192 -1320703 -1524380 -1839769 -2224828
37551 -2224828 -2529188 -2623127 -2500808 -2264604 -2037224 -1901361 -1891891 -1998842 -2166940 -2319280
$$ packed form
37621A058006j74774q6327Q3988L13973M78829M39519K04791n5300j79090j53905
37611A929710p3842r580M0229R5330J39462J34936Q3105N2935J20542K66379L65655
37600C144861L21238J87290J10620J55121K37568K42624J46466Q208j12008j98131
37590D243857k77855m00308n79418p40334p65799o28030m37678l26304l14239
37581b26108l34249l48956l82918m47960m94649m54100l03321r1358P6170R8292
37571b909157k3182j41541p4320K11041N42066O97294O07930L93649K20396J48961
37561c26863J14772K6306j29767k72826l11576k45238j75511k03677l15389l85059
37551b224828l04360r3939J22319K36204K27380J35863R470j06951j68098j52340
$$ plain form
37541 -2319280 -2403479 -2415421 -2381864 -2336626 -2318371 -2372203 -2531474 -2789150 -3082867 -3309700
37531 -3309700 -3377624 -3273186 -3083582 -2930308 -2866027 -2834881 -2720895 -2421191 -1898997 -1219140
37521 -1219140 -539087 -11918 336317 606003 877739 1098913 1148538 987838 708623 455894
37511 455894 348745 457915 786454 1234455 1613629 1744194 1565133 1166499 720244 362878
37501 362878 123704 -36849 -126047 -85775 125354 450614 768868 984625 1044907 892372
37491 892372 470611 -202615 -1001865 -1751356 -2304423 -2584433 -2597496 -2419029 -2133500 -1770592
37481 -1770592 -1319613 -802366 -290245 163186 570575 976550 1407527 1868230 2347754
37472 2347754 2802287 3160988 3372683 3418818 3262681 2835070 2124768 1265585 482619 -53906
$$ packed form
37541b319280q4199j1942L3557M5238J8255n3832j59271k57676k93717k26833
37531c309700o7924J04438J89604J53274O4281L1146J13986K99704N22194O79857
37521a219140O80053N27169L48235K69686K71736K21174M9625j60700k79215k52729
37511D55894j07149J09170L28539M48001L79174J30565j79061l98634m46255l57366
37501C62878k39174j60553q9198M0272K11129L25260L18254K15757O0282j52535
37491H92372m21761o73226p99250p49491n53067k80010j3063J78467K85529L62908
37481a770592M50979N17247N12121M53431M07389M05975M30977M60703M79524
37472B347754M54533L58701K11695M6135j56137m27611p10302q59183p82966n36525
$$ plain form
37462 -53906 -303971 -316478 -166644 67885 325865 589610 872674 1159986 1372915 1413305
37452 1413305 1248982 962811 721528 673700 839312 1085190 1226298 1168607 962229 737431
37442 737431 612681 646834 824975 1061107 1239632 1285732 1194898 995236 716361 419657
37432 419657 218044 197210 304759 364749 235715 -54667 -332768 -406321 -167359 365761
37422 365761 1042423 1632120 1955859 2001770 1889898 1711947 1435868 987719 397640 -175883
37412 -175883 -573379 -775275 -918233 -1173578 -1594863 -2074548 -2458458 -2703784 -2908344 -3189846
37402 -3189846 -3577189 -4034817 -4536611 -5051091 -5471425 -5634719 -5442248 -4931863 -4220757
37393 -4220757 -3417305 -2616434 -1941939 -1524223 -1401821 -1453393 -1451336 -1210831 -716450 -123996
$$ packed form
37462e3906k50065j2507J49834K34529K57980K63745K83064K87312K12929M0390
37452A413305j64323k86171k41283m7828J65612K45878J41108n7691k06378k24798
37442G37431j24750L4153J78141K36132J78525M6100r0834j99662k78875k96704
37432D19657k01613k0834J07549N9990j29034k90382k78101p3553K38962N33120
37422C65761O76662N89697L23739M5911j11872j77951k76079m48149n90079n73523
37412a75883l97496k01896j42958k55345m21285m79685l83910k45326k04560k81502
37402c189846l87343m57628n01794n14480m20334j63294J92471N10385P11106
37393d220757Q03452Q00871O74495M17716J22402n1572K057K40505M94381N92454
$$ plain form
37383 -123996 355730 582553 525591 227014 -232752 -742827 -1182359 -1467460 -1576431 -1520534
37373 -1520534 -1301768 -919644 -424729 49092 329986 307944 1217 -469225 -956189 -1331756
37363 -1331756 -1497253 -1417685 -1165665 -873276 -592686 -242410 250546 782520 1123052 1137554
37353 1137554 896441 552783 186997 -184301 -507641 -680981 -646259 -461795 -288464 -319918
37343 -319918 -692068 -1403204 -2306573 -3200302 -3933073 -4429120 -4652101 -4594822 -4303645 -3871062
37333 -3871062 -3386668 -2916416 -2536433 -2350004 -2428628 -2731150 -3103848 -3376541 -3460888 -3365386
37323 -3365386 -3146548 -2872795 -2618608 -2438154 -2310872 -2138758 -1841186 -1456339 -1125125
37314 -1125125 -971099 -1004286 -1120532 -1162534 -1003330 -635949 -204852 93508 175545 122906
$$ packed form
37383a23996M79726K26823n6962k98577m59766n10075m39532k85101j08971N5897
37373a520534K18766L82124M94915M73821K80894k2042l06727m70442m86964l75567
37363a331756j65497P9568K52020K92389K80590L50276M92956N31974L40532J4502
37353A137554k41113l43658l65786l71298l23340j73340L4722J84464J73331l1454
37343c19918l72150p11136r03369q93729p32771m96047k22981N7279K91177M32583
37333c871062M84394M70252L79983J86429p8624l02522l72698k72693q4347R5502
37323c365386K18838K73753K54187J80454J27282J72114K97572L84847L31214
37314a125125J54026l3187j16246m2002J59204L67381M31097K98360Q2037n2639
$$ plain form
37304 122906 65601 50824 49223 51453 114256 322394 732162 1334779 2041689 2716129 3254983
37293 3254983 3645214 3924810 4099793 4127843 3981514 3698953 3359574 3017194 2657653 2218239
37283 2218239 1660003 1033023 459048 33716 -244351 -430515 -534182 -495046 -270656 68745
37273 68745 352273 427329 274187 118 -285163 -571422 -897196 -1209447 -1335877 -1140679
37263 -1140679 -685415 -195736 129089 259437 316182 444279 687050 939945 1027470 862883
37253 862883 542483 262924 149505 189882 319372 510597 752234 983245 1103304 1054095
37243 1054095 864448 606361 323123 16890 -296711 -544437 -629976 -518909 -276190 -5143
37233 -5143 254784 570401 1050184 1714782 2411495 2878559 2942660 2668356 2291237 2009456
$$ packed form
37304A22906n7305j4777j601K230O2803K08138M09768O02617P06910O74440N38854
37293C254983L90231K79596J74983K8050j46329k82561l39379l42380l59541m39414
37283B218239n58236o26980n73975m25332k78067j86164j03667L9136K24390L39401
37273F8745K83528P5056j53142k74069k85281k86259l25774l12251j26430J95198
37263a140679M55264M89679L24825J30348N6745J28097K42771K52895Q7525j64587
37253H62883l20400k79559j13419M0377J29490J91225K41637K31011J20059m9209
37243A054095j89647k58087k83238l06233l13601k47726q5539J11067K42719K71047
37233e143K59927L15617M79783O64598O96713M67064O4101k74304l77119k81781
$$ plain form
37223 2009456 1878082 1889909 2065533 2411186 2851405 3277235 3631537 3888773 3992921 3905972
37213 3905972 3711730 3587747 3656394 3917641 4320857 4816573 5316279 5691741 5877808 5929679
37203 5929679 5928363 5868049 5684777 5363113 4964542 4574478 4266038 4086535 4014872 3936326
37193 3936326 3723407 3370509 3022102 2848635 2903706 3100119 3299592 3413791 3436039 3399357
37183 3399357 3319158 3184630 2998612 2800746 2635405 2509942 2401413 2293614 2184804 2058942
37173 2058942 1869543 1566897 1145524 663724 202662 -214966 -662499 -1231712 -1898505
37164 -1898505 -2493233 -2838509 -2908193 -2825852 -2723964 -2649242 -2604782 -2621009 -2731102 -2892762
37154 -2892762 -2990738 -2946013 -2809618 -2730902 -2834492 -3129642 -3519056 -3867154 -4055663 -3999309
$$ packed form
37223B009456j31374J1827J75624L45653M40219M25830L54302K57236J04148q6949
37213C905972j94242j23983O8647K61247M03216M95716M99706L75462J86067N1871
37203E929679j316o0314j83272l21664l98571l90064l08440j79503p1663p8546
37193C936326k12919l52898l48407j73467N5071J96413J99473J14199K2248l6682
37183C399357q0199j34528j86018j97866j65341j25463j08529j07799j08810j25862
37173B058942j89399l02646m21373m81800m61062m17628m47533n69213o66793
37164a898505n94728l45276o9684Q2341J01888P4722M4460j6227j10093j61660
37154b892762r7976M4725J36395P8716j03590k95150l89414l48098j88509N6354
$$ plain form
37144 -3999309 -3639611 -2948044 -1961922 -837167 156117 754773 869039 625446 227737
37135 227737 -209361 -675476 -1158199 -1583078 -1856687 -1915411 -1722845 -1280281 -685129 -148635
37125 -148635 103222 -25778 -448005 -966659 -1401821 -1671279 -1782529 -1766095 -1632468 -1400470
37115 -1400470 -1137520 -923721 -772048 -627017 -458742 -320055 -286134 -371501 -538760 -761222
37105 -761222 -1033763 -1329594 -1581482 -1710867 -1662155 -1418173 -1002085 -461897 154113 794035
37095 794035 1372009 1775604 1932789 1857882 1618037 1287132 958627 755793 757105 912273
37085 912273 1086401 1194588 1247064 1256255 1159726 871814 375102 -277894 -1025130 -1802858
37075 -1802858 -2494448 -2930904 -2995496 -2731443 -2316068 -1909870 -1544407 -1172799 -799498 -502880
$$ packed form
37144c999309L59698O91567R86122J124755R93284N98656J14266k43593l97709
37135B27737m37098m66115m82723m24879k73609n8724J92566M42564N95152N36494
37125a48635K51857j29000m22227n18654m35162k69458j11250J6434J33627K31998
37115a400470K62950K13799J51673J45031J68275J38687L3921q5367j67259k22462
37105g61222k72541k95831k51888j29385M8712K43982M16088N40188O16010O39922
37095G94035N77974M03595J57185p4907k39845l30905l28505k02834J312J55168
37085I12273J74128J08187N2476R191r6529k87912m96712o52996p47236p77728
37075a802858o91590m36456o4592K64053M15375M06198L65463L71608L73301K96618
$$ plain form
37065 -502880 -325583 -212302 -107006 -67303 -208850 -543964 -941776 -1260083 -1462024 -1586344
37055 -1586344 -1662194 -1695395 -1701258 -1702509 -1708474 -1730444 -1804481 -1964245 -2196052 -2448891 -2682950
37044 -2682950 -2877012 -2988955 -2947535 -2706783 -2295422 -1798702 -1302858 -869026 -540875 -336160
37034 -336160 -212765 -71956 158279 429241 589006 522462 271117 2900 -124408 -59282
37024 -59282 148952 400257 591897 672726 680800 702064 769215 818915 759414 550645 204389
37013 204389 -242942 -704669 -1022049 -1047052 -771090 -333047 116061 523505 903385 1250348
37003 1250348 1531651 1740867 1906700 2040282 2102988 2038412 1825954 1506966 1174301 927303
36993 927303 806793 767641 736816 699772 699535 747228 785508 780558 811890 1002232 1356700
$$ packed form
37065e02880J77297J13281J05296L9703j41547l35114l97812l18307k01941j24320
37055a586344p5850l3201n863j251n965k1970p4037j59764k31807k52839k34059
37044b682950j94062j11943M1420K40752M11361M96720M95844M33832L28151K04715
37034c36160J23395J40809K30235K70962J59765o6544k51345k68217j27308O5126
37024e9282K08234K51305J91640Q0829Q074K1264O7151M9700n9501k08769l46256
37013B04389m47331m61727l17380k5003K75962M38043M49108M07444L79880L46963
37003A250348K81303K09216J65833J33582O2706o4576k12458l18988l32665k46998
36993I27303j20510l9152l0825l7044k37M7693L8280m950L1332J90342L54468
$$ plain form
36982 1356700 1732087 1990104 2136682 2277406 2470400 2664495 2761495 2697755 2477884 2173551
36972 2173551 1888183 1680677 1516208 1327434 1130334 1037354 1136044 1390028 1685542 1943452
36962 1943452 2150864 2310113 2410040 2452067 2467831 2496378 2559627 2660069 2779324 2875543
36952 2875543 2909395 2887141 2857507 2845858 2806640 2673208 2463496 2312165 2365927 2632124
36942 2632124 2936039 3037811 2797977 2246191 1531190 842876 364358 223483 428495
36933 428495 849819 1287354 1557858 1531767 1155308 509517 -165529 -585034 -606893 -304578
36923 -304578 127346 496870 668137 600549 404415 306896 481594 911161 1450551 1988157
36913 1988157 2479389 2852935 2994697 2866828 2576516 2275062 2023363 1790018 1537150
$$ packed form
36982A356700L75387K58017J46578J40724J92994J94095R7000o3740k19871l04333
36972B173551k85368k07506j64469j88774j97100r2980R8690K53984K95514K57910
36962A943452K07412J59249R9927M2027J5764K8547O3249J00442J19255R6219
36952B875543L3852k2254k9634j1649l9218j33432k09712j51331N3762K66197
36942B632124L03915J01772k39834n51786p15001o88314m78518j40875K05012
36933D28495M21324M37535K70504k6091l76459o45791o75046m19505k1859L02315
36923c04578M31924L69524J71267o7588j96134r7519J74698M29567N39390N37606
36913A988157M91232L73546J41762j27869k90312l01454k51699k33345k52868
$$ plain form
36904 1537150 1257454 959035 676403 488664 471134 620281 864413 1151257 1484662 1868989
36894 1868989 2263045 2609451 2873712 3038200 3112657 3204212 3539394 4323363 5536060 6901710
36884 6901710 8092025 8947176 9494039 9803107 9890275 9745654 9383976 8829859 8095651
36875 8095651 7222664 6328861 5568523 5034131 4714739 4538630 4423619 4293960 4099341
36866 4099341 3840745 3551639 3241541 2888110 2495214 2115842 1790700 1505658 1251262
36857 1251262 1088974 1101022 1290326 1587156 1949669 2397469 2933007 3480598 3925321 4175818
36847 4175818 4174634 3892567 3348546 2617946 1808297 1049253 497457 277365 366650 582608
36837 582608 743312 828730 941252 1135376 1352111 1513186 1601003 1613549 1498638 1193727
$$ packed form
36904A537150k79696k98419k82632j87739j7530J49147K44132K86844L33405L84327
36894A868989L94056L46406K64261J64488P4457R1555L35182P83969J212697J365650
36884F901710J190315Q55151N46863L09068Q7168j44621l61678n54117p34208
36875H095651q72987q93803p60338n34392l19392j76109j15011j29659j94619
36866D099341k58596k89106l10098l53431l92896l79372l25142k85042k54396
36857A251262j62288J2048J89304K96830L62513M47800N35538N47591M44723K50497
36847D175818j184k82067n44021p30600q09649p59044n51796k20092Q9285K15958
36837E82608J60704Q5418J12522J94124K16735J61075Q7817J2546j14911l04911
$$ plain form
36827 1193727 726343 244956 -53784 -28228 347276 984339 1729439 2419782 2910554 3089503
36817 3089503 2924897 2529717 2149410 2033375 2289299 2848235 3538268 4163066 4542713
36808 4542713 4569386 4283808 3867195 3487266 3129957 2619144 1829630 863558 -4314 -543053
36798 -543053 -714409 -638379 -462664 -275051 -100867 60946 215647 377450 575823 832026
36788 832026 1119486 1364455 1500005 1499057 1332792 930289 242940 -643948 -1523385 -2229474
36778 -2229474 -2761893 -3221693 -3655457 -4010179 -4236026 -4386465 -4584477 -4885933 -5185119
36769 -5185119 -5277645 -5044510 -4573256 -4069745 -3649882 -3253750 -2764352 -2148768 -1450937 -708845
36759 -708845 52863 780605 1415533 1950988 2405259 2747003 2920954 2955945 2970627 3035040
$$ packed form
36827A193727m67384m81387k98740K5556L75504O37063P45100O90343M90772J78949
36817C089503j64606l95180l80307j16035K55924N58936O90033O24798L79647
36808D542713K6673k85578m16613l79929l57309n10813p89514r66072q67872n38739
36798e43053j71356P6030J75715J87613J74184J61813J54701J61803J98373K56203
36788H32026K87460K44969J35550r48j66265m02503o87349q86888q79437p06089
36778b229474n32419m59800m33764l54722k25847j50439j98012l01456k99186
36769e185119r2526K33135M71254N03511M19863L96132M89398O15584O97831P42092
36759g08845P61708P27742O34928N35455M54271L41744J73951L4991J4682O4413
$$ plain form
36749 3035040 3080480 2987266 2723014 2358951 1989161 1676347 1441649 1251299 1029999 746807
36739 746807 492570 421478 592533 899190 1183026 1402177 1656852 2038700 2471011 2723643
36729 2723643 2602157 2119715 1479876 911557 541257 390500 416612 523060 589078 556172
36719 556172 474110 418330 379915 291767 152599 48635 24172 -6053 -160043 -438864 -736294
36708 -736294 -987517 -1242762 -1571717 -1942667 -2235462 -2350368 -2263379 -1983419 -1503941 -823364
36698 -823364 3089 853090 1577325 2047775 2188071 1987669 1499598 819450 58112 -681583
36688 -681583 -1336411 -1922466 -2532996 -3248744 -4016669 -4632253 -4879467 -4706810 -4265452 -3784997
36678 -3784997 -3430182 -3262199 -3271683 -3385777 -3454787 -3308981 -2883451 -2270687 -1616041 -979059
$$ packed form
36749C035040M5440r3214k64252l64063l69790l12814k34698j90350k21300k83192
36739G46807k54237p1092J71055L06657K83836K19151K54675L81848M32311K52632
36729B723643j21486m82442o39839n68319l70300j50757K6112J06448O6018l2906
36719E56172q2062n5780l8415q8148j39168j03964k4463l0225j53990k78821k97430
36708g36294k51223k55245l28955l70950k92795j14906Q6989K79960M79478O80577
36698h23364Q26453Q50001P24235M70450J40296k00402m88071o80148p61338p39695
36688f81583o54828n86055o10530p15748p67925o15584k47214J72657M41358M80455
36678c784997L54815J67983r484j14094o9010J45806M25530O12764O54646O36982
$$ plain form
36668 -979059 -342044 253498 643749 653995 252496 -423105 -1161287 -1772543 -2129167 -2179523
36658 -2179523 -1955954 -1563742 -1153411 -882218 -849440 -1023420 -1240478 -1309585 -1126245 -687300
36648 -687300 -38473 746921 1562242 2304049 2923954 3408091 3713287 3776592 3591696 3222695
36638 3222695 2738338 2201904 1746229 1567904 1760713 2177279 2515882 2539997 2192677 1553895
36628 1553895 770384 14516 -583559 -1013838 -1367574 -1715404 -2018936 -2164677 -2058720
36619 -2058720 -1691853 -1159949 -645038 -341542 -356954 -672049 -1191294 -1812659 -2449775 -3022211
36609 -3022211 -3452368 -3669596 -3623177 -3324771 -2891516 -2509925 -2318470 -2333383 -2506462 -2825270
36599 -2825270 -3308949 -3913274 -4496793 -4909559 -5091746 -5071352 -4903794 -4654530 -4414915 -4261479
$$ packed form
36668i79059O37015N95542L90251J0246m01499o75601p38182o11256l56624n0356
36658b179523K23569L92212M10331K71193L2778j73980k17058o9107J83340M38945
36648f87300O48827P85394Q15321P41807O19905M84137L05196O3305j84896l69001
36638C222695m84357n36434m55675j78325J92809M16566L38603K4115l47320o38782
36628A553895p83511p55868n98075m30279l53736l47830l03532j45741J05957
36619b058720L66867N31904N14911L03496j5412l15095n19245o21365o37116n72436
36609c022211m30157k17228M6419K98406M33255L81591J91455j4913j73079l18808
36599b825270m83679o04325n83519m12766j82187K0394J67558K49264K39615J53436
$$ plain form
36589 -4261479 -4163100 -3963321 -3504823 -2778735 -1933520 -1146619 -519312 -93655 82583 -45188
36579 -45188 -481832 -1149523 -1904500 -2571389 -2989303 -3082106 -2908790 -2625735 -2383357 -2262401
36569 -2262401 -2293127 -2487870 -2829584 -3257681 -3698621 -4098746 -4403237 -4523533 -4373972 -3957734
36559 -3957734 -3398202 -2876202 -2540739 -2457730 -2590787 -2802077 -2903383 -2763761 -2399732 -1961505
36549 -1961505 -1619418 -1443654 -1369889 -1270901 -1069137 -786298 -484402 -177262 165999 527050
36539 527050 792435 836987 636210 270537 -157018 -567654 -893240 -1081193 -1132251 -1097313
36529 -1097313 -1026584 -958152 -956977 -1095562 -1349330 -1556761 -1547276 -1298405 -923858 -524129
36519 -524129 -103364 371497 892294 1415322 1907690 2362358 2789163 3211591 3661059 4162224
$$ packed form
36589d261479R8379J99779M58498P26088Q45215P86901O27307M25657J76238j27771
36579d5188m36644o67691p54977o66889m17914r2803J73316K83055K42378J20956
36569b262401l0726j94743l41714m28097m40940m00125l04491j20296J49561M16238
36559c957734N59532N22000L35463Q3009j33057k11290j01306J39622L64029M38227
36549a961505L42087J75764P3765R8988K01764K82839L01896L07140L43261L61051
36539E27050K65385M4552k00777l65673m27555m10636l25586j87953n1058L4938
36529a097313P0729O8432J175j38585k53768k07431R485K48871L74547L99729
36519e24129M20765M74861N20797N23028M92368M54668M26805M22428M49468N01165
$$ plain form
36509 4162224 4723745 5324572 5878851 6226585 6214131 5811951 5130808 4311646 3430028 2518747
36499 2518747 1636538 872681 304435 -18086 -69741 118186 426277 692353 815016 806601
36489 806601 743611 681366 625335 573914 565791 659159 853703 1059504 1181464 1223839 1256295
36478 1256295 1268460 1131416 755170 228602 -275776 -708012 -1158814 -1666972 -2103999 -2297660
36468 -2297660 -2205678 -1911995 -1505027 -1036492 -574592 -206158 40785 222675 397886 554310
36458 554310 650102 700919 791293 1005988 1367674 1823395 2264142 2576600 2724341 2786169
36448 2786169 2872502 2980061 2958336 2653061 2076693 1423253 930967 741328 850991 1139857
36438 1139857 1437140 1604677 1593299 1429113 1161642 844848 550056 349857 271858 287587
$$ packed form
36509D162224N61521O00827N54279L47734j2454m02180o81143q19162q81618r11281
36499B518747q82209p63857n68246l22521n1655J87927L08091K66076J22663q415
36489H06601o2990o2245n6031n1421q123R3368J94544K05801J21960M2375L2456
36478A256295J2165j37044l76246n26568n04378m32236m50802n08158m37027j93661
36468b297660R1982K93683M06968M68535M61900L68434K46943J81890J75211J56424
36458E54310R5792N0817R0374K14695L61686M55721M40747L12458J47741O1828
36448B786169Q6333J07559k1725l05275n76368o53440m92286j89639J09663K88866
36438A139857K97283J67537j1378j64186k67471l16794k94792k00199p7999J5729
$$ plain form
36428 287587 349869 422475 488369 576388 781046 1193783 1777481 2342460 2678808 2695929
36418 2695929 2435799 2019135 1620945 1427435 1515274 1771043 1995475 2099276 2154358 2255782
36408 2255782 2388358 2442390 2314935 1974454 1457627 824012 101453 -723037 -1641534 -2572998
36398 -2572998 -3412673 -4122555 -4724559 -5213419 -5543497 -5711403 -5775324 -5752602 -5559648 -5109779
36388 -5109779 -4433219 -3650778 -2863060 -2116025 -1436011 -820865 -204509 493995 1264023
36379 1264023 1989980 2555323 2917774 3075500 3020219 2764418 2377257 1939692 1463767 884282
36369 884282 134957 -773716 -1736756 -2593256 -3188550 -3422284 -3256746 -2707369 -1864979 -933282
36359 -933282 -185411 190353 220079 96138 -245 -4026 88006 304852 691200 1245400
$$ packed form
36428B87587O2282P2606O5894Q8019K04658M12737N83698N64979L36348J7121
36418B695929k60130m16664l98190j93510Q7839K55769K24432J03801N5082J01424
36408B255782J32576N4032j27455l40481n16827o33615p22559q24490r18497r31464
36398b572998q39675p09882o02004m88860l30078j67906o3921K2722J92954M49869
36388e109779O76560P82441P87718P47035O80014O15146O16356O98504P70028
36379A264023P25957N65343L62451J57726n5281k55801l87161m37565m75925n79485
36369H84282p49325r08673r63040q56500n95294k33734J65538N49377Q42390R31697
36359i33282P47871L75764K9726j23941r6383l781R2032K16846L86348N54200
$$ plain form
36349 1245400 1916528 2647288 3374051 3996589 4409996 4587676 4590643 4468949 4186431 3670586
36339 3670586 2910141 1976423 979927 48480 -674083 -1070900 -1118075 -891569 -511698 -102473
36329 -102473 214430 347607 288116 107318 -120727 -382151 -705672 -1115924 -1623064 -2222489
36319 -2222489 -2860389 -3407736 -3711426 -3694629 -3406211 -2976443 -2531032 -2132082 -1774152 -1430948
36309 -1430948 -1119810 -921616 -916744 -1087884 -1299176 -1396111 -1338705 -1232894 -1224305 -1360228
36299 -1360228 -1554707 -1676958 -1658223 -1517494 -1316510 -1118750 -982064 -954613 -1055207 -1258189
36289 -1258189 -1500511 -1706342 -1822370 -1849478 -1834369 -1810601 -1754462 -1625561 -1447980 -1315532
36279 -1315532 -1305838 -1421355 -1631763 -1939893 -2372589 -2925770 -3552213 -4194630 -4803467 -5333931
$$ packed form
36349A245400O71128P30760P26763O22538M13407J77680K967j21694k82518n15845
36339C670586p60445r33718r96496r31447p22563l96817m7175K26506L79871M09225
36329a02473L16903J33177n9491j80798k28045k61424l23521m10252n07140n99425
36319b222489o37900n47347l03690J6797K88418M29768M45411L98950L57930L43204
36309a430948L11138J98194M872j71140k11292r6935N7406J05811Q589j35923
36299a360228j94479j22251J8735J40729K00984J97760J36686K7451j00594k02982
36289a258189k42322k05831j16028k7108J5109K3768N6139J28901J77581J32448
36279a315532R694j15517k10408l08130m32696n53181o26443o42417o08837n30464
$$ plain form
36269 -5333931 -5762153 -6106601 -6402786 -6648205 -6794963 -6804539 -6691239 -6509469 -6323221 -6190052
36259 -6190052 -6129265 -6067958 -5846323 -5341678 -4614681 -3902476 -3430074 -3225130 -3127795 -2966049
36249 -2966049 -2690709 -2345404 -1961763 -1534544 -1086003 -701139 -477634 -463689 -650751 -983634
36239 -983634 -1342423 -1550849 -1478284 -1164231 -811872 -628628 -675997 -874404 -1120713 -1372535
36229 -1372535 -1637822 -1921699 -2186607 -2340971 -2275416 -1955790 -1499544 -1121632 -962170 -972381
36219 -972381 -992300 -926424 -815096 -753168 -792187 -930989 -1150630 -1424135 -1720572 -2035881
36209 -2035881 -2407262 -2867947 -3391217 -3892543 -4272593 -4448965 -4386820 -4149015 -3904051 -3829136
36199 -3829136 -3983711 -4292631 -4638013 -4923140 -5052908 -4928244 -4519958 -3933853 -3365059
$$ packed form
36269e333931m28222l44448k96185k45419j46758r576J13300J81770J86248J33169
36259f190052O0787O1307K21635N04645P26997P12205M72402K04944R7335J61746
36249b966049K75340L45305L83641M27219M48541L84864K23505J3945j87062l32883
36239i83634l58789k08426P2565L14053L52359J83244m7369j98407k46309k51822
36229a372535k65287k83877k64908j54364O5555L19626M56246L77912J59462j0211
36219i72381j9919O5876J11328O1928l9019j38802k19641k73505k96437l15309
36209b035881l71381m60685n23270n01326l80050j76372O2145K37805K44964P4915
36199c829136j54575l08920l45382k85127j29768J24664M08286N86105N68794
$$ plain form
36190 -3365059 -2984010 -2868778 -3011154 -3338247 -3720840 -3997324 -4030463 -3768207 -3264930 -2639161
36180 -2639161 -1984260 -1298155 -506020 426276 1388485 2141267 2459540 2295266 1816658
36171 1816658 1271941 790893 317668 -262532 -961360 -1676319 -2306804 -2822402 -3221118
36162 -3221118 -3484304 -3596468 -3561448 -3368998 -2986884 -2426837 -1794278 -1235099 -839341 -602779
36152 -602779 -441829 -219594 187597 774374 1359892 1712958 1742153 1547786 1306193 1138359
36142 1138359 1062239 994349 777198 271196 -519100 -1411686 -2157933 -2584279 -2641172 -2374910
36132 -2374910 -1903225 -1401961 -1058405 -1001654 -1268967 -1820720 -2557131 -3317392 -3907953 -4192075
36122 -4192075 -4176285 -3990102 -3761496 -3524494 -3262512 -3011397 -2869300 -2905279 -3106274 -3426384
$$ packed form
36190c365059L81049J15232j42376l27093l82593k76484l3139K62256N03277O25769
36180b639161O54901O86105P92135R32296R62209P52782L18273j64274m78608
36171A816658n44717m81048m73225n80200o98828p14959o30485n15598l98716
36162c221118k63186j12164L5020J92450L82114N60047O32559N59179L95758K36562
36152f02779J60950K22235M07191N86777N85518L53066K9195j94367k41593j67834
36142A138359p6120o7890k17151n06002p90296q92586p46247m26346n6893K66262
36132b374910M71685N01264L43556N6751k67313n51753p36411p60261n90561k84122
36122d192075J5790J86183K28606K37002K61982K51115J42097l5979k00995l20110
$$ plain form
36112 -3426384 -3838005 -4303910 -4740167 -5048866 -5166541 -5059555 -4722258 -4231076 -3751773
36103 -3751773 -3402798 -3112673 -2686965 -2029220 -1237982 -486013 114988 510281 666456
36094 666456 624905 541474 577485 740965 879046 822056 502133 -38362 -678332 -1247463
36084 -1247463 -1601606 -1731157 -1778853 -1907449 -2142017 -2354767 -2397326 -2230574 -1933939 -1621633
36074 -1621633 -1368015 -1191888 -1072945 -969092 -840094 -677645 -507015 -345869 -173462
36065 -173462 39310 283643 533542 813326 1198185 1715437 2266030 2677982 2839208 2766270
$$ packed form
36112c426384m11621m65905m36257l08699j17675J06986L37297M91182M79303
36103c751773L48975K90125M25708O57745P91238P51969O01001L95293J56175
36094F66456m1551q3431L6011J63480J38081n6990l19923n40495o39970n69131
36084a247463l54143j29551m7696j28596k34568k12750m2559J66752K96635L12306
36074a621633K53618J76127J18943J03853J28998J62449J70630J61146J72407
36065a73462K12772K44333K49899K79784L84859N17252N50593M11952J61226p2938
$$ [...]
##END NTUPLES=NMR SPECTRUM
##END=
