##TITLE=31Pdec_DE-146rm_4h
 Cl4,64 sc
 4.5.2026
##JCAMPDX= 6.0         $$ Bruker NMR JCAMP-DX V2.0
##DATA TYPE= NMR SPECTRUM
##DATA CLASS= NTUPLES
##ORIGIN= UXNMR, Bruker Analytische Messtechnik GmbH
##OWNER= root
$$ XWIN-NMR		Version 3.5
$$ Mon May  4 16:39:35 2026 Russian Standard Time (UT+4h)  she@DPX200
##.OBSERVE FREQUENCY= 81.013821
##.OBSERVE NUCLEUS= ^31P
##.ACQUISITION MODE= SIMULTANEOUS
##.ACQUISITION SCHEME= undefined
##.AVERAGES= 64
##.DIGITISER RES= 17
##SPECTROMETER/DATA SYSTEM= spect
##.PULSE SEQUENCE= zgpg30
##.SOLVENT NAME= DMSO
##.SHIFT REFERENCE= (INTERNAL, DMSO, 0, 197.392)
##AUDIT TRAIL= $$ (NUMBER, WHEN, WHO, WHERE, WHAT)
$$ ##TITLE= Audit trail, XWIN-NMR		Version 3.5
$$ ##JCAMPDX= 5.01
$$ ##ORIGIN= Bruker BioSpin GmbH
$$ ##OWNER= she
$$ F:/spectra/data/she/nmr/P31/2/pdata/1/auditp.txt
$$ ##AUDIT TRAIL=  $$ (NUMBER, WHEN, WHO, WHERE, WHAT)
(   1,<2026-05-04 16:38:39.93 +0400>,<she>,<DPX200>,
      <continue with go, POWCHK disabled, PULCHK disabled
       configuration hash MD5:
       00 E9 B6 7A A2 85 ED C7 34 08 36 98 17 FE 4E 26
       data hash MD5: 32K
       8A 9B 47 23 AB BD 79 25 95 82 4D 2C 4E 19 37 6A>)
(   2,<2026-05-04 16:38:41.68 +0400>,<she>,<DPX200>,
      <Start of raw data processing
       efp BC_mod = 2 LB = 1.5 FT_mod = 6 PKNL = 1 PHC0 = 1488.212 PHC1 = -221.8995 SI = 64K 
       data hash MD5: 64K
       D0 21 CF 1F 33 FB 47 76 50 97 B8 00 93 64 B0 E6>)
(   3,<2026-05-04 16:39:01.78 +0400>,<she>,<DPX200>,
      <pk PHC0 = 3.567466 PHC1 = 0 
       data hash MD5: 64K
       11 B9 E9 16 6E 75 6B 5A CB 7A 85 87 4C 74 FA B9>)
(   4,<2026-05-04 16:39:05.79 +0400>,<she>,<DPX200>,
      <abs ABSG = 5 
       data hash MD5: 64K
       15 77 0C 0D 20 3D 4B 93 6E E6 CA 11 51 ED 14 B5>)
$$ ##END=
$$ 
$$ hash MD5
$$ 54 49 2A 54 3E 5E 75 CB 44 CE 46 86 4B CD E6 2B
##$RELAX= 
##$RELAX= 
##$RELAX= 
##$RELAX= 
##$RELAX= 
##$RELAX= 
##$RELAX= 
##$RELAX= 
$$ Bruker specific parameters
$$ --------------------------
##$DU= <F:/spectra>
##$EXPNO= 2
##$NAME= <P31>
##$PROCNO= 1
##$TYPE= <nmr>
##$USER= <she>
##$AMP= (0..31)
100 100 100 100 100 100 100 100 100 100 100 100 100 100 100 100 100 100 
100 100 100 100 100 100 100 100 100 100 100 100 100 100 
##$AQSEQ= 0
##$AQ_mod= 1
##$AUNM= <au_zg>
##$AUTOPOS= <>
##$BF1= 81.014009
##$BF2= 200.13
##$BF3= 200.13
##$BF4= 200.13
##$BF5= 200.13
##$BF6= 200.13
##$BF7= 200.13
##$BF8= 200.13
##$BYTORDA= 1
##$CFDGTYP= 0
##$CFRGTYP= 5
##$CHEMSTR= <none>
##$CNST= (0..31)
1 1 145 1 1 1 1 1 1 1 1 1 1 1 1 1 1 1 1 1 1 1 1 1 1 1 1 1 1 1 1 1 
##$CPDPRG= <waltz16>
##$CPDPRG1= <>
##$CPDPRG2= <waltz16>
##$CPDPRG3= <>
##$CPDPRG4= <mlev>
##$CPDPRG5= <mlev>
##$CPDPRG6= <mlev>
##$CPDPRG7= <mlev>
##$CPDPRG8= <mlev>
##$CPDPRGB= <>
##$CPDPRGT= <>
##$D= (0..31)
0 1 0 0 0 0 0 0 0 0.06 0 0.03 2e-05 3e-06 0 0 0.0002 0 0 0 0 0 0 0 0 0 
0 0 0 0 0 0 
##$DATE= 1777898221
##$DBL= (0..7)
120 120 120 11 120 120 24 19 
##$DBP= (0..7)
150 150 150 150 150 150 150 150 
##$DBP07= 0
##$DBPNAM0= <>
##$DBPNAM1= <>
$$ [...]
##$SUBNAM3= <"">
##$SUBNAM4= <"">
##$SUBNAM5= <"">
##$SUBNAM6= <"">
##$SUBNAM7= <"">
##$SUBNAM8= <"">
##$SUBNAM9= <"">
##$SW= 400.765351723535
##$SWIBOX= (0..15)
0 1 3 0 0 0 0 0 0 0 0 0 0 0 0 0 
##$SW_h= 32467.5324675325
##$TD= 32768
##$TD0= 1
##$TE= 0
##$TE2= 300
##$TE3= 300
##$TEG= 300
##$TL= (0..7)
0 120 53 12 22 120 120 120 
##$TP= (0..7)
150 150 150 150 150 150 150 150 
##$TP07= 0
##$TPNAME0= <>
##$TPNAME1= <>
##$TPNAME2= <>
##$TPNAME3= <>
##$TPNAME4= <>
##$TPNAME5= <>
##$TPNAME6= <>
##$TPNAME7= <>
##$TPOAL= (0..7)
0.5 0.5 0.5 0.5 0.5 0.5 0.5 0.5 
##$TPOFFS= (0..7)
0 0 0 0 0 0 0 0 
##$TUNHIN= 0
##$TUNHOUT= 0
##$TUNXOUT= 0
##$USERA1= <user>
##$USERA2= <user>
##$USERA3= <user>
##$USERA4= <user>
##$USERA5= <user>
##$V9= 5
##$VALIST= <valist>
##$VCLIST= <CCCCCCCCCCCCCCC>
##$VD= 0
##$VDLIST= <DDDDDDDDDDDDDDD>
##$VPLIST= <PPPPPPPPPPPPPPP>
##$VTLIST= <TTTTTTTTTTTTTTT>
##$WBST= 1024
##$WBSW= 4
##$XGAIN= (0..3)
0 0 0 0 
##$XL= 0
##$YL= 0
##$YMAX_a= 49053
##$YMIN_a= -63836
##$ZGOPTNS= <>
##$ZL1= 120
##$ZL2= 120
##$ZL3= 120
##$ZL4= 120
##$ABSF1= 197.3918
##$ABSF2= -203.3724
##$ABSG= 5
##$ABSL= 3
##$ALPHA= 0
##$AQORDER= 0
##$ASSFAC= 0
##$ASSFACI= 0
##$ASSFACX= 0
##$ASSWID= 0
##$AUNMP= <proc_1d>
##$AZFE= 0.1
##$AZFW= 0.5
##$BCFW= 0
##$BC_mod= 2
##$BYTORDP= 0
##$COROFFS= 0
##$CY= -3
##$DATMOD= 1
##$DC= 0
##$DFILT= <>
##$DTYPP= 0
##$F1P= 0
##$F2P= 0
##$FCOR= 1
##$FTSIZE= 65536
##$FT_mod= 6
##$GAMMA= 0
##$GB= 0
##$INTBC= 1
##$INTSCL= 9.790993e-09
##$ISEN= 30
##$LB= 1.5
##$LEV0= 0
##$LPBIN= 0
##$MAXI= 10000
##$MC2= 0
##$MEAN= 0
##$ME_mod= 0
##$MI= 50
##$NCOEF= 0
##$NC_proc= -8
##$NLEV= 6
##$NOISF1= 182.463
##$NOISF2= 159.3651
##$NSP= 0
##$NTH_PI= 0
##$NZP= 0
##$OFFSET= 197.3918
##$PC= 4
##$PHC0= 1491.78
##$PHC1= -221.8995
##$PH_mod= 1
##$PKNL= yes
##$PPARMOD= 0
##$PSCAL= 0
##$PSIGN= 0
##$REVERSE= no
##$SF= 81.014063255964
##$SI= 65536
##$SIGF1= 159.3651
##$SIGF2= -187.1042
##$SINO= 113.3802
##$SIOLD= 16384
##$SREGLST= <1H.CDCl3>
##$SSB= 0
##$STSI= 65536
##$STSR= 0
##$SW_p= 32467.5324675325
##$SYMM= 0
##$S_DEV= 0
##$TDeff= 32768
##$TDoff= 0
##$TI= <>
##$TILT= no
##$TM1= 0
##$TM2= 0
##$TOPLEV= 0
##$USERP1= <user>
##$USERP2= <user>
##$USERP3= <user>
##$USERP4= <user>
##$USERP5= <user>
##$WDW= 1
##$XDIM= 65536
##$YMAX_p= 459273547
##$YMIN_p= -220932191
$$ End of Bruker specific parameters
$$ ---------------------------------
##NTUPLES= NMR SPECTRUM
##VAR_NAME=  FREQUENCY,     SPECTRUM/REAL,   SPECTRUM/IMAG
##SYMBOL=    X,             R,               I
##VAR_TYPE=  INDEPENDENT,   DEPENDENT,       DEPENDENT
##VAR_FORM=  AFFN,          ASDF,            ASDF
##VAR_DIM=   65536,         65536,           65536
##UNITS=     HZ,            ARBITRARY UNITS, ARBITRARY UNITS
##FACTOR=    0.49542278885378, 1,            1
##FIRST=     15991.5117654749, 0,            0
##LAST=      -16476.0207020576, 0,           0
##MIN=       -16476.0207020576, -220932191,  0
##MAX=       15991.5117654749, 459273547,    0
$$ Real data points
##PAGE= N=1
##DATA TABLE= (X++(R..R)), XYDATA
$$ [...]
46060a365407j077582K135283K414823J46638n29124J431883K558865R58721m80750
46051F193350J177068M023360L689470o34559m821623m653146p02376K655494
46043F927038K653285Q13026m67708j735754m392681o485741m595726K44571K842684
46034d197006J061582j436264j327962j71874j81798K08105K617941M189471J750517
46025B512712j941954j594887K182158L402320k42791m078500l489499Q5097K249062
46016i16282J525271j45082p40855o1957O39315o0179k009444l025987j526602
46007f321802Q39327J218726k25581p56847M38840J332418R79424R24929J695727
45998A25161J464123r6350k22113K116664L193282m3835m148310l346720J766819
$$ plain form
46060 -1365407 -2442989 -307706 2107117 2253755 1724631 3156514 5715379 6674100 6193350
46051 6193350 7370418 11393778 15083248 14448689 9627066 4973920 4271544 6927038
46043 6927038 9580323 10393349 9925641 8189887 3797206 -2688535 -7284261 -7039690 -4197006
46034 -4197006 -3135424 -4571688 -5899650 -6071524 -6253322 -6045217 -3427276 762195 2512712
46025 2512712 570758 -1024129 1158029 4560349 4317558 239058 -3250441 -3165344 -916282
46016 -916282 608989 463907 -276948 -338905 300410 240231 -1769213 -4795200 -6321802
46007 -6321802 -5482475 -4263749 -4489330 -5246177 -4807337 -3474919 -2495495 -1570566 125161
45998 125161 1589284 1492934 1270821 3387485 6580767 6536932 2388622 -958098 808721
45989H08721M611992J889724k181101k445150L17183J811141P49343m90238m84444
45980D587171n73569j781009k655809j460921J028904K330600J251234r43971
45972A782630k102720j174154J200596L350810L760914K219882J25063o71760
45964H491261L11768J580498J183712j051720l096368k882279p17422J130626
45956D950076J329096Q51913P49152l1930k614433m802219k823328K815697O337936
45947F761960L671460j953875m168102j506696J952130K892035J950859P35228
45939A0334999n78140j783635j952634j403510j770995l110078l499850k381522
45931f145365j386009q72184R15431L674732L830301M7514l565048l062941l73589
$$ plain form
45989 808721 5420713 7310437 5129336 2684186 3001369 4812510 5561853 5071615 4587171
45980 4587171 4013602 2232593 -423216 -1884137 -855233 1475367 2726601 1782630
45972 1782630 -320090 -1494244 -293648 3057162 6818076 9037958 9163021 8491261
45964 8491261 8803029 10383527 11567239 10515519 7419151 4536872 3819450 4950076
45956 4950076 6279172 7131085 7880237 7848307 5233874 431655 -2391673 424024 6761960
45947 6761960 10433420 8479545 4311443 2804747 4756877 7648912 9599771 10334999
45939 10334999 9756859 7973224 6020590 4617080 2846085 -263993 -3763843 -6145365
45931 -6145365 -7531374 -8403558 -7488127 -3813395 16906 64420 -3500628 -6563569 -6937158
45922f937158M35210j98561R04592L199940L031058J67285j362673M09600K565583
45913B214876K016934m11685k011105j648389l7912J341938Q90873j642001m027007
45904c313478l788859j475530L41776P85339Q24999M18082j207887k695697j620400
45895a1731655J370773L063758K619648K195694K241926O38900k323345k838744
45887d763045L33707K992145J604913j363720j485267J320016L846627M469283
45879F954659L645681J628388j142787k951384k790162j921860j421561l87218
45871A613756J242530J018958j874276l762146j535959K037079K396724L32783
45863A469449J0754J412609N28639l022685m332886o65607M081572M715178J281785
$$ plain form
45922 -6937158 -6501948 -6700509 -5795917 -2595977 435081 602366 -760307 -350707 2214876
45913 2214876 4231810 3820125 1809020 160631 122719 1464657 2355530 713529 -3313478
45904 -3313478 -7102337 -8577867 -8236091 -7450752 -6625753 -6207671 -7415558 -10111255 -11731655
45895 -11731655 -10360882 -7297124 -4677476 -2481782 -239856 399044 -1924301 -4763045
45887 -4763045 -4429338 -1437193 167720 -1196000 -2681267 -1361251 2485376 6954659
45879 6954659 10600340 12228728 11085941 8134557 5344395 3422535 2000974 1613756
45871 1613756 2856286 3875244 2000968 -1761178 -3297137 -1260058 1136666 1469449
45863 1469449 1480203 2892812 3421451 398766 -3934120 -4599727 -518155 4197023 5478808
45854E478808k071706k574613j095376j47851j044612k580210k332045K48894
45846f118711K872891L536009L059526K728240J439496j811107m438301l295770
45838b027727j21131N51889j515357k169283j01510J151821k48906j243578L98208
45829e325574K075589J337432M72324K088725L778747J933544j719603k448284
45821B192900P2364J612927J69251j743713j934933j478559j649246j392527L80924
45812c770612K432269K940760K028922J076707O78775N09343L40636J07637m87166
45803E857271j545212k393633k042613k73992J844523K633192J384368n96404
45795D867500j258209n14301o07048k811058m982450m178314r61531J255665J135254
$$ plain form
45854 5478808 3407102 832489 -262887 -410738 -1455350 -4035560 -6367605 -6118711
45846 -6118711 -3245820 290189 3349715 6077955 7517451 5706344 1268043 -2027727
45838 -2027727 -2148858 -1596969 -3112326 -5281609 -5383119 -4231298 -4480204 -5723782 -5325574
45829 -5325574 -3249985 -1912553 -1440229 648496 4427243 6360787 4641184 2192900
45821 2192900 2265264 3878191 4047442 2303729 368796 -1109763 -2759009 -4151536 -3770612
45812 -3770612 -1338343 1602417 3631339 4708046 5386821 5896164 6236800 6344437 5857271
45803 5857271 4312059 1918426 -124187 -398179 1446344 4079536 5463904 4867500
45795 4867500 3609291 3094990 2487942 -323116 -5305566 -9483880 -10445411 -9189746 -8054492
45786h054492J035065K770314M306264K798694p21643k438322j010232R89279
45778c25073J279301Q93142J633737K701636K192617P13159O35828J866535J343728
45769A2934610k137873n200391m167994m34211J198191j000038l669865l330348
45761e807919q40517O35643M49814J012121L743459O460173N848166J745273k369498
45752A0876715l367925j821632m71990l14726j5318R83780J172920k62436j623965
45743E155423j411259r71421k063335l265210j837708J579621L437754K427936
45735C051801Q63111M03654j72567j652017k136783k96243J719633J201493j106565
45726A875517k423185j917078q13959K37767J317089J734770J113855J180961
$$ plain form
45786 -8054492 -7019427 -4249113 57151 2855845 2134202 -304120 -1314352 -325073
45778 -325073 954228 1847370 3481107 6182743 8375360 9088519 9724347 11590882 12934610
45769 12934610 10796737 5596346 1428352 994141 2192332 1192294 -2477571 -5807919
45761 -5807919 -6648436 -6012793 -5562979 -4550858 -807399 5652774 11500940 13246213 10876715
45752 10876715 7508790 5687158 5215168 4900442 4885124 5868904 7041824 6779388 5155423
45743 5155423 3744164 2772743 709408 -2555802 -4393510 -2813889 623865 3051801
45735 3051801 3914912 4318566 4145999 2493982 357199 60956 1780589 2982082 1875517
45726 1875517 -547668 -2464746 -3278705 -3040938 -1723849 10921 1124776 2305737
45718B305737L401404N215397K321754m498497q487166n009617K112750N226400
45710B588162K175799k178339l134057j345441j5201N3530L86220J544236K503246
45701B578155K810947L051274L065309J824794m09221j797662j679298j689750
45693G754548k810892l190195r60546K093927K243301j157672m584109m502144
45685e113782r71878L088133M864358L743335J547012O53958J184830Q41427j464799
45676H372594l296505j975040J125605K285669P23050p74933k71809J204673K070440
45667I463744J932424P92390p95335q51910J746168M304187L125561q05016l036906
45658A5875307k646994l038421m901313m215271K97496L489664J463513k026540
$$ plain form
45718 2305737 5707141 10922538 13244292 8745795 258629 -4750988 -2638238 2588162
45710 2588162 4763961 2585622 -548435 -1893876 -1909077 -1855547 -1469327 74909 2578155
45701 2578155 5389102 8440376 11505685 13330479 12921258 11123596 9444298 7754548
45693 7754548 4943656 1753461 792915 2886842 5130143 3972471 -611638 -5113782
45685 -5113782 -6085660 -2997527 1866831 5610166 7157178 7811136 8995966 9837393 8372594
45676 8372594 5076089 3101049 4226654 6512323 7235373 6460440 6188631 7393304 9463744
45667 9463744 11396168 12188558 11393223 10541313 12287481 16591668 19717229 18912213 15875307
45658 15875307 13228313 10189892 5288579 1073308 1370804 4860468 6323981 4297441
45650D297441j628602J254036J623617o59739j427733N49436K358318K146763
45642H513537P85021j068772l270422m097997j892361J601186L089261K270085
45634E929538J202088L64126r35116j571555j78415J487999J010026j91654N84101
45625G701138J799830J39837k741916k134133J581830L274845J655020N55535
45617A1831986R34853p39228m198829l528289K689323O876427L327698k777419
45609A4416522l392338M90110J845331j052012l469774k602158n64368N36193
45601F207506J058989J149169j9282j836434k376423j173417N31949J863506K448635
45592G854198J529715p48409k425414k361766k088301k608550j711552K192021
$$ plain form
45650 4297441 2668839 3922875 5546492 4886753 3459020 4008456 6366774 8513537
45642 8513537 9298558 8229786 4959364 861367 -1030994 570192 3659453 5929538
45634 5929538 7131626 7495752 6560636 4989081 4810666 6298665 7308691 7117037 7701138
45625 7701138 9500968 9640805 6898889 4764756 6346586 9621431 11276451 11831986
45617 11831986 12766839 12027611 7828782 4300493 6989816 13866243 17193941 14416522
45609 14416522 11024184 11514294 13359625 12307613 8837839 6235681 5671313 6207506
45601 6207506 7266495 8415664 8396382 6559948 4183525 3010108 3542057 5405563 7854198
45592 7854198 9383913 8635504 6210090 3848324 1760023 -848527 -2560079 -368058
45584c68058N846525N014446R92402j291834p13818o62691k564542l651267k065202
45575E35961J06812L72394r56739k427070l388892l120197q12686K316711L446759
45566c926947J923459K70957L01885O77703j64700r61879M11604L345883M903451
45557F781416L330326j67926k938989l378614j992125l38034Q25181J768504K199231
45548F088970R73858j626028l026754j615896N39951N53735q91562q61100R00633
45539A035807J694478M95867n65858r3797L88456m97301j416631o37667J037316
45530A440670J532364M73897o37041m81599Q83149K283152K308412O33622j254921
45521G181705j500640j75478Q57240M50139n81317q94234k89319K71860k86621
$$ plain form
45584 -368058 5478467 10492913 11485315 10193481 9479663 8816972 6252430 2601163 535961
45575 535961 642773 1015167 58428 -2368642 -5757534 -8877731 -9690417 -7373706 -3926947
45566 -3926947 -2003488 -1732531 -1430646 -752943 -917643 -1879522 -1467918 1877965 6781416
45557 6781416 10111742 9943816 7004827 3626213 1634088 1296054 2121235 3889739 6088970
45548 6088970 7062828 5436800 2410046 794150 1334101 1887836 996274 135174 1035807
45539 1035807 2730285 3226152 2660294 2566497 2954953 2457652 1041021 403354 1440670
45530 1440670 2973034 3446931 2809890 2328291 3211440 5494592 7803004 8436626 7181705
45521 7181705 5681065 5505587 6362827 6812966 6231649 5337415 5048096 5319956 5033335
45512E033335j899909k812586j277947J616209K597906Q95295j59066J536489
45504E529726K684776m64933n234241n629821j314863K121435J963238J546983
45496A202300L284932M349639K144461q36817j195173J52514N20753j1442j86489
45487I424678q11030k715504l914969k554407o71243j299521l437614l514905
45479i494515o61166K746872M666812M555765K285650j074595k686747j132514
45471g94438J163866J493069R12312J451655J625691q18090l559164k473870J143309
45462A44340J821341j501982l784148j752794J912381L885366M474153M303341
45454I501998J731501l133531o013109l851804M90896K479323J983417J527369
$$ plain form
45512 5033335 3133426 320840 -957107 659102 3257008 4152303 3993237 5529726
45504 5529726 8214502 7749569 2515328 -3114493 -4429356 -2307921 -344683 1202300
45496 1202300 4487232 8836871 10981332 10144515 8949342 9101856 9622609 9611167 9424678
45487 9424678 8613648 5898144 1983175 -571232 -1242475 -2541996 -5979610 -9494515
45479 -9494515 -10155681 -7408809 -2741997 1813768 4099418 3024823 338076 -794438
45471 -794438 369428 1862497 2774809 4226464 5852155 5034065 1474901 -998969 144340
45462 144340 1965681 463699 -3320449 -5073243 -3160862 724504 5198657 9501998
45454 9501998 11233499 8099968 2086859 -1764945 -1274049 1205274 3188691 4716060
45446D716060J246581j44403j380923k10106K170884K586757J233765J293365
45438A1511980L245340L856317J563641j171243k296723l264507n505344o824258
45430A115203m216802J400837N900609O557672M076374Q61064r82887o88458M16620
45421A4440232j86646k986006m924033k999480J288558L410360J568551j421006
45413H190530k335311j186682K10677J009554J240923Q32960L44116J104418K965259
45404A2376444L502050J433680p41287m4364K341879K821935J042106K08363J539244
45395B4480050K064000o95859m784944o359599m112513K90622M235815N338427
45387B0455999K750698j167410k471066l53838J907851K024791J735193K726103
$$ plain form
45446 4716060 5962641 5818238 4437315 4227209 6398093 8984850 10218615 11511980
45438 11511980 14757320 18613637 20177278 19006035 16709312 13444805 7939461 1115203
45430 1115203 -3101599 -1700762 4199847 10757519 14833893 15694957 14712070 14023612 14440232
45421 14440232 14253586 11267580 6343547 3344067 4632625 8042985 9611536 8190530
45413 8190530 5855219 4668537 4879214 5888768 7129691 7962651 8306767 9411185 12376444
45404 12376444 15878494 17312174 16570887 16526523 18868402 21690337 22732443 22940806 24480050
45395 24480050 26544050 25848191 21063247 14703648 10591135 10881757 15117572 20455999
45387 20455999 23206697 22039287 19568221 19214383 21122234 23147025 24882218 27608321
45379B7608321L015551R08350m93148K515757P460123Q426748M857502K155049
45371E6454253L227792M939016M426481L681830N071300O654646N633615L471988
45363I3560921L781966O830179R384225Q983653N886898J845513q70370l82122
45355A29020863K678269M939840M083095J723285P10943J082442R54687k1358
45347A45172066q00281j422823k528953l248643k516338j806301l366198o103048
45339A23379481o692423m850711l776506m634064m523413j692987P91737o57133
45331I7343981m688660o831909n232999j905075N76863J068149n47749l136627
45323G6645974m147965k119113Q28846J236432j103969l157322l265929l077489
$$ plain form
45379 27608321 30623872 31532222 31039074 33554831 41014954 49441702 54299204 56454253
45371 56454253 59682045 64621061 69047542 72729372 77800672 84455318 90088933 93560921
45363 93560921 97342887 104173066 113557291 122540944 128427842 130273355 129402985 129020863
45355 129020863 131699132 136638972 140722067 142445352 143156295 144238737 145193424 145172066
45347 145172066 144371785 142948962 140420009 137171366 134655028 132848727 129482529 123379481
45339 123379481 116687058 111836347 108059841 103425777 98902364 97209377 98001114 97343981
45331 97343981 92655321 85823412 80590413 78685338 79262201 80330350 79782601 76645974
45323 76645974 72498009 70378896 71207742 72444174 71340205 68182883 64916954 61839465
45315F1839465m177476n451997n294866m332185m002951l859685k393988J63778
45307C2490095J792785J281552m93123j769795j386637N40075K397465K110583
45299C6963000m14552k566738k192399o65963q00888k377488k525627o06379N32281
45290B5345247p24139j982548r37343N25531n79430l045478k983473J32989K646737
45281A8398093K109964O4469j330540k177365k892736k305597J33493K374093
45273A4373874K297853O70918n73453j427188k632454k784039L6364M007523M452249
45264A8421647O53m890691n253183j494326J911868K260044R47684M39218J031519
45255A3374433J287012M68059m89493l11532Q75021J573015Q08895m71658n91816
$$ plain form
45315 61839465 57661989 52209992 46915126 42582941 38579990 34720305 32326317 32490095
45307 32490095 34282880 35564432 35071309 33301514 31914877 32454952 34852417 36963000
45299 36963000 36548448 33981710 31789311 31123348 30322460 27944972 25419345 24812966 25345247
45290 25345247 24621108 22638560 21701217 22226748 21647318 18601840 15618367 15751356 18398093
45281 18398093 20508057 20572526 19241986 17064621 14171885 11866288 11999781 14373874
45273 14373874 16671727 17342645 16769192 15342004 12709550 9925511 9961875 13969398 18421647
45264 18421647 18422300 13531609 8278426 6784100 8695968 10956012 11903696 12342914 13374433
45255 13374433 14661445 15129504 14640011 14328479 15203500 16776515 17585410 17113752 16521936
45246A6521936M80972J021341M8194j265341j417694p11586m11913o35219n60357
45237A3070333k22232l83888p46978j52672J090387R77041j200343l293149l022513
45228F115986r45518P33758J134926Q15046K65j177128j395185M13448K520494
45219H216092K018717o05026j370727J523378M665978M101427P54387j548533
45211A7755693j879693k661501m766562n640412l237881P95179L382741L729175
45203G476739L231977K897029K495677J774636J052603N42090l1359r39425k021937
45194A6478030k816341k903587k227341j243873n76725l39605J427Q80151J913547
45185I165683K216543J441033K68973l30117k45686k51738p57384j134741q82125
$$ plain form
45246 16521936 17002908 18024249 18072443 16807102 15389408 14677822 14265909 13630690 13070333
45237 13070333 12848101 12464213 11717235 11564563 12654950 13631991 12431648 9138499 6115986
45228 6115986 5170468 5904226 7039152 7854198 7854463 6677335 5282150 5695598 8216092
45219 8216092 10234809 9629783 8259056 9782434 14448412 18549839 19304226 17755693
45211 17755693 15876000 13214499 8447937 2807525 -430356 364823 3747564 7476739
45203 7476739 10708716 13605745 16101422 17876058 18928661 19470751 19439392 18499967 16478030
45194 16478030 13661689 10758102 8530761 7286888 6710163 6370558 6371985 7252136 9165683
45185 9165683 11382226 12823259 13092232 12762115 12516429 12264691 11507307 10372566 9490441
45176I490441q08167j822959k829229j536845K196388N522540N976195M149029
45168B0337393J937743j36012k172721l055461j760512L26727Q39410j56149m41878
45159A5718540P74077J819425J301176j78211j436668k060258j988237j339372
45151A2610472q16648p96028k63475J521415K823724J411856j487648k194316
45143A2809352J67539K512739K584223J706882J654417J940121J719871J393636
45135B6488780P32088j469807m091983l483083J039135M852363M125366J062560
45127B9255419k29753J02378m06924j464565j529374j850174l794951m318268
45119A5763788r3919N253201M832623p93321l740750q25367J851606p76315m658112
$$ plain form
45176 9490441 8682274 6859315 4030086 2493241 4689629 10212169 16188364 20337393
45168 20337393 22275136 22139124 19966403 16910942 15150430 15477157 16316567 16160418 15718540
45159 15718540 16492617 18312042 19613218 19435007 17998339 15938081 13949844 12610472
45151 12610472 11793824 10997796 10734321 12255736 15079460 16491316 15003668 12809352
45143 12809352 12976891 15489630 18073853 19780735 21435152 23375273 25095144 26488780
45135 26488780 27220868 25751061 21659078 18175995 19215130 24067493 28192859 29255419
45127 29255419 29025666 29128044 28721120 27256555 25727181 23877007 20082056 15763788
45119 15763788 15669869 20923070 25755693 24962372 21221622 20396255 22247861 21471546 16813434
45110A6813434l589462J040846L235319J706357L23638R90233J495183Q6631k201244
45101A9900935l940414m585392l309140K92574M158493N288513L587688J598128
45093B2991385L17041j710751m487538m954514j177139M008239N804976K974836
45085B3766535j227534l117259k026670J55055J422430J103199k78670j744927
45077A8052159k493615k249005j201384M55184K776149N427901O859543N133324
45069C2760256M26516l987929m615689j555358J739164K533837J325202Q2879
45061B8708878l87685m68088l97760p9676M91946J389301K567944K975389J124790
45052C5925039k379552m225785k066277J950928L353280R92095j444831k55507
$$ plain form
45110 16813434 13223972 14264818 17500137 19206494 19530132 20520365 22015548 22102179 19900935
45101 19900935 15960521 11375129 8065989 8358563 12517056 17805569 21393257 22991385
45093 22991385 23308426 21597675 17110137 12155623 10978484 14986723 20791699 23766535
45085 23766535 22539001 19421742 17395072 17550127 18972557 20075756 19797086 18052159
45077 18052159 15558544 13309539 12108155 12563339 15339488 20767389 27626932 32760256
45069 32760256 33186772 29198843 24583154 23027796 24766960 27300797 28625999 28708878
45061 28708878 28321193 27853105 27455345 27375669 27867615 29256916 31824860 34800249 35925039
45052 35925039 33545487 29319702 27253425 29204353 32557633 33549728 32104897 31849390
45044C1849390L435013M945812J656850l795071o250576l460219J727109M574988
45036C4683296L258859K419k068064k190173j977042l071742n296974o757691
45028A6582888n587883j939765J831140L432048K826191J556683N13452l96120
45020A8818634r13188o39400n37399k097291m512720m813976j787315K110697
45012E628042L856576L110307J256390p87646k239664j875571J68858J524992
45004A0642284O01587q59642l66702J467335K009392N02156j533938k861969l017326
44995F583177j223654K296967M636416L025567q73686k712466j491877l93176
44987I847268j167037j551810K84305K308733J963255J98877m28302L29459R84478
$$ plain form
45044 31849390 35284403 40230215 41887065 38091994 31841418 28381199 30108308 34683296
45036 34683296 37942155 37944574 35876510 33686337 31709295 28637553 23340579 16582888
45028 16582888 10995005 9055240 10886380 14318428 17144619 18701302 19214754 18818634
45020 18818634 17905446 17266046 16728647 14631356 10118636 5304660 3517345 5628042
45012 5628042 9484618 12594925 13851315 13063669 10824005 8948434 9117292 10642284
45004 10642284 11243871 10384229 10017527 11484862 13494254 13996410 12462472 9600503 6583177
44995 6583177 5359523 7656490 12292906 15318473 14444787 11732321 10240444 9847268
44987 9847268 8680231 7128421 7412726 9721459 11684714 11883591 11455289 11784748 12769226
44978A2769226J241911J766319K099936J272545k15456j224586k116976l772459
44970A1820460n008932l675241m65483J100718m57013k077272l65573L250714
44962D122378M051626M22636l718145l852920m13343K405908K350250J120028
44954F488418N89236j31374k209902l945103k893460o3024J112069j10960p76984
44945a941084R07825K613138J448179j679018l361020k077948O01754K387404
44937a100770K202141L67526j656497k090591o07822J037898J100908M7927l16248
44928a015528O18895J728755J830414R35178J015O5532J307813K586289K530555
44919A0588918J367634O21766O71106K13707j057759j292996M00129J664620J42546
$$ plain form
44978 12769226 14011137 15777456 17877392 19149937 18934481 17709895 15592919 11820460
44970 11820460 6811528 3136287 2670804 3771522 3314509 1237237 871664 4122378
44962 4122378 8174004 8596640 4878495 1025575 612232 3018140 5368390 6488418
44954 6488418 7077654 6946280 4736378 791275 -2102185 -2165209 -1053140 -1164100 -1941084
44945 -1941084 -1033259 1579879 3028058 1349040 -2011980 -4089928 -3488174 -1100770
44937 -1100770 1101371 1468897 -187600 -2278191 -2886013 -1848115 -747207 -699280 -1015528
44928 -1015528 -396633 1332122 3162536 4097714 4098729 4164261 5472074 8058363 10588918
44919 10588918 11956552 12578318 13249424 13463131 12405372 11112376 11512505 13177125 13319671
44910A3319671k507592k811551p56465M86270j69982m12556Q84902J454498k74531
44901I212664k000788r17513K028341L871643L840786L010042J227634k131827
44893A8140982m919854l573684J464510N022066L549590n01870k754870k844303
44885A3582567l181131l586291j457226K705935M345277J220270k805360l139365
44877G684676q23099J07382m89620N81567L011328K206875l047645p055759m654855
44868b479150J285879L841328J291238j843979j837760M99467K946673M649228
44860H352924N043861L510208J255579O19700J364461N22615k755109n207437
44852A2706802m172603j446072k3934M18308J705369K850702J335677k158649
$$ plain form
44910 13319671 10812079 8000528 7244063 7730333 7560351 7147795 8032697 9487195 9212664
44901 9212664 7211876 6294363 8322704 12194347 16035133 19045175 20272809 18140982
44893 18140982 13221128 9647444 11111954 16134020 19683610 19181740 16426870 13582567
44885 13582567 10401436 6815145 5357919 8063854 12409131 13629401 10824041 7684676
44877 7684676 6861577 6968959 6479339 7060906 10072234 12279109 9231464 2175705 -2479150
44868 -2479150 -1193271 2648057 3939295 2095316 257556 757023 3703696 8352924
44860 8352924 13396785 16906993 18162572 18782272 20146733 20669348 17914239 12706802
44852 12706802 8534199 7088127 7064193 7482501 9187870 12038572 13374249 11215600
44844A1215600l980839k549598j2362J538359K513075L601895L854321K479006
44836A8659457N11377q54958j958944l233249l650939k327959l97386N72958R76935
44827H297292J916881K420353N24791k951306m529967k853958q30635j300968
44819F92483k638014j266879K539714M592468K827038L60874Q50703L099620K996081
44810A4054088k10143k696989j562518J220268J906564J34845j223170m74678
44802A1148267R86576J270726M57333k74713m91876m83102m24725n42276j242693
44793A0403517k098450j625796O02326K451069J627022q74265j914643p99071
44785G771709L78m60437N90835M620971P316242L413878m876359r059655m986233
$$ plain form
44844 11215600 7234761 4685163 4672801 6211160 8724235 12326130 16180451 18659457
44836 18659457 19170834 18315876 16356932 13123683 9472744 7144785 6747399 7320357 8297292
44827 8297292 10214173 12634526 13159317 10208011 5678044 2824086 1993451 692483
44819 692483 -1945531 -3212410 -672696 3919772 6746810 7107684 7958387 11058007 14054088
44810 14054088 13843945 11146956 9584438 10804706 12711270 12846115 11622945 11148267
44802 11148267 12134843 13405569 13862902 13588189 13096313 12613211 12188486 11646210 10403517
44793 10403517 8305067 6679271 7281597 9732666 11359688 10485423 8570780 7771709
44785 7771709 7772087 7311650 7902485 12523456 19839698 23253576 18377217 9317562 4331329
44776D331329J937405M320306J800343q07539j291961j378238j765307q34986
44768F311352J408965K455568J475876P21379J311782J170991q51579k209870
44760A1794464q15887R07740l71976l287551l640541p93547J657196J292680o26887
44751F115691k227461l174204l156919j425371J159493K451955K412529L265643
44743E421356N110339M743349R33647k426575j580339J319658J598103n74643
44735A4544895q10399K000855L721493J635174j272710j187325O95717N69832
44727A9897532j756933k831811j211170M65972j62323j650538j273556Q22040
44719A2299213K101135J369454k3608n11565j0496R29600J935367K120884K67462
$$ plain form
44776 4331329 6268734 10589040 12389383 11581844 10289883 8911645 7146338 6311352
44768 6311352 7720317 10175885 11651761 12373140 13684922 14855913 14004334 11794464
44760 11794464 10978577 11886317 11514341 8226790 4586249 3792702 5449898 6742578 6115691
44751 6115691 3888230 714026 -2442893 -3868264 -2708771 -256816 2155713 5421356
44743 5421356 10531695 15275044 16208691 13782116 12201777 13521435 15119538 14544895
44735 14544895 13734496 15735351 19456844 21092018 19819308 18631983 19327700 19897532
44727 19897532 18140599 15308788 14097618 14563590 14401267 12750729 11477173 12299213
44719 12299213 14400348 15769802 15746194 15234629 15224133 16153733 18089100 20209984 20477446
44710B0477446l064013m957049l398734k44638J051051J88493J79587K605114
44702A2837257N231215N377973L428491J304185p51236l572700o239890o327319
44694A1287976l092729J295213L967282L666138J017803k181272l945894l566298
44686H448219k168748j029890Q3401J654224K396228O85019k246482l069905q14139
44677C937927J782722K199895J099087J89332m63289j138318o48756J594178L222845
44668A1775623J638785j571710k051070J300521M521610L665732o22082m711565
44660A3945844o128205m641774j027760L158506N476597M357952R01977k421216
44652A3621921m495044n521177m867225j424677L357634N357971K504220k095048
$$ plain form
44710 20477446 17413433 12456384 9057650 8813012 9864063 10052556 10232143 12837257
44702 12837257 18068472 23446445 26874936 28179121 27427885 23855185 17615295 11287976
44694 11287976 8195247 9490460 13457742 17123880 18141683 15960411 12014517 8448219
44686 8448219 6279471 5249581 5332982 6987206 9383434 10068453 7821971 4752066 3937927
44677 3937927 5720649 7920544 9019631 9208963 8745674 7607356 6958600 8552778 11775623
44668 11775623 13414408 11842698 9791628 11092149 15613759 19279491 18657409 13945844
44660 13945844 7817639 3175865 2148105 5306611 10783208 15141160 16043137 13621921
44652 13621921 9126877 3605700 -1261525 -2686202 671432 6029403 8533623 6438575
44644F438575l954905k887954k033172j899438O46822O167710R260397M869615
44636A6607650l884866q232049m136067L199286O170969L357826m88406j139357
44628A1454986P72865J767508J15564k326858k649340p05133N51035r72179l491437
44619D517011l863527k058426o71503m21923P15839L316118M746549L269636J030720
44610A0580494O11422R71051k90509k368058k285072K78322K405525K224809J024606
44601A3152590O19757Q97628Q03107P6597q89432j859582k722062l217122l026130
44592C835351j943715k28722J079018J006123J19717m069Q23523J159762O56377
44583F503365Q14240J944573K066782N92670P2042J659496K120839q63165l535676
$$ plain form
44644 6438575 2483670 -404284 -2437456 -4336894 -3690072 2477638 11738035 16607650
44636 16607650 12722784 4490735 354668 3553954 9724923 13082749 12594343 11454986
44628 11454986 12227851 13995359 14110923 11784065 9134725 8429592 8980627 8008448 4517011
44619 4517011 653484 -1404942 -2076445 -2498368 -1782529 1533589 6280138 9549774 10580494
44610 10580494 11191916 12162967 11872458 9504400 7219328 7497650 9903175 12127984 13152590
44601 13152590 13772347 14669975 15473082 15549679 14660247 12800665 10078603 6861481 3835351
44592 3835351 1891636 1662914 2741932 3748055 3867772 3863703 4687226 5846988 6503365
44583 6503365 7317605 9262178 11328960 11921630 11993672 13653168 15774007 14910842 11375166
44574A1375166j323393L084874L113638j371120l933539j994872k45254j818255
44566F887245k982980j40716L713692L984873J453867l45091j155322k724429
44558H691139m211989l427765q34218J506656L235037M592367M180892J465716
44550A5197835o05375N58778K592251J562045j629022k641738m37417J796241
44542A6393598J904492P90246n44622k043937k740264j492397M16406O92250k97804
44533A3077968n77344n03513j689105k624668r8422M784282O795418L863160j70184
44524B2857592j449848p53166o01162j444371k608352l801273l922051j435790
44516F841579K402502L769938J431320j336556j649150o50759l27815l9219J196814
$$ plain form
44574 11375166 10051773 13136647 16250285 14879165 10945626 8950754 8705500 6887245
44566 6887245 3904265 3763549 7477241 11462114 12915981 12570890 11415568 8691139
44558 8691139 4479150 1051385 217167 1723823 4958860 9551227 13732119 15197835
44550 15197835 14592460 15151238 17743489 19305534 17676512 15034774 14597357 16393598
44542 16393598 18298090 19088336 18543714 16499777 13759513 12267116 12683522 13375772 13077968
44533 13077968 12500624 11997111 10308006 7683338 7584916 12369198 19164616 23027776 22857592
44524 22857592 21407744 20654578 20053416 18609045 16000693 12199420 8277369 6841579
44516 6841579 9244081 13014019 14445339 13108783 11459633 10808874 10481059 10441840 11638654
44507A1638654J880190M61070j592886j929078p58671J96169M77178M25212k89342
44498A0508496j500968j610569J02559J853359J876473P70054l47928j686740
44490I964736k786609j401610K825191O002180M583608M07195k155182k261018
44482A5178491k187874k448340j520809K13126M16277j118249j872052o45049
44474F015521P65948N82126o78916j470772q64142J116038L044675K570739n30224
44465A0550993k701552p82232L022937L786675R98303r83791Q6203J309618L2298
44456A5319452j864081j532201K91977J267208J433433K021497K159881K52251
44448A9349417k350064k529700j82664J304101m7622k165383k399417j337717
$$ plain form
44507 11638654 13518844 13979914 12387028 10457950 9699279 9895448 10372626 10797838 10508496
44498 10508496 9007528 7396959 7499518 9352877 11229350 11999404 11651476 9964736
44490 9964736 7178127 5776517 8601708 14603888 19187496 19594691 17439509 15178491
44482 15178491 12990617 10542277 9021468 9234594 9650871 8532622 6660570 6015521
44474 6015521 6781469 7363595 6684679 5213907 4349765 5465803 8510478 11081217 10550993
44465 10550993 7849441 7067209 10090146 13876821 14875124 13891333 13977536 15287154 15319452
44456 15319452 13455371 11923170 12215147 13482355 14915788 16937285 19097166 19349417
44448 19349417 16999353 14469653 14286989 15591090 15543468 13378085 10978668 9640951
44440I640951j211916j988930j510818Q01091K752620K535687J201580P82113
44432A3002378J390111J760625J543624J078811k99063l198732n581683m152911
44424E543160P99397M601692L801545M82356q78798P88333K565082J749912j223328
44415A8229351l615396l035197R9412K332217Q56238k222593j784104L088256
44407A3948184O850697M672447r49542l752863j640799K248216M541261M170395
44399C0087996J399791j993422k599686J000203N294548N782934K804930J46641
44391D1923935o36599n69399M61323L014905M843103L531216J588502L226804
44383E7383790O573548N657745N85251j455459K778280P557527P224279L773446
$$ plain form
44440 9640951 8429035 6440105 4929287 5730378 8482998 11018685 12220265 13002378
44432 13002378 14392489 16153114 17696738 18775549 18476486 15277754 9696071 5543160
44424 5543160 6342557 10944249 14745794 15228150 14349352 15137685 17702767 19452679 18229351
44415 18229351 14613955 11578758 11678170 14010387 14866625 12644032 10859928 13948184
44407 13948184 20798881 25471328 24521786 20768923 19128124 21376340 25917601 30087996
44399 30087996 31487787 29494365 26894679 27894882 33189430 38972364 41777294 41923935
44391 41923935 41287336 40717937 41179260 44194165 49037268 52568484 54156986 57383790
44383 57383790 63957338 69615083 70200334 68744875 71523155 79080682 86304961 90078407
44375I0078407J536371K99550j517271j992057O25697L397192L061918J556421
44367I7046228K256844L919176L356339J211401J2045q00250k796006m167531
44359A00038246k731935q24924j643241l146081j661688O81353j006361n407847
44351H4297522o446235l194107q56152j516889j530192M87606O37125k645404
44343F9233274m828831k694879L81820M12006j139802j303261r22397j689847
44335E7448083j968560j40108J312752l55612l131256l517253k221711k037966
44327D5388369k390777q78545J426725J213874j362562k779796j564250M89043
44319C9542081K157575L782268M538217K792733m72764k329324k339659k602635
$$ plain form
44375 90078407 91614778 91914328 90397057 88405000 89030697 92427889 95489807 97046228
44367 97046228 99303072 103222248 106578587 107789988 107802033 107001783 104205777 100038246
44359 100038246 97306311 96481387 94838146 91692065 90030377 90711730 89705369 84297522
44351 84297522 77851287 74657180 73801028 72284139 70753947 71241553 71878678 69233274
44343 69233274 64404443 61709564 62091384 62503390 61363588 60060327 59137930 57448083
44335 57448083 55479523 55339415 56652167 56296555 53165299 49648046 47426335 45388369
44327 45388369 42997592 42119047 43545772 44759646 43397084 40617288 39053038 39542081
44319 39542081 41699656 45481924 50020141 52812874 52340110 50010786 47671127 45068492
44311D5068492l049707j084158K834944L772740q70983o700404p787975m288048
44303B7894901j079457n12429l82075J265917K941168K315700l40084k655154
44295B9448487k865331j150779Q36217J195081n80469k626059k335622K99121
44287B2220646K058120M79221k438339k583654L57640K016566l93627l467497
44279A8249076k060232L077254N849176L167752j060361j941583k12660J38170
44271B5206592j491031k038991m05235P20759n15517k047931j290571P16567R34510
44262A9789152j110570k758141k026981q4344O25312m80005j676630j207028O67048
44253A1737813J995907J319391o69016j748591m94679K085491L366497J722539
$$ plain form
44311 45068492 42018785 40934627 43769571 47542311 46671328 39970924 32182949 27894901
44303 27894901 26815444 26303015 25920940 27186857 30128025 32443725 32103641 29448487
44295 29448487 26583156 25432377 26268594 27463675 26883206 24257147 21921525 22220646
44287 22220646 24278766 24757987 22319648 19735994 20093634 22110200 21716573 18249076
44279 18249076 16188844 19266098 25115274 28283026 27222665 25281082 25068422 25206592
44271 25206592 23715561 21676570 21271335 21992094 21476577 19428646 18138075 18854642 19789152
44262 19789152 18678582 15920441 13893460 13809116 14434428 13954423 12277793 11070765 11737813
44253 11737813 13733720 15053111 14384095 12635504 12140825 14226316 17592813 19315352
44245A9315352j623519l633932k565585L04691K465340L016338K637567J339616
44237B1255868j554253m721138m734385n82031L639624L306864n48766k818601
44229A3243182j720263q91978l113105n597889m141325M73334L498613K703389
44221D453958P51879R66571L195802M766062L928393J274349j474601l132044
44213A4730369l567870l036461j496893Q48023K627048K260944L02738p01974
44205A1965924K85620J078231k56931j826805n25049K709181L612785P83418k210114
44196A5616260k072107j72987J74198j525537l158095l269425j878436O70104
44188D383975L464654M712412L835213K924231L912297N298401M222191R71341
$$ plain form
44245 19315352 17691833 14057901 11492316 11797007 14262347 17278685 19916252 21255868
44237 21255868 19701615 14980477 10246092 9664061 13303685 16610549 16061783 13243182
44229 13243182 11522919 10630941 7517836 1919947 -2221378 -1748044 1750569 4453958
44221 4453958 5205837 6172408 9368210 14134272 18062665 19337014 17862413 14730369
44213 14730369 11162499 8126038 6629145 7477168 10104216 12365160 12667898 11965924
44205 11965924 12251544 13329775 13072844 11246039 10720990 13430171 17042956 17826374 15616260
44196 15616260 13544153 13371166 13545364 12019827 8861732 5592307 3713871 4383975
44188 4383975 7848629 12561041 16396254 19320485 23232782 28531183 32753374 33724715
44180C3724715j520889k254655k978800m274477m301224k465849j121461j914074
44172A2893286l112283k541651q84159J15406P28311K076083L444354L351582
44164A6070929K249592J677092J489317L60655j475871k383952j957260j265547
44156A4764955o70835L39978J228403P27397o41349p31920R71237K455218K249816
44147B0692900J241349N17609l70918j659375j982290n90450P29730J26295j151632
44138A7553218m97556J795804K668306Q21220j425619j738319j025127j358362
44130A6793565k221745j345095J128849K104360J33847j830809m22608K965333
44122A7305697L935662J525573n21010L45625J787566Q15839j339052j746446
$$ plain form
44180 33724715 32203826 29949171 26970371 22695894 18394670 15928821 14807360 12893286
44172 12893286 9781003 7239352 6355193 6470599 7198910 9274993 12719347 16070929
44164 16070929 18320521 19997613 21486930 21847585 20371714 17987762 16030502 14764955
44156 14764955 14094120 14434098 15662501 16389898 15748549 15016629 15987866 18443084 20692900
44147 20692900 21934249 22451858 22080940 20421565 18439275 17848825 18578555 18704850 17553218
44138 17553218 17055662 18851466 21519772 22340992 20915373 19177054 18151927 16793565
44130 16793565 14571820 13226725 14355574 16459934 16593781 14762972 14340364 17305697
44122 17305697 21241359 22766932 22245922 22591547 24379113 25194952 23855900 22109454
44114B2109454r41388j680746l754562m258248k743962j756318j726850J62774
44106E410154M464656P099455N114885J258944l06273J49993j01080j020883p62441
44097B1307410j44916j568058m055929l872774m49197K338019J790121k09668
44089A5135008p29225L66349J676023K634611K792747J057279k316607m764175
44081A5852010m341666k148149k36149J202899K742660L515837K407524L09628
44073A9304594r87056j191651q38157M75216K710997L553082J124552k215756
44065B1935821k414832J29200J061113p10605r99930K328154M668985J364822
44057B7362728m300479n083370k35067L578765J986229j728071k626678r30337
$$ plain form
44114 22109454 21168066 19487320 15732758 11474510 8730548 6974230 5247380 5410154
44106 5410154 9874810 16974265 22089150 23348094 23041821 23191814 23090734 22069851 21307410
44097 21307410 21162494 19594436 15538507 11665733 11216536 13554555 15344676 15135008
44089 15135008 14405783 14772132 16448155 19082766 21875513 22932792 20616185 15852010
44081 15852010 11510344 9362195 9126046 10328945 13071605 16587442 18994966 19304594
44073 19304594 18317538 17125887 16287730 16762946 19473943 23027025 24151577 21935821
44065 21935821 19520989 19650189 20711302 20000697 19000767 21328921 25997906 27362728
44057 27362728 23062249 17978879 17743812 21322577 23308806 21580735 18954057 18023720
44049A8023720J03827j99321n7504Q27673R12655k46812j430255j889900j903612
44040A4140471j447608k74066Q79124R45922K09274k99435o42363j389557j728341
44031A0393421m47892J419832J526413l7247o73483L67679N39786j574705l147425
44022H366379r13840L691530O046766M281827J170763Q0610J114346J878365P51314
44013B6468060j414149k437281j295297O61640J345897O06215J97303Q81136J137444
44004B6150968k46034j791566j245924R73350K088628M95105k487386m282259
43996A9654882l285029K31451M048498N115283K362009j515172k621573m58454
43988B3531895J579362O91823k025898l652397l233660k004078q38081O04693
$$ plain form
44049 18023720 18127547 17928226 17870722 18698395 19611050 19364238 17933983 16044083 14140471
44040 14140471 12692863 12418797 13297921 14243843 14453117 14153682 13511319 12121762 10393421
44031 10393421 9945529 11365361 12891774 12854527 12181044 12548723 13088509 11513804 8366379
44022 8366379 7452539 11144069 17190835 21472662 22643425 22724035 23838381 25716746 26468060
44013 26468060 25053911 22616630 21321333 21982973 23328870 23935085 24132388 25013524 26150968
44004 26150968 25904934 24113368 22867444 23840794 25929422 26424527 23937141 19654882
43996 19654882 16369853 16601304 20649802 25765085 28127094 26611922 23990349 23531895
43988 23531895 25111257 25803080 23777182 20124785 16891125 14887047 14048966 14653659
43980A4653659K286565L069167K259856Q36111K88611P91693J257077Q14595n00835
43971B5756499k171778l341013k759456O9357L406690M325930K029049j007250
43963B6308028k063376j153326Q3216R58372J438689O18114k016840m482919m144359
43954A5545599j480082O02348J092918J560626K392573J891960O2666l70209J529492
43945B2827891K849516J619523L12323J470392K866960J020944k629826l580149
43937B6757574j236299M10478r89513l270235l661214k101306K32976K688112
43929A8830573M293950L690163J175404j005523j340344m68192N02340J272450
43921B6950821J488886N57848r06613j128774M78470K290495K440273Q03768j223005
$$ plain form
43980 14653659 16940224 20009391 22269247 23105358 23393969 24185662 25442739 26257334 25756499
43971 25756499 23584721 20243708 17484252 17553609 20960299 25286229 27315278 26308028
43963 26308028 24244652 23091326 23174542 24132914 25571603 26189717 24172877 19689958 15545599
43954 15545599 14065517 14667865 15760783 17321409 19713982 21605942 21668608 21298399 22827891
43945 22827891 25677407 27296930 27609253 29079645 31946605 32967549 30337723 26757574
43937 26757574 25521275 25931753 24942240 21672005 18010791 15909485 16142461 18830573
43929 18830573 23124523 26814686 27990090 26984567 25644223 25176031 25678371 26950821
43921 26950821 28439707 28997555 28090942 26962168 27440638 29731133 32171406 32975174 31752169
43912C1752169j934507m38408K241751L507680J940419q54319k606438l502839
43904C0105508m750650n169649k453368K423995N465068M809712K562434Q05859
43896C3798909j010527l451151m818125l422801k33456K311239K823202J499104
43888B7496394m24679j309509o64953N7423q7829P07937L951869O685896M675117
43879D1087666n51017k967461j036740K34850j987124l654411j234916J855730
43871C1746577J075151j633309j765769k52315j193667l850505l488774M90883
43863B1128272L373891K460787K90931m18334m64085j328303k342116k305729
43855B0395314j304014J90058J844134K603673J515236l36205q83815l2779O52189
$$ plain form
43912 31752169 29817662 29379254 31621005 35128685 37069104 36214785 33608347 30105508
43904 30105508 25354858 20185209 17731841 20155836 25620904 30430616 32993050 33798909
43896 33798909 32788382 29337231 24519106 21096305 20862849 23174088 25997290 27496394
43888 27496394 27071715 25762206 25097253 25154676 25066847 25774784 29726653 36412549 41087666
43879 41087666 40536649 37569188 36532448 36767298 34780174 31125763 29890847 31746577
43871 31746577 32821728 31188419 29422650 29170335 27976668 24126163 20637389 21128272
43863 21128272 24502163 26962950 27253881 26835547 26371462 25043159 22701043 20395314
43855 20395314 19091300 19281358 21125492 23729165 25244401 24908196 24024381 23991602 24643791
43846B4643791P53542Q44213J28256k430279m815516l568036P47459L332967J552269
43837B1188666j731973k569861o39824J994332L943506M368157K303026j570524
43829B7285505m170875l146175K97849L125749L852042K977258J389305k23020
43821C1387638j275535j761614k119127k060235p14456J422620K185584N13662
43813B7578537j685472j781867K36210J943485J634163J60006n60056j55650j77472
43804B7191884j599802k827758j687857Q69057J481422m80893j454030P14241
43796B2206264K845054J430453j250420o94183K054850J974588j108814j672721
43788B5785071K247361N164410K490696k394797l485678p19727J262606M26651
$$ plain form
43846 24643791 25397333 26241546 26369802 23939523 19124007 15555971 16303430 19636397 21188666
43837 21188666 19456693 16886832 16247008 18241340 22184846 26553003 28856029 27285505
43829 27285505 23114630 19968455 20266304 23392053 27244095 30221353 31610658 31387638
43821 31387638 30112103 28350489 26231362 24171127 23456671 24879291 27064875 27578537
43813 27578537 25893065 24111198 24347408 26290893 27925056 28085062 27525006 27369356 27191884
43804 27191884 25592082 22764324 21076467 21945524 23426946 22946053 21492023 22206264
43796 22206264 25051318 26481771 25231351 24537168 26592018 28566606 27457792 25785071
43788 25785071 28032432 33196842 35687538 33292741 29807063 29087336 30349942 30776593
43780C0776593r72278p54679P97212K367379K750325J169763j492604k685819
43772C1955892j197710J005790J618623J105303J063071J205924L65540q48684
43764C6273749q18519N80175K212412L350010L388895J405808k048618m304849
43756D0039063l798402k262334j646358j052530O15432J433321m52039k550511
43748C0325642j220972K168293L009042P95279l35348J279865K278306L08733
43740C8608840j973072j320685J295453K880286K558646J060060j360721l839410
43732C7909397l967186q91307K241056J906482p90706j676750N35684K895867
43724C8162537K937023J773071J407840J416657K86542j368144j357495M91537
$$ plain form
43780 30776593 29804315 29049636 29846848 32214227 34964552 36134315 34641711 31955892
43772 31955892 30758182 31763972 33382595 34487898 35550969 36756893 37122433 36273749
43764 36273749 35455230 36035405 38247817 41597827 44986722 46392530 44343912 40039063
43756 40039063 36240661 33978327 32331969 31279439 31894871 33328192 32876153 30325642
43748 30325642 29104670 31272963 34282005 35077284 34741936 36021801 38300107 38608840
43740 38608840 36635768 35315083 36610536 39490822 42049468 43109528 41748807 37909397
43732 37909397 33942211 33050904 35291960 37198442 36407736 34730986 35266670 38162537
43724 38162537 41099560 42872631 44280471 45697128 45983670 44615526 43258031 43749568
43716D3749568J568815K04407j617337r91554J522049K566636Q98002r29302o11538
43707D6359746O00475L69627q91860r98166M02408J705653K213440K602663K694587
43698E5058573J263311j484663l346173k783930o13937J490236K725701K924075
43690E5233193K047752N82658o63629j594783k673622l600884l329847j556119
43682D4444719R56193L466094N306406N123946K093253j881887l360128j516751
43674E4631845Q40547J293375Q07554J381904K645591K788809J682718R94698
43666F7067041J684482L085695M244959M724680M174002K471090N01886l13957
43658H7639878K92120J018159Q06730M92593J724042M256657N479236L614098
$$ plain form
43716 43749568 45318383 45522790 43905453 42913899 44435948 47002584 47900586 46971284 46359746
43707 46359746 46960221 47329848 46437988 45439822 45842230 47547883 49761323 52363986 55058573
43698 55058573 56321884 54837221 51491048 48707118 48093181 49583417 52309118 55233193
43690 55233193 57280945 57863603 57199974 55605191 52931569 49330685 46000838 44444719
43682 44444719 45400912 48867006 54173412 59297358 61390611 59508724 56148596 54631845
43674 54631845 55472392 56765767 57573321 58955225 61600816 64389625 66072343 67067041
43666 67067041 68751523 71837218 76082177 80806857 84980859 87451949 87953835 87639878
43658 87639878 87931998 88950157 89756887 90249480 91973522 96230179 101709415 105323513
43650A05323513O39702K65181K979670N318937M915409L742467M280137M863503
43642A32328519K367479j761757k465711J638352N930020O075979L281791J460229
43634A48854901K052494L847219N598089O480792N749615M069503L570064M715730
43626A84938407N061696L213653J768733L460476O406984O819047N097916N139599
43618B21906511P981708J0330915R954371Q639083Q507046Q845188Q448114Q163373
43610B92776309Q809295Q928067P219262N452516O127160Q302985Q670890O458440
43602C52744924M509087N079974O966599P819976P487493P601105Q893158J0383954
43594D11486270J0884888J0189075Q783712P151574N485013L681295J611720l96798
$$ plain form
43650 105323513 105963215 106228396 109208066 114527003 119442412 123184879 127465016 132328519
43642 132328519 134695998 132934241 130468530 132106882 138036902 144112881 147394672 148854901
43634 148854901 150907395 154754614 160352703 166833495 172583110 176652613 180222677 184938407
43626 184938407 190000103 193213756 194982489 198442965 204849949 211668996 216766912 221906511
43618 221906511 229888219 240219134 250173505 258812588 267319634 276164822 284612936 292776309
43610 292776309 301585604 310513671 317732933 323185449 329312609 337615594 346286484 352744924
43602 352744924 357254011 362333985 369300584 377120560 384608053 392209158 401102316 411486270
43594 411486270 422371158 432560233 441343945 448495519 453980532 457661827 459273547 458876749
43586D58876749j659619k125099k883397m989137p970740j0284364j1171013j1229212
43578D06564168j1192068j1196953j1427112j2228921j3106357j2913893j1853850
43571C22645014j1902449j3992733j6047175j5525562j2933459j0749181r618919
43564B31875536q167567o389881o245177q046639r008302p068513m075919l117879
43556A79755659m182176m791968m095281l822794n093344o407573n728329l340070
43548A42294124j560861j945198l543884m172292l071977j708092j706809k773450
43540A21811561l509269l628825l913860m225119l386894j370767J99858L82593
43532A02359278M8953r9462q03032k408995l623247l582193l407203l928166l635852
$$ plain form
43586 458876749 457217130 455092031 452208634 447219497 439248757 428964393 417793380 406564168
43578 406564168 395372100 384175147 372748035 360519114 347412757 334498864 322645014
43571 322645014 310742565 296749832 280702657 265177095 252243636 241494455 231875536
43564 231875536 223707969 217318088 211072911 203026272 194017970 186949457 182873538 179755659
43556 179755659 175573483 170781515 166686234 162863440 157770096 151362523 145634194 142294124
43548 142294124 140733263 138788065 135244181 131071889 127999912 126291820 124585011 121811561
43540 121811561 118302292 114673467 110759607 106534488 103147594 101776827 101976685 102359278
43532 102359278 102408231 102308769 101505737 99096742 95473495 91891302 88484099 84555933 80920081
43523H0920081j192251J523311J637447m01682j608229r91743k93187l55379L2836
43514G9271204J170921J402978J03758j012137q99743r39457j962967j926324
43506G5208233J014938M712838M987188Q20162m449982o803253m865477j90620
43498G0434027L992720M694256J665069j961615k906771j405024k33085o62939
43490G3616638j466025j696188j817068j568266M29172L577925M579068K037595
43482G7692851n90865L29813K883240K384280j175396l094567j567447k76031
43474G6585878j623086k299639R35167N068430N118387J919498M00279J616447
43466H7721361K050087M33154m53567M43243M37538j327404j513585J467152L836443
$$ plain form
43523 80920081 79727830 81251141 82888588 82486906 80878677 79886934 79593747 79238368 79271204
43514 79271204 80442125 81845103 81948861 80936724 80036981 79097524 77134557 75208233
43506 75208233 76223171 80936009 85923197 86743359 82293377 75490124 70624647 70434027
43498 70434027 74426747 79121003 80786072 78824457 75917686 74512662 74279577 73616638
43490 73616638 72150613 70454425 68637357 67069091 67498263 71076188 75655256 77692851
43482 77692851 77101986 77431799 80315039 82699319 81523923 78429356 76861909 76585878
43474 76585878 74962792 72663153 73598320 78666750 83785137 85704635 86104914 87721361
43466 87721361 89771448 90204602 89751035 90194278 90631816 89304412 87790827 89257979 93094422
43457I3094422K308729m41548k42981J987744K616875J568813J379686J909640
43449A04181380J059284l68466M27485K917334L707856K430721K356905M433552
43441A21146051N337638K893551n86738k036705j224546R23919M130205P105495
43433A37688870P361860M760743K454201K416865K869622K009777J176707J926819
43425A62665464K980533K937932L290024N463970P267207N996877L343050L300946
43417A97246003O257379Q914401R464528R111100Q602343O977584M344993K702791
43409B53621122L040043M168927N194103O624849Q150676P875340N186155K321463
43401B96182678J504574K134754K367956K047012K254188K905925K727567J397051
$$ plain form
43457 93094422 95403151 94961603 94718622 96706366 99323241 100892054 102271740 104181380
43449 104181380 105240664 104872198 105299683 108217017 111924873 114355594 116712499 121146051
43441 121146051 126483689 129377240 128790502 126753797 125529251 126453170 130583375 137688870
43433 137688870 145050730 149811473 152265674 154682539 157552161 159561938 160738645 162665464
43425 162665464 165645997 168583929 171873953 177337923 184605130 190602007 193945057 197246003
43417 197246003 203503382 212417783 221882311 230993411 239595754 246573338 250918331 253621122
43409 253621122 256661165 260830092 266024195 272649044 280799720 288675060 293861215 296182678
43401 296182678 297687252 299822006 302189962 304236974 306491162 309397087 312124654 313521705
43393C13521705J39710l504O31227J197352J532205J973191K556210L098965L893801
43384C28540862N517436P693844R089243Q897268Q056470P964715Q477389Q492930
43376C92730157Q169711Q655128R395194Q006118L963973L64818K26254K609726
43368D34121079M428609M736428M766452M635081K864097q14250m603093o906943
43360D43227460p526110o623256m767133m169566p249027j3056920j7360936j7343683
43352C65130829j4247397j0536671p051782m574860n390716j0225361j5256723
43345B97847319j5675501j1900162r114645j0257509j2401177j1303901p170080
43338B20024344l927770m101538o385333p835572o851158m041690j487119j353103
$$ plain form
43393 313521705 313661415 313657911 314289138 315486490 317018695 318991886 321548096 324647061 328540862
43384 328540862 334058298 341752142 350841385 359738653 367795123 375759838 384237227 392730157
43376 392730157 400899868 409554996 418950190 426956308 430920281 431285099 431511353 434121079
43368 434121079 438549688 443286116 448052568 452687649 455551746 454737496 450134403 443227460
43360 443227460 435701350 429078094 424310961 420141395 412892368 399835448 382474512 365130829
43352 365130829 350883432 340346761 333294979 328720119 323329403 313104042 297847319
43345 297847319 282171818 270271656 261157011 250899502 238498325 227194424 220024344
43338 220024344 216096574 211995036 205609703 197774131 190922973 186881283 185394164 184041061
43330A84041061m126845p749050r255025p752825n196063l829052l632790l064443
43322A39434968j708394r36222j811179l419399l980231l141064k394092l067584
43314A18976803m348783l918562q69269K543594L123865P36368j392798j101045
43306A13750173k49055j505611l788466l885386j926834j475184l513005m302810
43298I3103822j359381J909420Q84468l306552n425594l491416n52823N45388
43290H2307332K86728r0565o95084j309105o28044J245995J989927M31812j310503
43281H2228493q58234R48807J493092M0657j879128k863737k694613j596523j6586
43272G4802228J094542J022854K68178m4283L69615O85484J24092r44029j107040
$$ plain form
43330 184041061 179914216 172165166 162910141 155157316 149961253 146132201 142499411 139434968
43322 139434968 137726574 136790352 134979173 131559774 127579543 124438479 122044387 118976803
43314 118976803 114628020 110709458 109840189 112383783 115507648 116244016 114851218 113750173
43306 113750173 113501118 111995507 108207041 104321655 102394821 100919637 97406632 93103822
43298 93103822 91744441 93653861 94538329 91231777 85806183 82314767 81761944 82307332
43290 82307332 82594060 82503495 81808411 80499306 79871262 81117257 83107184 83538996 82228493
43281 82228493 81370259 82319066 83812158 83852815 81973687 79109950 76415337 74818814 74802228
43272 74802228 75896770 76919624 77187802 77143519 77513134 78198618 78322710 77378681 76271641
43263G6271641N68718K874121L183420Q06090j449461p84706J522088K048898
43255H5040809M71164m77433j27651q05408k732821k589194N57827K322100m34917
43246H1224476l911643k809445J420454L028834Q71513p06285P56335K981127
43238H2855366L694095L214206J634164j737656m987461m361747q0953K978733
43230H3208747K256831Q06871J471627K316869Q56795j409833k257938k664320
43222H4585649l542742k399836J921640M642396J184720m454969m214461K058356
43214G9780753O114004L402081j157167j745384R8569l78053l182485m320641
43206G8611677k133673J046958K516055J717657o6153p36232Q76933L045140K544032
$$ plain form
43263 76271641 76840359 79714480 82897900 83703990 82254529 81469823 82991911 85040809
43255 85040809 85511973 85034540 84906889 84101481 81368660 78779466 79337293 81659393 81224476
43246 81224476 77312833 74503388 75923842 78952676 79824189 79117904 79874239 82855366
43238 82855366 86549461 89763667 91397831 89660175 84672714 80310967 80230014 83208747
43230 83208747 85465578 86272449 87744076 90060945 90917740 89507907 87249969 84585649
43222 84585649 81042907 78643071 80564711 85207107 86391827 81936858 77722397 79780753
43214 79780753 85894757 89296838 88139671 86394287 86492856 86114803 82932318 78611677
43206 78611677 76478004 77524962 80041017 81758674 81692521 80956289 81833222 84878362 87422394
43197H7422394q05297l249789k343662m00815l94373j227417m82387M89893j298520
43188G7710027m443513m231884j17716K560016O0145m338093n026524j612069
43180F0560389J283746N87152j734211j897838R25711L992030M424913K348509
43172G0490401K43616k84609P7321L67523J067148K498110L097555J531051n39615
43163G8548501n99083L83244q48150m094083n065396j973710J031022j70882l276134
43154F3935329k961349J078788L795465K250100o11245p61764J440059K564633
43146G0730016J110094q87579p79114J495958L315290K175312j414744m133544
43138G1611689l387170j79178K334076K540366J335261r9936j524592k401525
$$ plain form
43197 87422394 86617097 83367308 81023646 80622831 80228458 79001041 78518654 79008547 77710027
43188 77710027 73266514 69034630 68916914 71476930 71537075 67198982 62172458 60560389
43180 60560389 61844135 62431287 60697076 58799238 59724949 63716979 68141892 70490401
43172 70490401 70734017 70449408 70526729 70894252 71961400 74459510 77557065 79088116 78548501
43163 78548501 77949418 78332662 77484512 73390429 68325033 66351323 67382345 67211463 63935329
43154 63935329 60973980 62052768 65848233 68098333 67487088 66725324 68165383 70730016
43146 70730016 71840110 70952531 70173417 71669375 74984665 77159977 75745233 71611689
43138 71611689 68224519 68045341 70379417 72919783 74255044 74155108 72630516 70228991
43130G0228991j530959R14662K539840J535373n36390n40307J852483L360836
43122G7824529J340044k422966l542903m93640L153531K849320j315526m627399
43114G2764990l525564L45355K929767L035701K667329K851017K054330m83980
43106H2638945k477095j617509P18897J214914n47170j454780N83132L612549
43098H2671883M328253K336307J54429l32762K99970P88014J143741J947885K676994
43089I6014714K090287J42108j652703k083676j605755j324962j318031p05192
43081H9556790R32596K871555L874838L176284J226619j58181Q70708L814202
43073A06165411N432796L192178j018608k281701J638677P297036R177628N369102
$$ plain form
43130 70228991 68698032 69612694 72152534 73687907 73151517 72611210 74463693 77824529
43122 77824529 79164573 76741607 73198704 72705064 75858595 78707915 77392389 72764990
43114 72764990 69239426 69584781 72514548 75550249 78217578 81068595 83122925 82638945
43106 82638945 80161850 78544341 79263238 80478152 79930982 78476202 79059334 82671883
43098 82671883 87000136 89336443 89490872 89158110 89458080 90246094 91389835 93337720 96014714
43089 96014714 98105001 98247109 96594406 94510730 92904975 91580013 90261982 89556790
43081 89556790 90489386 93360941 97235779 100412063 101638682 101480501 102351209 106165411
43073 106165411 111598207 114790385 113771777 111490076 113128753 120425789 129603417 134972519
43065A34972519j199811o158887p100671m431756n89245J588525J177160J92308
43057A18450142J175886L583359M089655J167284k322844k688332l60788R51978
43049A24046340k86464j451626K8945K882594M136766L241544J694707k61614
43041A34031192l584314p206631p985867m896354p86742J451765K261513L211558
43033A16496120L592757J868754q24705j641456j19687J359250J231412L90518
43025A22352963q4438l69501m50843L94518J729404J770941K66617n52670N97635
43016A25654626J693676M90845j655907j518025J365691M197767M685560L041983
43008A37956216L46524k709441m860097m136165m9841N074566Q022119P568594
$$ plain form
43065 134972519 133772708 127613821 120513150 116081394 115492149 117080674 118257834 118450142
43057 118450142 119626028 123209387 127299042 128466326 126143482 123455150 123094362 124046340
43049 124046340 123759876 122308250 122337195 125219789 129356555 132598099 134292806 134031192
43041 134031192 130446878 123240247 115254380 110358026 109571284 111023049 113284562 116496120
43033 116496120 120088877 121957631 121132926 119491470 119371783 120731033 121962445 122352963
43025 122352963 122268525 121899024 121448181 121842699 123572103 125343044 125609661 125056991 125654626
43016 125654626 127348302 127839147 126183240 124665215 126030906 130228673 134914233 137956216
43008 137956216 138302740 135593299 130733202 126597037 126547196 131621762 139643881 147212475
43000A47212475N042894K613607J472803J288157J049726N33020P21392K350632
42992A62284706M414919N016054L621429J571617L60460M01515J485050L131778
42984A82287528M141315L252642J122982L58811K319643M931843N306541L832671
42976B07553976L598166N711293P392294N707718J557458j504269j389329J059361
42968B29686668L894399N562572M996837K324418k17415q8969K046469K598512
42960B50803491J42864j778693O96108N628045O970798K414182l554242n545116
42952B55777437l588984j599394j522648j863076j376705j275031k882302n036595
42944B36632702n319923l218006r51647j179288m296594p931909r019372o746195
$$ plain form
43000 147212475 152255369 154868976 156341779 157629936 158679662 159212682 159934074 162284706
42992 162284706 166699625 171715679 175337108 176908725 177269185 177670700 179155750 182287528
42984 182287528 186428843 189681485 190804467 191163278 193482921 198414764 203721305 207553976
42976 207553976 211152142 216863435 224255729 229963447 231520905 230016636 228627307 229686668
42968 229686668 233581067 239143639 244140476 246464894 246247479 246158510 248204979 250803491
42960 250803491 250946355 249167662 249863770 255491815 262462613 264876795 261322553 255777437
42952 255777437 252188453 250589059 249066411 247203335 245826630 244551599 241669297 236632702
42944 236632702 231312779 228094773 227143126 225963838 221667244 213735335 204715963 197969768
42936A97969768l637592l238341o320913r805742r997130o588876k760978j506644
42928A54113552k855146m846775n947641n666719l980867j725308r28363k823652
42920A25339081n536757n747348l070005o85743q18481j960003k101043k197899
42912A03221802l793812n178806l479469K70732J825360m41231l716049n145453
42904H3563074m797763l618837j879230p77618k084441m551595m213418m45920
42896F1194252J931283l58420l531253k427520J202710J500693j938327l360972
42888E4212446p9444L347956K257444j380407k499049j64959K094623J578630
42880E9367240q71978k804067k722350r93844N57127L50366r60320j097864N82634
$$ plain form
42936 197969768 194332176 191093835 184772922 174967180 164970050 158381174 155620196 154113552
42928 154113552 151258406 146411631 140463990 134797271 130816404 129091096 128162733 125339081
42920 125339081 119802324 114054976 110984971 110299228 109480747 107520744 105419701 103221802
42912 103221802 99427990 94249184 90769715 91040447 92865807 92424576 88708527 83563074
42904 83563074 78765311 75146474 73267244 72489626 70405185 65853590 61640172 61194252
42896 61194252 63125535 62767115 59235862 56808342 58011052 59511745 57573418 54212446
42888 54212446 54133002 57480958 59738402 58357995 55858946 55693987 57788610 59367240
42880 59367240 58495262 55691195 52968845 51975001 52532128 52882494 51922174 50824310 51406944
42871E1406944J839142O83733j626720k415427j375832n11661p02540m84086J288721
42862D8102274L285446L309084J172547j195676k232879k182152j784439p04482
42854D7769723J520491L480882K704050q98352m012416l696567j001550P95335
42846D6661596N43816k63691n42634m87520M43909L231740O149218N204509k25430
42837F0715513m928666l995774L86696J788169j616953m912145l689050K29473
42829D3977263K225949J250124j01904k47920k0498L05537K032578M980066O113371
42820F0514566L325383j078073l009938j743050K314N00811O93203J251559J009362
42811F1466137n03242j528817p62792N24923Q35860R27067J866450K475509J240625
$$ plain form
42871 51406944 53246086 53929819 52303099 49887672 48511840 48000179 47297639 46813553 48102274
42862 48102274 51387720 54696804 55869351 54673675 52440796 50258644 48474205 47769723
42854 47769723 49290214 52771096 55475146 54576794 50564378 46867811 45866261 46661596
42846 46661596 47205412 46941721 46399087 45911567 46355476 49587216 55736434 60940943 60715513
42837 60715513 55786847 51791073 52177769 53965938 52348985 47436840 43747790 43977263
42829 43977263 46203212 47453336 47351432 47103512 47083014 47388551 49421129 54401195 60514566
42820 60514566 63839949 62761876 59751938 58008888 58011202 58512013 59205216 60456775 61466137
42811 61466137 60962895 59434078 58671286 59196209 60032069 60959136 62825586 65301095 66541720
42802F6541720p16948j302362q62572j114102j789062j489970r10830j607141
42794E6748733k192318J19456M135547N234742K133746j198829j790069j455141
42786F1735867k189048k126792N45864L179029K215415j201786l163577k838892
42778E6156080k423446k392369r16788K110055M090677L418600J562056Q36707
42770F2441572J943361L907936M882267L207383p18179m047876m561016l398318
42762F3657130k931256k981953j689383O03245J351676k26501j918257j693130
42754E4171571J39522K246244L552892L050662P06752j161899M593L030073L849778
42745F9590188J156013j687581j756537p15254j656206m109084n013072l334331
$$ plain form
42802 66541720 65824772 64522410 63659838 62545736 60756674 59266704 58355874 56748733
42794 56748733 54556415 54675871 58811418 64046160 66179906 64981077 63191008 61735867
42786 61735867 59546819 57420027 57965891 61144920 63360335 62158549 58994972 56156080
42778 56156080 53732634 51340265 50423477 52533532 56624209 60042809 61604865 62441572
42770 62441572 64384933 68292869 73175136 76382519 75664340 71616464 67055448 63657130
42762 63657130 60725874 57743921 56054538 56657783 58009459 57782958 55864701 54171571
42754 54171571 54311093 56557337 60110229 63160891 63867643 62705744 62710337 65740410 69590188
42745 69590188 70746201 69058620 67302083 66586829 64930623 60821539 55808467 52474136
42737E2474136r32835N93328J390203J741164J321724N95593R97515K631987L159773
42728F3972588N18453l759510n581375l046077J158100L130835K484980J932359
42720F0810353K689766K931246J514708M44483J604229L285451K781654Q15846
42712G6877736L0775J46040j359130l889277l528916O29429M126307L309654L05477
42703G6648095j004547q34638j651711k759863j136875L029460N727149M505959
42695H2523029J348890n60132l86388Q10099J831771J748954M31529n40575P00172
42686H7907349L276644L986452J748380n46575j91997J407205J249930m21766
42678I8415622p42461J027092K581707K675608K966012M438831M777489J676201
$$ plain form
42737 52474136 51541301 52134629 53524832 55265996 56587720 57183313 58180828 60812815 63972588
42728 63972588 64491041 60731531 55150156 52104079 53262179 56393014 58877994 60810353
42720 60810353 63500119 66431365 67946073 68390556 69994785 73280236 76061890 76877736
42712 76877736 76908511 77054551 75695421 71806144 68277228 68906657 73032964 76342618 76648095
42703 76648095 75643548 74808910 73157199 70397336 69260461 72289921 78017070 82523029
42695 82523029 83871919 83311787 82925399 83735498 85567269 87316223 87747752 87207177 87907349
42686 87907349 91183993 95170445 96918825 96372250 96180253 97587458 98837388 98415622
42678 98415622 97673161 98700253 101281960 103957568 106923580 111362411 116139900 117816101
42670A17816101k955138m852109k782726M73053K387654L373095M618252N553088
42662A23631270M904810K976772J499530J708150L174608M002777K193195j995869
42654A42095243n106919l782895O61648L341732K326647J142926K898445N088071
42646A48664898L716167K21367l92896K487733M009259J499015j365640j23146
42638A58716757M223234P184237O658533M215446K068496J162825J431471K165024
42630A87826023K625542L107215M264885M964767L031337p54230k164226P75331
42622B03676644M173639L446380j9247j257641N90533J618832N7541j058004M92816
42613B11721493K257980J497205j18165L52888J795657Q95254j961037k813009
$$ plain form
42670 117816101 114860963 110008854 107226128 107699181 110086835 113459930 118078182 123631270
42662 123631270 128536080 131512852 133012382 134720532 137895140 141897917 144091112 142095243
42654 142095243 136988324 133205429 133867077 137208809 139535456 140678382 143576827 148664898
42646 148664898 152381065 152602432 152209536 154697269 158706528 160205543 158839903 158716757
42638 158716757 162939991 170124228 176782761 180998207 183066703 184229528 185660999 187826023
42630 187826023 190451565 193558780 197823665 202788432 205819769 205065539 202901313 203676644
42622 203676644 207850283 211296663 211277416 210019775 210610308 212229140 212286681 211228677 211721493
42613 211721493 213979473 215476678 215358513 215711401 217507058 218402312 216441275 213628266
42605B13628266j06440L267857M599566M431330L650954J122693l197994n743387
42597B21652845l547361P75203K161895K96572n06119J544105L313472K577436
42589B28268048J596639K498591L321867K095481J204244L287181N671486M166356
42581B52109893N52608L73420L859842N282922K080824j551594k169620k221772
42573B58316523m340023n759243l118447J019404J633072j238214l450255l562546
42565B39500271l726354m657362m629317l550420l654348n458905o759922o462785
42557B00600858o072936o481492o429985n282119m427719m675405m873585m390178
42549A57967439m404257n307298n330748l518336j803426k090191l180942k852112
$$ plain form
42605 213628266 213521826 216789683 221389249 225820579 229471533 230594226 227396232 221652845
42597 221652845 218105484 218880687 221042582 221339154 220833035 222377140 225690612 228268048
42589 228268048 229864687 232363278 235685145 237780626 238984870 242272051 247943537 252109893
42581 252109893 252662501 253035921 256895763 262178685 264259509 262707915 260538295 258316523
42573 258316523 253976500 248217257 245098810 246118214 247751286 246513072 243062817 239500271
42565 239500271 235773917 231116555 226487238 222936818 219282470 213823565 207063643 200600858
42557 200600858 194527922 188046430 181616445 176334326 171906607 167231202 162357617 157967439
42549 157967439 153563182 148255884 142925136 139406800 137603374 135513183 132332241 129480129
42541A29480129j472601j142480k213428l065849k923201k720591l150669l641747
42533A09149563l604828l366849l428253l625939l349008k186549m52387O45535
42525H9781285q9164k181839l406978k266002J5384J012854J37740j091179j439403
42516H0472698j091619m15184O83839J629880J068691r63521k047223j47511L323044
42507H2513094M928897L497811J240033L71576M79849J63159l56513Q3093J160698
42498I4081697J148559o55751k906724l699501k175278J035050L848300L760643
42490I4436995N52687k326663j260287K452341L551746j83715m545344m441382
42482H8236378o01640K048970J294169m28889o72625j40065k46247l61444N82281
$$ plain form
42541 129480129 128007528 126865048 124651620 121585771 118662570 115941979 112791310 109149563
42533 109149563 105544735 102177886 98749633 95123694 91774686 89588137 89135750 89781285
42525 89781285 89692121 87510282 84103304 81837302 81852686 82865540 83003280 81912101 80472698
42516 80472698 79381079 78965895 79649734 81279614 82348305 81384784 79337561 79190050 82513094
42507 82513094 87441991 90939802 92179835 92551411 93031260 93194419 92837906 92920999 94081697
42498 94081697 95230256 94574505 91667781 87968280 85793002 86828052 90676352 94436995
42490 94436995 94989682 92663019 91402732 93855073 97406819 97223104 92677760 88236378
42482 88236378 87634738 89683708 90977877 90548988 89876363 89736298 89490051 89128607 89710888
42473H9710888J513890N65709j667003k407140n25562J703076J714483K90299
42465I0898640L47075K415318L459489J148061k495770l612674j630800M63721
42457I0993060N88129l20674r33906j510705k162053j670014K30501J423881K59177
42448H6897396j763760k167188j013943k15795m73865r48287j004868l84139J300820
42439H0226371L274106L055047m57640m441441n238135l125963j420491j675967
42431G0195887k650836l332934l751708l058593j78554L384109M536491K799212
42423F7943074N80476r43329k874566n074605n367084l447813j967686k083739
42415D6764728j477743J079844K716602R53819j733884j400512J401055K844720
$$ plain form
42473 89710888 91224778 91790487 90123484 87716344 87190782 88893858 90608341 90898640
42465 90898640 91245715 93661033 97120522 98268583 95772813 92160139 90529339 90993060
42457 90993060 91581189 91260515 90326609 88815904 86653851 84983837 85214338 86638219 86897396
42448 86897396 85133636 82966448 81952505 81736710 81262845 80314558 79309690 78925551 80226371
42439 80226371 83500477 86555524 86097884 81656443 76418308 73292345 71871854 70195887
42431 70195887 67545051 64212117 60460409 57401816 57223262 60607371 65143862 67943074
42423 67943074 68523550 67580221 64705655 59631050 54263966 50816153 48848467 46764728
42415 46764728 45286985 46366829 49083431 50037250 48303366 46902854 48303909 51148629
42407E1148629J725058L40551n3409r42848l062149m293756k623592O79588K567416
42398D5485488K048385R42438Q50637Q87625m64272k170993j593822R28506J259214
42389D8173206k549640n904675l180465L648220O704854K843176k482609l699272
42381D3552795k468004l198124n335295m853619j127625K462447L860368M059779
42373C6952722L745377K049245q43075k988426l432843l240920l015984j600402
42365B7625694J606283M608718M492755P36346l814137n365345k787201J148642
42357B8251755K689976J161171r87655j938356k224124k365785j576809j58019
42349B2852154l24538k485275l403078r09133K052987J690783m46124j2280K624805
$$ plain form
42407 51148629 52873687 53214238 53160829 52217981 49155832 44862076 42238484 42918072 45485488
42398 45485488 47533873 48476311 49326948 50214573 49750301 47579308 45985486 46913992 48173206
42389 48173206 45623566 39718891 36538426 40186646 46891500 49734676 47252067 43552795
42381 43552795 41084791 37886667 32551372 27697753 26570128 29032575 32892943 36952722
42373 36952722 40698099 42747344 41904269 38915843 35483000 32242080 29226096 27625694
42365 27625694 29231977 33840695 38333450 39069796 35255659 29890314 27103113 28251755
42357 28251755 30941731 32102902 31115247 29176891 26952767 24586982 23010173 22852154
42349 22852154 22527616 20042341 16639263 15730130 17783117 19473900 19027776 19015496 21640301
42340B1640301K594616j465391m626561k689906J986289M237202K894744J056030
42332B5627324J140363K278538K282616N58569j248494j211821K50204L74660
42324C0051959k357023n491999n321752j879773J075890J172393N6278K11683
42316A7517656J448750J888036Q05164q78062j885857j400369M25130J992385
42308A9912833J374900j233574l147937k201976N68895K121985Q57827j806093
42300A6446860l097132j663001J298160L475165L715505K516584P10853j101044
42292B2301950j847320o31944J197447Q00231j912000l084067k18733L502176
42284B0107740L305443m07988l060749k631012j288415o04881M72750K149496
$$ plain form
42340 21640301 24234917 22769526 18142965 15453059 17439348 21676550 24571294 25627324
42332 25627324 26767687 29046225 31328841 31887410 30638916 29427095 29677299 30051959
42324 30051959 27694936 22202937 16881185 15001412 16077302 17249695 17305973 17517656
42316 17517656 18966406 20854442 21659606 20781544 18895687 17495318 17920448 19912833
42308 19912833 21287733 20054159 16906222 14704246 15273141 17395126 18252953 16446860
42300 16446860 13349728 11686727 12984887 16460052 20175557 22692141 23402994 22301950
42292 22301950 20454630 19822686 21020133 21820364 19908364 16824297 16605564 20107740
42284 20107740 23413183 23005195 19944446 17313434 16025019 15420138 15892888 18042384
42276A8042384K411920O47904q00522l78714M34240K99217M29760J842006K985152
42267B5913347K422253J441486J512853J286044j089791m217962m889154k468705
42259A9910371N17149J669218O75187j483513l461469l922000k427289L9358K100960
42250A3617972L061798K634221P78582j494686k457315j694922o26976k76964
42242A3541710R27P24057R65767J20114o11356K3109J426388K396998K890406
42233B1478120L096481K236633N4255j715050j307462L97175R14483n85424k421387
42224B2147824k461932j90003K735227L570099J245369j667920j485739J586271
42216B5479196L276933J087348k366831l574904k931634k747431k889494j749003
$$ plain form
42276 18042384 20454304 21102208 20301686 19922972 20357212 20656429 21086189 22928195 25913347
42267 25913347 28335600 29777086 31289939 32575983 31486192 27268230 22379076 19910371
42259 19910371 20427520 22096738 22771925 21288412 17826943 13904943 11477654 11517012 13617972
42250 13617972 16679770 19313991 20092573 18597887 16140572 14445650 13818674 13541710
42242 13541710 13542637 14266694 15232461 15352575 14741219 14764328 16190716 18587714 21478120
42233 21478120 24574601 26811234 26865489 25150439 23842977 24240152 25154635 24569211 22147824
42224 22147824 19685892 19495889 22231116 25801215 27046584 25378664 23892925 25479196
42216 25479196 28756129 29843477 27476646 23901742 20970108 18222677 15333183 13584180
42208A3584180N4516N29338Q7641J010431L256355L949729J573004j762787k982485
42199A9299922j411873R22915J360867q21762l147338k204785J907005N079520
42191B0984471M558605K530333J988200J570463j654272o011502o660355k921137
42183A4384806N95621R51573N21947K020096L844423L009951l9835k327297k434716
42174B0526569j479886j063766j847705l242498l439107r42562K968197M748807
42166A6228049K716263o72865j872550k97634J910629K853949K091550m5312k586293
42157B0325786l870221k932391q42497M71480N76364O69388J479644K145024J440467
42148A9463044o89128l202340m949639n097538l130979N71622M129395N282773
$$ plain form
42208 13584180 13638696 14168034 14255675 15266106 18522461 22472190 24045194 22282407 19299922
42199 19299922 17888049 18810964 20171831 19350069 16202731 13997946 15904951 20984471
42191 20984471 25543076 28073409 30061609 31632072 29977800 23966298 17305943 14384806
42183 14384806 14980427 15932000 16453947 18474043 22318466 25328417 25288582 22961285 20526569
42174 20526569 19046683 17982917 16135212 12892714 9453607 8511045 11479242 16228049
42166 16228049 18944312 18271447 16398897 16101263 18011892 20865841 22957391 22912079 20325786
42157 20325786 16455565 13523174 12680677 13152157 13728521 14397909 15877553 18022577 19463044
42148 19463044 18773916 15571576 10621937 5524399 2393420 2965042 7094437 12377210
42140A2377210L894859K437723K831835L638311K190937j011201k582885j215860
42132B2560929M85593L53495L3707J806978M243928L870718K385m546987o714993
42123B2095753n163853l45753M984043O585217K916968k198690l649573r88762
42115B4235350K131194L223338K542376N20227k529917m471532k957296P05451
42107B3399191K654797J647295j35296j354574k756743l904482k872622j39574
42099A6537992J171358N6781j172554j408265k125160k932042o64951M655697
42091A4118856P676580M859276k22879k354424j811621j995430l097216k679104
42083A4494038m56147J739786L214189L971079K769766o39227l042845j515190
$$ plain form
42140 12377210 16272069 18709792 21541627 25179938 27370875 26359674 23776789 22560929
42132 22560929 23046522 23400017 23433724 25240702 29484630 33355348 33357733 28810746 22095753
42123 22095753 16931900 16586147 21570190 28155407 31072375 28873685 25224112 24235350
42115 24235350 26366544 29589882 32132258 32652485 30122568 25651036 22693740 23399191
42107 23399191 26053988 27701283 27565987 26211413 23454670 19550188 16677566 16537992
42099 16537992 17709350 17766131 16593577 15185312 13060152 10128110 9463159 14118856
42091 14118856 21795436 26654712 26431833 24077409 22265788 20270358 17173142 14494038
42083 14494038 14037891 15777677 18991866 22962945 25732711 25093484 22050639 20535449
42075B0535449J714323K099647o71279k934489k829600j686506l97231J283597
42067A7113911K124934M20830k241731k327622J26789J354175j13654j279102
42059A5178530K70730K882516M024389L719319L017122J845221K40319o42149
42051C0535997n20610r56931k742830m190208l544460j428324M75118J589102
42043A9216854K094532K036075J938235K673263L561452K375710j329223m540824
42035B8026074m185579j047424J362260J039766q83771k197731j957144q55706
42027A9300745k1481L95857J210657K392559K170108n28949l390010k854827Q86395
42018A9561054L598621K496496m35054j894050j675240j724494k581154k985443
$$ plain form
42075 20535449 22249772 24349419 23678140 20743651 17914051 16227545 15830314 17113911
42067 17113911 19238845 19659675 17417944 15090322 15217111 16571286 16457632 15178530
42059 15178530 15449260 18331776 22356165 26075484 29092606 30937827 31178146 30535997
42051 30535997 30015387 29058456 26315626 22125418 18580958 17152634 17627752 19216854
42043 19216854 21311386 23347461 25285696 27958959 31520411 33896121 32566898 28026074
42035 28026074 23840495 22793071 24155331 25195097 24311326 22113595 20156451 19300745
42027 19300745 19279264 19675121 20885778 23278337 25448445 24919496 21529486 18674659 19561054
42018 19561054 23159675 25656171 25221117 23327067 21651827 19927333 17346179 14360736
42010A4360736k089718k59921J708473K873602K372768M63440j418422k408054
42002A5602904k929051l063817j956081Q0366Q54797n78261j864487m95332K459243
41993H110281L960697L047922R97803j251435l227085l598150j680495M63428
41985F822966M50911m89818O71871L423651M057972J681614k80754K22398Q23626
41976A7384437n37495j761596n11366J272744N03161j823341k543806j740506
41968A0242232j952255l027213k285363L83302K046113J783154J798659K540799
41960A1529428J405946j751280k544727J206061M725233K699860k490142m062777
41952A0717602o34275K708486K657622J447610J414105R80509j498394l895453
$$ plain form
42010 14360736 12271018 12011097 13719570 16593172 18965940 19429380 18010958 15602904
42002 15602904 12673853 9610036 7653955 7734321 8589118 8010857 6146370 5651038 8110281
41993 8110281 12070978 15118900 16116703 14865268 11638183 8040033 6359538 6822966
41985 6822966 7273877 6784059 7455930 10879581 14937553 16619167 16338413 16560811 17384437
41976 17384437 16846942 15085346 14573980 15846724 16349885 14526544 11982738 10242232
41968 10242232 8289977 5262764 2977401 3360703 5406816 7189970 8988629 11529428
41960 11529428 12935374 11184094 8639367 9845428 14570661 17270521 14780379 10717602
41952 10717602 10083327 12791813 15449435 16897045 18311150 19291659 17793265 13897812
41944A3897812l442427j025234O66209J340640K496660L911249L670335J299862
41936B2815106j437097k850651k823477k091362j266073n28946L60036J394805
41928A3572341J571885K7711j909905j848837j75376r0748k315319k887539Q94422
41919F838635N134728M119803j175330m071617j350800L149583M672406K887016
41911B0204424k44408l742972o362578n525656p43507L995351M348220R82376
41903A2911250j701306j277701O85581J751725J376104M38790j56630J5884O91671
41894A4735368R51226K03544q99959j216695o49350k32393o99757j535196j602277
41885I054511n12400P75322R60173J22415j98115P37899J389204N4639k182370
$$ plain form
41944 13897812 10455385 9430151 10096360 11437000 13933660 17844909 21515244 22815106
41936 22815106 21378009 18527358 15703881 13612519 12346446 11817500 12177536 13572341
41928 13572341 15144226 15171937 13262032 11413195 11237819 11147071 8831752 5944213 6838635
41919 6838635 11973363 16093166 14917836 10846219 9495419 12645002 17317408 20204424
41911 20204424 19960016 16217044 9854466 4328810 3585303 7580654 11928874 12911250
41903 12911250 11209944 9932243 10617824 12369549 13745653 14184443 14027813 14043697 14735368
41894 14735368 15686594 15890138 14990179 13773484 13124134 12891741 12191984 10656788 9054511
41885 9054511 8542111 9317433 10277606 10400021 10201906 10939805 12329009 12383648 10201278
41876A0201278k583218o83897J154123J468040J473814K122503J946318k36738
41868A4862223k494764k149527K05706J537595O54658o33793n04055P66895J856295
41859A4101233J906610P11799j233745k615984k385997j108887j84315J85183
41851I375897R34274K047728K154659P21448q25466j062979m96576m30268q10080
41842A1608637n57446L83276Q20242K74267k02930J85891M97490n41755k338415
41833A0129257l079709k377259j644027j524704p36361J483608L381208K885220
41825H517233P62632m89259l91086q36049k549830l470007j662550J696737L514860
41816E092681K281921m12619j575692J69502L017331L838426K003153K31182O47464
$$ plain form
41876 10201278 7618060 6934163 8088286 9556326 11030140 13152643 15098961 14862223
41868 14862223 12367459 10217932 10423638 11961233 12615891 11982098 11478043 12244938 14101233
41859 14101233 16007843 16719642 15485897 12869913 10483916 9375029 9190714 9375897
41851 9375897 10310171 12357899 14512558 15234006 14408540 13345561 12848985 12418717 11608637
41842 11608637 11051191 11434467 12254709 12528976 12326046 12511937 13009427 12467672 10129257
41833 10129257 7049548 4672289 3028262 1503558 767197 2250805 5632013 8517233
41825 8517233 9279865 8790606 8399520 7563471 5013641 1543634 -118916 1577821 5092681
41816 5092681 7374602 6961983 5386291 5555793 8573124 12411550 14414703 14645885 15293349
41807A5293349J737037J307182N47853J610406K539626l96512n304538n417128
41799A1917275P90571N915870L791695j575349k414821J192497K546982o59907
41791B1504813l434834j952282J126780J694772j37484j916782k917652l661893
41783A0305438l723031k471401o39666N69078R20785P72673N19585R76152K654161
41774I883774M130301L183197L37050j071198L56136J680526j5346k953569l064729
41765A2466142J25300K949408K745418Q65635j03122L7516l43167j714035k630119
41756A4398976j952141o02298l99658j610919k542570j731240J68882J163144
41748F892176J44011k096648l660314k958187L7308L336712M340094K466222j24016
$$ plain form
41807 15293349 17030386 18337568 18885421 20495827 23035453 22638941 17334403 11917275
41799 11917275 12707846 18623716 22415411 20840062 18425241 19617738 22164720 21504813
41791 21504813 18069979 16117697 17244477 18939249 18801765 16884983 13967331 10305438
41783 10305438 6582407 4111006 3471340 4040418 4961203 5733876 6253461 7229613 9883774
41774 9883774 14014075 17197272 17534322 16463124 16819260 18499786 18484440 15530871 12466142
41765 12466142 12591442 15540850 18286268 19151903 19048781 19086297 18743130 17029095 14398976
41756 14398976 12446835 11844537 11444879 9833960 7291390 5560150 5729032 6892176
41748 6892176 7036187 4939539 1279225 -1678962 -1641654 1695058 6035152 8501374 8377358
41739H377358j074140l49783N64549R28386R26211N26007k36296n31657K5226
41730I155861J26337j301914k607952j271964K052345M053482L453293K291587
41722A5951075J921249R00688j584203l170084j721032Q16587R43653j156207
41714A2901726j970562J2378K278137K272970Q86435L42423L23247j417134m881017
41705A0748603o691924m292221K93247K768699J937205N66040R07350J872377
41697H109376J576872K89642q15606j790066k719981k242008K61017K516073K197224
41688G382543N95102L83824R60646k76784k762455l154002j008983L17437o07280
41679A830048r31071J360408L744508L024285M0460j905781j276024R30211K760091
$$ plain form
41739 8377358 7303218 6953435 7517984 8446370 9372581 9898588 9662292 9130635 9155861
41730 9155861 9282198 7980284 5372332 4100368 6152713 10206195 13659488 15951075
41722 15951075 17872324 18773012 17188809 14018725 12297693 13114280 14057933 12901726
41714 12901726 10931164 10943542 13221679 15494649 16381084 16723507 17046754 15629620 10748603
41705 10748603 4056679 -235542 57705 2826404 4763609 5329649 6236999 8109376
41697 8109376 9686248 9975890 9160284 7370218 4650237 2408229 2669246 5185319 7382543
41688 7382543 7977645 8361469 9322115 9045331 6282876 3128874 2119891 2437328 1830048
41679 1830048 898977 2259385 6003893 9028178 9068638 7162857 5886833 6817044 9577135
41670I577135K342735o07279l368640k752124K18724J304291m53464j246632R38958
41661E953704K857529J747627k9180K45696N31878j695924l774611j959211J537652
41652E415160J586265j468818k571179m24496Q73833q93450k783536k142272o23124
41643c031617p02019j729690j600363K9268J827425K531331J805599N39864J97330
41634a32872P86743N97632o59621o44740J388817K094857o05971k780883k00691
41625a56729L965019L698764M47953J033670N729021P120989K285175k603873
41617B1519989k852713k064889l890145m807550j242572K718690J854898j107409
41609A0128299m51953K504393K229273r99656j965146J02619R13776n09983m85173
$$ plain form
41670 9577135 11919870 11312591 7943951 5191827 5410551 6714842 6261378 5014746 5953704
41661 5953704 8811233 10558860 10529680 10775376 11307254 9611330 5836719 3877508 5415160
41652 5415160 7001425 5532607 2961428 2536932 3410765 2517315 -266221 -2408493 -3031617
41643 -3031617 -3733636 -5463326 -7063689 -7034421 -5206996 -2675665 -870066 -330202 -132872
41634 -132872 653871 1251503 591882 -52858 1335959 3430816 2824845 43962 -156729
41625 -156729 3808290 7507054 7955007 8988677 14717698 21838687 24123862 21519989
41617 21519989 18667276 16602387 12712242 7904692 6662120 9380810 11235708 10128299
41609 10128299 9676346 12180739 14410012 13410356 11445210 11547829 12461605 11951622 11466449
41600A1466449J674139J922440q38190j961868J263096M709318L677958k19371
41592B1693971k149786r74696M36391j58310k345377m408707m572127j961568
41584E559791K067377M566930M126005K283980J001812J52578j390556l396087
41576A4971830m239862k728719N28463L143113K666353p10000l703902l571047
41568F356229j460310l72330p65156p89795j44413l28727j102301l68295J707381
41559B732283K129753o0769j871885j094749M20468N07770M77678K170008L869438
41550I279995K691342o58224k900670k824140j759118l46160J891995M087000
41542I462020M232090K114663l92493k131889l489592m322528l513057j221141
$$ plain form
41600 11466449 13140588 15063028 14224838 12262970 13526066 18235384 21913342 21693971
41592 21693971 19544185 18569489 19005880 18847570 16502193 12093486 7521359 5559791
41584 5559791 7627168 12194098 16320103 18604083 19605895 19758473 18367917 14971830
41576 14971830 10731968 8003249 8531712 11674825 14341178 13631178 9927276 6356229
41568 6356229 4895919 4523589 3758433 2968638 2824225 2495498 1393197 1024902 2732283
41559 2732283 4862036 4801267 2929382 1834633 2255101 2762871 3240549 5410557 9279995
41550 9279995 11971337 11313113 8412443 5588303 3829185 3483025 5375020 9462020
41542 9462020 13694110 15808773 15416280 13284391 9794799 5472271 1959214 738073
41534G38073N25691M48340k77762K33089K231941M315234M855087L183836K67708
41525A6521237j716640j460622j35268J35884q52181j513436j316869j548682
41517H113423k717806l113738j189916J871371L389293K428095P11775M83554
41509I976051K145454L973491L903871J742446m94031q95051l2962o0603j537500
41500A8721166k585808j711144j389O33074L08144O35415J815081K091748N06792
41491B0413079j351505j471080m07090n94493k641743l895535j789379K312978
41483A0575232M322258K474524n59315j381094j15856N55228m46271j475065j023864
41474A2925777L39290J422912K057154K293290J362246j089889l428136l264641
$$ plain form
41534 738073 1263764 1712104 1434342 1667431 3899372 8214606 13069693 16253529 16521237
41525 16521237 14804597 13343975 13208707 13344591 12492410 10978974 9662105 8113423
41517 8113423 5395617 2281879 1091963 2963334 6352627 8780722 9492497 9976051
41509 9976051 12121505 16094996 19998867 21741313 21247282 20352231 20319269 20258666 18721166
41500 18721166 16135358 14424214 14422825 15055899 15364043 15999458 17814539 19906287 20413079
41491 20413079 19061574 17590494 17183404 16588911 13947168 10051633 8262254 10575232
41483 10575232 14897490 17372014 16812699 15431605 15315749 15870977 15424706 13949641 12925777
41474 12925777 13265067 14687979 16745133 19038423 20400669 19310780 15882644 12618003
41466A2618003m06823K451966K451408l95350l177244l081705l52589J941334
41458A2049000J310696j319853k823622j673676N66949J737096J711168J688079
41450A3245837J996131K034403J824916J995291K195456J103355j408138l371207
41442A9616044k970468r19323M78375K16934n96932p36679m54548o40194j326969
41433A2666240j829770j836254j531497r45280k8728P72283R13932P01564R10209
41424I792699J424177J348606O34948K37826K10424p01843k571132l172691j147542
41415F055472J194857P03315j839629k617562k82442K469989L333451L290340
41407A2307791L754152L719233J949195j79503n59395L92093P79627L03746k06179
$$ plain form
41466 12618003 12211180 14663146 17114554 16719204 13541960 10460255 10107666 12049000
41458 12049000 13359696 12039843 9216221 7542545 8109494 9846590 11557758 13245837
41450 13245837 15241968 17276371 19101287 21096578 23292034 24395389 22987251 19616044
41442 19616044 16645576 15726253 16204628 16421562 15824630 15087951 14633403 13993209 12666240
41433 12666240 10836470 9000216 7468719 6523439 6494711 7266994 8180926 8882490 9792699
41424 9792699 11216876 12565482 13200430 13438256 13648680 12946837 10375705 7203014 6055472
41415 6055472 7250329 7953644 6114015 3496453 3214011 5684000 9017451 12307791
41407 12307791 16061943 19781176 21730371 21550868 20991473 21383566 22163193 22466939 22260760
41398B2260760j204606l419302n021320l122098J512771M276521K405372j482106
41390A6205992k931983r76324J589978K059157N04116q86143l51203J372928J703329
41381A8289847l24194k004539k66739L425224M310216R91364k285030j626466
41373B0509683J148516J717925m89783k525184k971532l114576l434816k522763
41365H317470j60739J518391J190416L08295M79431Q39503j65871j743517j537630
41356I045749R84731L590534L865811J723507q62834j940686j163402K63341R01034
41347A6407785L99359l71704m04512L23119Q30034K49672j078688j936722j821645
41338A2596698j593263j820086j294754J146809L735347L241722m3980j680120
$$ plain form
41398 22260760 21056154 17636852 12615532 9493434 11006205 15282726 17688098 16205992
41390 16205992 13274009 12297685 13887663 15946820 16450936 15564793 15213590 16586518 18289847
41381 18289847 17965653 15961114 15694375 19119599 23429815 24421179 22136149 20509683
41373 20509683 21658199 23376124 22886341 20361157 17389625 14275049 10840233 8317470
41365 8317470 8156731 9675122 10865538 11173833 11653264 12492767 12326896 10583379 9045749
41356 9045749 10030480 13621014 17486825 19210332 18347498 16406812 15243410 15506751 16407785
41347 16407785 16807144 16435440 16030928 16354047 17184081 17433753 16355065 14418343 12596698
41338 12596698 11003435 9183349 7888595 9035404 12770751 16012473 15968493 14288373
41330A4288373Q10734L910106L009345q71065k992269k103874j318880k092632
41322A2639838k045113J67700K073427J419672m38935j292432j228381r57122
41314A0338654O1089J516486J222311j147436k160936M14228L445827K836443
41306A6526666k85104j819676j136953p46551j052532m24007L02141j291803l742058
41297F330123k553808K360402N174564K141436l154894m928090k097335K178349
41289E450747M721455L931837J35283l537645l385439n6995J761276J49094j406036
41280G763577l33157N93075j323684l142009r12070L464341N228742M054722K930234
41271A8323771J940693q52867l783084l253853n67809o03898l438814l956355
$$ plain form
41330 14288373 15099107 19009213 22018558 21147493 18155224 16051350 14732470 12639838
41322 12639838 10594725 10762425 12835852 14255524 13816589 12524157 11295776 10338654
41314 10338654 10399743 11916229 13138540 11991104 9830168 10244396 13690223 16526666
41306 16526666 16241562 14421886 13284933 12538382 11485850 11061843 11363984 10072181 6330123
41297 6330123 3776315 6136717 11311281 13452717 10297823 5369733 3272398 5450747
41289 5450747 10172202 14104039 14239322 10701677 7316238 7259243 9020519 9169613 7763577
41280 7763577 7430420 8023495 6699811 3557802 2645732 6110073 11338815 15393537 18323771
41271 18323771 20264464 19411597 15628513 12374660 11806851 11202953 7764139 3807784
41263C807784q83263P77985j268733k101122J949908O356123N261247P08585j000340
41254A3608174R20577J824987j38213j922760j517648o64551q26476q00745K61774
41245A0745119Q64552j94808j712060k121533j760738j715716j817183j097066
41237A190567N33971K006903K209026J070665k54486m54937M49071J209713J214059
41228I174552J212889J601969J368286j02510j524802j553267r37362j112051
41220H127704j738729j591869r10527p21528o70697J27927Q08002l2176j263740
41211B134367l44155K352951L329025R11664k218741k707673o07158J628010K527953
41202G006243K451224K131422J760659J068496l83866k561838m407881m590744
$$ plain form
41263 3807784 2924521 3702506 2433773 332651 2282559 8638682 13899929 14608514 13608174
41254 13608174 14528751 16353738 16215525 14292765 12775117 12110566 11284090 10483345 10745119
41245 10745119 11609671 11414863 9702803 7581270 5820532 4104816 2287633 1190567
41237 1190567 1724538 3731441 5940467 7011132 6756646 6301709 6750780 7960493 9174552
41228 9174552 10387441 11989410 13357696 13255186 11730384 10177117 9239755 8127704
41220 8127704 6388975 4797106 3886579 3165051 2494354 2622281 3430283 3398107 2134367
41211 2134367 1790212 4143163 7472188 8383852 6165111 3457438 2850280 4478290 7006243
41202 7006243 9457467 11588889 13349548 14418044 14034178 11472340 7064459 2473715
41194B473715k866359q9990K723602M444157L730968N63598k567100k894303p31077
41185D787211J117909J089113J31973m97536n37872J58780J571606K455746J522111
41176A1799041k91945r85372p17289j177903k009462j244989N67494O43957q82253
41167E701279m61592K585658L809834M09289l830361l999042j108562M55057p6214
41158C485346O4275J683883K676991J978189O74831o01682k134733l131984k279065
41149B416051l34014M23049n55371j508364r94854O54203K155455K114744q137
41140D362762k337669j607281K334120N032328L012778j178216k668872j056257
41132E893693K63542o1261m90178n86867j345398j940167n88721J448861J149717
$$ plain form
41194 2473715 -392644 -482634 2240968 6685125 10416093 10979691 8412591 5518288 4787211
41185 4787211 5905120 6994233 7126206 6628670 6090798 6249578 7821184 10276930 11799041
41176 11799041 11507096 10521724 9804435 8626532 6617070 5372081 5939575 6583532 5701279
41167 5701279 5239687 7825345 11635179 12044468 8214107 4215065 3106503 3561560 3485346
41158 3485346 3549621 5233504 7910495 9888684 10563515 9961833 7827100 4695116 2416051
41149 2416051 2082037 2505086 1949715 441351 -553503 100700 2256155 4370899 4362762
41140 4362762 2025093 417812 2751932 7784260 10797038 9618822 6949950 5893693
41132 5893693 6157235 6095974 5605796 5018929 3673531 1733364 1144643 2593504 3743221
41123C743221r27862j146807J043599K270731J342531J123877K785309L181638
41115A3416237L97770k481376k082528L22313J467487O90079p20910k002959k375118
$$ plain form
41123 3743221 2815359 1668552 2712151 4982882 6325413 7449290 10234599 13416237
41115 13416237 13814007 11332631 9250103 9572416 11039903 11729982 11009072 9006113 6630995
$$ [...]
##END NTUPLES=NMR SPECTRUM
##END=
