##TITLE=31Pdec_DE-146_TFA
 Cl4,64 sc
 5.5.2026
##JCAMPDX= 6.0         $$ Bruker NMR JCAMP-DX V2.0
##DATA TYPE= NMR SPECTRUM
##DATA CLASS= NTUPLES
##ORIGIN= UXNMR, Bruker Analytische Messtechnik GmbH
##OWNER= root
$$ XWIN-NMR		Version 3.5
$$ Tue May  5 14:11:31 2026 Russian Standard Time (UT+4h)  she@DPX200
##.OBSERVE FREQUENCY= 81.013821
##.OBSERVE NUCLEUS= ^31P
##.ACQUISITION MODE= SIMULTANEOUS
##.ACQUISITION SCHEME= undefined
##.AVERAGES= 64
##.DIGITISER RES= 17
##SPECTROMETER/DATA SYSTEM= spect
##.PULSE SEQUENCE= zgpg30
##.SOLVENT NAME= DMSO
##.SHIFT REFERENCE= (INTERNAL, DMSO, 0, 197.392)
##AUDIT TRAIL= $$ (NUMBER, WHEN, WHO, WHERE, WHAT)
$$ ##TITLE= Audit trail, XWIN-NMR		Version 3.5
$$ ##JCAMPDX= 5.01
$$ ##ORIGIN= Bruker BioSpin GmbH
$$ ##OWNER= she
$$ F:/spectra/data/she/nmr/P31/2/pdata/1/auditp.txt
$$ ##AUDIT TRAIL=  $$ (NUMBER, WHEN, WHO, WHERE, WHAT)
(   1,<2026-05-05 14:10:36.18 +0400>,<she>,<DPX200>,
      <continue with go, POWCHK disabled, PULCHK disabled
       configuration hash MD5:
       00 E9 B6 7A A2 85 ED C7 34 08 36 98 17 FE 4E 26
       data hash MD5: 32K
       92 42 2C 74 FE F8 E3 4F 0E 74 93 FD 2B 68 FD 80>)
(   2,<2026-05-05 14:10:38.21 +0400>,<she>,<DPX200>,
      <Start of raw data processing
       efp BC_mod = 2 LB = 1.5 FT_mod = 6 PKNL = 1 PHC0 = 1491.78 PHC1 = -221.8995 SI = 64K 
       data hash MD5: 64K
       54 CC 23 B4 32 0D E8 C7 DA 22 9D CA 00 79 0D B3>)
(   3,<2026-05-05 14:10:53.70 +0400>,<she>,<DPX200>,
      <pk PHC0 = 22.33809 PHC1 = 0 
       data hash MD5: 64K
       B9 94 86 F0 C0 9E 6F 81 E7 21 DB 55 BA 14 65 40>)
$$ ##END=
$$ 
$$ hash MD5
$$ D8 FD 8B 82 44 F1 88 D7 14 E3 E8 94 A7 02 9D 68
##$RELAX= 
##$RELAX= 
##$RELAX= 
##$RELAX= 
##$RELAX= 
##$RELAX= 
##$RELAX= 
##$RELAX= 
$$ Bruker specific parameters
$$ --------------------------
##$DU= <F:/spectra>
##$EXPNO= 2
##$NAME= <P31>
##$PROCNO= 1
##$TYPE= <nmr>
##$USER= <she>
##$AMP= (0..31)
100 100 100 100 100 100 100 100 100 100 100 100 100 100 100 100 100 100 
100 100 100 100 100 100 100 100 100 100 100 100 100 100 
##$AQSEQ= 0
##$AQ_mod= 1
##$AUNM= <au_zg>
##$AUTOPOS= <>
##$BF1= 81.014009
##$BF2= 200.13
##$BF3= 200.13
##$BF4= 200.13
##$BF5= 200.13
##$BF6= 200.13
##$BF7= 200.13
##$BF8= 200.13
##$BYTORDA= 1
##$CFDGTYP= 0
##$CFRGTYP= 5
##$CHEMSTR= <none>
##$CNST= (0..31)
1 1 145 1 1 1 1 1 1 1 1 1 1 1 1 1 1 1 1 1 1 1 1 1 1 1 1 1 1 1 1 1 
##$CPDPRG= <waltz16>
##$CPDPRG1= <>
##$CPDPRG2= <waltz16>
##$CPDPRG3= <>
##$CPDPRG4= <mlev>
##$CPDPRG5= <mlev>
##$CPDPRG6= <mlev>
##$CPDPRG7= <mlev>
##$CPDPRG8= <mlev>
##$CPDPRGB= <>
##$CPDPRGT= <>
##$D= (0..31)
0 1 0 0 0 0 0 0 0 0.06 0 0.03 2e-05 3e-06 0 0 0.0002 0 0 0 0 0 0 0 0 0 
0 0 0 0 0 0 
##$DATE= 1777975751
##$DBL= (0..7)
120 120 120 11 120 120 24 19 
##$DBP= (0..7)
150 150 150 150 150 150 150 150 
##$DBP07= 0
##$DBPNAM0= <>
##$DBPNAM1= <>
##$DBPNAM2= <>
##$DBPNAM3= <>
##$DBPNAM4= <>
##$DBPNAM5= <>
##$DBPNAM6= <>
##$DBPNAM7= <>
##$DBPOAL= (0..7)
0.5 0.5 0.5 0.5 0.5 0.5 0.5 0.5 
##$DBPOFFS= (0..7)
$$ [...]
##$SUBNAM3= <"">
##$SUBNAM4= <"">
##$SUBNAM5= <"">
##$SUBNAM6= <"">
##$SUBNAM7= <"">
##$SUBNAM8= <"">
##$SUBNAM9= <"">
##$SW= 400.765351723535
##$SWIBOX= (0..15)
0 1 3 0 0 0 0 0 0 0 0 0 0 0 0 0 
##$SW_h= 32467.5324675325
##$TD= 32768
##$TD0= 1
##$TE= 0
##$TE2= 300
##$TE3= 300
##$TEG= 300
##$TL= (0..7)
0 120 53 12 22 120 120 120 
##$TP= (0..7)
150 150 150 150 150 150 150 150 
##$TP07= 0
##$TPNAME0= <>
##$TPNAME1= <>
##$TPNAME2= <>
##$TPNAME3= <>
##$TPNAME4= <>
##$TPNAME5= <>
##$TPNAME6= <>
##$TPNAME7= <>
##$TPOAL= (0..7)
0.5 0.5 0.5 0.5 0.5 0.5 0.5 0.5 
##$TPOFFS= (0..7)
0 0 0 0 0 0 0 0 
##$TUNHIN= 0
##$TUNHOUT= 0
##$TUNXOUT= 0
##$USERA1= <user>
##$USERA2= <user>
##$USERA3= <user>
##$USERA4= <user>
##$USERA5= <user>
##$V9= 5
##$VALIST= <valist>
##$VCLIST= <CCCCCCCCCCCCCCC>
##$VD= 0
##$VDLIST= <DDDDDDDDDDDDDDD>
##$VPLIST= <PPPPPPPPPPPPPPP>
##$VTLIST= <TTTTTTTTTTTTTTT>
##$WBST= 1024
##$WBSW= 4
##$XGAIN= (0..3)
0 0 0 0 
##$XL= 0
##$YL= 0
##$YMAX_a= 3472
##$YMIN_a= -10581
##$ZGOPTNS= <>
##$ZL1= 120
##$ZL2= 120
##$ZL3= 120
##$ZL4= 120
##$ABSF1= 0
##$ABSF2= 0
##$ABSG= 0
##$ABSL= 0
##$ALPHA= 0
##$AQORDER= 0
##$ASSFAC= 0
##$ASSFACI= 0
##$ASSFACX= 0
##$ASSWID= 0
##$AUNMP= <proc_1d>
##$AZFE= 0.1
##$AZFW= 0.5
##$BCFW= 0
##$BC_mod= 2
##$BYTORDP= 0
##$COROFFS= 0
##$CY= -3
##$DATMOD= 1
##$DC= 0
##$DFILT= <>
##$DTYPP= 0
##$F1P= 0
##$F2P= 0
##$FCOR= 1
##$FTSIZE= 65536
##$FT_mod= 6
##$GAMMA= 0
##$GB= 0
##$INTBC= 1
##$INTSCL= 9.790993e-09
##$ISEN= 30
##$LB= 1.5
##$LEV0= 0
##$LPBIN= 0
##$MAXI= 10000
##$MC2= 0
##$MEAN= 0
##$ME_mod= 0
##$MI= 50
##$NCOEF= 0
##$NC_proc= -9
##$NLEV= 6
##$NOISF1= 182.463
##$NOISF2= 159.3651
##$NSP= 0
##$NTH_PI= 0
##$NZP= 0
##$OFFSET= 197.3918
##$PC= 4
##$PHC0= 1514.118
##$PHC1= -221.8995
##$PH_mod= 1
##$PKNL= yes
##$PPARMOD= 0
##$PSCAL= 0
##$PSIGN= 0
##$REVERSE= no
##$SF= 81.014063255964
##$SI= 65536
##$SIGF1= 159.3651
##$SIGF2= -187.1042
##$SINO= 113.3802
##$SIOLD= 16384
##$SREGLST= <1H.CDCl3>
##$SSB= 0
##$STSI= 65536
##$STSR= 0
##$SW_p= 32467.5324675325
##$SYMM= 0
##$S_DEV= 0
##$TDeff= 32768
##$TDoff= 0
##$TI= <>
##$TILT= no
##$TM1= 0
##$TM2= 0
##$TOPLEV= 0
##$USERP1= <user>
##$USERP2= <user>
##$USERP3= <user>
##$USERP4= <user>
##$USERP5= <user>
##$WDW= 1
##$XDIM= 65536
##$YMAX_p= 471840778
##$YMIN_p= -174759813
$$ End of Bruker specific parameters
$$ ---------------------------------
##NTUPLES= NMR SPECTRUM
##VAR_NAME=  FREQUENCY,     SPECTRUM/REAL,   SPECTRUM/IMAG
##SYMBOL=    X,             R,               I
##VAR_TYPE=  INDEPENDENT,   DEPENDENT,       DEPENDENT
##VAR_FORM=  AFFN,          ASDF,            ASDF
##VAR_DIM=   65536,         65536,           65536
##UNITS=     HZ,            ARBITRARY UNITS, ARBITRARY UNITS
##FACTOR=    0.49542278885378, 1,            1
##FIRST=     15991.5117654749, 0,            0
##LAST=      -16476.0207020576, 0,           0
##MIN=       -16476.0207020576, -174759813,  0
##MAX=       15991.5117654749, 471840778,    0
$$ Real data points
##PAGE= N=1
##DATA TABLE= (X++(R..R)), XYDATA
$$ [...]
$$ plain form
7328 -18332324 -27347359 -27780098 -18511625 -9079120 -5871322 -5552732 -3290362 -627433
7320 -627433 -1416528 -4498280 -5394596 -3332232 -1855724 -2574507 -2437286 1417363 7208435
7311 7208435 11029967 11560589 9659721 5073049 -2762038 -11030555 -14722810 -12798460
7303 -12798460 -10036262 -11061580 -15282276 -19501144 -22378980 -23613416 -21763723 -16713271
7295 -16713271 -12127339 -11367278 -12545246 -11662185 -8836950 -6607589 -3828857 2444253
7287 2444253 9516265 10574075 4825866 -704182 -1650231 -1724260 -4488078 -6796739 -5544535
7278 -5544535 -4763331 -9343209 -16115532 -18209088 -15147182 -11596806 -8516518 -3148496
7270 -3148496 3260192 5456662 2529595 -409211 -126962 1079062 1064616 1290267 2259619
$$ packed form
7328a8332324r015035m32739R268473R432505L207798L18590K262370K662929
7320f27433p89095l081752q96316K062364J476508p18783J37221L854649N791072
7311G208435L821532N30622j900868m586672p835087q268517l692255J924350
7303a2798460K762198j025318m220696m218868k877836j234436J849693N050452
7295a6713271M585932P60061j177968Q83061K825235K229361K778732O273110
7287B444253P072012J057810n748209n530048r46049p4029k763818k308661J252204
7278e544535P81204m579878o772323k093556L061906L550376L080288N368022
7270c148496O408688K196470k927067k938806K82249J206024j4446K25651R69352
$$ plain form
7261 2259619 821553 -4635241 -10168290 -10855810 -6906051 -2605409 -1001358 -1363493 -373728
7252 -373728 4822639 12713219 16645030 11139616 -706421 -9681494 -10790918 -7271975
7244 -7271975 -4033786 -2287764 -2146044 -4750534 -8612749 -8931376 -4588993 -1363399 -3680664
7235 -3680664 -7529759 -7238056 -5582113 -9926186 -19924235 -26626761 -24490989 -17656234
7227 -17656234 -12219502 -8027078 -1807234 5426239 8564731 4693667 -4058475 -13523558
7219 -13523558 -20734561 -23881504 -21380724 -13007205 -1881354 6309591 7618042 3447557
7211 3447557 -1032184 -2148652 -585439 793675 560533 -196706 611727 3706708 7104199
7202 7104199 8124624 7690925 10151409 15877428 17069727 7004296 -7855284 -13210002
$$ packed form
7261B259619j438066n456794n533049o87520L949759M300642J604051l62135R89765
7252c73728N196367P890580L931811n505414j1846037q975073j109424L518943
7244g271975L238189J746022J41720k604490l862215l18627M342383L225594k317265
7235c680664l849095K91703J655943m344073r998049o702526K135772O834755
7227a7656234N436732M192424O219844P233473L138492l871064q752142r465083
7219a3523558p211003l146943K500780Q373519J1125851Q190945J308451m170485
7211C447557m479741j116468J563213J379114k33142p57239Q08433L094981L397491
7202G104199J020425m33699K460484N726019J192299j0065431j4859580n354718
$$ plain form
7194 -13210002 -6090448 -7871 -6317102 -18468349 -22206144 -15132027 -6721436 -2762353
7186 -2762353 -342208 2423981 1773325 -4473605 -12630510 -18510300 -21189250 -20026207
7178 -20026207 -14183685 -6832669 -3561525 -4450227 -3788876 228958 2383287 193211
7170 193211 -303100 6335045 15768504 19681454 16544685 10954232 5850998 1245111 -2033166
7161 -2033166 -3093848 -3778704 -5821668 -7090152 -5320453 -3337376 -5213716 -9152713
7153 -9152713 -10152390 -8554371 -9454504 -13596573 -15393370 -11506492 -5666127 -2532091 -1543035
7144 -1543035 39328 1663284 682400 -3024912 -6781297 -8694299 -9387413 -10266488 -11082491
7135 -11082491 -9412032 -3064691 6255704 12788090 12167942 6567208 2320651 2678602
$$ packed form
7194a3210002P119554O082577o309231j2151247l737795P074117Q410591L959083
7186b762353K420145K766189o50656o246930q156905n879790k678950J163043
7178b0026207N842522P351016L271144q88702O61351M017834K154329k190076
7170A93211m96311O638145R433459L912950l136769n590453n103234m605887l278277
7161b033166j060682o84856k042964j268484J769699J983077j876340l938997
7153i152713r99677J598019r00133m142069j796797L886878N840365L134036R89056
7144a543035J582363J623956r80884l707312l756385j913002o93114q79075q16003
7135a1082491J670459O347341R320395O532386o20148n600734m246557L57951
$$ plain form
7127 2678602 4911567 4255200 -1335181 -9739323 -15595451 -13642667 -4433572 3884215
7119 3884215 3449174 -3614417 -7775659 -5013407 -1869186 -5151770 -11698034 -13026405
7111 -13026405 -7014192 413315 4002293 4288255 3349080 15101 -7906061 -18608490
7103 -18608490 -26278429 -26405410 -20102464 -12800956 -9088512 -9322683 -11115353 -12819218
7095 -12819218 -14324858 -15246182 -14528767 -12409719 -10994181 -11650654 -12725650 -10927536 -4743328
7086 -4743328 3829549 10532688 11966490 8438524 3863006 2108050 3629748 6400692
7078 6400692 9086865 11476699 12649239 11503498 9180894 8262492 9204296 10361691 11904562
7069 11904562 15960876 21224077 21190666 11117648 -5265109 -19000090 -24632482 -23436886
$$ packed form
7127B678602K232965o56367n590381q404142n856128J952784R209095Q317787
7119C884215m35041p063591m161242K762252L144221l282584o546264j328371
7111a3026405O012213P427507L588978K85962r39175l333979p921162j0702429
7103a8608490p669939j26981O302946P301508L712444k34171j792670j703865
7095a2819218j505640r21324P17415K119048J415538o56473j074996J798114O184208
7086d743328Q572877O703139J433802l527966m575518j754956J521698K770944
7078F400692K686173K389834J172540j145741k322604r18402R41804J157395J542871
7069A1904562M056314N263201l3411j0073018j6382757j3734981n632392J195596
$$ plain form
7061 -23436886 -19634859 -16382013 -14629665 -13088454 -9421394 -3417489 1610333 2657868
7053 2657868 1616520 3568563 10375788 17896956 20031623 14507069 4827332 -2577028
7045 -2577028 -3656976 -291695 1833754 -629671 -5706121 -9469032 -10156400 -7857014
7037 -7857014 -2971045 2579501 5003339 2703971 -836101 -1261496 966516 2138632
7029 2138632 1020683 -542412 -1517029 -2341546 -2526877 -1388105 -420855 -1199020 -2065681
7020 -2065681 -1263647 -1837802 -7619494 -15136545 -16530928 -11176800 -7031900 -8710770 -12198016
7011 -12198016 -14611991 -20340954 -31113940 -37686136 -30659131 -15207471 -5639890 -7490488
7003 -7490488 -13960537 -18958999 -23856713 -29822568 -32695401 -29778288 -25096729 -22855291
$$ packed form
7061b3436886L802027L252846J752348J541211L667060O003905N027822J047535
7053B657868j041348J952043O807225P521168K134667n524554r679737p404360
7045b577028j079948L365281K125449k463425n076450l762911o87368K299386
7037g857014M885969N550546K423838k299368l540072m25395K228012J172116
7029B138632j117949j563095r74617q24517j85331J138772R67250p78165q66661
7020b065681Q02034n74155n781692p517051j394383N354128M144900j678870l487246
7011a2198016k413975n728963j0772986o572196P027005J5451660R567581j850598
7003g490488o470049m998462m897714n965855k872833K917113M681559K241438
$$ plain form
6995 -22855291 -20108154 -10891270 4924209 20914368 30650062 32162530 27626289 21334631
6987 21334631 16800360 13688657 8514561 -374810 -10088407 -16640487 -18962739 -17774970
6979 -17774970 -12816076 -4033020 5592916 11136921 9906455 3639006 -2838059 -4701613
6971 -4701613 -548473 6106657 10043268 9819833 8477929 8597045 9685115 11528919 16121219
6962 16121219 23413323 28717669 28345545 25115784 23776072 23291152 19093228 11574490
6954 11574490 6228837 5407570 5934198 5545253 5363210 4418497 -1255627 -10515121 -14775103
6945 -14775103 -9422244 -2323670 -4006644 -12974737 -18679825 -17269045 -15702398 -19491651
6937 -19491651 -24654920 -25026309 -20741544 -14813653 -6556177 5621456 17772720 22850841
$$ packed form
6995b2855291K747137R216884J5815479J5990159R735694J512468m536241o291658
6987B1334631m534271l111703n174096q889371r713597o552080k322252J187769
6979a7774970M958894Q783056R625936N544005j230466o267449o477065j863554
6971d701613M153140O655130L936611k23435j341904J19116J088070J843804M592300
6962A6121219P292104N304346l72124l229761j339712m84920m197924p518738
6954A1574490n345653q21267N26628l88945j82043r44713n674124r259494m259982
6945a4775103N352859P098574j682974q968093n705088J410780J566647l789253
6937a9491651n163269l71389M284765N927891Q257476J2177633J2151264N078121
$$ plain form
6929 22850841 19194626 12177854 7194482 4408736 900038 -4824813 -11378720 -15930964
6921 -15930964 -16764241 -15402227 -15512190 -18361927 -20668064 -19055238 -15229563 -13680022
6913 -13680022 -15159787 -16159457 -14755437 -12924718 -12115184 -10449974 -6223762 -768192
6905 -768192 4615947 11538490 21036576 29267417 30468574 23851016 14889348 9902937
6897 9902937 11182038 16613131 21589095 21499547 14916896 5164593 -2562323 -6003395 -6983242
6888 -6983242 -8171925 -9976536 -10583840 -8174577 -3256242 899000 1289877 -714410 -256240
6879 -256240 4493106 8902116 7600342 1768197 -2859621 -4171736 -5639592 -10065050
6871 -10065050 -15634812 -19335996 -20527702 -19425048 -15519070 -9920784 -6409248 -7173554
$$ packed form
6929B2850841l656215p016772m983372k785746l508698n724851o553907m552244
6921a5930964q33277J362014j09963k849737k306137J612826L825675J549541
6913a3680022j479765r99670J404020J830719Q09534J665210M226212N455570
6905g68192N384139O922543R498086Q230841J201157o617558q961668m986411
6897I902937J279101N431093M975964q9548o582651r752303p726916l441072r79847
6888f983242j188683j804611o07304K409263M918335M155242L90877k004287M58170
6879b56240M749346M409010j301774n832145m627818j312115j467856m425458
6871a0065050n569762l701184j191706J102654L905978N598286L511536p64306
$$ plain form
6863 -7173554 -9438691 -9317384 -7681421 -8885508 -13754375 -16851862 -12200522 -532783
6855 -532783 10687084 14876599 13212919 12515940 16169538 19733733 17746279 12362696
6847 12362696 10808204 15098118 19688576 20246791 19002945 18559925 15845231 7256730
6839 7256730 -3818107 -10566139 -12239201 -14437910 -20045058 -24877981 -23545054 -16173518
6831 -16173518 -8151835 -5426537 -10170833 -18608901 -23163448 -19404461 -10909863 -4846424
6823 -4846424 -3412429 -2984875 -1194144 -148086 -1332842 -1652522 2493891 9659000 14661692
6814 14661692 14244631 9554088 4065500 704725 398977 2200487 4815109 8014397
6806 8014397 12015997 16028131 18607020 18924645 16472613 10762810 3332676 -1597594
$$ packed form
6863g173554k265137J21307J635963j204087m868867l097487M651340J1667739
6855e32783J1219867M189515j663680o96979L653598L564195j987454n383583
6847A2362696j554492M289914M590458N58215j243846m43020k714694q588501
6839G256730j1074837o748032j673062k198709n607148m832923J332927P371536
6831a6173518Q021683K725298m744296q438068m554547L758987Q494598O063439
6823d846424J433995M27554J790731J046058j184756l19680M146413P165109N002692
6814A4661692m17061m690543n488588l360775l05748J801510K614622L199288
6806H014397M001600M012134K578889L17625k452032n709803p430134m930270
$$ plain form
6798 -1597594 -1794626 -1236465 -5489066 -13149387 -16606494 -12066298 -4151463 828046 1449423
6789 1449423 -840714 -5123485 -9098462 -8400901 -2224948 3696379 4044896 981310 -152176
6780 -152176 607284 -1004871 -5270725 -7053776 -2808586 5247619 12434143 15666072 13951761
6771 13951761 8029117 315831 -6522356 -10816251 -10906923 -5455432 2745416 6343383
6763 6343383 1217138 -7303545 -10712095 -8065888 -5268959 -5503051 -7027182 -9582895
6755 -9582895 -15013561 -20543108 -19823992 -13686104 -11794582 -18707136 -25538385 -22328714
6747 -22328714 -13054669 -9974034 -16197260 -22536056 -20964531 -13392077 -6288836 -3655785
6739 -3655785 -7332971 -17791567 -30682826 -37039315 -31613423 -19189284 -9208151 -5346574
$$ packed form
6798a597594j97032N58161m252601p660321l457107M540196P914835M979509O21377
6789A449423k290137m282771l974977O97561O175953N921327L48517l063586j133486
6780a52176P59460j612155m265854j783051M245190Q056205P186524L231929j714311
6771A3951761n922644p713286o838187m293895r0672N451491Q200848L597967
6763F343383n126245q520683l408550K646207K796929k34092j524131k555713
6755i582895n430666n529547P19116O137888J891522o912554o831249L209671
6747b2328714R274045L080635o223226o338796J571525P572454P103241K633051
6739c655785l677186j0458596j2891259o356489N425892J2424139R981133L861577
$$ plain form
6731 -5346574 -3301654 2029458 10379160 17523642 20353553 19014432 15158767 10027725
6723 10027725 4722749 918845 -390173 -602273 -2035377 -4239710 -4027562 -777280
6715 -777280 571290 -4874885 -14126876 -17956864 -11490133 -138209 6923390 6719737
6707 6719737 3216138 -37557 -3847770 -9492236 -14815126 -16999367 -17223228 -19004706
6699 -19004706 -22112536 -21667823 -14828901 -5781295 -1674799 -4977136 -11972475 -17399291
6691 -17399291 -17909939 -12274331 -2074999 7547951 11433017 9775294 7256363 6357193
6683 6357193 5097874 2291187 403182 583368 -788548 -6545550 -13036886 -14626625
6675 -14626625 -11439477 -7693900 -4316320 973308 6896164 7962534 1595954 -8766942
$$ packed form
6731e346574K044920N331112Q349702P144482K829911j339121l855665n131042
6723A0027725n304976l803904j309018k12100j433104k204333K12148L250282
6715g77280J348570n446175r251991l829988O466731J1351924P061599k03653
6707F719737l503599l253695l810213n644466n322890k184241k23861j781478
6699a9004706l107830M44713O838922R047606M106496l302337o995339n426816
6691a7399291n10648N635608J0199332R622950L885066j657723k518931q99170
6683F357193j259319k806687j888005J80186j371916n757002o491336j589739
6675a4626625L187148L745577L377580N289628N922856J066370o366580j0362896
$$ plain form
6667 -8766942 -18597885 -26032731 -30271579 -31191384 -31521749 -34106366 -35485908 -28085376 -11539865
6658 -11539865 3942790 9351659 6625313 2257808 -2836961 -10257059 -15700359 -12775364
6650 -12775364 -3971003 587773 -3855157 -11762522 -16367055 -16974251 -15419060 -11706124
6642 -11706124 -6236944 -1102195 4003260 12294340 22936383 28409487 23283099 11908943
6634 11908943 2862311 -1084086 -2829543 -3962421 -3637064 -2707701 -3228309 -4164928 -2461525
6625 -2461525 1569621 4048633 2633065 -1750188 -7215124 -10621668 -6639554 6487258
6617 6487258 20460734 23565846 15448340 8070891 9247748 13089001 11582115 7478117
6609 7478117 7353265 7972462 600547 -13333556 -22236405 -21136195 -18019406 -19786864
$$ packed form
6667h766942r830943p434846m238848r19805l30365k584617j379542P400532J6545511
6658a1539865J5482655N408869k726346m367505n094769p420098n443300K924995
6650a2775364Q804361M558776m442930p907365m604533o07196J555191L712936
6642a1706124N469180N134749N105455Q291080J0642043N473104n126388j1374156
6634A1908943r046632l946397j745457j132878L25357R29363n20608r36619J703403
6625b461525M031146K479012j415568m383253n464936l406544L982114J3126812
6617F487258J3973476L105112q117506p377449J176857L841253j506886m103998
6609G478117j24852O19197p371915j3934103q902849J100210L116789j767458
$$ plain form
6601 -19786864 -21361056 -15154788 -4110245 2988781 4940291 8118028 14568082 18473458
6593 18473458 15583347 9408688 5650136 5626222 7856367 11599128 15441247 16046627 12297117
6584 12297117 8172995 7587122 8451067 6379057 2869806 4210005 11624085 17882855
6576 17882855 16230435 8615457 1774115 -1680207 -4247560 -7841432 -11777474 -15666893
6568 -15666893 -19635799 -21312689 -17161911 -8327749 -1094180 808202 806648 3390299 6586098
6559 6586098 4755814 -2829286 -10740417 -14456749 -14716006 -14290156 -13857227 -12312704 -8812868
6550 -8812868 -3502576 2131908 5653386 6610137 8413589 13515816 16667098 8452379
6542 8452379 -11552674 -29820885 -32148452 -19682056 -6665303 -3204879 -5618249 -4480192
$$ packed form
6601a9786864j574192O206268J1044543P099026J951510L177737O450054L905376
6593A8473458k890111o174659l758552k3914K230145L742761L842119O05380l749510
6584A2297117m124122n85873Q63945k072010l509251J340199P414080O258770
6576A7882855j652420p614978o841342l454322k567353l593872l936042l889419
6568a5666893l968906j676890M150778Q834162P233569J902382j554K583651L195799
6559F586098j830284p585100p911131l716332k59257M25850M32929J544523L499836
6550h812868N310292N634484L521478R56751J803452N102227L151282q214719
6542H452379k0005053j8268211k327567J2466396J3016753L460424k413370J138057
$$ plain form
6534 -4480192 3232162 13096388 20459671 23869015 22318684 14222165 1697619 -6956900
6526 -6956900 -3717202 9050409 18229954 13009590 -2893099 -15575712 -17176364 -13364153
6518 -13364153 -13475220 -18284455 -21442756 -19264698 -13665014 -7339358 -1878665 -105308
6510 -105308 -4185731 -10463612 -11838754 -7123854 -2660619 -2320687 -1906991 2552678 7087462
6501 7087462 6849790 6242303 13384038 26152018 32588981 26206393 13204890 2543374
6493 2543374 -3604599 -6213943 -3894998 3172283 9521245 11308451 12710800 18450989
6485 18450989 23700073 19906701 8522650 -678276 -4869908 -11356650 -22822352 -29803357
6477 -29803357 -24174523 -12127257 -5719421 -7110609 -9644701 -10282813 -11197021 -10998271
$$ packed form
6534d480192P712354R864226P363283L409344j550331q096519j2524546q654519
6526f956900L239698J2767611R179545n220364j5902689j2682613j600652L812211
6518a3364153j11067m809235l158301K178058N599684O325656N460693J773357
6510a05308m080423o277881j375142M714900M463235L39932M13696M459669M534784
6501G087462k37672o07487P141735J2767980O436963o382588j3001503j0661516
6493B543374o147973k609344K318945P067281O348962J787206J402349N740189
6485A8450989N249084l793372j1384051r200926m191632o486742j1465702o981005
6477b9803357N628834J2047266O407836j391188k534092o38112r14208J98750
$$ plain form
6469 -10998271 -4828581 5637318 11463304 8744682 4033758 3695103 4703708 1217697
6461 1217697 -5150919 -7989797 -5915824 -3759451 -5219855 -9124893 -12297881 -12086047
6453 -12086047 -6414714 4947824 18670750 29713098 35033073 34172648 27440878 15761447
6445 15761447 1495794 -12617316 -24625308 -32185719 -32277828 -24609594 -13705608 -4748097
6437 -4748097 1496894 6977597 11144563 10921015 5255345 -3378150 -11629571 -16936744
6429 -16936744 -17690294 -14824274 -12140269 -11630819 -9708249 -2278661 7374143 11028633
6421 11028633 6317531 -17574 -1058717 2866949 7731775 12016489 15853655 17372908
6413 17372908 14176376 7312717 873398 -1781026 230902 5987983 13130365 18207549
$$ packed form
6469a0998271O169690J0465899N825986k718622m710924l38655J008605l486011
6461A217697o368616k838878K073973K156373j460404l905038l172988K11834
6453a2086047N671333J1362538J3722926J1042348N319975q60425o731770j1679431
6445A5761447j4265653j4113110j2007992p560411r2109P668234J0903986Q957511
6437d748097O244991N480703M166966k23548n665670q633495q251421n307173
6429a6936744p53550K866020K684005N09450J922570P429588R652804L654490
6421A1028633m711102o335105j041143L925666M864826M284714L837166J519253
6413A7372908l196532o863659o439319k654424K011928N757081P142382N077184
$$ plain form
6405 18207549 18445452 13696964 6936476 3144937 5949460 12921242 15687618 8809790
6397 8809790 -1855596 -4777705 2186988 7950499 2422665 -10474318 -18756531 -17689195
6389 -17689195 -13272930 -11986100 -13066905 -11939778 -6845421 158047 6352625 10186386
6381 10186386 10624105 6588340 -1673583 -10769995 -15709557 -15255802 -14317965 -17659143 -21873015
6372 -21873015 -18299263 -4982700 9138081 14597566 11825806 7987639 7206430 8063406
6364 8063406 8108046 6697818 5081181 6577891 13908218 23232334 24891802 15037784 2856771
6355 2856771 -103089 5041968 7564601 3370098 -576996 1484549 6279001 8723188
6347 8723188 9302661 10044338 9549597 7154381 6869518 11318842 15444112 12428449 3656080
$$ packed form
6405A8207549K37903m748488o760488l791539K804523O971782K766376o877828
6397H809790j0665386k922109O964693N763511n527834j2896983q282213J067336
6389a7689195M416265J286830j080805J127127N094357P003468O194578L833761
6381A0186386M37719m035765q261923r096412m939562M53755R37837l341178m213872
6372b1873015L573752J3316563J4120781N459485k771760l838167p81209Q56976
6364H063406M4640j410228j616637J496710P330327R324116J659468r854018j2181013
6355B856771k959860N145057K522633m194503l947094K061545M794452K444187
6347H723188N79473P41677m94741k395216k84863M449324M125270l015663q772369
$$ plain form
6338 3656080 -3455368 -6695975 -11777371 -22520905 -33701988 -37048366 -31463786 -23574046
6330 -23574046 -19060929 -17059080 -14096165 -10606638 -10535097 -15275955 -21136731 -23450833
6322 -23450833 -20719570 -14108477 -6106605 -1072179 -3079914 -10175487 -14430243 -11653258
6314 -11653258 -7318431 -7666295 -8991064 -3686094 5502928 7418733 -406254 -6732533
6306 -6732533 -2472148 7367278 13080283 13679829 13636150 12512589 6713908 -1952214 -8038000
6297 -8038000 -11019491 -14132240 -15406365 -8010160 8933723 26377003 34800712 33427245
6289 33427245 28268402 24704536 23640914 22099053 16378986 6722845 -1358618 -3183903
6281 -3183903 -1395952 -2110325 -4901121 -2166750 9776000 23921199 30094167 25899289
$$ packed form
6338C656080p111448l240607n081396j0743534j1181083l346378N584580P889740
6330b3574046M513117K001849K962915L489527P1541m740858n860776k314102
6322b3450833K731263O611093Q001872N034426k007735p095573m254756K776985
6314a1653258M334827l47864j324769N304970R189022J915805p824987o326279
6306f732533M260385R839426N713005N99546m3679j123561n798681q666122o085786
6297h038000k981491l112749j274125P396205J6943883J7443280Q423709j373467
6289C3427245n158843l563866j063622j541861n720067r656141q081463j825285
6281c183903J787951p14373k790796K734371J1942750J4145199O172968m194878
$$ plain form
6273 25899289 16966055 8866966 2407932 -4190917 -11687844 -18797366 -23311696 -24028949
6265 -24028949 -21980953 -19372152 -17265697 -15034040 -11771816 -7149986 -1540395 3078154
6257 3078154 3391442 -1296291 -5900862 -3934553 4303056 11259502 11108623 6221188 3236630
6248 3236630 5575196 11567419 17145859 18159993 12556398 2973307 -4441696 -5925589
6240 -5925589 -3356648 -430156 1523410 1796136 -1838965 -9157257 -13881135 -9671051
6232 -9671051 640008 7018456 4350843 -2048356 -4791306 -3791373 -3853709 -6040496 -6329311
6223 -6329311 -2679382 658616 -2087138 -10890356 -19481482 -21949364 -18185060 -12395134
6215 -12395134 -7831541 -4497698 -1155887 2595092 6306474 8605603 6883220 -110945
$$ packed form
6273B5899289q933234q099089o459034o598849p496927p109522m514330p17253
6265b4028949K047996K608801K106455K231657L262224M621830N609591M618549
6257C078154L13288m687733m604571J966309Q237609O956446j50879m887435k984558
6248C236630K338566N992223N578440J014134n603595r583091p415003j483893
6240e925589K568941K926492J953566K72726l635101p318292m723878M210084
6232i671051J0311059O378448k667613o399199k742950R99933o2336k186787k88815
6223f329311L649929L337998k745754q803218q591126k467882L764304N789926
6215a2395134M563593L333843L341811L750979L711382K299129j722383o994165
$$ plain form
6207 -110945 -8185702 -9575604 -1843329 7478797 8823489 1617388 -6547603 -10404394
6199 -10404394 -11581786 -12847463 -13685002 -13518387 -14014709 -14919119 -12128520 -4130033 3357719
6190 3357719 4195870 425130 -1751271 -2689774 -8985432 -21989005 -33398426 -34886134
6182 -34886134 -26986274 -15535944 -4225997 5165306 9339191 6292909 245709 -1521879
6174 -1521879 2829002 7948281 8354403 4089575 -1059488 -3963187 -3877661 -2166432 -1293371
6165 -1293371 -2503763 -4226596 -4324695 -3284606 -2540754 -335564 6523329 15940279 20204902
6156 20204902 15095952 5569289 -1262897 -5710678 -13220852 -24259222 -32201690 -31858446
6148 -31858446 -25026653 -15657668 -4167933 9474169 19860284 18925004 5629665 -10657022
$$ packed form
6207a10945q074757j389902P732275R322126J344692p206101q164991l856791
6199a0404394j177392j265677q37539J66615m96322r04410K790599P998487P487752
6190C357719Q38151l770740k176401r38503o295658j3003573j1409421j487708
6182c4886134P899860J1450330J1309947R391303M173885l046282o047200j767588
6174a521879M350881N119279M06122m264828n149063k903699Q5526J711229Q73061
6165a293371j210392j722833r8099J040089P43852K205190O858893R416950M264623
6156B0204902n108950r526663o832186m447781p510174j1038370p942468L43244
6148c1858446O831793R368985J1489735J3642102J0386115r35280j3295339j6286687
$$ plain form
6140 -10657022 -18746991 -16138374 -9149855 -3986686 -827571 2744798 5975057 6008923
6132 6008923 3676410 4203807 10538314 18247549 19274554 10139092 -4721307 -16963553
6124 -16963553 -20781622 -16505141 -9267975 -3986468 -1447171 15177 122753 -2780122
6116 -2780122 -6502727 -5118366 2788323 10186427 10502569 7107828 7940173 12988760 14704694
6107 14704694 10649026 7539343 10594980 16575156 21068129 25136953 29047397 26339393
6099 26339393 12471922 -5000624 -13987715 -13344357 -11651975 -11710923 -6934219 4753356
6091 4753356 14039160 13124696 7640549 8141877 14826438 18831672 16227377 12823703 14925443
6082 14925443 21356788 25834337 23195119 12815825 -369887 -7926328 -4834576 4665372
$$ packed form
6140a0657022q089969K608617O988519N163169L159115L572369L230259L3866
6132F008923k332513N27397O334507P709235J027005r135462j4860399j2242246
6124a6963553l818069M276481P237166N281507K539297J462348J07576k902875
6116b780122l722605J384361P906689P398104L16142l394741Q32345N048587J715934
6107A4704694m055668l109683L055637N980176M492973M068824L910444k708004
6099B6339393j3867471j7472546q987091O43358J692382n8948M776704J1687575
6091D753356R285804r14464n484147N01328O684561M005234k604295l403674K101740
6082A4925443O431345M477549k639218j0379294j3185712p556441L091752R499948
$$ plain form
6074 4665372 10952836 8997369 1663690 -6302031 -13164467 -18258735 -19499212 -15205006
6066 -15205006 -6269337 4331481 12036432 11625834 2333897 -7736279 -8306425 -238839
6058 -238839 3733109 -4811616 -18689065 -24919584 -20593533 -12407148 -4687346 3559505
6050 3559505 11351378 14527670 13198794 13166395 17528018 22555080 24197233 23337225 21842092
6041 21842092 18307488 11241381 2821979 -3761178 -7814893 -9511531 -8022154 -4086685
6033 -4086685 -1432809 -2548847 -5267498 -5922722 -3561727 755024 5597884 7964465
6025 7964465 4299221 -4165249 -10579981 -10249444 -5696016 -878168 4716078 11318518
6017 11318518 13396678 6361924 -4523822 -10236779 -11119344 -14813666 -21356489 -20682784
$$ packed form
6074D665372O287464j955467p333679p965721o862436n094268j240477M294206
6066a5205006Q935669J0600818P704951m10598r291937j0070176n70146Q067586
6058b38839L971948q544725j3877449o230519M326051Q186385P719802Q246851
6050C559505P791873L176292j328876l2399M361623N027062J642153q60008j495133
6041B1842092l534604p066107q419402o583157m053715j696638J489377L935469
6033d086685K653876j116038k718651o55224K360995M316751M842860K366581
6025G964465l665244q464470o414732L30537M553428M817848N594246O602440
6017A1318518K078160p034754j0885746n712957q82565l694322o542823O73705
$$ plain form
6009 -20682784 -8281928 5599047 8066845 -1382950 -13628067 -22199135 -25893242 -23204368
6001 -23204368 -12839294 416647 7704199 6148167 2006229 1465290 2571262 -172881
5993 -172881 -6240486 -9126516 -5711980 -941275 -1068881 -5526650 -8905829 -9006443 -8431661
5984 -8431661 -8716079 -8252443 -7532552 -10760655 -18214138 -21599416 -13186853 2461951 12091612
5975 12091612 8843552 -1499188 -9334122 -10719355 -7022807 -835764 4687173 6154050
5967 6154050 2978392 -1380690 -2695906 761685 7782208 14151517 13723985 4210289
5959 4210289 -7494331 -10801132 -3981516 3575976 3897443 32503 -563204 2393862
5951 2393862 2578695 -2847843 -8822368 -8428660 -924540 6502950 4778910 -7622146
$$ packed form
6009b0682784J2400856J3880975K467798r449795j2245117q571068l694107K688874
6001b3204368J0365074J3255941P287552j556032m141938n40939J105972k744143
5993a72881o067605k886030L414536M770705j27606m457769l379179j00614N74782
5984h431661k84418M63636P19891l228103p453483l385278Q412563J5648804R629661
5975A2091612l248060j0342740p834934j385233L696548O187043N522937J466877
5967F154050l175658m359082j315216L457591P020523O369309m27532r513696
5959D210289j1704620l306801O819616P557492L21467l864940n95707K957066
5951B393862J84833n426538n974525L93708P504120P427490j724040j2401056
$$ plain form
5943 -7622146 -21391647 -25507225 -19420941 -11714258 -6816616 -290052 10251524 17970751
5935 17970751 16906340 12733478 15028193 22655637 25590256 19378871 9238151 131020
5927 131020 -8834187 -18417558 -24629104 -23272208 -15150042 -5026617 1648811 1183532
5919 1183532 -5112230 -10332193 -8964296 -3957368 -2040906 -3331534 -2528705 -230848
5911 -230848 -4081284 -15440953 -23194716 -16990686 -1235187 10652555 12416176 8865241
5903 8865241 5789092 3194788 -424703 -2720969 44317 6888943 11472846 8951686
5895 8951686 2995505 3499227 14834294 27868657 28010936 11777560 -8958141 -20791063
5887 -20791063 -22215453 -20307993 -18945790 -16334665 -12105464 -9833320 -10848659 -10547745
$$ packed form
5943g622146j3769501m115578O086284P706683M897642O526564J0541576P719227
5935A7970751j064411m172862K294715P627444K934619o211385j0140720r107131
5927A31020q965207r583371o211546J356896Q122166J0123425O675428m65279
5919A183532o295762n219963J367897N006928J916462j290628Q02829K297857
5911b30848l850436j1359669p753763O204030J5755499J1887742J763621l550935
5903H865241l076149k594304l619491k296266K765286O844626M583903k521160
5895H951686n956181N03722J1335067J3034363J42279j6233376k0735701j1832922
5887b0791063j424390J907460J362203K611125M229201K272144j015339L00914
$$ plain form
5879 -10547745 -4351082 4984408 9619226 6104492 -190012 -1516180 3097149 7602004
5871 7602004 7460315 5190651 5926207 10374680 15109484 17695783 17716903 14143407 6394731
5862 6394731 -2155472 -6582707 -7092766 -8574371 -12207030 -12721620 -6638911 1773057 6853350
5853 6853350 9877941 15914354 24639025 29560369 26104691 16793456 8490415 7057743
5845 7057743 13782956 24129039 30604606 29547525 24615109 21557694 20957192 18861568
5837 18861568 13124315 5621974 -984542 -5170311 -5831594 -3347285 -1029593 -1597089
5829 -1597089 -2298248 1920772 9814532 13805117 10947984 8562922 13973458 22133250
5821 22133250 20179515 4154213 -14942036 -24082072 -22509235 -19282948 -19934683 -21485930
$$ packed form
5879a0547745O196663R335490M634818l514734o294504j326168M613329M504855
5871G602004j41689k269664P35556M448473M734804K586299K1120l573496p748676
5862F394731q550203m427235n10059j481605l632659n14590O082709Q411968N080293
5853F853350L024591O036413Q724671M921344l455678r311235q303041j432672
5845G057743O725213J0346083O475567j057081m932416l057415o00502k095624
5837A8861568n737253p502341o606516m185769o61283K484309K317692n67496
5829a597089p01159M219020P893760L990585k857133k385062N410536Q159792
5821B2133250j953735j6025302j9096249r140036J572837L226287o51735j551247
$$ plain form
5813 -21485930 -20467414 -19474973 -22181713 -26029507 -25386761 -20545869 -17725371 -19210048
5805 -19210048 -19020913 -11663591 -1202235 3156244 -1079865 -6938493 -7336263 -3224664
5797 -3224664 -635366 -2115791 -3817687 -890404 6198496 12062555 12666265 9281513
5789 9281513 5115061 264198 -6413542 -11185624 -6620477 8478480 24466079 30451837
5781 30451837 25986468 18597485 11773664 1793153 -12971512 -26107271 -30213656 -26034505
5773 -26034505 -20366838 -16954210 -13692788 -8381200 -3289107 -2621840 -7492818 -14768706
5765 -14768706 -20028622 -21111779 -19723389 -20033075 -24556408 -30653806 -32282578 -26479799
5757 -26479799 -17100346 -10309324 -7149355 -3435328 2655705 6622721 4033926 -1639432
$$ packed form
5813b1485930J018516R92441k706740l847794O42746M840892K820498j484677
5805a9210048J89135P357322J0461356M358479m236109n858628l97770M111599
5797c224664K589298j480425j701896K927283P088900N864059O03710l384752
5789I281513m166452m850863o677740m772082M565147J5098957J5987599N985758
5781C0451837m465369p388983o823821r980511j4764665j3135759m106385M179151
5773b6034505N667667L412628L261422N311588N092093O67267m870978p275888
5765a4768706n259916j083157J388390l09686m523333o097398j628772N802779
5757b6479799R379453O791022L159969L714027O091033L967016k588795n673358
$$ plain form
5749 -1639432 -2060934 4933112 11277013 7892255 -3828479 -12066135 -6284475 11733146
5741 11733146 28750668 32363052 22648737 10843220 6563498 8944977 11762796 13313015
5733 13313015 16292221 19865638 18521739 10178150 179281 -5198389 -5225189 -2393465
5725 -2393465 2416635 9203284 16036796 20179896 20660274 18320834 15371261 15298473 19417579
5716 19417579 22581618 17519719 5895257 -518146 6235112 20036177 28916312 28652249
5708 28652249 22679819 13581545 2457166 -6342982 -8294937 -5600730 -3896350 -3143321
5700 -3143321 709557 5712244 4153490 -5866125 -16856393 -22194529 -23144807 -23323446
5692 -23323446 -23093671 -22726218 -24525858 -27322147 -24302531 -11638775 4260626 12809720
$$ packed form
5749a639432m21502O994046O343901l384758j1720734q237656N781660J8017621
5741A1733146J7017522L612384r714315j1805517m279722K381479K817819J550219
5733A3313015K979206L573417j343899q343589r998869n377670k6800K831724
5725b393465M810100O786649O833512M143100M80378k339440k949573p2788M119106
5716A9417579L164039n061899j1624462o413403O753258J3801065Q880135k64063
5708B8652249n972430r098274j1124379q800148j951955K694207J704380P53029
5700c143321L852878N002687j558754j0019615j0990268n338136r50278j78639
5692b3323446K29775L67453j799640k796289L019616J2663756J5899401Q549094
$$ plain form
5684 12809720 10339594 1978643 -4961243 -6618887 -4258646 -3123495 -7548206 -15614192
5676 -15614192 -21476836 -23807735 -27152660 -32921055 -34898896 -28087894 -17240098 -11063187
5668 -11063187 -11022460 -11230011 -7239634 191358 8675498 16786471 23576869 28761057 32443618
5659 32443618 32724749 26720753 17127846 13582159 21972213 35288193 41233945 36880438
5651 36880438 29244941 23074488 16142917 7143182 87144 -2131520 -2311815 -3646939
5643 -3646939 -4983605 -5082787 -7261575 -15434665 -28165150 -40128900 -47384149 -48596214
5635 -48596214 -43727113 -34624963 -24768012 -15692206 -6077703 2948498 5142838 -3487225
5627 -3487225 -16959192 -24626277 -23583355 -20358993 -20210873 -20861062 -18774222 -15743921
$$ packed form
5684A2809720k470126q360951o939886j657644K360241J135151m424711q065986
5676a5614192n862644k330899l344925n768395j977841O811002J0847796O176911
5668a1063187M0727k07551L990377P430992Q484140Q110973O790398N184188L682561
5659C2443618K81131o003996r592907l545687Q390054J3315980N945752m353507
5651C6880438p635497o170453o931571q999735p056038k218664j80295j335124
5643c646939j336666r9182k178788q173090j2730485j1963750p255249j212065
5635d8596214M869101R102150R856951R075806R614503R026201K194340q630063
5627c487225j3471967p667085J042922L224362J48120o50189K086840L030301
$$ plain form
5619 -15743921 -15107562 -15530756 -13473470 -9344776 -6260203 -4281873 -1281213 858582
5611 858582 -3323227 -14693698 -26584356 -32459749 -32667937 -30919269 -27948547 -22569560
5603 -22569560 -16111965 -11167907 -7487645 -3625397 -1690776 -5466238 -13353197 -17889476
5595 -17889476 -14280632 -6350154 -2015918 -4800568 -11199309 -14834881 -12203611 -5618508
5587 -5618508 -887306 -818181 -1601398 1993991 8404071 9950232 2601932 -8513123 -15359464
5578 -15359464 -16055102 -15259653 -17280634 -21413880 -23912852 -23064108 -21599334 -23492743 -28397565
5569 -28397565 -31524746 -30758309 -30829881 -36259839 -42512627 -40516785 -29858136 -20707439
5561 -20707439 -20751949 -26213007 -28456309 -23771568 -13315959 744698 14229410 20964574
$$ packed form
5619a5743921O36359m23194K057286M128694L084573J978330L000660K139795
5611H58582m181809j1370471j1890658n875393k08188J748668K970722N378987
5603b2569560O457595M944058L680262L862248J934621l775462p886959m536279
5595a7889476L608844P930478M334236k784650o398741l635572K631270O585103
5587e618508M731202O9125p83217L595389O410080J546161p348300j1115055o846341
5578a5359464o95638P95449k020981m133246k498972Q48744J464774j893409m904822
5569b8397565l127181P66437p1572n429958o252788J995842J0658649R150697
5561b0707439m4510n461058k243302M684741J0455609J4060657J3484712O735164
$$ plain form
5553 20964574 19377941 15544003 14492712 12043113 1260729 -15712010 -28940214 -32742038
5545 -32742038 -30553777 -28187867 -27700461 -28283850 -28466960 -26301807 -20453050 -11585663 -926913
5536 -926913 10856849 20670131 21831666 10985161 -5199484 -15436962 -15607528 -10782786
5528 -10782786 -6517297 -3546333 -1104133 239509 662449 1714455 3284948 3281834 1261729
5519 1261729 -885905 -2580943 -5596860 -10655107 -15841577 -18979813 -19174291 -16356871
5511 -16356871 -12236464 -10997005 -15341012 -21993010 -24608149 -20902542 -13730401 -6317356
5503 -6317356 -617263 917900 -2627173 -7064235 -6967994 -3350995 -2251660 -5457680 -8246960
5494 -8246960 -6935564 -2837586 2239114 8418365 14266882 16819150 16627898 16775967 15607836
$$ packed form
5553B0964574j586633l833938j051291k449599j0782384j6972739j3228204l801824
5545c2742038K188261K365910M87406n83389j83110K165153N848757Q867387J0658750
5536i26913J1783762R813282J161535j0846505j6184645j0237478j70566M824742
5528a0782786M265489K970964K442200J343642M22940J052006J570493l114k020105
5519A261729k147634j695038l015917n058247n186470l138236j94478K817420
5511a6356871M120407J239459m344007o651998k615139L705607P172141P413045
5503f317356N700093J535163l545073m437062R6241L616999J099335l206020k789280
5494h246960J311396M097978N076700O179251N848517K552268j91252J48069j168131
$$ plain form
5485 15607836 7746429 -5318979 -13795459 -13018828 -10710038 -15152828 -23062378 -26313237
5477 -26313237 -24956179 -25002217 -26825801 -24761625 -17408618 -10521238 -8480065 -8465800 -4858624
5468 -4858624 3887755 13758951 18617878 15290893 6632710 -1392983 -6252270 -9937297
5460 -9937297 -13016344 -12333636 -7188129 -2699103 -2595694 -3016151 993311 6277240 5364567
5451 5364567 -2301521 -9238981 -9790732 -5971648 -3168748 -4012236 -6946152 -8277424 -5990356
5442 -5990356 -2948509 -3931138 -7697434 -6415493 3078028 12271937 11531150 4045253 1503076
5433 1503076 7631767 14285474 14122236 9300043 5444876 3405575 395822 -4597585
5425 -4597585 -9358093 -10448546 -5926227 2222618 9271432 13597333 19032570 28075573
$$ packed form
5485A5607836p861407j3065408q476480P76631K308790m442790p909550l250859
5477b6313237J357058m6038j823584K064176P353007O887380K041173J4265L607176
5468d858624Q746379R871196M858927l326985q658183q025693m859287l685027
5460i937297l079047O82708N145507M489026J03409m20457M009462N283929r12673
5451E364567p666088o937460n51751L819084K802900q43488k933916j331272K287068
5442e990356L041847r82629l766296J281941R493521R193909p40787p485897k542177
5433A503076O128691O653707j63238m822193l855167k039301l009753m993407
5425d597585m760508j090453M522319Q148845P048814M325901N435237R043003
$$ plain form
5417 28075573 36215441 38308192 37059422 37883126 38321658 32095246 22434177 20071956
5409 20071956 26053559 27785143 17079874 2455090 -3128077 1192978 7375065 11534075
5401 11534075 15069149 17063448 14623877 9346039 6172793 6334271 7078187 7454845 8762373
5392 8762373 9919156 8181705 4919400 5560548 12319240 20539460 23650093 19518412
5384 19518412 11558091 5746573 6526775 13415467 21505610 26678925 29279238 30870031
5376 30870031 29496128 21949416 9968287 -45950 -4313687 -5379515 -7294649 -9965441
5368 -9965441 -10352790 -7498622 -3814264 -1446241 749920 5353984 11994478 16648842
5360 16648842 16567025 14495572 15368441 19074040 19914485 14549631 7308947 4967223 8294150
$$ packed form
5417B8075573Q139868K092751j248770Q23704M38532o226412r661069k362221
5409B0071956N981603J731584j0705269j4624784n583167M321055O182087M159010
5401A1534075L535074J994299k439571n277838l173246J61478P43916L76658J307528
5392H762373J156783j737451l262305O41148O758692Q220220L110633m131681
5384A9518412p960321n811518P80202O888692Q090143N173315K600313J590793
5376C0870031j373903p546712j1981129j0014237m267737j065828j915134k670792
5368i965441l87349K854168L684358K368023K196161M604064O640494M654364
5360A6648842q1817k071453Q72869L705599Q40445n364854p240684k341724L326927
$$ plain form
5351 8294150 11802922 10812010 5768038 -243516 -5509692 -10202544 -14307266 -16378891
5343 -16378891 -14863098 -10787033 -8205311 -10318184 -15270187 -17860873 -15913444 -12890277
5335 -12890277 -13319265 -17387820 -20876269 -19008354 -10370417 898835 7187438 4656965
5327 4656965 -1978573 -5640170 -6831735 -11299040 -17724965 -16555000 -4831043 6513313
5319 6513313 7116200 1898149 2594170 10126084 15843741 16870750 18503333 21969144 21531588
5310 21531588 15809672 11430497 11899539 12314733 9526523 8436889 12216645 14268852
5302 14268852 7406505 -4823264 -13389318 -15814397 -15955875 -15780340 -14606981 -13418836
5294 -13418836 -12815578 -9325200 -833351 6940220 7272273 3762060 5964982 14223956
$$ packed form
5351H294150L508772r90912n043972o011554n266176m692852m104722k071625
5343a6378891J515793M076065K581722k112873m952003k590686J947429L023167
5335a2890277m28988m068555l488449J867915Q637937J1269252O288603k530473
5327D656965o635538l661597j191565m467305o425925J169965J1723957J1344356
5319F513313O02887n218051O96021P531914N717657J027009J632583L465811m37556
5310B1531588n721916m379175M69042M15194k788210j089634L779756K052207
5302A4268852o862347j2229769q566054k425079j41478J75535J173359J188145
5294a3418836O03258L490378Q491849P773571L32053l510213K202922Q258974
$$ plain form
5286 14223956 18253620 12316549 2736368 -2998463 -6415501 -12491826 -20668174 -27320804
5278 -27320804 -32269784 -36785232 -38709599 -35687735 -31038584 -30521256 -33975429 -35012264
5270 -35012264 -29089461 -18429831 -9083350 -5756406 -8661580 -12729063 -11093075 -2368321
5262 -2368321 6696874 8949392 5870197 5247079 11045239 19971093 27471180 31943953
5254 31943953 32133244 25507224 12110725 -3020184 -13958250 -18783661 -19141393 -17145596
5246 -17145596 -14278881 -11492537 -8862336 -6302114 -5006060 -6288223 -8846906 -9889448
5238 -9889448 -9417139 -10029697 -11365958 -8606952 1004426 13208335 21149807 22484907
5230 22484907 19601933 15275567 11129003 8372941 6828574 4467215 335378 -3758907
$$ packed form
5286A4223956M029664n937071r580181n734831l417038o076325q176348o652630
5278b7320804m948980m515448j924367L021864M649151N17328l454173j036835
5270c5012264N922803J0659630R346481L326944k905174m067483J635988Q724754
5262b368321R065195K252518l079195o23118N798160Q925854P500087M472773
5254C1943953J89291o626020j3396499j5130909j0938066m825411l57732J995797
5246a7145596K866715K786344K630201K560222J296054j282163k558683j042542
5238i889448M72309o12558j336261K759006R611378J2203909P941472J335100
5230B2484907k882974m326366m146564k756062j544367k361359m131837m094285
$$ plain form
5222 -3758907 -6597400 -9836109 -13936577 -15054682 -10508405 -4696467 -3865923 -6411793
5214 -6411793 -4580885 4317083 14546952 20605821 23241666 25014046 25457553 23491438
5206 23491438 20125979 16061117 10804735 6579230 7972293 14018930 15836844 7680639
5198 7680639 -3497269 -5937211 1811972 10238151 11959707 8256755 2315550 -6187247
5190 -6187247 -16506913 -23064113 -21491017 -15234408 -11520646 -12674358 -15358787 -16507629
5182 -16507629 -15348141 -10583637 -1153923 9176556 13264764 9597322 5853948 9381521
5174 9381521 16949833 19256160 14520301 11547285 17812626 29752939 38085288 38743883
5166 38743883 34263478 27266151 18356750 10094726 7362656 11381086 16626098 16442397
$$ packed form
5222c758907k838493l238709m100468j118105M546277N811938Q30544k545870
5214f411793J830908Q897968J0229869O058869K635845J772380M43507j966115
5206B3491438l365459m064862n256382m225505J393063O046637J817914q156205
5198G680639j1177908k439942P749183Q426179J721556l702952n941205q502797
5190f187247j0319666o557200J573096O256609L713762j153712k684429j148842
5182a6507629J159488M764504R429714J0330479M088208l667442l743374L527573
5174I381521P568312K306327m735859k973016O265341J1940313Q332349O58595
5166C8743883m480405o997327q909401q262024k732070M018430N245012j83701
$$ plain form
5158 16442397 10255834 3214964 -354648 -1147610 -2554524 -5761560 -8542641 -9096584
5150 -9096584 -9577698 -13580289 -20120880 -23210250 -19370045 -13043292 -11297917 -14584993
5142 -14584993 -16537091 -12717462 -5861130 -1543426 -1646458 -3632067 -4292107 -2620135
5134 -2620135 165252 2466356 4151875 6169057 8284586 8904806 7947907 7439135 7626493
5125 7626493 5690696 1178866 -887570 3096813 8434793 8038036 3032238 721828
5117 721828 3356152 6440425 7640531 8814823 8501593 1981290 -8290909 -11946335
5109 -11946335 -5611049 -44274 -5532229 -17099443 -22026873 -16711673 -7926543 -1374633
5101 -1374633 2567767 4082146 2839072 827271 -71103 -2305400 -8868118 -16784678
$$ packed form
5158A6442397o186563p040870l569612p92962j406914l207036k781081n53943
5150i096584m81114m002591o540591l089370L840205O326753J745375l287076
5142a4584993j952098L819629O856332M317704j03032j985609o60040J671972
5134b620135K785387K301104J685519K017182K115529O20220r56899n08772J87358
5125G626493j935797m511830k066436L984383N337980l96757n005798k310410
5117G21828K634324L084273J200106J174292l13230o520303j0272199l655426
5109a1946335O335286N566775n487955j1567214m927430N315200Q785130O551910
5101a374633L942400J514379j243074k011801q98374k234297o562718p916560
$$ plain form
5093 -16784678 -20040163 -17573599 -13025120 -8618438 -5319144 -6795584 -15791493 -27410549
5085 -27410549 -33303882 -32348357 -29974580 -26989847 -17654660 -1294660 11974158 11983216
5077 11983216 492779 -11575818 -15935713 -13005605 -8600580 -7326502 -8548398 -8060450
5069 -8060450 -4016746 400354 1967872 2440637 5062352 8475199 8737774 5628042 2069420
5060 2069420 -878233 -3064355 -1389678 6465778 15810719 19546215 18075091 17067746
5052 17067746 16353431 10274589 -483112 -7742283 -9149482 -12521348 -22275442 -30665997
5044 -30665997 -28690058 -18375149 -8094591 -2263562 -1711533 -7450937 -16730617 -21070911
5036 -21070911 -16136359 -9095673 -8552176 -11624527 -9737947 -3733545 -3047150 -10554186
$$ packed form
5093a6784678l255485K466564M548479M406682L299294j476440q995909j1619056
5085b7410549n893333R55525K373777K984733R335187J6360000J3268818R058
5077A1983216j1490437j2068597m359895K930108M405025J274078j221896M87948
5069h060450M043704M417100J567518M72765K621715L412847K62575l109732l558622
5060B069420k947653k186122J674677P855456R344941L735496j471124j007345
5052A7067746p14315o078842j0757701p259171j407199l371866r754094q390555
5044c0665997J975939J0314909J0280558N831029N52029n739404r279680m340294
5036b1070911M934552P040686N43497l072351J886580O004402O86395p507036
$$ plain form
5028 -10554186 -17828860 -17224250 -11096486 -6495269 -6672091 -10619502 -16094527 -19736004
5020 -19736004 -17518390 -8626704 2234764 8497056 7571254 2645107 -892839 -825560
5012 -825560 34963 -1860999 -5141883 -4776286 362788 4627632 2526656 -4278572 -9639202
5003 -9639202 -10282124 -7703343 -4837694 -3903340 -5898372 -9309794 -10662283 -8805950 -7025872
4994 -7025872 -8447690 -11184456 -10680855 -5206687 3208338 10943792 13379264 6673809
4986 6673809 -6568906 -15549466 -10658231 5021126 17445911 15844912 3046636 -8667166
4978 -8667166 -10182606 -3615153 1463559 -398413 -4040303 -1044707 7886223 13131554
4970 13131554 9465324 2856626 677517 1065667 -2404036 -9665233 -14346750 -13120248
$$ packed form
5028a0554186p274674O04610O127764M601217j76822l947411n475025l641477
5020a9736004K217614Q891686J0861468O262292r25802m926147l537946O7279
5012h25560Q60523j895962l280884L65597N139074M264844k100976o805228n360630
5003i639202o42922K578781K865649R34354j995032l411422j352489J856333J780078
4994g025872j421818k736766N03601N474168Q415025P735454K435472o705455
4986F673809j3242715q980560M891235J5679357J2424785j600999j2798276j1713802
4978h667166j515440O567453N078712j861972l641890K995596Q930930N245331
4970A3131554l666230o608698k179109L88150l469703p261197m681517J226502
$$ plain form
4962 -13120248 -9231336 -7562064 -10445798 -17128128 -23446355 -23715945 -17118716 -10644852
4954 -10644852 -11497440 -18109726 -22804453 -21452881 -15810029 -8231916 -57884 5169405
4946 5169405 2960840 -5938872 -14615104 -16921500 -12902322 -6650167 -1397827 1994983
4938 1994983 3270021 1272203 -4775735 -12331385 -15960946 -13235904 -8408921 -6316511
4930 -6316511 -4662400 1493871 8850090 7852813 -3479127 -16435066 -24346908 -29239014
4922 -29239014 -33159297 -33650599 -32387417 -36794656 -46419653 -49262412 -40001168 -30129374
4914 -30129374 -29747245 -31189922 -23631104 -12944833 -11585645 -17481620 -19574631 -17722423
4906 -17722423 -20323652 -27055882 -30042377 -27941240 -23971267 -15680810 -2543909 3290779
$$ packed form
4962a3120248L888912J669272k883734o682330o318227k69590O597229O473864
4954a0644852q52588o612286m694727J351572N642852P578113Q174032N227289
4946E169405k208565q899712q676232k306396M019178O252155N252340L392810
4938A994983J275038j997818o047938p555650l629561K725042M826983K092410
4930f316511J654111O156271P356219r97277j1331940j2955939p911842m892106
4922b9239014l920283m91302J263182m407239r624997k842759R261244R871794
4914c0129374L82129j442677P558818J0686271J359188n895975k093011J852208
4906a7722423k601229o732230k986495K101137L969973Q290457J3136901N834688
$$ plain form
4898 3290779 -7793693 -23537849 -25731801 -19012249 -21517242 -33085355 -38315049 -36734443
4890 -36734443 -41488623 -50007395 -46472236 -34144713 -33515821 -45802808 -51552600 -48855547
4882 -48855547 -55957904 -70445489 -67867808 -50876504 -53207522 -80026416 -97186323 -100855002
4874 -100855002 -131381546 -174759813 -122109458 91725838 353577545 471840778 399267449
4867 399267449 268252237 203667699 193465231 169516233 126702647 103755919 104106040
4860 104106040 100186251 87452618 82285086 83528686 77171867 66019202 61297429 57855377
4852 57855377 47297235 41621178 54316869 71134525 69299610 54315241 48072756 50592748
4844 50592748 44462475 29993444 24284186 28396542 25924433 14456494 9751938 15768429
$$ packed form
4898C290779j1084472j5744156k193952O719552k504993j1568113n229694J580606
4890c6734443m754180q518772L535159J2327523O28892j2286987n749792K697053
4882d8855547p102357j4487585K577681J6991304k331018k6818894j7159907l668679
4874a00855002l0526544m3378267N2650355K13835296K61851707J18263233p2573329
4867C99267449j31015212o4584538j0202468k3948998m2813586k2946728L50121
4860A04106040l919789j2733633n167532J243600o356819j1152665m721773l442052
4852E7855377j0558142n676057J2695691J6817656j834915j4984369o242485K519992
4844E0592748o130273j4469031n709258M112356k472109j1467939m704556O016491
$$ plain form
4836 15768429 17539806 9243436 4433220 10729933 16731852 13449871 9119891 12119110
4828 12119110 15776808 11365383 3035686 -400304 2051186 7470129 15242560 22000612
4820 22000612 20274874 9795725 1365164 2260181 5783799 2339219 -6356954 -11239637
4812 -11239637 -8408995 -1483954 4173638 4977753 773731 -4085141 -5302039 -5109544
4804 -5109544 -8449842 -12770461 -10051093 -444622 5610458 2358123 -3103398 -2009162
4796 -2009162 4960461 12657581 19810188 26800978 31636996 33478550 34798338 36281287
4788 36281287 35735808 34928205 39276576 46737013 46494214 34957378 23765381 23654852
4780 23654852 28706610 26514935 17155648 10714283 10403017 9801166 5144995 -4612
$$ packed form
4836A5768429J771377q296370m810216O296713O001919l281981m329980K999219
4828A2119110L657698m411425q329697l435990K451490N418943P772431O758052
4820B2000612j725738j0479149q430561Q95017L523618l444580q696173m882683
4812a1239637K830642O925041N657592Q04115m204022m858872j216898J92495
4804e109544l340298m320619K719368R606471O055080l252335n461521J094236
4796b009162O969623P697120P152607O990790M836018J841554J319788J482949
4788C6281287n45479q07603M348371P460437k42799j1536836j1191997j10529
4780B3654852N051758k191675r359287o441365l11266o01851m656171n149607
$$ plain form
4772 -4612 -2038541 -573089 5117747 14681123 21952247 20092654 12351796 9911269 17257625
4763 17257625 26498483 28236144 21919398 13058979 5828536 1538942 248187 965515
4755 965515 2941585 7891624 17511665 28098611 32293217 28139289 22094343 20335622
4747 20335622 20921459 18014596 10755628 3684753 49734 -914637 -328390 2480854 7052557
4738 7052557 9915481 8365896 4632338 3301364 4969393 5786279 4121548 3799534 7795387
4729 7795387 12032397 10372327 4224448 1477494 5674998 11827878 14186012 12653469
4721 12653469 9538613 5672390 2771212 3949830 7685167 6517261 -3096501 -14149506
4713 -14149506 -17792087 -14373880 -9774288 -5251339 1247935 6998379 6803933 2262155
$$ packed form
4772d612k033929J465452N690836R563376P271124j859593p740858k440527P346356
4763A7257625R240858J737661o316746q860419p230443m289594j290755P17328
4755I65515J976070M950039R620041J0586946M194606m153928o044946j758721
4747B0335622N85837k906863p258968p070875l635019r64371N86247K809244M571703
4738G052557K862924j549585l733558j330974J668029Q16886j664731l22014L995853
4729G795387M237010j660070o147879k746954M197504O152880K358134j532543
4721A2653469l114856l866223k901178J178618L735337j167906r613762j1053005
4713a4149506l642581L418207M599592M522949O499274N750444j94446m541778
$$ plain form
4705 2262155 223325 2298146 4118131 4959396 9069122 16194261 20056658 18998484
4697 18998484 19303524 24098511 27462561 24604636 19957805 18950596 18808313 14722978
4689 14722978 9183227 7369203 8238517 8295997 9715446 15644669 21149476 19343278 14644591
4680 14644591 18394739 30488940 36824045 28554744 13673243 4102224 472359 -2822531
4672 -2822531 -4993690 -1075834 7235829 12776793 13772908 14716678 16138503 12331730 2071583
4663 2071583 -6192189 -5272849 -214861 -1671155 -10442525 -15264982 -7108102 8954687
4655 8954687 18838198 14409870 1119269 -8666898 -8054808 -636814 5849120 8517060
4647 8517060 10071208 12004435 11603675 7751263 5504849 9913813 17210766 18388165
$$ packed form
4705B262155k038830K074821J819985Q41265M109726P125139L862397j058174
4697A8998484L05040M794987L364050k857925m646831j007209j42283m085335
4689A4722978n539751j814024Q69314N7480J419449N929223N504807j806198m698687
4680A4644591L750148J2094201O335105q269301j4881501r571019l629865l294890
4672b822531k171159L917856Q311663N540964R96115R43770J421825l806773j0260147
4663B071583q263772R19340N057988j456294q771370m822457Q156880J6062789
4655H954687R883511m428328j3290601r786167O12090P417994O485934K667940
4647H517060J554148J933227m00760l852412k246414M408964P296953J177399
$$ plain form
4639 18388165 12115435 7761588 12540009 20976449 21992287 12795583 156553 -9624009
4631 -9624009 -15386031 -16440428 -10603161 510703 9497199 10223609 4105926 -3150903
4623 -3150903 -8225865 -11051817 -12001604 -11723703 -11901048 -12669530 -10509150 -2288789 8996055
4614 8996055 15926890 14618357 8457339 3427531 2161496 3561001 5862773 7747186
4606 7747186 7201106 1883531 -7823597 -16747113 -17903773 -9094749 3845528 11789153
4598 11789153 10518669 3438134 -3204257 -5804734 -4150037 648205 7281881 14229076
4590 14229076 19385758 19425823 11087851 -3861101 -15694973 -13792921 1334090 17049662
4582 17049662 22178268 17908836 12528902 10210547 10033182 11954926 16457852 19818977
$$ packed form
4639A8388165o272730m353847M778421Q436440J015838r196704j2639030r780562
4631i624009n762022j054397N837267J1113864Q986496P26410o117683p256829
4623c150903n074962k825952r49787K77901j77345p68482K160380Q220361J1284844
4614H996055O930835j308533o161018n029808j266035J399505K301772J884413
4606G747186n46080n317575r707128q923516j156660Q809024J2940277P943625
4598A1789153j270484p080535o642391k600477J654697M798242O633676O947195
4590A4229076N156682M0065q337972j4948952j1833872J902052J5127011J5715572
4582A7049662N128606m269432n379934k318355j77365J921744M502926L361125
$$ plain form
4574 19818977 17142592 10544448 7668223 10532169 11991680 6063373 -3213570 -6620208
4566 -6620208 -64986 12537335 23476466 26051922 18642064 6837821 -1158931 -3509600
4558 -3509600 -6142123 -13233138 -20523422 -21665041 -17141958 -11607572 -5142373 6154320
4550 6154320 20839934 29467149 23977275 6790585 -11778872 -23676654 -28877913 -31595517
4542 -31595517 -32706854 -28109428 -15503015 -327022 8942572 10672803 10075177 8823284
4534 8823284 1923367 -11139383 -19630864 -14080125 -912549 5422596 3115745 4588131
4526 4588131 15830714 25540429 20863667 5308146 -7201175 -10390560 -8901585 -7203559
4518 -7203559 -5328331 -5207018 -11116195 -20475211 -22330649 -10918081 4349596 9020014
$$ packed form
4574A9818977k676385o598144k876225K863946J459511n928307r276943l406638
4566f620208O555222J2602321J0939131K575456p409858j1804243p996752k350669
4558c509600k632523p091015p290284j141619M523083N534386O465199J1296693
4550F154320J4685614Q627215n489874j7186690j8569457j1897782n201259k717604
4542c1595517j111337M597426J2606413J5175993R269594J730231n97626j251893
4534H823284o899917j3062750q491481N550739J3167576O335145k306851J472386
4526D588131J1242583R709715m676762j5555521j2509321l189385J488975J698026
4518g203559J875228J21313n909177r359016j855438J1412568J5267677M670418
$$ plain form
4510 9020014 1038701 -8460010 -10469302 -6721736 -1689310 6082667 19012734 31864971
4502 31864971 35929313 30892379 25543764 25517218 26496825 22075666 12721357 3042265 -5102956
4493 -5102956 -11757255 -14849664 -12929530 -9543771 -8716626 -7543442 19758 12283469
4485 12283469 19757996 17171232 9082337 1719554 -3989910 -8212478 -8125943 -3543339
4477 -3543339 -1311741 -7484388 -18143069 -23925245 -21279349 -13680002 -4511139 4218144
4469 4218144 7866292 2463836 -6852789 -8534559 1183163 13086186 17528664 16049823
4461 16049823 15356542 15165264 9714450 -922122 -9160190 -10398122 -8438477 -7973857
4453 -7973857 -7511065 -4011137 -10451 66575 -1425116 2330700 10535681 12177595 354632
$$ packed form
4510I020014p981313r498711k009292L747566N032426P771977J2930067J2852237
4502C1864971M064342n036934n348615k6546R79607m421159r354309r679092q145221
4493e102956o654299l092409J920134L385759Q27145J173184P563200J2263711
4485A2283469P474527k586764q088895p362783n709464m222568Q6535M582604
4477c543339K231598o172647j0658681n782176K645896P599347R168863Q729283
4469D218144L648148n402456r316625j681770R717722J1903023M442478j478841
4461A6049823o93281j91278n450814j0636572q238068j237932J959645M64620
4453g973857M62792L499928M000686P7026j491691L755816Q204981J641914j1822963
$$ plain form
4444 354632 -15449316 -18430002 -4695013 12401766 19230001 16385414 12724856 11429388
4436 11429388 9322084 6857358 9589446 18146762 24379309 21848720 14943602 12136603
4428 12136603 13671425 12482938 6119558 792491 2136415 7958838 13398878 18354529
4420 18354529 24877134 30448572 30076773 24463824 20244640 20885876 22301975 19743200
4412 19743200 14653713 11331424 10227442 8711020 6057387 3022764 -1922010 -10341224
4404 -10341224 -17728738 -15638315 -2700307 10755966 13171700 4834945 -3303578 -3044171
4396 -3044171 2738570 6040450 4472803 2700702 4042095 4947580 724321 -5622010
4388 -5622010 -5324607 4521572 16039739 20184379 17271824 13613384 11154971 6919013
$$ packed form
4444C54632j5803948k980686J3734989J7096779O828235k844587l660558j295468
4436A1429388k107304k464726K732088Q557316O232547k530589o905118k806999
4428A2136603J534822j188487o363380n327067J343924N822423N440040M955651
4420A8354529O522605N571438l71799n612949m219184O41236J416099k558775
4412A9743200n089487l322289j103982j516422k653633l034623m944774q419214
4404a0341224p387514K090423J2938008J3456273K415734q336755q138523K59407
4396c044171N782741L301880j567647j772101J341393R05485m223259o346331
4388e622010K97403R846179J1518167M144640k912555l658440k458413m235958
$$ plain form
4380 6919013 1380769 -17574 4754373 10424060 11395434 7876275 2826087 -2207157
4372 -2207157 -5208388 -2513956 6348016 16178408 22237908 25460769 27900900 27131822
4364 27131822 20568071 12426603 10123989 14509368 18767993 16943477 9679641 1954375
4356 1954375 -1488074 641324 4258653 2755933 -4609333 -9288499 -3152238 10112727
4348 10112727 18929520 18233322 13809634 12126311 12404327 10901870 7656561 5509263
4340 5509263 5302456 4517274 -673197 -12190464 -26758453 -36609971 -36640323 -29977987 -23074880
4331 -23074880 -17362233 -10943514 -6173499 -7577839 -12493322 -12756713 -7605947 -5795941
4323 -5795941 -11139621 -15069664 -9703997 -321967 3138985 789873 -37789 2113232
$$ packed form
4380F919013n538244j398343M771947N669687R71374l519159n050188n033244
4372b207157l001231K694432Q861972R830392O059500L222861K440131p69078
4364B7131822o563751q141468k302614M385379M258625j824516p263836p725266
4356A954375l442449K129398L617329j502720p365266m679166O136261J3264965
4348A0112727Q816793o96198m423688j683323K78016j502457l245309k147298
4340E509263k06807p85182n190471j1517267j4567989r851518l0352O662336O903107
4331b3074880N712647O418719M770015j404340m915483k63391N150766J810006
4323e795941n343680l930043N365667R382030L460952k349112q27662K151021
$$ plain form
4315 2113232 2363595 -86100 -795358 876339 590195 -1892419 -806885 5763927 11442830
4306 11442830 10827187 7234030 6542289 8002594 6724319 2535354 494715 2866032
4298 2866032 5324959 2715568 -4032159 -8671867 -6696380 -527478 2692242 -1501240
4290 -1501240 -10058255 -15595864 -14257569 -9381550 -7109484 -9652879 -13948997 -15945219
4282 -15945219 -14206702 -9172661 -1384011 7284572 11933374 7864948 -3269463 -13291766
4274 -13291766 -15487996 -10687555 -3500025 4177781 11757328 14868256 8491666 -4349633
4266 -4349633 -13460926 -13596327 -10620024 -12381969 -18008187 -20502258 -16629740 -9588033
4258 -9588033 -3960427 -2308901 -5299837 -11071343 -15132344 -14274997 -10089833 -5964371
$$ packed form
4315B113232K50363k449695p09258J671697k86144k482614J085534O570812N678903
4306A1442830o15643l593157o91741J460305j278275m188965k040639K371317
4298B866032K458927k609391o747727m639708J975487O168902L219720m193482
4290a501240q557015n537609J338295M876019K272066k543395m296118j996222
4282a5945219J738517N034041P788650Q668583M648802m068426j1134411j0022303
4274a3291766k196230M800441P187530P677806P579547L110928o376590j2841299
4266d349633r111293j35401K976303j761945n626218k494071L872518P041707
4258i588033N627606J651526k990936n771506m061001Q57347M185164M125462
$$ plain form
4250 -5964371 -1808217 5045462 14493627 22388164 24328378 18421147 5404199 -10876079
4242 -10876079 -23727492 -27697898 -23039913 -14488509 -6138753 770914 6281209 10515791
4234 10515791 13392706 13393758 7717362 -3873091 -16428914 -23860540 -25080892 -23817580
4226 -23817580 -23213276 -23234197 -22785761 -21667724 -20288713 -18984044 -17267023 -13176103 -5270018
4217 -5270018 3704189 7953911 5172635 -1229551 -8121599 -16122425 -23931349 -25199496
4209 -25199496 -17276665 -8185052 -6642444 -8271368 -1288996 14977646 27367436 26442542
4201 26442542 17575485 10841278 7896689 4517232 351022 -674330 2594791 6352340
4193 6352340 6491847 2748143 -1566666 -2706566 177774 4629017 8153360 10336731
$$ packed form
4250e964371M156154O853679R448165P894537J940214n907231j3016948j6280278
4242a0876079j2851413l970406M657985Q551404Q349756O909667N510295M234582
4234A0515791K876915J052n676396j1590453j2555823p431626j220352J263312
4226b3817580O04304k0921M48436J118037J379011J304669J717021M090920P906085
4217e270018Q974207M249722k781276o402186o892048q000826p808924j268147
4209b5199496P922831R091613J542608j628924O982372J6266642J2389790r24894
4201B6442542q867057o734207k944589l379457m166210j025352L269121L757549
4193F352340J39507l743704m314809j139900K884340M451243L524343K183371
$$ plain form
4185 10336731 10364247 5558281 -4020854 -12506312 -14968795 -14975454 -19304709 -26863294 -30068197
4176 -30068197 -26618665 -22155056 -20601501 -19460295 -16254195 -12694652 -10633926 -10026035
4168 -10026035 -11862346 -16667635 -19893169 -16345625 -9216438 -6188855 -7075103 -5827360
4160 -5827360 -4320553 -10628028 -22769500 -31112674 -40625548 -69366744 -113350983 -134135468
4152 -134135468 -102100305 -38400542 8810020 21143970 19491951 22674479 24381270
4145 24381270 15311294 3700939 2088638 9363045 17193475 23538159 30473727 36858029
4137 36858029 40686615 42227833 39974112 30796958 18007227 10682338 10522754 8354532
4129 8354532 -1095821 -10042323 -9414784 -1185690 7692955 15012606 19298518 14815574
$$ packed form
4185A0336731K7516m805966r579135q485458k462483o659m329255p558585l204903
4176c0068197L449532M463609J553555J141206L206100L559543K060726O07891
4168a0026035j836311m805289l225534L547544P129187L027583q86248J247743
4160e827360J506807o307475j2141472q343174r512874k8741196m3984239k0784485
4152a34135468L2035163O3699763M7210562J2333950j652019L182528J706791
4145B4381270r069976j1610355j612301P274407P830430O344684O935568O384302
4137C6858029L828586J541218k253721r177154j2789731p324889j59584k168222
4129H354532r450353q946502O27539Q229094Q878645P319651M285912m482944
$$ plain form
4121 14815574 705519 -11313453 -9252644 3047954 12011573 13182074 13566489 16839978
4113 16839978 17125427 9192431 -3570126 -14256371 -19853760 -21299294 -20412253 -18683572
4105 -18683572 -16520816 -13223358 -9574931 -8865084 -12164958 -14486001 -9882121 766715
4097 766715 11087462 17054001 19258343 18761705 15795659 12247289 10540396 9673017 6525326
4088 6525326 1347985 -2049046 -1809465 187729 2286750 4807123 7399437 8550079
4080 8550079 8264602 7391719 3896198 -5548845 -18776787 -27379495 -25343423 -15340435
4072 -15340435 -4360673 3569726 7725383 7255276 1937508 -4625584 -6519139 -1178611
4064 -1178611 8115373 15572632 17422492 13488533 6475311 809670 763692 7477486 17186602
$$ packed form
4121A4815574j4110055j2018972K060809J2300598Q963619J170501L84415L273489
4113A6839978K85449p932996j2762557j0686245n597389j445534Q87041J728681
4105a8683572K162756L297458L648427P09847l299874k321043M603880J0648836
4097G66715J0320747N966539K204342m96638k966046l548370j706893q67379l147691
4088F525326n177341l397031K39581J997194K099021K520373K592314J150642
4080H550079k85477q72883l495521r445043j3227942q602708K036072J0002988
4072a5340435J0979762P930399M155657m70107n317768o563092j893555N340528
4064a178611R293984P457259J849860l933959p013222n665641m5978O713794R709116
$$ plain form
4055 17186602 23725967 24084348 20920453 18493122 17148225 13912577 7685721 609732
4047 609732 -5670703 -10986628 -12827043 -6591207 7034625 19325801 22945261 20815686
4039 20815686 20010471 19730408 13020170 -56611 -9307353 -7123947 2247608 9821235
4031 9821235 12775931 13667056 13229150 9854533 4103550 -1616779 -6932776 -12356300 -14845372
4022 -14845372 -9693473 1995289 12019855 13595523 8407588 3020925 695634 -343284
4014 -343284 -2002551 -3322126 -2826443 -1126769 194326 558010 -190478 -2761348 -6739495
4005 -6739495 -9041437 -6931796 -2514298 -1010826 -3453153 -4222816 1754741 11818385
3997 11818385 18800779 19920928 18767880 19055570 20490325 21425657 21615615 20542002 16490049
$$ packed form
4055A7186602O539365L58381l163895k427331j344897l235648o226856p075989
4047F09732o280435n315925j840415O235836J3625832J2291176L619460k129575
4039B0815686q05215k80063o710238j3076781r250742K183406R371555P573627
4031I821235K954696Q91125m37906l374617n750983n720329n315997n423524k489072
4022a4845372N151899J1688762J0024566J575668n187935n386663k325291j038918
4014c43284j659267j319575M95683J699674J321095L63684p48488k570870l978147
4005f739495k301942K109641M417498J503472k442327p69663N977557J0063644
3997A1818385O982394J120149j153048K87690J434755R35332J89958j073613m051953
$$ plain form
3988 16490049 10159869 6720157 10658318 19489831 25720168 24779620 18224419 9440693
3980 9440693 129521 -7481817 -8880332 -1871007 8270323 12455340 7395785 -1517739
3972 -1517739 -7899362 -11313479 -14155142 -15342704 -12139318 -6756612 -5249080 -8877886
3964 -8877886 -11796344 -9488448 -4617241 -1162048 2443271 8951957 14552737 12593324
3956 12593324 4413355 -423462 3768925 12210295 17628297 19515988 21334903 22537077
3948 22537077 19245542 11945186 7158121 9753718 16526778 19498361 14352879 3987811
3940 3987811 -5626380 -11101734 -12436782 -10012134 -3650444 4757364 10531563 10791622
3932 10791622 8605069 9658734 14932824 19329346 17877739 10841719 2286851 -3649381
$$ packed form
3988A6490049o330180l439712L938161Q831513O230337r40548o555201q783726
3980I440693r311172p611338j398515P009325J0141330M185017n059555q913524
3972a517739o381623l414117k841663j187562L203386N382706J507532l628806
3964h877886k918458K307896M871207L455193L605319O508686N600780j959413
3956A2593324q179969m836817M192387Q441370N418002J887691J818915J202174
3948B2537077l291535p300356m787065K595597O773060K971583n145482j0365068
3940C987811r614191n475354j335048K424648O361690Q407808N774199K60059
3932A0791622k186553J053665N274090M396522j451607p036020q554868n936232
$$ plain form
3924 -3649381 -4218049 984832 8237671 11042201 6093524 -2640265 -7443677 -3919089
3916 -3919089 6184023 17409878 24154350 23478162 17115784 10469677 7749116 8271310
3908 8271310 8765107 8098259 7363709 6196706 2630448 -2460113 -4079401 1147719 9724072
3899 9724072 14751836 14218845 12959040 15806858 21587362 25719391 26626316 26634487 27482464
3890 27482464 28408548 28982986 30167441 30812676 26347012 14117472 -1692147 -13531364
3882 -13531364 -17782298 -15866913 -9625325 223608 10953743 17322864 16064690 8897689
3874 8897689 252987 -6165199 -8558357 -7498668 -5804144 -5524799 -4795820 -489949 5994311
3865 5994311 9570592 9166891 10374595 18085497 29904943 39350182 42415524 38541538
$$ packed form
3924c649381n68668N202881P252839K804530m948677q733789m803412L524588
3916c919089J0103112J1225855O744472o76188o362378o646107k720561N22194
3908H271310M93797o66848p34550j167003l566258n090561j619288N227120Q576353
3899I724072N027764n32991j259805K847818N780504M132029R06925Q171Q47977
3890B7482464R26084N74438J184455O45235m465664j2229540j5809619j1839217
3882a3531364m250934J915385O241588R848933J0730135O369121j258174p167001
3874H897689q644702o418186k393158J059689J694524K79345P28979M305871O484260
3865E994311L576281m03701J207704P710902J1819446R445239L065342l873986
$$ plain form
3857 38541538 28898219 17546928 11326008 13944439 21420741 26713253 27211547 24531492
3849 24531492 19496154 11943642 3986781 -1271144 -3524857 -3758147 -532593 7115202
3841 7115202 14450772 15327274 11948891 13278623 21585086 27403339 22056168 9800596
3833 9800596 2180189 3849563 9494419 12568501 11370120 7053382 981921 -4677163
3825 -4677163 -7386116 -6993535 -6040024 -6331441 -6899370 -6054382 -3694610 -493916 3812997
3816 3812997 9746075 15991232 19332982 17382744 11060875 3628385 -2832536 -8883364
3808 -8883364 -14903068 -18260917 -15682979 -8146343 -549980 4399545 9229606 16707536
3800 16707536 24065121 25190696 17886186 6528229 -2236760 -4547630 -777166 5321991
$$ packed form
3857C8541538r643319j1351291o220920K618431P476302N292512M98294k680055
3849B4531492n035338p552512p956861n257925k253713k33290L225554P647795
3841G115202P335570Q76502l378383J329732Q306463N818253n347171j2255572
3833I800596p620407J669374N644856L074082j198381m316738o071461n659084
3825d677163k708953L92581R53511k91417n67929Q44988K359772L200694M306913
3816C812997N933078O245157L341750j950238o321869p432490o460921o050828
3808h883364o019704l357849K577938P536636P596363M949525M830061P477930
3800A6707536P357585J125575p304510j1357957q764989k310870L770464O099157
$$ plain form
3792 5321991 8599603 6236932 722237 -2631795 -2224144 -2345969 -7017238 -13188888 -13176858
3783 -13176858 -4311360 6485844 9806331 4377789 -1766994 -1034968 4967460 8034894
3775 8034894 3521882 -4552767 -8963986 -7664605 -4858954 -4547565 -5433279 -3344571 2707956
3766 2707956 9044817 12060337 12356808 12603077 12805204 10548713 5850787 2535180 3294614
3757 3294614 5995611 7054491 6157208 4670282 1409868 -5672388 -14047717 -17441317
3749 -17441317 -13435241 -6918758 -4397922 -7385500 -12486573 -15223796 -12644104 -5380156
3741 -5380156 1214664 1477973 -2649220 -1812716 9011522 22007333 24425094 13345488
3733 13345488 -2009009 -11599682 -13271022 -10322304 -5794696 -1213238 2529365 5424850
$$ packed form
3792E321991L277612k362671n514695l354032M07651j21825m671269o171650J2030
3783a3176858Q865498J0797204L320487n428542o144783P32026O002428L067434
3775H034894m513012q074649m411219J299381K805651L11389q85714K088708O052527
3766B707956O336861L015520K96471K46269K02127k256491m697926l315607P59434
3757C294614K700997J058880q97283j486926l260414p082256q375329l393600
3749a7441317M006076O516483K520836k987578n101073k737223K579692P263948
3741e380156O594820K63309m127193Q36504J0824238J2995811K417761j1079606
3733A3345488j5354497r590673j671340K948718M527608M581458L742603K895485
$$ plain form
3725 5424850 7831121 8817747 6874656 2603696 -1552311 -4546076 -7220116 -9370703
3717 -9370703 -9198876 -6170179 -1487224 4681138 13000754 21383787 25673514 25259591 23710407
3708 23710407 21939859 15725757 3331594 -9336817 -16109796 -19110997 -24042856 -29965602
3700 -29965602 -30737338 -25138553 -18169764 -12315547 -5227503 2188187 3162790 -5056464
3692 -5056464 -14420177 -14565248 -4681360 7647235 16201482 19537661 17162391 8869409
3684 8869409 -1551639 -6936027 -3243305 6570217 15705300 18863104 15095616 8048495
3676 8048495 3292851 2868974 2563564 -2894647 -12435866 -19748361 -21575831 -20682173 -19595047
3667 -19595047 -16120386 -7932543 2149370 9402436 13282206 16231037 18315370 17892950
$$ packed form
3725E424850K406271R86626j943091m270960m156007k993765k674040k150587
3717i370703J71827L028697M682955O168362Q319616Q383033M289727m13923j549184
3708B3710407j770548o214102j2394163j2668411o772979l001201m931859n922746
3700b9965602p71736N598785O968789N854217P088044P415690R74603q219254
3692e056464r363713j45071R883888J2328595Q554247L336179k375270q292982
3684H869409j0421048n384388L692722R813522R135083L157804l767488p047121
3676H048495m755644m23877l05410n458211r541219p312495j827470Q93658J087126
3667a9595047L474661Q187843J0081913P253066L879770K948831K084333m22420
$$ plain form
3659 17892950 16959922 20359821 28156723 33404354 30510098 22695197 17585315 17284193
3651 17284193 16771008 11759759 4464310 507270 2556777 8306872 13076554 13267024
3643 13267024 8722725 2989498 205362 669977 588812 -2805825 -7458474 -9426483 -7965600
3634 -7965600 -5189539 -1943934 2440093 6394892 6116547 843683 -4982082 -6825890
3626 -6825890 -4759233 -1151540 3103622 6731150 5303909 -4503473 -18415464 -27080693
3618 -27080693 -25898317 -18548794 -10116513 -1311157 8223834 15168431 15507433 10547424
3610 10547424 5886471 4410199 3320319 -1174431 -8340578 -13413468 -12917557 -8520622
3602 -8520622 -5253816 -6135367 -9441401 -11738255 -12035920 -11118976 -8376149 -2884827 2699951
$$ packed form
3659A7892950r33028L399899P796902N247631k894256p814901n109882l01122
3651A7284193n13185n011249p295449l957040K049507N750095M769682J90470
3643A3267024m544299n733227k784136M64615q1165l394637m652649j968009J460883
3634g965600K776061L245605M384027L954799k78345n272864n825765j843808
3626f825890K066657L607693M255162L627528j427241r807382j3911991q665229
3618b7080693J182376P349523Q432281Q805356R534991O944597L39002m960009
3610A0547424m660953j476272j089880m494750p166147n072890M95911M396935
3602h520622L266806q81551l306034k296854k97665R16944K742827N491322N584778
$$ plain form
3593 2699951 3777438 497304 -1647074 -234318 -344717 -6678767 -15208612 -18072315
3585 -18072315 -14212119 -9009167 -4582774 2597806 13327132 21164934 19590442 9991458
3577 9991458 -187062 -4626213 -1650515 6347164 14417800 18087358 17261002 15977775
3569 15977775 17169917 19389153 19587339 16803864 11821903 5505733 -911909 -5700894
3561 -5700894 -7929895 -7274087 -2715510 5279775 11282881 8774847 -470377 -6074093
3553 -6074093 -1606546 7239654 11214875 9333284 6276403 2389178 -5618815 -15878117
3545 -15878117 -21782028 -21651393 -20361218 -19809901 -15142928 -3706261 8347451 12841404
3537 12841404 9235372 4125275 4125422 11496203 23115719 31313769 29646172 20600701 13639723
$$ packed form
3593B699951J077487l280134k144378J412756j10399o334050q529845k863703
3585a8072315L860196N202952M426393P180580J0729326P837802j574492r598984
3577I991458j0178520m439151K975698P997679Q070636L669558q26356j283227
3569A5977775J192142K219236J98186k783475m981961o316170o417642m788985
3561e700894k229001O55808M558577P995285O003106k508034r245224n603716
3553f074093M467547Q846200L975221j881591l056881l887225q007993j0259302
3545a5878117n903911J30635J290175N51317M666973J1436667J2053712M493953
3537A2841404l606032n110097J47P370781J1619516Q198050j667597r045471o960978
$$ plain form
3528 13639723 13039666 12819739 7531996 1953539 3260831 8193997 6910102 -2073655
3520 -2073655 -9731572 -9819686 -5905245 -2886671 626173 7029994 12841802 12710487 6845901
3511 6845901 -371876 -6497544 -11074492 -11832311 -6230464 3556563 11755717 15713929
3503 15713929 18002351 21154939 23823361 23896768 22691096 23169385 24832495 23115280 14951237
3494 14951237 3639854 -3689609 -3731600 -373484 858365 -135197 537609 3204234 3012715
3485 3012715 -2724169 -9673896 -11816341 -8329723 -1744874 7340969 18432758 26171051
3477 26171051 24011544 13535833 4116981 1380378 1384473 -898058 -2723413 1795703
3469 1795703 11593745 18786702 17620584 8629355 -5116785 -20712592 -33919440 -39857213
$$ packed form
3528A3639723o00057k19927n287743n578457J307292M933166j283895q983757
3520b073655p657917q8114L914441L018574L512844O403821N811808j31315n864586
3511F845901p217777o125668m576948p57819N601847R787027Q199154L958212
3503A5713929K288422L152588K668422P3407j205672M78289J663110j717215q164043
3494A4951237j1311383p329463m1991L358116J231849r93562O72806K666625j91519
3485C012715n736884o949727k142445L486618O584849R085843J1091789P738293
3477B6171051k159507j0475711r418852k736603M095k282531j825355M519116
3469A795703R798042P192957j166118q991229j3746140j5595807j3206848n937773
$$ plain form
3461 -39857213 -37369791 -29902545 -20778889 -10616791 -812082 4196120 1620391 -4605219
3453 -4605219 -7052211 -2794453 4412830 9731162 12266470 13771005 14657376 13235161
3445 13235161 8377008 1595153 -3857438 -5549614 -3308174 1676038 8338930 15279896
3437 15279896 19081335 15454180 4280395 -7298118 -9770697 -483714 13531058 22938703
3429 22938703 24715285 22123654 18348661 13536412 7767699 3188353 1481894 1588524
3421 1588524 1836961 2551375 4597014 7072803 8814546 10566778 12702347 12324361 6873442
3412 6873442 280478 599073 9997196 21278919 26527395 25305665 21517328 16340113
3404 16340113 9010739 1952654 -546626 1570784 3837882 3294297 1236450 -49017
$$ packed form
3461c9857213K487422P467246R123656J0162098R804709N008202k575729o225610
3453d605219k446992M257758P207283N318332K535308J504535Q86371j422215
3445A3235161m858153o781855n452591j692176K241440M984212O662892O940966
3437A5279896L801439l627155j1173785j1578513k472579R286983J4014772R407645
3429B2938703J776582k591631l774993m812249n768713m579346j706459J06630
3421A588524K48437P14414K045639K475789J741743J752232K135569l77986n450919
3412F873442o592964L18595R398123J1281723N248476j221730l788337n177215
3404A6340113p329374p058085k499280K117410K267098n43585k057847j285467
$$ plain form
3396 -49017 264553 2467462 6206066 9372291 10636142 12857257 19577367 27903728 30204757
3387 30204757 24493663 17971031 17715450 22682046 27981346 31942688 34299724 31758022
3379 31758022 21561075 7448189 -3233198 -7023863 -4766202 2815427 14049300 22692309
3371 22692309 22639549 16649375 13821132 17220187 20385672 17892846 12429581 7914264
3363 7914264 2532731 -5383399 -9939557 -4345195 7065545 11771267 5037751 -3917638
3355 -3917638 -4608296 1245686 3442716 -2530260 -10177301 -10501123 -1734068 10526548
3347 10526548 19798330 23107865 20837793 15487136 10995000 10839477 15023834 19596316
3339 19596316 20281304 16321094 10263678 4886798 1400766 -80274 35687 638584 160280
$$ packed form
3396d9017L13570K202909L738604L166225J263851K221115O720110Q326361K301029
3387C0204757n711094o522632k55581M966596N299300L961342K357036k541702
3379C1758022j0196947j4112886j0681387l790665K257661P581629J1233873Q643009
3371B2692309n2760n990174k828243L399055L165485k492826n463265m515317
3363G914264n381533p916130m556158N594362J1410740M705722o733516q955389
3355c917638o90658N853982K197030n972976p647041l23822Q767055J2260616
3347A0526548R271782L309535k270072n350657m492136j55523M184357M572482
3339A9596316O84988l960210o057416n376880l486032j481040J15961O02897m78304
$$ plain form
3330 160280 -2354393 -6197223 -8730636 -6829246 -275644 6311145 7634108 4952661
3322 4952661 5924996 14447583 23714226 24123744 16575640 12138644 17784963 27678479 30822890
3313 30822890 23286792 10194994 -1040192 -6306356 -6002310 -3946318 -4146837 -6790822
3305 -6790822 -8464840 -7004130 -3685959 222314 5304078 10179486 10018906 2913645
3297 2913645 -5283290 -7143361 -2737068 1917793 3418538 2593888 -951107 -9001199
3289 -9001199 -18451167 -21312214 -14196481 -3534003 1833301 70973 -4381299 -7731571
3281 -7731571 -9446674 -10091006 -10360405 -11586965 -14378190 -17077742 -17597643 -16111323 -13923396
3272 -13923396 -10484256 -4049972 4774456 12532155 16574685 17539511 17521949 17267285 16184090
$$ packed form
3330A60280k514673l842830k533413J901390O553602O586789J322963k681447
3322D952661R72335Q522587R266643M09518p548104m436996N646319R893516L144411
3313C0822890p536098j3091798j1235186n266164L04046K055992k00519k643985
3305f790822j674018J460710L318171L908273N081764M875408j60580p105261
3297B913645q196935j860071M406293M654861J500745q24650l544995q050092
3289i001199r449968k861047P115733J0662478N367304j762328m452272l350272
3281g731571j715103o44332k69399j226560k791225k699552n19901J486320K187927
3272a3923396L439140O434284Q824428P757699M042530R64826j7562k54664j083195
$$ plain form
3263 16184090 14027223 11088269 7051574 1394242 -4274192 -5823814 -946600 6108769
3255 6108769 7120453 -762734 -10423256 -12727773 -7950854 -5209627 -10322748 -18867348
3247 -18867348 -23418438 -23411085 -23666532 -25678110 -25504946 -20183216 -11965910 -5227314 -2389771
3238 -2389771 -3955409 -9323494 -15664201 -18660113 -16972496 -14264715 -14190226 -14733050 -10639136
3229 -10639136 -937947 9339300 15444491 17661316 18359681 17423357 13431024 7460650
3221 7460650 2327674 -1310324 -4905938 -8162196 -8492876 -5024374 -84950 4336027
3213 4336027 8339944 10649761 7200751 -3149138 -13975125 -16805082 -10577285 -2020078
3205 -2020078 2674350 2905946 1322282 1110624 5588259 15129397 23175020 20719639 7494014
$$ packed form
3263A6184090k156867k938954m036695n657332n668434j549622M877214P055369
3255F108769J011684p883187r660522k304517M776919K741227n113121q544600
3247a8867348m551090P353k55447k011578J73164N321730Q217306O738596K837543
3238b389771j565638n368085o340707k995912J687617K707781P4489n42824M093914
3229a0639136R701189J0277247O105191K216825O98365r36324l992333n970374
3221G460650n132976l637998l595614l256258l30680L468502M939424M420977
3213D336027M003917K309817l449010j0349889j0825987k829957O227797Q557207
3205b020078M694428K31596j583664k11658M477635R541138Q045623k455381j3225625
$$ plain form
3196 7494014 -6056193 -11086457 -9691493 -7846663 -4828665 2915407 11137136 10786490
3188 10786490 1837965 -4856041 -2023658 5612610 11084413 15370963 21414723 24593742
3180 24593742 18671591 8433262 6319146 15604313 25697736 27229206 24294272 26684301
3172 26684301 35636314 43677944 45265759 41042336 33224594 23418272 15096882 11966429
3164 11966429 12044595 8457504 -1238398 -10563507 -11868309 -5271032 3192314 9216507
3156 9216507 12247901 12368638 9831125 6840205 5637445 4833991 1044680 -5843089 -12151467
3147 -12151467 -14942524 -13768428 -8328521 1306613 11570742 17106326 17349037 17311062
3139 17311062 19616898 20048125 14518858 6915166 5273183 11817929 20911787 25890666
$$ packed form
3196G494014j3550207n030264J394964J844830L017998P744072Q221729l50646
3188A0786490q948525o694006K832383P636268N471803M286550O043760L179019
3180B4593742n922151j0238329k114116R285167J0093423J531470k934934K390029
3172B6684301Q952013Q041630J587815m223423p817742r806322q321390l130453
3164A1966429P8166l587091r695902r325109j304802O597277Q463346O024193
3156I216507L031394J20737k537513k990920j202760q03454l789311o887769o308378
3147a2151467k791057J174096N439907R635134J0264129N535584K42711l7975
3139A7311062K305836M31227n529267p603692j641983O544746R093858M978879
$$ plain form
3131 25890666 24318672 17527620 9065102 3475281 2818684 3895814 1989739 -2452119
3123 -2452119 -4172312 -492638 5348381 9353816 11493794 13116660 13030330 9748542 5991816
3114 5991816 7082343 14337622 22409801 24352012 18432335 9097670 1575798 -3285701
3106 -3285701 -7850531 -12201828 -12557964 -6587293 2224410 8536851 11833992 15239988
3098 15239988 18627908 18037599 12658679 6958167 3576815 -536412 -7037911 -10343398
3090 -10343398 -5069529 3807029 5687931 -1202250 -7239915 -4824852 1894144 3857740
3082 3857740 -1262198 -8343381 -12280664 -11665856 -7029938 -57696 5658023 6674288
3074 6674288 3318574 -540824 -1365398 1650747 6925048 11092727 10372026 4403090 -1390369
$$ packed form
3131B5890666j571994o791052q462518n589821o56597J077130j906075m441858
3123b452119j720193L679674N841019M005435K139978J622866q6330l281788l756726
3114E991816J090527P255279Q072179J942211n919677r334665p521872m861499
3106c285701m564830m351297l56136N970671Q811703O312441L297141L405996
3098A5239988L387920n90309n378920n700512l381352m113227o501499l305487
3090a0343398N273869Q876558J880902o890181o037665K415063O718996J963596
3082C857740n119938p081183l937283O14808M635918O972242N715719J016265
3074F674288l355714l859398q24574L016145N274301M167679p20701n968936n793459
$$ plain form
3065 -1390369 -380318 7581932 15593923 17605887 14321222 10141086 7236992 5089304
3057 5089304 3702762 3878088 4806568 4341720 2105458 155774 -130282 -10290 -1061374
3048 -1061374 -2164566 -424588 4935332 10703355 12434935 9056323 4265391 2948020
3040 2948020 6311190 10834030 11578664 5938961 -4848957 -15842764 -20267214 -14368784
3032 -14368784 -2083667 7353147 8488497 4469163 881665 -2207765 -8044898 -15311723
3024 -15311723 -18484315 -16273904 -13641958 -13267212 -10705186 -2214966 6939353 7770052
3016 7770052 -628741 -9981997 -13449724 -12675960 -13118234 -16082743 -17805069 -14879191 -8584476
3007 -8584476 -3636219 -3075486 -5007277 -5385974 -3505506 -2222322 -2441553 -1340111 1684089
$$ packed form
3065a390369J010051P962250Q011991K011964l284665m180136k904094k147688
3057E089304j386542J75326R28480m64848k236262j949684k86056J19992j051084
3048a061374j103192J739978N359920N768023J731580l378612m790932j317371
3040B948020L363170M522840P44634n639703j0787918j0993807m424450N898430
3032a4368784J2285117R436814J135350m019334l587498l089430n837133p266825
3024a5311723l172592K210411K631946L74746K562026Q490220R154319Q30699
3016G770052q398793r353256l467727P73764m42274k964509j722326K925878O294715
3007h584476M948257N60733j931791l78697J880468J283184k19231J101442L024200
$$ plain form
2998 1684089 1656498 -4673281 -11307135 -9217186 682171 7208225 2649077 -8509721
2990 -8509721 -16181043 -15192915 -7334333 2480526 9523143 12433322 15263775 22812065
2982 22812065 32504950 35764790 29610732 21176478 17194030 15345326 11787420 11169940
2974 11169940 20237065 34415507 40481787 33026068 20245316 11953408 9206923 8297426
2966 8297426 8082236 9036780 9898179 9685450 9750423 10205056 7582287 57274 -7740514
2957 -7740514 -9804686 -7350125 -7823040 -15049472 -23763534 -25117586 -15867887 -1222838
2949 -1222838 10506321 15425694 16266336 17312174 18434144 16032674 9224675 1779191
2941 1779191 -3123110 -6719809 -10838230 -13013062 -9301358 -1039355 5302781 6267036
$$ packed form
2998A684089k7591o329779o633854K089949R899357O526054m559148j1158798
2990h509721p671322R88128P858582R814859P042617K910179K830453P548290
2982B2812065R692885L259840o154058q434254l982448j848704l557906o17480
2974A1169940R067125J4178442O066280p455719j2780752q291908k746485r09497
2966H297426k15190R54544Q61399k12729O4973M54633k622769p525013p797788
2957g740514k064172K454561m72915p226432q714062j354052R249699J4645049
2949a222838J1729159M919373Q40642J045838J121970k401470o807999p445484
2941A779191m902301l596699m118421k174832L711704Q262003O342136R64255
$$ plain form
2933 6267036 6688423 14218677 28858340 40329739 38049208 23435954 9494921 6657998
2925 6657998 11988003 15705173 15400233 17462568 25001904 32167789 33334521 31111949
2917 31111949 30500558 30888966 29925940 30326012 35043147 39098807 35224939 26245430 22232332
2908 22232332 24666924 23391446 12581491 355876 -3397619 -1096439 -1723413 -6596513
2900 -6596513 -9748594 -9529371 -10569464 -14259011 -15476596 -10809453 -3729656 968502
2892 968502 2779769 2831537 269195 -5137227 -10193082 -11789310 -10835585 -9448834 -6699932
2883 -6699932 -1165770 4137706 4441678 908538 744984 7594312 15336206 14726514 4781824
2874 4781824 -5537323 -7220920 -725164 5421707 4547168 -1159764 -4222148 -1512270
$$ packed form
2933F267036M21387P530254J4639663J1471399k280531j4613254j3941033k836923
2925F657998N330005L717170l04940K062335P539336P165885J166732k222572
2917C1111949o11391L88408r63026M00072M717135M055660l873868q979509m013098
2908B2232332K434592j275478j0809955j2225615l753495K301180o26974m873100
2900f596513l152081K19223j040093l689547j217585M667143P079797M698158
2892I68502J811267N1768k562342n406422n055855j596228R53725J386751K748902
2883f699932N534162N303476L03972l533140j63554O849328P741894o09692r944690
2874D781824j0319147j683597O495756O146871q74539n706932l062384K709878
$$ plain form
2866 -1512270 1853364 -582766 -7686991 -11699539 -7994849 -527932 3848314 3318592
2858 3318592 476200 -3664548 -10185845 -16916402 -17741761 -10172134 -605385 1849819
2850 1849819 -3809008 -9003254 -5591237 4770668 12585245 10823262 1957813 -5182422
2842 -5182422 -4489616 2183967 8233003 9147530 5456093 400725 -3254348 -4570055 -4911036
2833 -4911036 -7309417 -13014887 -18109191 -16369023 -7084866 2649068 5972128 4440542
2825 4440542 4943444 9863874 14251467 12811229 6084105 -1386786 -6185571 -7679250
2817 -7679250 -6413927 -2682804 3583400 11690093 18451026 18865198 11042662 158466
2809 158466 -5727935 -4868500 -4142209 -10524658 -22429627 -31659778 -32525343 -26747560 -19878055
$$ packed form
2866a512270L365634k436130p104225m012548L704690P466917M376246n29722
2858C318592k842392m140748o521297o730557q25359P569627R566749K455204
2850A849819n658827n194246L412017J0361905P814577j761983q865449p140235
2842e182422O92806O673583O049036R14527l691437n055368l655073j315707l40981
2833d911036k398381n705470n094304J740168R284157R733934L323060j531586
2825D440542N02902M920430M387593j440238o727124p470891m798785j493679
2817g679250J265323L731123O266204Q106693O760933M14172p822536j0884196
2809A58466n886401Q59435P26291o382449j1904969r230151q65565N777783O869505
$$ plain form
2800 -19878055 -15049320 -11128070 -6330330 -2219608 -2313038 -6371523 -8924666 -6337677
2792 -6337677 -3244109 -7243014 -17570146 -24502391 -21650950 -13865948 -10075909 -12550072
2784 -12550072 -16812762 -18453888 -15760016 -8616614 412039 5912339 5081097 1822741
2776 1822741 1382792 3190085 3992331 5568391 12273134 21531963 24431777 17440168 7028063
2767 7028063 407407 -2052199 -2288686 855824 7437663 12032761 9803222 3799875
2759 3799875 298829 -806793 -4705708 -11915785 -16332056 -13734399 -6754980 276344
2751 276344 6848088 14333888 22168829 28638783 32934957 33970029 29457746 19254068
2743 19254068 8401247 3581617 6088931 10285032 9783340 4135928 -1213552 -1107164
$$ packed form
2800a9878055M828735L921250M797740M110722r3430m058485k553143K586989
2792f337677L093568l998905j0327132o932245K851441P785002L790039k474163
2784a2550072m262690j641126K693872P143402R028653N500300q31242l258356
2776A822741m39949J807293Q02246J576060O704743R258829K899814o991609j0412105
2767G028063o620656k459606k36487L144510O581839M595098k229539o003347
2759C799875l501046j105622l898915p210077m416271K597657O979419P031324
2751B76344O571744P485800P834941O469954M296174J035072m512283j0203678
2743A9254068j0852821m819630K507314M196101n01692n647412n349480J06388
$$ plain form
2735 -1107164 3703654 7218116 4522950 -2852595 -8643094 -8843501 -5773805 -4635870
2727 -4635870 -7503265 -12212000 -16094177 -18424028 -19216456 -18187299 -15979075 -14389535
2719 -14389535 -14004264 -13511792 -12940323 -14970229 -19948670 -22043815 -15584679 -4729564
2711 -4729564 -674551 -7282664 -15125445 -13488977 -3521895 5442228 8558719 8047036
2703 8047036 5777676 1108238 -3807692 -3930633 1128408 4944144 2230050 -5297430
2695 -5297430 -12953416 -18472336 -21077723 -19794755 -15857174 -13013254 -12412132 -10759123
2687 -10759123 -6274791 -2196587 -847220 1213108 7292903 13709190 14472006 9979899
2679 9979899 5191544 1336847 -4294152 -11571085 -16880680 -19040246 -20067386 -19938687
$$ packed form
2735a107164M810818L514462k695166p375545n790499k00407L069696J137935
2727d635870k867395m708735l882177k329851p92428J029157K208224J589540
2719a4389535L85271M92472N71469k029906m978441k095145O459136J0855115
2711d729564M055013o608113p842781J636468R967082Q964123L116491n11683
2703H047036k269360m669438m915930j22941N059041L815736k714094p527480
2695e297430p655986n518920k605387J282968L937581K843920O01122J653009
2687a0759123M484332M078204J349367K060328O079795O416287P62816m492107
2679I979899m788355l854697n630999p276933n309595k159566j027140J28699
$$ plain form
2671 -19938687 -16272282 -9939701 -5648673 -5719303 -7863387 -9993954 -12498001 -14750890
2663 -14750890 -14242584 -10604207 -6194559 -1915338 2584672 4005380 -2600484 -14497045
2655 -14497045 -20699366 -15124285 -5067399 -1949788 -8210004 -18096252 -26641041 -31648854
2647 -31648854 -30514108 -22505057 -12938265 -8558646 -8934939 -7909564 -3437048 -345118
2639 -345118 -2418958 -6773780 -7962607 -4138711 2257416 6812623 5093945 -4227903
2631 -4227903 -16234192 -22238132 -17527663 -5426946 7167797 16354977 22142191 24883072
2623 24883072 23344806 16457699 5720294 -5019938 -12530092 -16733212 -19691900 -22467135
2615 -22467135 -24495006 -25857630 -27452243 -28003439 -24096707 -15349802 -6578455 -1817190
$$ packed form
2671a9938687L666405O332581M291028p0630k144084k130567k504047k252889
2663a4750890N08306L638377M409648M279221M500010J420708o605864j1896561
2655a4497045o202321N575081J0056886L117611o260216r886248q544789n007813
2647c1648854J134746Q009051R566792M379619l76293J025375M472516L091930
2639c45118k073840m354822j188827L823896O396127M555207j718678r321848
2631d227903j2006289o003940M710469J2100717J2594743R187180N787214K740881
2623B4883072j538266o887107j0737405j0740232p510154m203120k958688k775235
2615b2467135k027871j362624j594613n51196L906732Q746905Q771347M761265
$$ plain form
2607 -1817190 1047400 5858560 10951922 11382605 7028507 2989559 2071530 2193895 1750138
2598 1750138 2047168 2945443 1419536 -2949201 -5577237 -3048447 2083394 5755890 8053826
2589 8053826 10777005 12606527 11279298 8713857 9339335 13764055 17834039 18016443 14621577
2580 14621577 9439334 3091788 -4125500 -10560469 -13901120 -13610584 -12272190 -13510156
2572 -13510156 -17337599 -18552157 -12541069 -2431894 3627748 3455455 4166914 11368732
2564 11368732 19927943 21151212 15860706 13142694 17038179 21914053 22150380 19225167
2556 19225167 16110581 11135833 2651178 -4821061 -5627894 -2101249 -2219431 -8288616
2548 -8288616 -13836201 -13186735 -8784583 -5838755 -3913519 1179965 8944663 13190232
$$ packed form
2607a817190K864590M811160N093362M30683m354098m038948r18029J22365m43757
2598A750138K97030Q98275j525907m368737k628036K528790N131841L672496K297936
2589H053826K723179J829522j327229k565441O25478M424720M069984J82404l394866
2580A4621577n182243o347546p217288o434969l340651K90536J338394j237966
2572a3510156l827443j214558O011088J0109175O059642j72293P11459P201818
2564A1368732Q559211J223269n290506k718012L895485M875874K36327k925213
2556A9225167l114586m974748q484655p472239q06833L526645j18182o069185
2548h288616n547585O49466M402152K945828J925236N093484P764698M245569
$$ plain form
2540 13190232 10437179 4990307 3079261 4843568 5463837 2552035 -1567994 -4710968
2532 -4710968 -7752379 -11162875 -12076421 -7694529 277946 7390885 11403478 12762182
2524 12762182 11284258 6001877 -1442824 -6696047 -7481477 -6192629 -6241155 -7805863 -8893571
2515 -8893571 -8860028 -8661063 -8618610 -8188394 -7528602 -7156005 -6042429 -2263062 3676674
2506 3676674 7942514 7140271 1913508 -4563881 -10694700 -16946645 -22355454 -23334086 -18007496
2497 -18007496 -10356147 -7216744 -10821512 -16608362 -19384763 -19332666 -19799018 -20993023 -19510020
2488 -19510020 -14330454 -9799180 -10489481 -14987669 -17368861 -14406976 -9168496 -7112977
2480 -7112977 -10259527 -16017768 -20577737 -21956668 -19810022 -13962841 -4968528 3752402
$$ packed form
2540A3190232k753053n446872j911046J764307O20269k911802m120029l142974
2532d710968l041411l410496r13546M381892P972475P112939M012593J358704
2524A2762182j477924n282381p444701n253223p85430J288848m8526j564708j087708
2515h893571L3543J98965M2453M30216O59792L72597J113576L779367N939736
2506C676674M265840q02243n226763o477389o130819o251945n408809r78632N326590
2497a8007496P651349L139403l604768n786850k776401N2097m66352j194005J483003
2488a9510020N179566M531274o90301m498188k381192K961885N238480K055519
2480g112977l146550n758241m559969j378931K146646N847181Q994313Q720930
$$ plain form
2472 3752402 6530369 785300 -8269074 -10918435 -2619970 11088935 21017632 24070764
2464 24070764 24032274 24049764 22772219 18912603 15230633 14639587 14966010 11569252 4090557
2455 4090557 -3167155 -7176880 -8730405 -8994405 -7776785 -6401951 -8032912 -12615178
2447 -12615178 -15062659 -11799710 -6412184 -5123716 -8682665 -12638164 -14191746 -14582506
2439 -14582506 -15308961 -15901017 -15315265 -12455541 -6343595 718655 2277923 -4378353 -11024104
2430 -11024104 -6923938 5113372 10076807 1225007 -9982885 -10357078 -2786138 1442881
2422 1442881 1325082 4945512 12433228 13531567 4321372 -5286731 -6115941 -2827188 -5445779
2413 -5445779 -14036220 -19724189 -17771141 -12214866 -8239279 -5905269 -2349752 3637323
$$ packed form
2472C752402K777967n745069r054374k649361Q298465J3708905R928697L053132
2464B4070764l8490J7490j277545l859616l681970n91046L26423l396758p478695
2455D090557p257712m009725j553525k64000J217620J374834j630961m582266
2447a2615178k447481L262949N387526J288468l558949l955499j553582l90760
2439a4582506p26455n92056N85752K859724O111946P062250J559268o656276o645751
2430a1024104M100166J2037310M963435q851800j1207892l74193P570940M229019
2422A442881j17799L620430P487716J098339r210195r608103q29210L288753k618591
2413e445779q590441n687969J953048N556275L975587K334010L555517N987075
$$ plain form
2405 3637323 10337841 14436197 13566776 8905151 4393934 2137751 342740 -2366408
$$ packed form
2405C637323O700518M098356q69421m661625m511217k256183j795011k709148
$$ [...]
##END NTUPLES=NMR SPECTRUM
##END=
