##TITLE=31Pdec_DE-145k_TFA
 Cl4,64 sc
 4.5.2026
##JCAMPDX= 6.0         $$ Bruker NMR JCAMP-DX V2.0
##DATA TYPE= NMR SPECTRUM
##DATA CLASS= NTUPLES
##ORIGIN= UXNMR, Bruker Analytische Messtechnik GmbH
##OWNER= root
$$ XWIN-NMR		Version 3.5
$$ Mon May  4 16:31:54 2026 Russian Standard Time (UT+4h)  she@DPX200
##.OBSERVE FREQUENCY= 81.013821
##.OBSERVE NUCLEUS= ^31P
##.ACQUISITION MODE= SIMULTANEOUS
##.ACQUISITION SCHEME= undefined
##.AVERAGES= 64
##.DIGITISER RES= 17
##SPECTROMETER/DATA SYSTEM= spect
##.PULSE SEQUENCE= zgpg30
##.SOLVENT NAME= DMSO
##.SHIFT REFERENCE= (INTERNAL, DMSO, 0, 197.392)
##AUDIT TRAIL= $$ (NUMBER, WHEN, WHO, WHERE, WHAT)
$$ ##TITLE= Audit trail, XWIN-NMR		Version 3.5
$$ ##JCAMPDX= 5.01
$$ ##ORIGIN= Bruker BioSpin GmbH
$$ ##OWNER= she
$$ F:/spectra/data/she/nmr/P31/2/pdata/1/auditp.txt
$$ ##AUDIT TRAIL=  $$ (NUMBER, WHEN, WHO, WHERE, WHAT)
(   1,<2026-05-04 16:30:44.56 +0400>,<she>,<DPX200>,
      <continue with go, POWCHK disabled, PULCHK disabled
       configuration hash MD5:
       00 E9 B6 7A A2 85 ED C7 34 08 36 98 17 FE 4E 26
       data hash MD5: 32K
       E2 D8 BA CB 3C 85 6E 36 88 AB 16 10 A7 4A D0 03>)
(   2,<2026-05-04 16:30:46.98 +0400>,<she>,<DPX200>,
      <Start of raw data processing
       efp BC_mod = 2 LB = 1.5 FT_mod = 6 PKNL = 1 PHC0 = 1532.59 PHC1 = -221.8995 SI = 64K 
       data hash MD5: 64K
       92 67 B0 6A F5 5A A2 F2 19 9D 13 FA 9D 33 A6 BE>)
(   3,<2026-05-04 16:31:10.06 +0400>,<she>,<DPX200>,
      <pk PHC0 = -7.402772 PHC1 = 0 
       data hash MD5: 64K
       80 CE BE 1E 87 8D C3 E9 E4 79 6E 55 8C F2 B3 57>)
(   4,<2026-05-04 16:31:19.15 +0400>,<she>,<DPX200>,
      <abs ABSG = 5 
       data hash MD5: 64K
       9D B6 94 09 3C CC AB AE E1 15 9C 2D 33 8F 8D 09>)
$$ ##END=
$$ 
$$ hash MD5
$$ 08 21 CA 41 23 59 E6 C2 8D E6 80 7E 68 27 E8 0E
##$RELAX= 
##$RELAX= 
##$RELAX= 
##$RELAX= 
##$RELAX= 
##$RELAX= 
##$RELAX= 
##$RELAX= 
$$ Bruker specific parameters
$$ --------------------------
##$DU= <F:/spectra>
##$EXPNO= 2
##$NAME= <P31>
##$PROCNO= 1
##$TYPE= <nmr>
##$USER= <she>
##$AMP= (0..31)
100 100 100 100 100 100 100 100 100 100 100 100 100 100 100 100 100 100 
100 100 100 100 100 100 100 100 100 100 100 100 100 100 
##$AQSEQ= 0
##$AQ_mod= 1
##$AUNM= <au_zg>
##$AUTOPOS= <>
##$BF1= 81.014009
##$BF2= 200.13
##$BF3= 200.13
##$BF4= 200.13
##$BF5= 200.13
##$BF6= 200.13
##$BF7= 200.13
##$BF8= 200.13
##$BYTORDA= 1
##$CFDGTYP= 0
##$CFRGTYP= 5
##$CHEMSTR= <none>
##$CNST= (0..31)
1 1 145 1 1 1 1 1 1 1 1 1 1 1 1 1 1 1 1 1 1 1 1 1 1 1 1 1 1 1 1 1 
##$CPDPRG= <waltz16>
##$CPDPRG1= <>
##$CPDPRG2= <waltz16>
##$CPDPRG3= <>
##$CPDPRG4= <mlev>
##$CPDPRG5= <mlev>
##$CPDPRG6= <mlev>
##$CPDPRG7= <mlev>
##$CPDPRG8= <mlev>
##$CPDPRGB= <>
##$CPDPRGT= <>
##$D= (0..31)
0 1 0 0 0 0 0 0 0 0.06 0 0.03 2e-05 3e-06 0 0 0.0002 0 0 0 0 0 0 0 0 0 
0 0 0 0 0 0 
##$DATE= 1777897737
##$DBL= (0..7)
120 120 120 11 120 120 24 19 
##$DBP= (0..7)
150 150 150 150 150 150 150 150 
##$DBP07= 0
##$DBPNAM0= <>
##$DBPNAM1= <>
$$ [...]
##$SUBNAM3= <"">
##$SUBNAM4= <"">
##$SUBNAM5= <"">
##$SUBNAM6= <"">
##$SUBNAM7= <"">
##$SUBNAM8= <"">
##$SUBNAM9= <"">
##$SW= 400.765351723535
##$SWIBOX= (0..15)
0 1 3 0 0 0 0 0 0 0 0 0 0 0 0 0 
##$SW_h= 32467.5324675325
##$TD= 32768
##$TD0= 1
##$TE= 0
##$TE2= 300
##$TE3= 300
##$TEG= 300
##$TL= (0..7)
0 120 53 12 22 120 120 120 
##$TP= (0..7)
150 150 150 150 150 150 150 150 
##$TP07= 0
##$TPNAME0= <>
##$TPNAME1= <>
##$TPNAME2= <>
##$TPNAME3= <>
##$TPNAME4= <>
##$TPNAME5= <>
##$TPNAME6= <>
##$TPNAME7= <>
##$TPOAL= (0..7)
0.5 0.5 0.5 0.5 0.5 0.5 0.5 0.5 
##$TPOFFS= (0..7)
0 0 0 0 0 0 0 0 
##$TUNHIN= 0
##$TUNHOUT= 0
##$TUNXOUT= 0
##$USERA1= <user>
##$USERA2= <user>
##$USERA3= <user>
##$USERA4= <user>
##$USERA5= <user>
##$V9= 5
##$VALIST= <valist>
##$VCLIST= <CCCCCCCCCCCCCCC>
##$VD= 0
##$VDLIST= <DDDDDDDDDDDDDDD>
##$VPLIST= <PPPPPPPPPPPPPPP>
##$VTLIST= <TTTTTTTTTTTTTTT>
##$WBST= 1024
##$WBSW= 4
##$XGAIN= (0..3)
0 0 0 0 
##$XL= 0
##$YL= 0
##$YMAX_a= 6839
##$YMIN_a= -14575
##$ZGOPTNS= <>
##$ZL1= 120
##$ZL2= 120
##$ZL3= 120
##$ZL4= 120
##$ABSF1= 197.3918
##$ABSF2= -203.3724
##$ABSG= 5
##$ABSL= 3
##$ALPHA= 0
##$AQORDER= 0
##$ASSFAC= 0
##$ASSFACI= 0
##$ASSFACX= 0
##$ASSWID= 0
##$AUNMP= <proc_1d>
##$AZFE= 0.1
##$AZFW= 0.5
##$BCFW= 0
##$BC_mod= 2
##$BYTORDP= 0
##$COROFFS= 0
##$CY= -3
##$DATMOD= 1
##$DC= 0
##$DFILT= <>
##$DTYPP= 0
##$F1P= 0
##$F2P= 0
##$FCOR= 1
##$FTSIZE= 65536
##$FT_mod= 6
##$GAMMA= 0
##$GB= 0
##$INTBC= 1
##$INTSCL= 9.790993e-09
##$ISEN= 30
##$LB= 1.5
##$LEV0= 0
##$LPBIN= 0
##$MAXI= 10000
##$MC2= 0
##$MEAN= 0
##$ME_mod= 0
##$MI= 50
##$NCOEF= 0
##$NC_proc= -8
##$NLEV= 6
##$NOISF1= 182.463
##$NOISF2= 159.3651
##$NSP= 0
##$NTH_PI= 0
##$NZP= 0
##$OFFSET= 197.3918
##$PC= 4
##$PHC0= 1525.187
##$PHC1= -221.8995
##$PH_mod= 1
##$PKNL= yes
##$PPARMOD= 0
##$PSCAL= 0
##$PSIGN= 0
##$REVERSE= no
##$SF= 81.014063255964
##$SI= 65536
##$SIGF1= 159.3651
##$SIGF2= -187.1042
##$SINO= 113.3802
##$SIOLD= 16384
##$SREGLST= <1H.CDCl3>
##$SSB= 0
##$STSI= 65536
##$STSR= 0
##$SW_p= 32467.5324675325
##$SYMM= 0
##$S_DEV= 0
##$TDeff= 32768
##$TDoff= 0
##$TI= <>
##$TILT= no
##$TM1= 0
##$TM2= 0
##$TOPLEV= 0
##$USERP1= <user>
##$USERP2= <user>
##$USERP3= <user>
##$USERP4= <user>
##$USERP5= <user>
##$WDW= 1
##$XDIM= 65536
##$YMAX_p= 303459540
##$YMIN_p= -181822424
$$ End of Bruker specific parameters
$$ ---------------------------------
##NTUPLES= NMR SPECTRUM
##VAR_NAME=  FREQUENCY,     SPECTRUM/REAL,   SPECTRUM/IMAG
##SYMBOL=    X,             R,               I
##VAR_TYPE=  INDEPENDENT,   DEPENDENT,       DEPENDENT
##VAR_FORM=  AFFN,          ASDF,            ASDF
##VAR_DIM=   65536,         65536,           65536
##UNITS=     HZ,            ARBITRARY UNITS, ARBITRARY UNITS
##FACTOR=    0.49542278885378, 1,            1
##FIRST=     15991.5117654749, 0,            0
##LAST=      -16476.0207020576, 0,           0
##MIN=       -16476.0207020576, -181822424,  0
##MAX=       15991.5117654749, 303459540,    0
$$ Real data points
##PAGE= N=1
##DATA TABLE= (X++(R..R)), XYDATA
$$ [...]
44723b682307k772049J533792M065086K524430j568312m109861k803133L26902
44715e485452J759084R45757K47044J020213K183042K715369K874823K250977
44707H510857m60584m286237n420968k099254K292437L514424J870164N17798
44699D438637L25909j45307q89130n09820N46720N20420j41830M84726J580341
44690F210666J99678l264013m539214j906504R27852O07916j044313r21739R5024
44681c634647m13417j307942K36710L142666L361482K62248k174444j322941O60598
44672a189687Q37998k52756m45094L13813N60426K29421M75545J190501R56823
44663B676990m85182j579097j169118P2468R63004J267746J125260K65171j047417
$$ plain form
44723 -2682307 -5454356 -3920564 144522 2668952 1100640 -3009221 -5812354 -5485452
44715 -5485452 -3726368 -2780611 -2533567 -1513354 669688 3385057 6259880 8510857
44707 8510857 8050273 3764036 -1656932 -3756186 -1463749 2050675 3920839 4438637
44699 4438637 4764546 4619239 3730109 3220289 3767009 4287429 4145599 4630325 6210666
44690 6210666 6410344 3146331 -1392883 -3299387 -2371535 -1763619 -2807932 -3729671 -3634647
44681 -3634647 -4048064 -5356006 -5119296 -1976630 1384852 1647100 -527344 -1850285 -1189687
44672 -1189687 -351689 -604445 -1049539 -735726 -175300 54121 529666 1720167 2676990
44663 2676990 2191808 612711 -556407 -483939 479065 1746811 2872071 3137242 2089825
44654B089825j298244L86729K110162R75010k679973m802409k540886J880549
44646c879237L854044K025478o37724j098461L33199J229836K53529j639288k513113
44637b071737j488932K67460P01306o26333j789926j068422N24891P01352o79969
44628e530310j522511p49842L37904L53072m00280j111175j736226k246078k086671
44619a4692117j258405n68865n2653J335235L550752M639376L351299J145595
44611b549783J62227L80489K36887q81618k075954k098695k12440L004323N018387
44602I83823L259559j228948m126674l366745j947206k935690m211350j739989
44594a5313220L602622O686267N081478J379175j420089k838918k755907m48732
$$ plain form
44654 2089825 791581 1178310 3288472 4263482 1583509 -3218900 -5759786 -3879237
44646 -3879237 -25193 2000285 1362561 264100 597299 1827135 2080664 441376 -2071737
44637 -2071737 -3560669 -3293209 -2591903 -3218236 -5008162 -6076584 -5551693 -4850341 -5530310
44628 -5530310 -7052821 -7802663 -7464759 -7111687 -7511967 -8623142 -10359368 -12605446 -14692117
44619 -14692117 -15950522 -16519387 -16572040 -15236805 -11686053 -7046677 -3695378 -2549783
44611 -2549783 -2387556 -2007067 -1770180 -2651798 -4727752 -6826447 -7038887 -4034564 983823
44602 983823 4243382 3014434 -1112240 -4478985 -6426191 -9361881 -13573231 -15313220
44594 -15313220 -11710598 -5024331 57147 1436322 16233 -2822685 -5578592 -6027324
44586f027324K762261L526821J009719j596684j893857j482629k150619k064628
44578g916940J026518N127030O102771L183579p08909l081823l455658j919021
44570a642453P43953K137720N75866k057408k675789j606937j462280j979491
44562g966819l66608K822738L112951p06856l504202j090696L397227M531277
44554B29012K742920K280744L148957J220947l785157o531133l895559N26653
44546d062616K270631J922218J954234J554314j060725l854852l328066l37386
44538d942248J025470j93194r91492P6407J084516J099525J870184L682076L766212
44529F477456J017423j560580j754457j778955l729901m914819k048916K549372
$$ plain form
44586 -6027324 -3265063 261758 1271477 -325207 -2219064 -3701693 -5852312 -7916940
44578 -7916940 -6890422 -1763392 4339379 7522958 6814049 3732226 276568 -1642453
44570 -1642453 -898500 1239220 1815086 -242322 -2918111 -4525048 -5987328 -7966819
44562 -7966819 -8333427 -5510689 -2397738 -3104594 -6608796 -7699492 -4302265 229012
44554 229012 2971932 5252676 8401633 9622580 5837423 -693710 -4589269 -4062616
44546 -4062616 -1791985 130233 2084467 3638781 2578056 -1276796 -4604862 -4942248
44538 -4942248 -3916778 -4109972 -5101464 -5025057 -3940541 -2841016 -970832 2711244 6477456
44529 6477456 7494879 5934299 4179842 2400887 -1329014 -6243833 -8292749 -5743377
44521e743377L930283K067282J255284K682409K988239O18827j571175j472735
44513D755037r09461j697542k489805j844916r86622j080057q79901M24824J019412
44504c689031k47772j348283p34931m52494k087332k622712J139883O248959O852629
44495C058916K645715j140393j810321j872908l042519l000984j47857K947265
44487b363086L577592K940119L345018M148196L316970R74780j237651k680357
44479A2021581l309618k397638J6069J802408J158254p84026j748726j463151
44471E295153j033348o04974M8027j17712j895288l599966k931428l65014J754562
44462c449988K696884L236028K862503L93144k764641l360119r07938J471810
$$ plain form
44521 -5743377 -1813094 254188 1509472 4191881 7180120 7798947 6227772 4755037
44513 4755037 3845576 2148034 -341771 -2186687 -3173309 -4253366 -5133267 -4708443 -3689031
44504 -3689031 -3936803 -5285086 -6020017 -6472511 -8559843 -11182555 -10042672 -3793713 3058916
44495 3058916 5704631 4564238 2753917 881009 -2161510 -5162494 -5310351 -2363086
44487 -2363086 1214506 4154625 7499643 11647839 14964809 15939589 14701938 12021581
44479 12021581 8711963 6314325 6330394 8132802 9291056 8507030 6758304 5295153
44471 5295153 4261805 3656831 3704858 3587146 1691858 -1908108 -4839536 -5204550 -3449988
44462 -3449988 -753104 2482924 5345427 5738571 2973930 -386189 -1294127 177683
44454A77683J637358R34735J035330J180550K44037r76444j501065k086470l267510
44445b621796l328795p32438K684172L562493J519313n88982p61893O600O1622
44436a99704l76502n3759J043546J515254N59954o92958m78416J136088K005001
44427D458504O96661j423593k130966j521955j330326j547045l71873K110952
44419a059641L141995J473287l62289P5848J408945J123717k7785N49282K678776
44410I002135L490766J693148j145089l412412m780040m706691k491015O48672
44402a700526K071991J054644m51329r05842q35310q35975l14945P93781J251529
44393A28018O43593L25981J025537J407446M07327q74422j242715j650429l350785
$$ plain form
44454 177683 1815041 2749776 3785106 4965656 5209693 4233249 2732184 645714 -2621796
44445 -2621796 -5950591 -6683029 -3998857 -436364 1082949 493967 -267926 -261326 -199704
44436 -199704 -576206 -629965 413581 1928835 2488789 1795831 1317415 2453503 4458504
44427 4458504 5155165 3731572 1600606 78651 -1251675 -2798720 -3170593 -1059641
44419 -1059641 2082354 3555641 3193352 3269200 4678145 5801862 5774077 6323359 9002135
44410 9002135 12492901 14186049 13040960 9628548 4848508 141817 -2349198 -1700526
44402 -1700526 371465 1426109 974780 68938 -766372 -1602347 -1917292 -1123511 128018
44393 128018 771611 1097592 2123129 3530575 3937902 3063480 1820765 170336 -3180449
44384c180449n046232m105101j92052M040660N748338M245193R53256j881670
44376E81943k679439j620189j66817P00220J086462R92529j0913j336550j297274
44367c750028L80799J493972K94883j800424k090182j13245K351041L759360L476536
44358D002712J065506k779014n242057l956524o05333N58172j621398l382331
44350a1960267j164152L387650N543158L680677J046318R75508K409846J927450
44342E846188p41219j970022K09115K550576J098367k663125l861849j686279
44334a218248k90063j623805k268464K64708K694354J318593j431018p23770K718863
44325e58850L794495J089083j568628j612277p63779p82336q08091l30609p20885
$$ plain form
44384 -3180449 -8226681 -12331782 -12523834 -8483174 -2734836 1510357 2463613 581943
44376 581943 -2097496 -3717685 -3884502 -3184282 -2097820 -1105291 -1116204 -2452754 -3750028
44367 -3750028 -3369229 -1875257 -1580374 -3380798 -5470980 -5584225 -3233184 526176 4002712
44358 4002712 5068218 2289204 -2952853 -6909377 -7514710 -6956538 -8577936 -11960267
44350 -11960267 -13124419 -9736769 -4193611 -512934 533384 1508892 3918738 5846188
44342 5846188 5104969 3134947 3344062 5894638 6993005 4329880 468031 -1218248
44334 -1218248 -1508311 -3132116 -5400580 -5135872 -2441518 -1122925 -2553943 -3277713 -558850
44325 -558850 3235645 4324728 2756100 1143823 380044 -402292 -1210383 -1540992 -2261877
44316b261877k076213k113879m4584J673898J272088K61424K04140J0965j273841
44307d347879j880353j49686K351662L109992K114665Q06332l83401j266861r02882
44298e48411K91613j67573k735193l613622j02362M111155L337376j754104m773850
44289e954971k397864J830367L141176J213503j071794j635338m97317R37359
44281d434879Q76859j068662k791125k036727K87178J289231L74927l08431K25298
44272g586331N75829L11722J221959L666277M693697K100384j879857l424288
44264c20608k070089m21268j12298m87033o27520m56295q703O35747Q43482L00922
44254b723663Q7394J348638L129431L180215J051999j104972j240843K60319J419155
$$ plain form
44316 -2261877 -4338090 -6451969 -6496553 -4822655 -3550567 -3289143 -3085003 -3074038 -4347879
44307 -4347879 -6228232 -6377918 -4026256 -916264 1198401 2004733 1621332 354471 -548411
44298 -548411 -256798 -424371 -3159564 -6773186 -6875548 -2764393 572983 -1181121 -5954971
44289 -5954971 -8352835 -6522468 -3381292 -2167789 -3239583 -4874921 -5372238 -4434879
44281 -4434879 -3558020 -4626682 -7417807 -9454534 -9167356 -7878125 -7503198 -7811629 -7586331
44272 -7586331 -7010502 -6698780 -5476821 -1810544 2883153 4983537 3103680 -320608
44264 -320608 -2390697 -2811965 -2924263 -3411296 -4038816 -4495111 -4503814 -3868067 -3024585 -2723663
44254 -2723663 -2636269 -1287631 1841800 5022015 6074014 4969042 3728199 3988518 5407673
44245E407673R19300r73232l052601m148548l726857j938530O55353L030012L526928
44236c00502R92577l058629m662122j608142L101364M194412O91787k804547k229751
44227e683553R40471K555386J554974J67947l81989j068019k086628j991944o74223
44218f667578k96255j743260k615383p31431K375869L669189K658313R53630o22700
44209c019606j771728r89522K527678N920267N141006M85573l527788m019331
44201G46549k353530p39135J60570l13992k696478m529586j955394L768197N770749
44192b142050P63175n322559n098437J39184L030192P34634k555103k916634j291582
44183a4659180k08746r6721o5499M24433J455362K360390J862911L36237M88669
$$ plain form
44245 5407673 6326973 5353741 2301140 -1847408 -5574265 -7512795 -6857442 -3827430 -300502
44236 -300502 692075 -2366554 -7028676 -8636818 -5535454 -1341042 -649255 -3453802 -5683553
44227 -5683553 -4743082 -2187696 -632722 -464775 -846764 -1914783 -4001411 -5993355 -6667578
44218 -6667578 -6963833 -8707093 -11322476 -12053907 -9678038 -6008849 -3350536 -2396906 -3019606
44209 -3019606 -4791334 -5780856 -3253178 2667089 7808095 8293668 4765880 746549
44201 746549 -1606981 -2346116 -2185546 -2499538 -5196016 -9725602 -11680996 -7912799 -2142050
44192 -2142050 -1378875 -6701434 -11799871 -11660687 -8630495 -7895861 -10450964 -13367598 -14659180
44183 -14659180 -14867926 -14964647 -15030146 -14605713 -13150351 -10789961 -8927050 -8590813 -8102144
44174h102144L157716M471404J130403l390521l112304J125920K771774R805j691396
44165c629343Q67517L239404Q91912l497860m640325k219139N23836K290541L381558
44156b791899K685262n14494l670636l785778j450488J009504L092896M557890
44148h67743L216497j391692m611500j959090L866476O311035M026191J263438
44140I853612P0898j847438m986627n760108k412871J586328K611580J580346
44132F95720J097053J174977N60426k22060R670N64790r9846j833174l049423
44123a101867k764866j217167O69210J651049J064579n8563K5083J297014J962071
44114A526543J231886L27146J79067P9343n63479r99506o96047m68602j002349
$$ plain form
44174 -8102144 -4944428 -473024 657379 -2733142 -5845446 -4719526 -1947752 -1937947 -3629343
44165 -3629343 -2761826 477578 1369490 -2128370 -6768695 -8987834 -8463998 -6173457 -2791899
44156 -2791899 -106637 -621131 -4291767 -8077545 -9528033 -8518529 -5425633 -867743
44148 -867743 2348754 957062 -3654438 -5613528 -1747052 4563983 8590174 9853612
44140 9853612 9924510 8077072 3090445 -2669663 -5082534 -3496206 -884626 695720
44132 695720 1792773 2967750 3528176 3306116 3315786 3880576 3780730 1947556 -1101867
44123 -1101867 -3866733 -5083900 -4414690 -2763641 -1699062 -1757625 -1732542 -435528 1526543
44114 1526543 2758429 3085575 3264642 3343985 2780506 1781000 1084953 616351 -385998
44105c85998j655219j614386r47627N6532J123465J252417l39939k101025j234996
44096e846776K293163N131340M861749K617068M53061j132346j742291k64130
44088F370838K402362K767499m31122l502680k911023n39747k57058j572373j176277
44079A150419P74264R83449q32766j297855N34093J456324J6511o25492J643357
44070C802304L556740J458157k488863l410455j204804k70599k172293l159057
44062c888870k44930L914964M673212J696471j193700j573521r87189j595706
44054H00731k656977j949891N31037K332445J919229N03345j29636q6217l81264
44045H82802n64735P89112L313462M332520J881415k708034n992081n710272k472482
$$ plain form
44105 -385998 -2041217 -3655603 -4603230 -4546698 -3423233 -2170816 -2510755 -4611780 -5846776
44096 -5846776 -3553613 1577727 6439476 9056544 9509605 8377259 6634968 6370838
44088 6370838 8773200 11540699 11109577 7606897 4695874 4156127 3899069 2326696 1150419
44079 1150419 1924683 2908132 2075366 777511 1311604 2767928 2784439 2158947 3802304
44070 3802304 7359044 8817201 6328338 2917883 1713079 1442480 -729813 -3888870
44062 -3888870 -4133800 -218836 4454376 6150847 4957147 3383626 2396437 800731
44054 800731 -1856246 -3806137 -3275100 -942655 976574 1479919 1350283 1264066 882802
44045 882802 318067 1107179 4420641 8753161 10634576 7926542 1934461 -3775811 -6248293
44036f248293J269718L293611K895873Q26290j565789k945788k185691R15871
44028c744198M462475N109082J486058l335821m601622j409720K233282K615953
44020B815489P90799L82069K309208L818145K418506j140592m139569m740340
44012B513715l108112p37669P66241Q38759K48996m6923j36841o30748j345650
44003a638232j597372j500900j567525j141500R39178L824228M870348L265633
43995E453858J367369J050811Q45055j179904l552560l373264j058473J85867
43987b61241o47056j243064k11255Q74953P61602P25693J760317K209843M39993
43978D409785k138415l012400k035157q57348k64439j22886o20452j407010q09914
$$ plain form
44036 -6248293 -4978575 -1684964 1210909 2037199 471410 -2474378 -4660069 -3744198
44028 -3744198 718277 5827359 7313417 3977596 -624026 -2033746 199536 2815489
44020 2815489 3606288 3988357 6297565 10115710 12534216 11393624 7254055 2513715
44012 2513715 -594397 -1332066 -565825 272934 521930 475007 338166 -292582 -1638232
44003 -1638232 -3235604 -4736504 -6304029 -7445529 -6506351 -2682123 2188225 5453858
43995 5453858 6821227 7872038 8717093 7537189 3984629 611365 -447108 -261241
43987 -261241 -908297 -2151361 -2362616 -1487663 -726061 -368 1759949 3969792 4409785
43978 4409785 2271370 -741030 -2776187 -3633535 -3897974 -4020860 -4641312 -6048322 -6858236
43969f858236J772216L903477L022286K29707j428729j346057j080197p70208
43961b555741O37579K164731J703292J57443O10802K796821K720924q11613l612870
43952C811368k421324R4826j57698k357414k761329q63305N18796K39986N6598
43943c839496R84343J679214R60774m25559j150488p59770M76410J860866K423253
43934B209547J862060R73786J59574j535155m357697n885890l424372J913656
43926h084491N691275M968822J068632k496528l313777j340799J432211K354283
43918B79628N37714j899644k162203j83667J641394J822318J093632M09391l33186
43909A205377j026798p06457P98840J959745J420285k09902j477409k153265k964409
$$ plain form
43969 -6858236 -5086020 -1182543 1839743 2069450 640721 -705336 -1785533 -2555741
43961 -2555741 -1918162 246569 1949861 2107304 2718106 5514927 8235851 7424238 3811368
43952 3811368 1390044 1484870 1327172 -1030242 -3791571 -4654876 -4136080 -3896094 -3839496
43943 -3839496 -2855153 -1175939 -215165 -640724 -1791212 -2550982 -2074572 -213706 2209547
43934 2209547 4071607 5045393 5204967 3669812 -687885 -6573775 -9998147 -8084491
43926 -8084491 -2393216 2575606 3644238 1147710 -2166067 -3506866 -2074655 279628
43918 279628 817342 -1082302 -3244505 -3428172 -1786778 35540 1129172 1538563 1205377
43909 1205377 178579 -527878 270962 2230707 3650992 3441090 1963681 -189584 -3153993
43900c153993l734572l187516q95571J597169K424643J748805J407272K127910
43892a665853K428446J147302k91799Q7528J452790J277592m99745j312227k98657
43883B325377L72674m26817p13382P64594J831840N95644j086813r13014j93873
43874B556230j058612k133333j184134J27501j019302k786110j101777K948536
43866c651001M136698J627016K73031K107723K766318q90124n074911m797359
43858c502609j108251J414614J367540Q59021J321775K294587K781192J498511
43850F926380k213958n846757m967946N80174M930313L686785l6163p79318J184199
43841C463709J634462j01245q54829K48992O74796n06108j210097n18499j00785
$$ plain form
43900 -3153993 -6888565 -10076081 -10971652 -9374483 -6949840 -5201035 -3793763 -1665853
43892 -1665853 762593 1909895 1618096 1705624 3158414 4436006 3936261 2624034 2325377
43883 2325377 2698051 2271234 1557852 2322446 4154286 4749930 3663117 2750103 2556230
43874 2556230 1497618 -635715 -1819849 -1692348 -2711650 -5497760 -6599537 -3651001
43866 -3651001 485697 2112713 2385744 4493467 7259785 6369661 1294750 -3502609
43858 -3502609 -4610860 -3196246 -1828706 -969685 352090 2646677 5427869 6926380
43850 6926380 4712422 -1134335 -6102281 -5522107 -591794 3094991 3058828 2279510 3463709
43841 3463709 5098171 4996926 4142097 4391089 5065885 4559777 3349680 2831181 2730396
43832B730396o19164m39121R97621J794815P81695p17649j308018j172715n46717
43823A501143Q05561J819720O46876k021947k911683p68265J579727J292749p39746
43814A204135j916484j451070k3233J984650L715805L143973k64388l450720l041214
43805i8546k9198J542083L41320p70265L08295J434984k42791l256922l362701
43796d133741K76179L557937L100612O82262j46261L10334r28513l695361m191929
43787e168481r63413K586257L356228K650138K656353K184952n91730l710169
43779C000135l800240j296236P00342J453859K307108K461193j15928l802580
43771I07653m379008j604724J19471j167677k137903k84624J928639J783445P94262
$$ plain form
43832 2730396 2111232 1672111 2669732 4464547 5246242 4528593 3220575 2047860 1501143
43823 1501143 2306704 4126424 4773300 2751353 -160330 -928595 651132 1943881 1204135
43814 1204135 -712349 -2163419 -2186652 -202002 3513803 6657776 6393388 2942668 -98546
43805 -98546 -127744 1414339 1755659 985394 1293689 2728673 2485882 -771040 -4133741
43796 -4133741 -3857562 -299625 2800987 3483249 3336988 3647322 2718809 -976552 -5168481
43787 -5168481 -6131894 -3545637 -189409 2460729 5117082 7302034 6710304 3000135
43779 3000135 -800105 -2096341 -1395999 57860 2364968 4826161 4710233 907653
43771 907653 -3471355 -5076079 -4956608 -6124285 -8262188 -8546812 -6618173 -4834728 -4040466
43762d040466J060646J013832j122600k836087r39792K550578K974953J77467
43754a161469j562258j60269K139375L183236L147230J918099j454650n414042
43746F35252n960297k164294J580522J305840j159611j488329N18538J252869
43738e479510n01725j563990N07143L349810L041111l09254k760908j897071M46669
43729e167725J363038P19386L95830R92869J192982Q7344j475181k101432j403449
43720e396338j77556L18315n09031j571399r22507J445937K744092J008704j519318
43711d579101j169195J631527K750975M53117k245651k290453m25791J235933
43703d638639K397523L205249K536902L54238o26138J313449L397821J993203
$$ plain form
43762 -4040466 -2979820 -1965988 -3088588 -5924675 -6864467 -4313889 -1338936 -1161469
43754 -1161469 -2723727 -2883996 -744621 2438615 5585845 7503944 6049294 635252
43746 635252 -5325045 -7489339 -5908817 -4602977 -5762588 -7250917 -6732379 -5479510
43738 -5479510 -5981235 -7545225 -7038082 -3688272 -647161 -956415 -3717323 -5614394 -5167725
43729 -5167725 -3804687 -3085301 -2689471 -1696602 -503620 -416276 -1891457 -3992889 -5396338
43720 -5396338 -5573894 -5255579 -5764610 -7336009 -8258516 -6812579 -4068487 -3059783 -4579101
43711 -4579101 -5748296 -4116769 -1365794 -912677 -3158328 -5448781 -5874572 -4638639
43703 -4638639 -2241116 964133 3501035 3855273 3229135 4542584 7940405 9933608
43695I933608j697322l207617j258575J110956J669296J429975J342525J99214
43687I522060k491372m336084k994192L33479K389721J973721Q53785R21359J904658
43678H077135K199210J062750p07053k080302k973818l637390l568421k166528
43670c794417j26953J254734J992014K823172K877518N82670k602973k700434
43662C05331Q95788L403238J228322k533173k789797k4275J354352M18786K34126
43653B492698J563313J532927p06627k083666j026115k50900j756348k917629
43645c152347o77746L170159M216141J431090j828798k132696N28439L125178
43637D679420K635490n96722k602735m49475L284177L467099k09341k667065j239083
$$ plain form
43695 9933608 8236286 5028669 3770094 4881050 6550346 7980321 9322846 9522060
43687 9522060 7030688 2694604 -299588 33891 2423612 4397333 5251118 6172477 8077135
43678 8077135 10276345 11339095 10632042 8551740 5577922 1940532 -1627889 -3794417
43670 -3794417 -3921370 -2666636 -674622 2148550 5026068 5608738 3005765 305331
43662 305331 1201119 4604357 5832679 3299506 509709 485434 1839786 2258572 2492698
43653 2492698 4056011 5588938 4882311 2798645 1772530 1521630 -234718 -3152347
43645 -3152347 -3830093 -659934 3556207 4987297 3158499 1025803 1554242 4679420
43637 4679420 7314910 6718188 4115453 3665978 6950155 10417254 10207913 7540848 6301765
43628F301765M23524j233221l584865k277034J285979J928380j170840l302118
43620a628430j314851K317663L584774J898734m66395j634138j336412k85271
43612A135674M17688N789j049163j331249p2630J871904K786825J701547o08553
43603D857832k220248k077453j221703j215995j720989j096353P54528K062539
43595a877842J854107P87919q29400l101792m136763j143659M553382P296959
43587C402911M326665k22394j484299m59543o31399j474750m35658J206619L27739
43578D555891j695447p78704K339564K748839j61524j509900L74046P58086l038109
43569C592742o091044l165312L051469N878189L605549j23612k489758l437717
$$ plain form
43628 6301765 6725289 5492068 1907203 -369831 916148 2844528 1673688 -1628430
43620 -1628430 -2943281 -625618 2959156 4857890 4391495 2757357 1420945 1135674
43612 1135674 1553362 1559151 509988 -821261 -893891 978013 3764838 5466385 4857832
43603 4857832 2637584 560131 -661572 -1877567 -3598556 -4694909 -3940381 -1877842
43595 -1877842 -23735 764184 -65216 -3167008 -7303771 -8447430 -3894048 3402911
43587 3402911 7729576 7507182 6022883 5563340 4931941 3457191 3021533 4228152 4555891
43578 4555891 2860444 2081740 4421304 7170143 7008619 5498719 5872765 6630851 3592742
43569 3592742 -2498302 -5663614 -2612145 3266044 6871593 6747981 4258223 820506
43561H20506k955825p58776J831286K996481K945103K826497K269760O60177n48336
43552A0086873J02638R63451l66455k606688k491168k81363N33206q66048j286749
43543C787697R15766K937105K041014l67382j538112j526565j790667j689350
43535B769506L86565L288630L667691N42592l056420l828618j923847J25490R80386
43526B951975J461156K232538K202512J94967k652163l706768k229366n56354
43518a01503j064687k953392l291303q41094K414345L640753K147153k41972j293181
43509a584881n76996L99321L15868j46535M95090J811054J656050m67930k227213
43500c26172j810548m90237l8621M53919K523210M570956L529130k36459l079179
$$ plain form
43561 820506 -2135319 -2894095 -1062809 1933672 4878775 7705272 9975032 10635209 10086873
43552 10086873 10189511 11152962 10786507 8179819 5688651 5407288 5940494 5074446 3787697
43543 3787697 4703463 7640568 9681582 9314200 7776088 6249523 4458856 2769506
43535 2769506 3156071 6444701 10112392 10654984 7598564 3769946 1846099 1971589 2951975
43526 2951975 4413131 6645669 8848181 9043148 6390985 2684217 454851 -101503
43518 -101503 -1166190 -4119582 -7410885 -8251979 -5837634 -2196881 -49728 -291700 -1584881
43509 -1584881 -2161877 -1762556 -1446688 -1593223 -1098133 712921 2368971 1901041 -326172
43500 -326172 -2136720 -2626957 -2665578 -2211659 311551 4882507 8411637 8175178 5095999
43491E095999l224097k442734k101731j091314R85984J889170J46670k140715
43483b882768k207616m17042R69981J085453M57205n89420j374325l50094K487766
43474b820860M202478K538267l92741q91136R95183K084607J204797J72362j81320
43465F911637j223623l118772l701434k050502k42453j0351k52554M28484J068054
43456b191514K08433j467556k346627k172165j347173M36740K954190M351015
43448a574657L375955J391129J46904r11881k701202l472507j011449L003221
43440a754487M436916K452102L38529J50697Q2009j616232l455024l392514j975460
43431d733464o39700P33635K190264J944969p22682k627877l94684L855651M414617
$$ plain form
43491 5095999 1871902 -570832 -2672563 -3763877 -2777893 -888723 -742053 -2882768
43483 -2882768 -5090384 -5507426 -4537445 -3451992 -2994787 -3584207 -4958532 -5308626 -2820860
43474 -2820860 1381618 3919885 3527144 2636008 3631191 5715798 6920595 7092957 6911637
43465 6911637 5688014 2569242 -1132192 -3182694 -3425147 -3435498 -3688052 -3259568 -2191514
43456 -2191514 -1983081 -3450637 -5797264 -7969429 -9316602 -8879862 -5925672 -1574657
43448 -1574657 1801298 3192427 3339331 2427450 -273752 -3746259 -4757708 -1754487
43440 -1754487 2682429 5134531 5473060 5623757 5705766 4089534 634510 -2758004 -4733464
43431 -4733464 -5373164 -4639529 -2449265 -504296 -1226978 -3854855 -4249539 -393888 4020729
43422D020729j96718m933479m839612q84931K457530K923369J558593j17919j558513
43413a570951k456391k541194j989098r01527J114436L727492M982731L152772
43405C518270p90990l902552m335258k633150l51031J279511J552466O23113k91116
43396e330737k23732J85701o9355k35773J101877K908885K265796j146193l646688
43387d190219k258259J240092K976536K051496O03889Q8824K01142Q44668K291277
43378C849446L351727K144110p40740k322566j381881k40114j152460l023815
43370D83707l415227k141502q44982q6412R94827K522068L261630K319554K67187
43361C360850j527747j968508r29899L54906J18274j814464l255429k050950J235960
$$ plain form
43422 4020729 3824011 -1109468 -5949080 -6834011 -4376481 -1453112 105481 -12438 -1570951
43413 -1570951 -4027342 -6568536 -8557634 -9459161 -8344725 -4617233 365498 3518270
43405 3518270 2727280 -1175272 -5510530 -8143680 -8494711 -7215200 -5662734 -5039621 -5330737
43396 -5330737 -5554469 -5368768 -5438123 -5673896 -4572019 -1663134 602662 -543531 -4190219
43387 -4190219 -6448478 -5208386 -2231850 -180354 423535 512359 713501 1558169 3849446
43378 3849446 7201173 9345283 8604543 6281977 4900096 4659982 3507522 483707
43370 483707 -2931520 -5073022 -5918004 -6004416 -5009589 -2487521 774109 3093663 3360850
43361 3360850 1833103 -135405 -1065304 -710398 -592124 -2406588 -5662017 -7712967 -6477007
43352f477007M084286M849320L602201Q88839k487922m672604l847838p03583
43344d764308J765131J655532J25612o27509n3763R11723J492964J415011M40448
43335B360841j174596k170577j422078M25468J396505M91723j107580j500943
43327b701237l03329J101092J418229Q99311O01949Q30941J177337J724461K850684
43318G599438L692854K446527r62354l954489m233091k377929k46771J669549
43310C633734L448505L829245J742010j158356k273947j774253j633328j666796
43302D146814k04010J535753K59009l349091m190372m44802K951031J659875j548315
43293H15892j878411l02177p79028k352559n61702M069636N642355K025477j609371
$$ plain form
43352 -6477007 -2392721 2456599 6058800 6947639 4459717 -212887 -4060725 -4764308
43344 -4764308 -2999177 -1343645 -1218033 -1845542 -1899305 -987582 505382 1920393 2360841
43335 2360841 1186245 -984332 -2406410 -1980942 -584437 -92714 -1200294 -2701237
43327 -2701237 -3004566 -1903474 -485245 414066 1016015 1846956 3024293 4748754 7599438
43318 7599438 11292292 13738819 12776465 8821976 4588885 2210956 1964185 3633734
43310 3633734 7082239 10911484 12653494 11495138 9221191 7446938 5813610 4146814
43302 4146814 3942804 5478557 5737566 2388475 -1801897 -2246699 704332 2364207 815892
43293 815892 -1062519 -1364696 -2143724 -4496283 -5057985 -988349 4654006 6679483 5070112
43284E070112p72559J871519J378647k000050m190343l631201k199744j104974
43276e578593L55948K141854K695840J379108m81907j573927k000359k174607
43268e236643j759491n41602O39545Q59141N86730J212884K967801M137911L054071
43259E920347M53678j195678q16416Q2426r1820p17738m58515J37744m99621k086556
43249G27851k695216j864898j240341j505291q66685K045381N327721N618071
43241E546593K195270k087559l884739k531896j24995R57522K43894j071730j985882
43232b743522k379872j942968m0631K456258K923689L37304k435053j901279J430027
43223d296047M076379M364604L366229J742324q40415l078113k532731L61467
$$ plain form
43284 5070112 4297553 6169072 7547719 5547669 1357326 -2273875 -4473619 -5578593
43276 -5578593 -5222645 -3080791 -384951 994157 512250 -1061677 -3062036 -5236643
43268 -5236643 -6996134 -7537736 -6898191 -6039050 -5452320 -4239436 -1271635 2866276 5920347
43259 5920347 6374025 5178347 4361931 4444357 4352537 3634799 3176284 3314028 2814407 727851
43249 727851 -1967365 -3832263 -5072604 -6577895 -7444580 -5399199 -71478 5546593
43241 5546593 7741863 5654304 1769565 -762331 -887326 70196 314090 -757640 -2743522
43232 -2743522 -5123394 -7066362 -7106993 -4650735 -1727046 -1389742 -3824795 -5726074 -4296047
43223 -4296047 -219668 4144936 7511165 9253489 8413074 5334961 2802230 3163697
43215C163697K184968J503941N62420P83556M10687j384923j990966O2295J524485
43206F820160p47727m135696l773667Q3733K673512J774083j79484q11813n54661
43197A148440k34529M03747P75974p56871l736146m773466j704951K970230M552814
43188a354758J513358k704364l355193L57079M062760L031560j978049n381819
43180e809426l745905K62056K321115K236810K613526L838707L950542K558069
43172H225494J378464J041703M41931o51182j137484r49026j307792k352897k810706
43163A878505k221615j386828o08967M45597J338379J378750J090081J057956
43155B971858K53136j953212l347149j699492J129072J733055P29783J233080
$$ plain form
43215 3163697 5348665 6852606 7415026 8198582 8609269 7224346 5233380 5295675 6820160
43206 6820160 6072433 1936737 -1836930 -1753197 920315 2694398 2514914 1703101 1148440
43197 1148440 913911 1317658 2093632 1336761 -2399385 -7172851 -8877802 -5907572 -1354758
43188 -1354758 158600 -2545764 -5900957 -5543878 -1481118 1550442 -427607 -5809426
43180 -5809426 -9555331 -9293275 -6972160 -4735350 -2121824 1716883 5667425 8225494
43172 8225494 9603958 10645661 11087592 10436410 9298926 8349900 7042108 4689211 1878505
43163 1878505 -343110 -1729938 -2338905 -1893308 -554929 823821 1913902 2971858
43155 2971858 3224994 1271782 -2075367 -3774859 -2645787 -912732 -182949 1050131
43147A050131K584385J139224k585841l643658p85521J269366j17104j304291
43139b393309N58061K184670K71488k254308j362184R71905N25522j669037j610500
43130d777692L79479P92815l10430J96702K191217K506250J169144J494861L522797
43121G165143L167397p74235m058304l376547p06437Q90073J587022K332799J869225
43112H096136o23661k796851k297509n47105k76939j002869k22152J856560K138272
43103D323882o25127l650807l696959j090295J182362J584935J586441K696790
43095B311222L440266J248408k824885l995726M1051N009184M936906j30319m611322
43086E424785n106044l828988l654163l632060j669212J225042K401774J748556
$$ plain form
43147 1050131 3634516 4773740 2187899 -1455759 -2241280 -971914 -1089018 -2393309
43139 -2393309 -1835248 349422 620910 -1633398 -2995582 -2023677 -1498155 -3167192 -4777692
43130 -4777692 -4398213 -3605398 -3915828 -3719126 -1527909 978341 2147485 3642346 7165143
43121 7165143 10332540 9558305 5500001 2123454 1417017 2307090 3894112 6226911 8096136
43112 8096136 7472475 4675624 2378115 1831010 1554071 551202 329050 2185610 4323882
43103 4323882 3698755 47948 -3649011 -4739306 -3556944 -1972009 -385568 2311222
43095 2311222 5751488 6999896 4175011 179285 220336 5229520 10166426 10036107 5424785
43086 5424785 318741 -3510247 -7164410 -10796470 -12465682 -11240640 -8838866 -7090310
43078g090310J485494K392841K835987J653274r2922q15368l39881N18838J137606
43069A685559J049946k69899k393937l241157r69477L115407N061486K782545
43061F820473j091833k498867j168821k46468j068532j430181J31807J559869
43053A007447P80459p51450p41725q3705r14980k274315j464195J055333K023184
43044a363947N97292m87646M87652J897228J932993R89601j74253j694700k783425
43035e99205j573995J601039L437601K019431l94873r01996j12422n54110k604144
43026C17326m237733l702005p71729L347565N897531M139121r73600m404495k744829
43017c132848J104027J767403j084965k449921O22423M662135M427299j13120
$$ plain form
43078 -7090310 -5604816 -3211975 -375988 1277286 1184364 368996 29115 547953 1685559
43069 1685559 2735505 2465606 71669 -3169488 -4138965 -1023558 4037928 6820473
43061 6820473 5728640 3229773 2060952 1814484 745952 -684229 -552422 1007447
43053 1007447 1787906 1036456 294731 211026 -703954 -2978269 -4442464 -3387131 -1363947
43044 -1363947 -766655 -1254301 -766649 1130579 3063572 4053173 3878920 2184220 -599205
43035 -599205 -2173200 -572161 2865440 4884871 4489998 3588002 3475580 2921470 317326
43026 317326 -3920407 -7622412 -8394141 -5046576 850955 4990076 4016476 -388019 -3132848
43017 -3132848 -2028821 -261418 -1346383 -3796304 -3173881 1488254 5915553 5802433
43009E802433l675795k179706K371071M358814J245181l538326m898902k072199
43001b587429J155270J551808k66240j771923j692317m71361P71810Q78721m03198
42992b834859j528441p21883J142418J227649j024224k704654j680614M58386
42984g666222J436739J838763L215053M648323M063318J681062n67048k113886
42976F536102l593017m400699l237361p96561O93468O62513O61125J490605J973822
42967a0003J000942q20466j951002j325887Q64565K889885K680708M14865j201975
42958B541632o23656J19803j264429l289108k866122k54117J636148K120047L014408
42949A134606M152057K924111p60956l165457k150684l10830m28761j132113p2306
$$ plain form
43009 5802433 2126638 -53068 2318003 6676817 7921998 4383672 -515230 -2587429
43001 -2587429 -1432159 119649 -146591 -1918514 -3610831 -4082192 -3310382 -2431661 -2834859
42992 -2834859 -4363300 -5085183 -3942765 -2715116 -3739340 -6443994 -8124608 -7666222
42984 -7666222 -6229483 -4390720 -1175667 3472656 7535974 9217036 8649988 6536102
42976 6536102 2943085 -1457614 -4694975 -5491536 -4798068 -4135555 -3474430 -1983825 -10003
42967 -10003 990939 170473 -1780529 -3106416 -2241851 648034 3328742 3743607 2541632
42958 2541632 1917976 2037779 773350 -2515758 -5381880 -5635997 -3999849 -1879802 1134606
42949 1134606 5286663 8210774 7449818 4284361 2133677 1822847 1394086 261973 189667
42940A89667J303908n5012l331448m432992j851329J384003K154914R30289j12460
42931c820460m70901j055648j728144j162369P87429K292953K077371J573471
42923a506298K857090M826204L816561j061700n511010n121124j287112P89640
42915b197749p31879k443074j227300J600024L025516K526462J604949J055515
42907C212464P54647R07861J589242J839075P97568r08194k145050k787855k988974
42898B70784j979114P01992L462311L963406J953297p01301k540996l491242l500130
42889a860993k096113K14230J705248J470317O01198M66585Q01347O63605N72377
42880B537801K032196M736912N797948K914904k369322n905346n411680k567966
$$ plain form
42940 189667 1493575 1438563 -1892885 -6325877 -8177206 -6793203 -4638289 -3708000 -3820460
42931 -3820460 -4291361 -5347009 -7075153 -8237522 -7450093 -5157140 -3079769 -1506298
42923 -1506298 1350792 6176996 9993557 8931857 3420847 -1700277 -2987389 -2197749
42915 -2197749 -2929628 -5372702 -6600002 -4999978 -1974462 552000 2156949 3212464
42907 3212464 3967111 4874972 6464214 8303289 9100857 8192663 6047613 3259758 270784
42898 270784 -1708330 -1006338 2455973 6419379 8372676 7671375 5130379 1639137 -1860993
42889 -1860993 -3957106 -3742876 -2037628 -567311 33887 500472 1301819 1965424 2537801
42880 2537801 4569997 9306909 15104857 18019761 15650439 9745093 4333413 1765447
42872A765447m22441k931k99140m86890p41122j200779j458759j236860p07611
42863d791086l1857P56333J368133J352290O38995l03500o89042K48635K372028
42854I20929L838551K444464j390747m270385l674320r42733R81862J331536J132723
42845C71880N91055n07389r34540M00703J842116J305643M61828K440525N531686
42836A1503507M277222j887797o337291m385832k6383M44462k330852k987631
42828a730595l99389J298034j6829j504475n69598J248719J266028m35839j796697
42819b640641j542335N6688J701253J660760n92633k898785k382549M62515J671485
42810d504242j022176m642945m349982N56246N770026O981040M294505J205565
$$ plain form
42872 1765447 1343006 1340075 1040935 554045 -187077 -1387856 -2846615 -4083475 -4791086
42863 -4791086 -4822943 -4066610 -2698477 -1346187 -707192 -1010692 -1699734 -1451099 920929
42854 920929 4759480 7203944 5813197 1542812 -2131508 -3074241 -2092379 -760843 371880
42845 371880 962935 455546 -478994 -78291 1763825 3069468 3531296 5971821 11503507
42836 11503507 15780729 13892932 7555641 3169809 3143426 3587888 1257036 -1730595
42828 -1730595 -2129984 -831950 -848779 -2353254 -2922852 -1674133 -408105 -843944 -2640641
42819 -2640641 -4182976 -4126288 -2425035 -764275 -1356908 -4255693 -6638242 -6175727 -4504242
42810 -4504242 -5526418 -10169363 -14519345 -13963099 -8193073 -1212033 3082472 4288037
42802D288037J74076L27273m71195k461359l903920l578297j936278J95807K421129
42793d944727L858395L269074J181800K28384J798040L669624K781158o22877
42785A1218871l505041l962074k683591r93875M99875J391923J466527J349033
42777D781648J690114J744919K75801k181377l546916k832399j134675J13888
42769a088997N56267N11271M60452R56568J832383J719496k10152k320248k145461
42760B71579O2183J409373L59300j295171j233306K91470J209383L32178j649615
42751b42626l065291k559127k64531J919905K041289L23661j186723j247338n18532
42742d799313L8833L54734L96375l17937j502953j755033n24402O46195J72548
$$ plain form
42802 4288037 4462113 4789386 4318191 1856832 -2047088 -5625385 -7561663 -7365856 -4944727
42793 -4944727 -1086332 2182742 3364542 3592926 5390966 9060590 11841748 11218871
42785 11218871 7713830 3751756 1068165 74290 574165 1966088 3432615 4781648
42777 4781648 6471762 8216681 8492482 6311105 2764189 -68210 -1202885 -1088997
42769 -1088997 -532730 -21459 438993 1395561 3227944 4947440 4737288 2417040 271579
42760 271579 333762 1743135 2102435 807264 -426042 -134572 1074811 1406989 -242626
42751 -242626 -3307917 -5867044 -6131575 -4211670 -2170381 -1846720 -3033443 -4280781 -4799313
42742 -4799313 -4760480 -4405746 -4009371 -4327308 -5830261 -7585294 -8109696 -7463501 -7290953
42733g290953j043544p07124J431192K893936J912476K19495Q29390L475408M460775
42724F181051J926013j015886p34869J091270j41482m305447n982147k700209
42716e681706J176962J493348M75724J627828K722583j14215m203816l360812
42708e864104J835294M188734R90787k161125p43615K133888J963948o9468n87881
42699A686458j17349r52532k220367j705930k26815P635n25668J462J176626J615628
42689a260852J915710K807635K423402o82327l726740l237035p66415l93442j765852
42680d685916q62315K689423M457886K088966j530573l278913l574312l485934
42672h181688k143436P25372K974399L090653K421375K325284J690291n17227
$$ plain form
42733 -7290953 -8334497 -9041621 -7610429 -4716493 -2804017 -2584522 -1755132 1720276 6181051
42724 6181051 8107064 7091178 6356309 7447579 7306097 3000650 -2981497 -5681706
42716 -5681706 -4504744 -3011396 -2535672 -907844 1814739 1700524 -2503292 -5864104
42708 -5864104 -4028810 159924 1150711 -1010414 -1754029 379859 2343807 2274339 1686458
42699 1686458 1569109 616577 -1603790 -3309720 -3536535 -3528900 -4054568 -4053106 -2876480 -1260852
42689 -1260852 654858 3462493 5885895 5203568 1476828 -1760207 -2526622 -2920064 -4685916
42680 -4685916 -5548231 -2858808 1599078 3688044 2157471 -1121442 -4695754 -8181688
42672 -8181688 -10325124 -9599752 -6625353 -3534700 -1113325 1211959 2902250 2385023
42664B385023k585522k394734o33676O31775J123617J837804K548526K080684
42656D993497M83183q31160p72745O50523K508110L087866J109479k186855l662824
42647E379074k281419p85605j656459l223022k325534N59406K055601J173376
42639a104582L96293J114623J386411l54926k263116j894446O1806J312324J650040
42630C04427K334676K778858J100869j989539l107487j017455J283704R50827
42622B638880p23574r52167K2062J660r42497p57897N47714P14296n09410l79487
42612c40420K256849M372770K762948j466700m449165m181503j913860n4437k9532
42603c043050j265271j561076K75270K100631J058015j414657r08312K586007
$$ plain form
42664 2385023 -200499 -2595233 -3228909 -2597134 -1473517 364287 2912813 4993497
42656 4993497 5476680 4645520 3872775 4523298 7031408 10119274 11228753 9041898 5379074
42647 5379074 3097655 2312050 655591 -2567431 -4892965 -4333559 -2277958 -1104582
42639 -1104582 -708289 406334 1792745 1437819 -825297 -2719743 -2657937 -1345613 304427
42630 304427 2639103 5417961 6518830 4529291 1421804 404349 1688053 2638880
42622 2638880 1915306 963139 985201 986861 44364 -713533 -165819 548477 39067 -340420
42612 -340420 1916429 6289199 9052147 7585447 3136282 -1045221 -2959081 -3013518 -3043050
42603 -3043050 -4308321 -5869397 -5594127 -3493496 -2435481 -3850138 -4758450 -2172443
42595b172443L380211j036225m726375j691777M482818N624855J033426k515918
42587B378572j733669k91277q03359p96848J092742J643001q12777k517286o32608
42578b473509J529282K29654k076655j133911J569201J579214m94369p7200L078079
42569A729786M003489O70438k595015j901955N41028N03545j762389k610570r36277
42560b357920M67738n29294k193203j468399J702873M238487L864945J610788
42552E336015l10318j573800l003855l798786k111238J524122L973172L472840
42544C508152J434639n38780k602876m214173k967457J408422M578553K680471
42536C286951j853398l298611m15862K642681K797861J427077P89889P33696K63549
$$ plain form
42595 -2172443 1207768 171543 -4554832 -6246609 -1763791 3861064 4894490 2378572
42587 2378572 644903 353626 -449733 -1246581 -153839 1489162 676385 -1840901 -2473509
42578 -2473509 -944227 -714573 -2791228 -3925139 -2355938 -776724 -1271093 -1348293 1729786
42569 1729786 5733275 6403713 3808698 1906743 2447771 2951316 1188927 -1421643 -2357920
42560 -2357920 -1890182 -2419476 -4612679 -6081078 -4378205 -139718 3725227 5336015
42552 5336015 5025697 3451897 448042 -3350744 -5461982 -3937860 35312 3508152
42544 3508152 4942791 4404011 1801135 -2413038 -5380495 -3972073 606480 3286951
42536 3286951 1433553 -1865058 -2280920 361761 3159622 4586699 5376588 6110284 6373833
42527F373833m54457j144431k288374l604208l497868j286260J524951L144761
42519a232053L268222K292488M91191j156854j082948P27573K144852J588800
42511G041271j9376j069328j542538k087411k159076q85655R77016J741904J188502
42502C185309P64494J373823K222059K139215J089924j40002j215019k536629
42494F883174m160161m910135l349052J12255K884884K825226O71141j116430
42486a59098j362483o31219P84327L125538N140668M274567L03844l121441k578580
42477E776123O59103K405446J107376q37643j320624j406177k717709l997399
42469c31504k580666J337184M211679L453646N35747j238813q14712K55889P35942
$$ plain form
42527 6373833 5919376 4774945 2486571 -1117637 -4615505 -5901765 -4376814 -1232053
42519 -1232053 2036169 4328657 4819848 3662994 2580046 3307619 5452471 7041271
42511 7041271 7021895 5952567 4410029 2322618 163542 -722113 254903 1996807 3185309
42502 3185309 3949803 5323626 7545685 9684900 10774824 10634822 9419803 6883174
42494 6883174 2723013 -2187122 -5536174 -5423919 -2539035 286191 957332 -159098
42486 -159098 -1521581 -2152800 -1368473 1757065 6897733 11172300 11476144 8354703 5776123
42477 5776123 6435226 8840672 9948048 9110405 7789781 6383604 3665895 -331504
42469 -331504 -2912170 -1574986 2636693 6090339 6626086 5387273 4572561 4828450 5564392
42460E564392R94994J311839R00493m53308j326485n38634R50623J388398O84124
42451I476436J00368J04633P5513k01215l34293n27116j389332k360775j836093
42442C108126N60631K915312K899263J65774l343689n001008l538480j98269K312738
42433a19602K620094J945782J847808J730707J84320k015802k498767q04427R56771
42424C846884J335402J285044J905983K399499J435606q14357l010237l951877
42416D431947k996249m27259K116671K979900K627626K822217L444060K447212
42408A7446125l10183j979948j093267l30688k396578n252505m720008p53456
42400F09492K268549J517495r38649j516049L30107K118995J756069j14296r71278
$$ plain form
42460 5564392 6559386 7871225 8771718 8318410 6991925 6453291 7403914 8792312 9476436
42451 9476436 9576804 9681437 9756950 9555735 9221442 8694326 7304994 4944219 3108126
42442 3108126 3668757 6584069 9483332 9649106 6305417 1304409 -2234071 -2432340 -119602
42433 -119602 2500492 4446274 6294082 8024789 8209109 6193307 3694540 2890113 3846884
42424 3846884 5182286 6467330 8373313 10772812 12208418 11394061 8383824 4431947
42416 4431947 1435698 1008439 3125110 6105010 8732636 11554853 14998913 17446125
42408 17446125 17135942 15155994 14062727 13732039 11335461 6082956 1362948 609492
42400 609492 2878041 4395536 3456887 1940838 2270945 4389940 6146009 6031713 5060435
42391E060435O22321L093483L574156J585207m06126p05108p52548k264129l882497
42382E925194l127924m86594J257880J210524R93505J304964R23980k65624k80900
42373G455005J520725K527783M20004l093822m303005k328925J88300R38128M92121
42364C816314N47610J137582Q12916q33082k121906j418960M14053R39190m98548
42355B795169j828937j352433k11763k90574r18629Q3616K553084L700654K141779
42346F671966j1496k15652J005060J137808o43069k399140j930441O45755L138994
42337G399785L764164K950364K320119K125501Q66087j979256m228389l503685
42329I714690n65916J667139J851094R79632r1869j412595k231632j290576N32332
$$ plain form
42391 5060435 5682756 8776239 12350395 13935602 13529476 12824368 12071820 9807691 5925194
42382 5925194 2797270 2310676 3568556 4779080 5772585 7077549 8001529 7735905 7455005
42373 7455005 8975730 11503513 11923517 8829695 4526690 2197765 2386065 3324193 3816314
42364 3816314 4363924 5501506 6314422 5481340 3359434 1940474 2354527 3293717 2795169
42355 2795169 966232 -386201 -597964 -888538 -1807167 -1723551 829533 4530187 6671966
42346 6671966 6660470 6444818 7449878 8587686 7944617 5545477 3615036 4260791 7399785
42337 7399785 11163949 14114313 16434432 18559933 19426020 17446764 13218375 9714690
42329 9714690 9148774 10815913 12667007 13646639 13554770 12142175 9910543 8619967 9152299
42320I152299N90342j400950k316577l91726J605929M69303k299209k610119Q3776
42311B883068K128816J035014j500274k582207j731519m13370L49190O44092Q85270
42302A698080J312011J823870J899089J122348j20498j060031j547039j815678
42294C312152j430371K57526K369396K611675m679l448568m651118k767588K73724
42285c477851K065436J817960N32757k6690J321374L935122N399736L810879K90021
42276A5668744j887772j309291k84536j377101l312003k743784L04313J929334
42268F987904K19658j592540j63257K546521K414508j24235r05414J019043K058057
42259A2460245L83953j220856o48111l3274j119225j229069K021106N327751M073018
$$ plain form
42320 9152299 9742641 8341691 6025114 5633388 7239317 7708620 5409411 2799292 2883068
42311 2883068 5011884 6046898 4546624 1964417 232898 -180472 168718 812810 1698080
42302 1698080 3010091 4833961 6733050 7855398 7734900 6674869 5127830 3312152
42294 3312152 1881781 2139307 4508703 7120378 7115699 3667131 -983987 -3751575 -3477851
42285 -3477851 -1412415 405545 938302 911612 2232986 6168108 11567844 15378723 15668744
42276 15668744 13780972 12471681 12187145 10810044 7498041 4754257 5058570 6987904
42268 6987904 7207562 5615022 5451765 7998286 10412794 10288559 9383145 10402188 12460245
42259 12460245 12844198 11623342 10975231 10941957 9822732 8593663 10614769 15942520 20015538
42250B0015538o4146j388597R62570K288459N86813n01694J293336K576774K17251
42241B5986304l019061k928708o33284k58443k008764k423297o27231M40341o77069
42232A3850788j696420q15309M01628J60009m26308M03611J760064J564138J7507
42223A5219708q36673l89109m2067o58218j463250j705132j570357r57928Q85575
42214H482549L541365M727310K890207l55827j864049o73293J184000J400423
42206A9332685l12009k620608m029159l704863j931170j07197N38115M32082R76886
42197H574762K333870L110921K522184J464359R07934O72801N67632J190859K484004
42188B3829326L003489K049939J083950J363509J687293O89067n744K099851N702780
$$ plain form
42250 20015538 19951392 18562795 19525365 21813824 22400637 21898943 23192279 25769053 25986304
42241 25986304 22967243 20038535 19405251 19146808 17138044 14714747 14087516 14527857 13850788
42232 13850788 12154368 11339059 11740687 11900696 11474388 11877999 13638063 15202201 15219708
42223 15219708 14383035 13993926 13951859 13293641 11830391 10125259 8554902 7596974 8482549
42214 8482549 12023914 16751224 19641431 19285604 17421555 16748262 17932262 19332685
42206 19332685 19020676 16400068 12370909 8666046 6734876 6627679 7165794 7597876 8574762
42197 8574762 10908632 14019553 16541737 18006096 18914030 19586831 20154463 21345322 23829326
42188 23829326 26832815 28882754 29966704 31330213 33017506 33706573 33700829 35800680 41503460
42179D1503460O459311K839595j691233l249789j726769P48887L042350M918632
42171E2844444N641030M865004L964077M586148O336746P335950O815384N970537
42163I8359320O201513P306917P795469P028694O827023R946864J6288345K1936941
42155A81691086K3566844K2499576K1953737K1473459J7743101J0613727L918010
42148C03459540n14769m928447r850560j1285248p264895k771028l148125n834986
42140B57861482m383989J294025M916897L413943K15720j831980m837707j0759458
42132B45888933j6708648j8654828j6798477j4370456j3241680j3106995j3231891
42125A39775958j2842088j1069186q153835n631809m350036l667535l264555l855255
$$ plain form
42179 41503460 47962771 50802366 49111133 45861344 44134575 44883462 47925812 52844444
42171 52844444 58485474 63350478 67314555 71900703 78237449 85573399 92388783 98359320
42163 98359320 104560833 111867750 119663219 126691913 133518936 143465800 159754145 181691086
42155 181691086 205257930 227757506 249711243 271184702 288927803 299541530 303459540
42148 303459540 302944771 298016324 288165764 276880516 269615621 266844593 263696468 257861482
42140 257861482 253477493 254771518 259688415 263102358 263318078 261486098 256648391 245888933
42132 245888933 229180285 210525457 193726980 179356524 166114844 153007849 139775958
42125 139775958 126933870 115864684 107710849 102079040 97729004 94061469 90796914 86941659
42117H6941659n265885n852976m899201l692252l304442l296106l353426l799998
42109E3477373l669918j221569K319956K780183j149450n166918m998182k034675
42101D0336800m35848j102447j893167j924149k143299k800009l324784l664866
42093B3048231l335558q34100L406257N651993L654545N38075J54970R43607q75346
42084C2352674m033376l943594p30526P16967j058746k043551j06770J591041
42076B2744119O50028o16954l3330O08301k74410n75448J233734K424966N04161
42067B6665167k142263k130679m49330K67699R03800L573349O417995N688621
42059C8794359J794348j227512j391267J54930K641610N916689P939152O570891
$$ plain form
42117 86941659 81675774 75822798 70923597 67231345 63926903 60630797 57277371 53477373
42109 53477373 49807455 48585886 50905842 53686025 52536575 47369657 42371475 40336800
42101 40336800 39900952 38798505 36905338 34981189 32837890 30037881 26713097 23048231
42093 23048231 19712673 18878573 22284830 27936823 31591368 32129443 32284413 33228020 32352674
42084 32352674 28319298 24375704 23645178 24362145 23303399 21259848 21153078 22744119
42076 22744119 23394147 22777193 22743863 23352164 23077754 22502306 23736040 26161006 26665167
42067 26665167 24522904 22392225 21942895 22210594 23114394 26687743 33105738 38794359
42059 38794359 40588707 39361195 37969928 38124858 40766468 46683157 54622309 61193200
42051F1193200L676874L177958N129286O077263N317960N993753R174448J1615262
42043A11356004J1006556R225986Q469767Q030926P028489O657205P337760P096903
42035A76209596N431218N441712R039446J3121041J4105556J3537064J4890943
42028B51776576J6759845J4094508N710213l929199j0830384j5467691j9646367
42021B38467501k2794227k3259868k1160634j8161443j5598104j3940570j3130594
42014A10422061j2598479j1672743j0419355r380387q440476o937717m908704
42007D6064200l122079j911782j165153j259785k446420l430885k566871p02204
41999B9459021n74067k652651m045781k917780j487226k311042l695374k120826
$$ plain form
42051 61193200 64870074 68048032 73177318 79254581 84572541 90566294 99740742 111356004
42043 111356004 122362560 131588546 140058313 148089239 155117728 161774933 169112693 176209596
42035 176209596 181640814 187082526 196121972 209243013 223348569 236885633 251776576
42028 251776576 268536421 282630929 288341142 284411943 273581559 258113868 238467501
42021 238467501 215673274 192413406 171252772 153091329 137493225 123552655 110422061
42014 110422061 97823582 86150839 75731484 66351097 57910621 50972904 46064200
42007 46064200 42942121 41030339 39865186 38605401 36158981 32728096 30161225 29459021
41999 29459021 28884954 26232303 22186522 19268742 17781516 15470474 11775100 9654274
41991I654274J778660L418225P87890k669595l083689j205710k97698j088585
41983G293772j588001q87180k78309n58589o87739J21848Q63538M28523m23905
41974D283958p4431J627745L186481L362422K310837P76740j027949l167484m803855
41965F474464m134900m41331L945452N213352K519257m81431k19098J811192J213141
41956A5900098k638565n427907m190947j384927o64096j518700j070478R17943
41948g7579K297964K518734K737514K565784M49845k594687l313261j079679R06259
41939D410894M41052q33424r01903n51570r29597p21643J440880L781244L555314
41930I691247J158773o68446q16961m30156l09206k62077n41807j396357j493227
$$ plain form
41991 9654274 11432934 14851159 15639049 12969454 9885765 8680055 8382357 7293772
41983 7293772 5705771 4818591 4540282 3981693 3293954 3415802 4279340 4707863 4283958
41974 4283958 4209527 5837272 9023753 12386175 14697012 15473752 14445803 11278319 6474464
41965 6474464 2339564 1898233 5843685 11057037 13576294 13094863 12875765 14686957 15900098
41956 15900098 13261533 7833626 3642679 2257752 1593656 74956 -995522 -77579
41948 -77579 2220385 4739119 7476633 10042417 10492262 7897575 4584314 3504635 4410894
41939 4410894 4851946 4018522 3116619 2565049 1635452 913809 2354689 6135933 9691247
41930 9691247 10850020 10181574 9364613 8934457 8625251 8363174 7821367 6425010 4931783
41921D931783N81896L270125L245390K01694k241510j545565K19941l75777l087743
41912E200234m451121k592723N12205J830829Q05330o67432r44866k83740J59855
41903d31429K3122j83745j84454k47501m94245p38856j014038j364741j168042
41894e803929J51959J644079J559683n5517j153457o78415J22573L13270R70051
41885b929703K680060L592075K301614P46305J331642K684629J637465j485707
41877A0558380l199978k196886p22477m18598m06259j85921q64368k302791k401170
41868b140068p43866K13214o84354j151160L34636J407026j92632k275674j385239
41859f618117J737694L617150L473035L164785K609256k17687m335781n243443
$$ plain form
41921 4931783 5513679 8783804 12029194 12230888 9989378 8443813 8663754 8287977 5200234
41912 5200234 749113 -1843610 -1331405 499424 1304754 637322 -307544 -591284 -431429
41903 -431429 -408307 -592052 -776506 -1024007 -1518252 -2257108 -3271146 -4635887 -5803929
41894 -5803929 -5651970 -4007891 -2448208 -2503725 -3657182 -4335597 -4213024 -3899754 -2929703
41885 -2929703 -249643 3342432 5644046 6390351 7721993 10406622 12044087 10558380
41877 10558380 7358402 5161516 4439039 4020441 3614182 3428261 2563893 261102 -2140068
41868 -2140068 -2883934 -2670720 -3355074 -4506234 -4171598 -2764572 -2957204 -5232878 -6618117
41859 -6618117 -4880423 -1263273 2209762 5374547 7983803 7766116 3430335 -1813108
41851a813108j212916L243886K887504j295231l567025j108554K651456L053206
41843B839218L74967j038936Q36831K828995J391077j798798k052154J174208
41835D555408L087984N87810l093346l236856l33124J385715K84220j437141j899414
41826i8744j369437k64078J286072J899157K78585j723841p87579K658418M482203
41817F360756L001254J260209J586509J855307j18094j990206m73106K824112
41809A4306741L228932m24738m726710o611407n931086l400272M26191L544356
41801D12007L160987n66608l713371l025349L46196K744203K333330L54246r73413
41792A072228o64126M83403R09240R0381p53430l76783M75858L8345j698489k828173
$$ plain form
41851 -1813108 -3026024 217862 3105366 1810135 -1756890 -2865444 -213988 2839218
41843 2839218 3214185 2175249 3012080 5841075 7232152 5433354 3381200 4555408
41835 4555408 7643392 8231202 5137856 1901000 1567876 2953591 3237811 1800670 -98744
41826 -98744 -1468181 -1732259 -446187 1452970 1731555 7714 -779865 1878553 6360756
41817 6360756 9362010 10622219 12208728 14064035 13945941 11955735 11482629 14306741
41809 14306741 17535673 17110935 12384225 5772818 -158268 -3558540 -3132349 412007
41801 412007 3572994 3006386 -706985 -3732334 -3386138 -641935 1691395 2045641 1072228
41792 1072228 408102 891505 1800745 1891126 1137696 760913 1236771 1275116 -423373 -3251546
41782c251546k326273j251372o64485j41880Q29586J677017J975817K255636K481748
41773A584248J440072j011034k858675k812378k427787l148793l108183m5368
41765a2387898L840924L913586n1799k988994j503887J919680L397434K951025
41757i09929K697525K452878O26037j952439k649368j146714J22183r8218j94549
41748a052594J329091L362882L841687K431363M98751o13890m19112Q16922K136193
41739A2331293K260771O06213k061291m162457m529141l283247j591998k72536
41731g02393J163601L200050M308802K213343k163400m403591k076090J632409
41723C172731K330215M55735n94770p12711k643704n613073m834663J016593O616315
$$ plain form
41782 -3251546 -5577819 -6829191 -7493676 -7635556 -6805970 -5128953 -3153136 -897500 1584248
41773 1584248 3024320 2013286 -845389 -3657767 -6085554 -9234347 -12342530 -12387898
41765 -12387898 -8546974 -4633388 -4685187 -7674181 -9178068 -7258388 -3860954 -909929
41757 -909929 1787596 4240474 4866511 2914072 264704 -882010 -759827 -858045 -1052594
41748 -1052594 276497 3639379 7481066 9912429 10411180 9797290 9378178 10195100 12331293
41739 12331293 14592064 15198277 13136986 8974529 4445388 1162141 -429857 -702393
41731 -702393 461208 3661258 7970060 10183403 8020003 3616412 1540322 3172731
41723 3172731 5502946 5958681 5363911 4651200 2007496 -3605577 -8440240 -7423647 -807332
41714h07332O898648L248091r3694k052174l489860l265199j95662L025005K602763
41705E870586n79697k197816r08311N89146O42059N74682J181923J306541P60960
41696G240073J025523J980747J408319r72954k333527j157167M06314N01477O76632
41687H775437K498687L853634J862223k250653m397703k913249J4065J642225
41679I084666J179986n63993j999026j505499Q30027K483776J198029j763468
41671H944498k773174l58732K999736M042793K485742Q37929J090899K489275
41663A9758966K881262J785087J028210J888961K944797K261536O08969R5302
41655C3253090J94240j650526n099681o222932l289797J19463K54913j449015
$$ plain form
41714 -807332 6091316 9339407 9245713 7193539 3703679 438480 242818 3267823 5870586
41705 5870586 5290889 3093073 2184762 2773908 3415967 3990649 5172572 6479113 7240073
41696 7240073 8265596 10246343 11654662 10681708 8348181 7191014 7597328 8098805 8775437
41687 8775437 11274124 15127758 16989981 14739328 10341625 7428376 7442441 9084666
41679 9084666 10264652 9700659 7701633 6196134 7026161 9509937 10707966 8944498
41671 8944498 6171324 5812592 8812328 12855121 15340863 16178792 17269691 19758966
41663 19758966 22640228 24425315 25453525 27342486 30287283 32548819 33157788 33253090
41655 33253090 33447330 31796804 26697123 20474191 17184394 17303857 17558770 16109755
41647A6109755j299797O70374J364869r0424j504252j597346j459231k020363
41639A0173585k839687l373041l065913p30535L426491N863705L230661k344915
41631A0340351n145833l283682l98985O52374J435176L524621M727220K789370
41623A4640612k38153q41722P64711J585141N80723o50571j047207j075316j022210
41614A2696008p77578r90570k251486l437414k921046j078092M12344J288155
41606B940321K437974L259452K017803p79502k032630j98309K305776K284424
41598A2235309j81026k396226k693919j777227r16623l62717K17023P28036O74207
41589E526837p0869r63459j419667j516812j665115j680574r17939M50393J196422
$$ plain form
41647 16109755 14809958 15480332 16845201 16754777 15250525 13653179 12193948 10173585
41639 10173585 7333898 3960857 894944 164409 3590900 9454605 12685266 10340351
41631 10340351 5194518 1910836 1511851 2164225 3599401 7124022 11851242 14640612
41623 14640612 14402459 13560737 14325448 15910589 16491312 15840741 14793534 13718218 12696008
41614 12696008 11918430 10927860 8676374 5238960 2317914 1239822 1652166 2940321
41606 2940321 5378295 8637747 10655550 9876048 7843418 7645109 9950885 12235309
41598 12235309 12054283 9658057 6964138 5186911 4270288 3907571 4124594 4852630 5526837
41589 5526837 5455968 4492509 3072842 1556030 -109085 -1789659 -2707598 -2257205 -1060783
41580a060783O61926k93516p70976j170555j803464j350657J262857M184815M402255
41571D061902K169133Q57581J688659J604195j827064n977946o388867k834714
41563f647121Q48190K196204K224245K140072J262015o01048j348544P92211M267567
41554E133791N714227L831756L84973k103027k476376j285825j79910o11206k162613
41545F245790k616781p17486J757937K091683L51962p55031J77023J376843O92214
41536H604154j361357k600511k173758j149686n69207k29171M79354J407723J775277
41527D182818J265186O83612J108815K168957J913537o03904l252264l123900
41519D342857q35077j26193k266372l479159k36257M765210N197351o75528p392705
$$ plain form
41580 -1060783 -398857 -692373 -1463349 -2633904 -4437368 -5788025 -4525168 -340353 4061902
41571 4061902 6231035 7088616 8777275 10381470 8554406 2576460 -3812407 -6647121
41563 -6647121 -5798931 -3602727 -1378482 761590 2023605 1422557 74013 866224 5133791
41554 5133791 10848018 14679774 15064747 12961720 10485344 9199519 9019609 8408403 6245790
41545 6245790 3629009 2911523 4669460 6761143 7113105 6358074 6535097 7911940 8604154
41536 8604154 7242797 4642286 2468528 1318842 749635 520464 999818 2407541 4182818
41527 4182818 5448004 6131616 7240431 9409388 11322925 10719021 7466757 4342857
41519 4342857 3507780 3381587 1115215 -2363944 -2600201 2165009 7362360 6686832 -705873
41510g05873q605805l762525K420331N309802L941856N50896j973369k347275
41502e171962j352206l23780L11166O12835K96213l87253J03847K500769M543510
41493A133139L441119K91987r68582N83609J503321k57831j829207j67725K741618
41484F471448K883963L43084j354158q27654Q1720L77707J168040K438317K117776
41475A3700243m53183k955904l411278k822129l078928m055290m192571k641951
41467i910991J48253K687510K778699n32361m592305m935902p70291L425771L462157
41458h239460N97074r72217L7178J368974J305336M11371m26979r70209n49282
41449g438214J469120L753307L856284J636496k80221k16577M98326K27599m01224
$$ plain form
41510 -705873 -9311678 -13074203 -10653872 -5344070 -1402214 -851318 -2824687 -5171962
41502 -5171962 -6524168 -6847948 -6536782 -5923947 -5627734 -6014987 -5911140 -3410371 1133139
41493 1133139 4574258 4866245 3897663 4481272 5984593 5726762 3897555 3729830 6471448
41484 6471448 9355411 9698495 8344337 7516683 7598403 7976110 9144150 11582467 13700243
41475 13700243 13247060 10291156 6879878 4057749 978821 -3076469 -7269040 -9910991
41467 -9910991 -9762738 -7075228 -4296529 -4828890 -9421195 -14357097 -15127388 -11701617 -8239460
41458 -8239460 -7642386 -8614603 -8577425 -7208451 -5903115 -5491744 -5918723 -6888932 -7438214
41449 -7438214 -5969094 -2215787 1640497 3276993 2996772 2780195 3278521 3506120 3104896
41440C104896k64196j44767j075127j631188K47724L117114K812282j681583n741213
41431a256058m528364O09809L704403J798795j611585j714180J253559K937946
41423A194325J105302j816863k769193j989813j345288p56681J163379L789137
41415a425695M597306K793535L93244r15850j613585k045222q71016K171130M107845
41406G191692K208671j591771k878339r18504N97781p28985k837750k946324j539744
41397c443273o88701o39024l31480L25386R67803K184567M020812M293066J227270
41388G916426k901268l840900j097276J390884Q41101j033016j406333l51378
41380d81760L77292N05149R93704J864511K247252J874570R85505n32291k483926
$$ plain form
41440 3104896 2840700 2695933 1620806 -10382 237342 3354456 6166738 4485155 -1256058
41431 -1256058 -5784422 -5174613 -1470210 328585 -1283000 -2997180 -1743621 1194325
41423 1194325 2299627 482764 -2286429 -4276242 -5621530 -6378211 -5214832 -1425695
41415 -1425695 3171611 5965146 6358390 5442540 3828955 1783733 912717 3083847 7191692
41406 7191692 9400363 7808592 4930253 4011749 4609530 3880545 1042795 -1903529 -3443273
41397 -3443273 -4131974 -4770998 -5102478 -4777092 -3809289 -1624722 2396090 6689156 7916426
41388 7916426 5015158 1174258 76982 1467866 2308967 1275951 -130382 -481760
41380 -481760 -104468 400681 1394385 3258896 5506148 7380718 8366223 7833932 5350006
41371E350006l614365k983042j439051l31700N04136J901339L205182K854051
41363E446556Q40782j178709k130316k212341j502400J92775J898596J857723
41355C212666R141j585924j576836j042410j401739k032718j383600L76431J293688
41346d131301J44401j893602k338746q3712K979592L484399M69829k817567k453810
41337f640517J065259L288012J757133r26062j360193l29115r69032l334883l973382
41328a1422780r57181L379093N551705M729015K400644j1998j807360k439733
41320e78595j836874p84333P9138J096856K403479K658730N63886k594678l707406
41311b699797j620449J313267K244701J150627J08076L17110J251778K102242
$$ plain form
41371 5350006 1735641 -1247401 -2686452 -3018152 -2514016 -612677 2592505 5446556
41363 5446556 6287338 5108629 2978313 765972 -736428 -543653 1354943 3212666
41355 3212666 3221807 1635883 59047 -983363 -2385102 -4417820 -5801420 -5424989 -4131301
41346 -4131301 -3986900 -5880502 -8219248 -8302960 -5323368 -1838969 -1369140 -4186707 -6640517
41337 -6640517 -5575258 -2287246 -530113 -1456175 -2816368 -3145483 -4114515 -7449398 -11422780
41328 -11422780 -12379961 -9000868 -3449163 1279852 3680496 3668498 1861138 -578595
41320 -578595 -2415469 -3199802 -3120664 -2023808 379671 3038401 3602287 1007609 -2699797
41311 -2699797 -4320246 -3006979 -762278 388349 496425 813535 2065313 4167555
41303D167555K451923J741326l05693k510873k955838j338700N46081J057482
41295B853263K72240r47893j957472j940786k82307J840973K089428L42070n67245
41286A702271Q98169K228732Q09608j505030j193214J016738J234246j041447
41278D150073k074188l07568J032389l05055j544935K33455K594827J247232k981311
41269B044919m994097k618478R05411J904623N56515o60979l92714Q30486J700572
41260g23742J127970q75326k879983l399053k529300j320623J12584K411674M979747
41251c096052N796935L784870K97300k292689k870332k174216j559722j298212
41243c412118j38040K804427N679392N027141L46811m054047l741799L03509L027431
$$ plain form
41303 4167555 6619478 8360804 8055111 5544238 2588400 1249700 1795781 2853263
41295 2853263 3125503 2177610 220138 -1720648 -2002955 -161982 1927446 2269516 1702271
41286 1702271 2600440 4829172 5638780 4133750 2940536 3957274 5191520 4150073
41278 4150073 2075885 1768317 2800706 2495651 950716 1184171 3778998 5026230 2044919
41269 2044919 -2949178 -5567656 -4662245 -2757622 -2201107 -2862086 -3254800 -2424314 -723742
41260 -723742 404228 -471098 -3351081 -6750134 -9279434 -10600057 -10487473 -8075799 -3096052
41251 -3096052 2700883 6485753 6783053 4490364 1620032 -554184 -2113906 -3412118
41243 -3412118 -3550158 -745731 4933661 9960802 10307613 6253566 2511767 2815276 5842707
41234E842707J585334k058679m562154m664111k840528L3796K561534L080568
41226a021533J343606q55938j435490L5738K079895K413792r032l092844k972115
41217c513921J001747M179562K284440k170973l014455O05129L124612J153007
41209C649148j940355k166774q27341q26933j150658M84098K359377J130697k154667
41200a443408l257712j216112R01621J385301J513423J574073j12099l009930
41192c664843l501147l08615K679989J620671j824188l005554n64451K504164
41184f063974L185880J531586l83046r26955j82077M68612J6487q39247o41093
41175c833827O68552J705926J730584J213691K40501j602549l242334k412035
$$ plain form
41234 5842707 7428041 5369362 807208 -3856903 -6697431 -6663635 -4102101 -1021533
41226 -1021533 322073 -533865 -1969355 -1933617 146278 2560070 2551038 -541806 -3513921
41217 -3513921 -2512174 1667388 3951828 1780855 -1233600 -628471 2496141 3649148
41209 3649148 1708793 -457981 -1285322 -2112255 -3262913 -2778815 -419438 711259 -1443408
41200 -1443408 -4701120 -5917232 -5015611 -3630310 -2116887 -542814 -654913 -3664843
41192 -3664843 -7165990 -7474605 -4794616 -3173945 -4998133 -8003687 -8568138 -6063974
41184 -6063974 -2878094 -1346508 -1729554 -2656509 -2838586 -2369974 -2353487 -3192734 -3833827
41175 -3833827 -3165275 -1459349 271235 1484926 1725427 122878 -3119456 -5531491
41167e531491Q98565L579036L554208K514221K466968J989540r96440m464085
41159D010522m181513L6831L634594L330624P00509j064358j101787l64446L28791
41150E329767K26758j276875k977556k232070J304830M163174L280454J30959
41142G949441j648771j366473j233276k052479k138945p36226M48610J47873l80795
41133a011041L90235J656955J574857L9895j392665j740226j364534q20749j49414
41124b816687O14126J050500P50684j74736j089070j435354j514243k228603l423003
41115a0266386l142904l0617L838572M693869K164695K04492J483608L278582
41107B223911J564485k510005l781648l70621L770431M514426K630338J287014
$$ plain form
41167 -5531491 -4632926 -1053890 2500318 5014539 7481507 9471047 8474607 4010522
41159 4010522 -170991 -134160 3500434 6831058 7531567 6467209 5365422 5000976 5329767
41150 5329767 5556525 4279650 1302094 -929976 374854 4538028 7818482 7949441
41142 7949441 6300670 4934197 3700921 1648442 -490503 -1226729 -778119 -630246 -1011041
41133 -1011041 -620806 1036149 2611006 2650901 1258236 -481990 -1846524 -2667273 -2816687
41124 -2816687 -2202561 -1152061 -401377 -576113 -1665183 -3100537 -4614780 -6843383 -10266386
41115 -10266386 -13409290 -13439907 -9601335 -4907466 -2742771 -2538279 -1054671 2223911
41107 2223911 3788396 1278391 -2503257 -2873878 896553 5410979 8041317 9328331
41099I328331Q82276p64869l930580n632467l550762N17687K595600J272573r86650
41090b68861j471766o15258m93859j104431n03888J395015K027255L64177q70559
41081a542175N74845K454299J442250j173552j232255J605019L247078J560426
41073F935935q95016j608421j514817j858705j468438L53962J471434K94306j158992
41064E51248n02691J077554J111088r8779q06097j183557k038288k032861K01344
41055c721039K715224K748089J251998J016163J540255J93244k341889k649711
41047G52334n23452O20118k03902j00094J879844K519406K14343j715234n02530
41038B940833J291791J37553k491185k597596o6473J516376N15591r42298p70533
$$ plain form
41099 9328331 10210607 9445738 5515158 -117309 -3668071 -3150384 -554784 717789 -268861
41090 -268861 -1740627 -2355885 -2849744 -3954175 -4458063 -3063048 -1035793 -671616 -1542175
41081 -1542175 -967330 1486969 2929219 1755667 523412 2128431 5375509 6935935
41073 6935935 6040919 4432498 2917681 1058976 -409462 -55500 1415934 1710240 551248
41064 551248 48557 1126111 2237199 2138420 1332323 148766 -1889522 -3922383 -3721039
41055 -3721039 -1005815 1742274 2994272 4010435 5550690 5743934 3402045 752334
41047 752334 228882 849000 645098 545004 2424848 4944254 5158597 3443363 2940833
41038 2940833 4232624 4370177 1878992 -718604 -785077 731299 1246890 304592 -465941
41029d65941L95484R37164P38861R75004K058335K495604M70700l029497m069862
41020E05852o55147L489065L194583p66681k770240r68614L20348j547822k872822
41011b071478k07207L276437K745528p25561k766154k906872l488668l618898
41003i762873n30875L939773M515804M51546l206619l147028j471660p28840k32021
40994a0172793Q78531J292002M27521O6628J042952J487814K23908j069620p73790
40985f596847L69373J203572J540204O96628j923210m075880k910103r90475m316936
40976a7003674j1757770j3038965k458716J0991761J4319934P529846J775268
40969i642316K553168L993753Q34730k898808j376850L392737N056660K339945
$$ plain form
41029 -465941 -70457 866707 1605568 2580572 4638907 7134511 7605211 4575714 505852
41020 505852 -149295 3339770 6534353 5767672 2997432 2028818 2349166 801344 -2071478
41011 -2071478 -2278685 997752 3743280 3017719 251565 -2655307 -6143975 -9762873
41003 -9762873 -10293748 -6353975 -1838171 -1386625 -4593244 -7740272 -9211932 -9940772 -10172793
40994 -10172793 -9294262 -8002260 -7574739 -7508111 -6465159 -4977345 -4753437 -5823057 -6596847
40985 -6596847 -6227474 -5023902 -3483698 -2787070 -4710280 -8786160 -11696263 -12686738 -17003674
40976 -17003674 -28761444 -41800409 -44259125 -33267364 -18947430 -11417584 -9642316
40969 -9642316 -7089148 -3095395 -2260665 -5159473 -6536323 -3143586 1913074 4253019
40961D253019n17873r81282r00420k139212l536657l254635j559050O2687J077852
40952g495571J982678K903878L152406K159956L33548j241315j784463j311254
40944a300137k98045P10129J163914Q03034J07218j76847j83809p63047j858837
40935a796427k237999j458524o91615n43091L12521K610300M148528K455276j100630
40926A698339k656508j042975J135328J669292J106666L97687q97615k831088
40918a420874l951921l394331k079405p16419J152402K932359K523949n1338j325611
40909f331189P16104K894445J269984k681183m184861k142668K60267J319317
40901h879784K545903M219903L912524J083287r86323k07800R24119k34483j846635
$$ plain form
40961 4253019 3735146 2753864 1853444 -285768 -3822425 -7077060 -8636110 -8573423 -7495571
40952 -7495571 -5512893 -2609015 543391 2703347 3036895 1795580 11117 -1300137
40944 -1300137 -1598182 -888053 275861 1078895 1186113 1009266 825457 62410 -1796427
40935 -1796427 -4034426 -5492950 -6184565 -6727656 -6415135 -3804835 343693 2798969 1698339
40926 1698339 -958169 -2001144 -865816 803476 1910142 2307829 1410214 -1420874
40918 -1420874 -5372795 -8767126 -10846531 -11562950 -10410548 -7478189 -4954240 -5005578 -6331189
40909 -6331189 -5615085 -2720640 -1450656 -4131839 -8316700 -10459368 -10199101 -8879784
40901 -8879784 -6333881 -2113978 1798546 2881833 1895510 1687710 2611829 2377346 530711
40892E30711q85104J488518J869141K40962o30761n04460j749858m060103l795684
40883g496638p320L029073J695180j727759k544830r9096K268049K251693O43544
40874a988104q96216j481482o67528J259480K627117J858265l22572j695635j432358
40865b739033o08746j7820P17043J657002J885046R01371m68107r67743J0J958968
40855B317991L143699J469019k694792n462827l420760J607397M336423K688848
40847C984998j40505q78637k48712l06190o89311o5684P48885n2116k117932l433262
40837c198466l253115k434999j467315j52659J205923K052195K557758K908794
40829a781884K427725R50392o5397K54479J89430j810492l481244j237893L944656
$$ plain form
40892 530711 -354393 1134125 3003266 3244228 2613467 2109007 359149 -3700954 -7496638
40883 -7496638 -7503958 -4474885 -2779705 -4507464 -7052294 -7151390 -4883341 -2631648 -1988104
40874 -1988104 -2884320 -4365802 -5033330 -3773850 -1146733 711532 388960 -1306675 -2739033
40865 -2739033 -3347779 -3365599 -2648556 -991554 893492 1794863 1326756 359013 359023 2317991
40855 2317991 5461690 6930709 4235917 -1226910 -4647670 -3040273 1296150 3984998
40847 3984998 3844493 2965856 2717144 2410954 1721643 1655959 2404844 2352728 234796 -3198466
40837 -3198466 -6451581 -8886580 -10353895 -10506554 -9300631 -7248436 -4690678 -1781884
40829 -1781884 645841 1596233 1530836 1785315 1974745 164253 -3316991 -4554884 -610228
40820f10228O718019M162554p07183l401995l140035k011372j360196j008430
40812a358866n43371L89527K048409L628292L455053J184212j411493k785807
40804D605956l330242l734610l305873j389025R39283K168473K171909J351821
40796e22308n40017k951276l432401m48955L615862M868052K935844J063388J224254
40787E812443J806187P90400j192191k251389j936282j142911n12571k09230m19442
40778G45014q79224n75418R07754K222661J655626m72376j952585j386354K54979
40769E20077J159485R04745M29835L29214J93367l52699r16967j061575j035048
40760A70434j220965j458380j554249j798908k056214j071043J835984M728210
$$ plain form
40820 -610228 6107791 10270345 9563162 6161167 3021132 1009760 -350436 -1358866
40812 -1358866 -1902237 -1512710 535699 4163991 7619044 8803256 7391763 4605956
40804 4605956 1275714 -2458896 -5764769 -7153794 -6214511 -4046038 -1874129 -522308
40796 -522308 -1062325 -4013601 -7446002 -7894957 -4279095 588957 3524801 4588189 5812443
40787 5812443 7618630 8409030 7216839 4965450 3029168 1886257 1373686 1164456 745014
40778 745014 -134210 -709628 198126 2420787 4076413 3604037 1651452 265098 520077
40769 520077 1679562 2584307 3014142 3343356 3536723 3184024 2267057 1205482 170434
40760 170434 -1050531 -2508911 -4063160 -5862068 -7918282 -8989325 -7153341 -2425131
40752b425131M568004J125525k299468k741140o90785J359503J901291R06926
40744A704725j021622k476468j563954J758099M564507M003021Q07097j876652
40736E898753k377834j366187K58862J874220K025849k70652k865145k045807
40728A132059K237060N349748L651374j041011m370645m758327l637402k114525
40720c551669k27234J195038P51947j178420k412196j772438l20284O30929J167516
40711e716811J808723K268123K095136J628933J461518J567404J586337J357450
40703H056813O50541q64233k662391l167904j582754N73051J011021l45550j262881
40694D05713l89245Q08566K65100j480592j796726M39092L179230L722566J864462
$$ plain form
40752 -2425131 2142873 3268398 968930 -1772210 -2462995 -1103492 797799 1704725
40744 1704725 683103 -1793365 -3357319 -1599220 2965287 6968308 7775405 5898753
40736 5898753 3520919 2154732 2413594 4287814 6313663 6043011 3177866 1132059
40728 1132059 3369119 8718867 12370241 11329230 6958585 2200258 -1437144 -3551669
40720 -3551669 -3778903 -2583865 -1831918 -3010338 -5422534 -7194972 -7515256 -6884327 -5716811
40711 -5716811 -3908088 -1639965 455171 2084104 3545622 5113026 6699363 8056813
40703 8056813 8707354 7843121 5180730 2012826 430072 1003123 2014144 1668594 405713
40694 405713 16468 825034 1090134 -390458 -2187184 -1748092 1431138 5153704 7018166
40685G018166l87004j546321j793647j509770k45989J968872L387864K186568
40677I078739p47144k153854j94455L125804M312450K531433J98673l80793L89277
40668A6160130N96434m68443j730333k031429j526829j231019j563351j702070
40660F503090p20575O25481J71704k627024m786249k905794J833192M274244J868761
40651D236830j855425k303994K3338J260817L43061k99684M04517O33214m93841
40642A948833j245232o68447l46617j166730j418658r5738Q41360o5895p64649
40633b981773Q55800K795856J760579j385664k668544p83716J596556K054005
40625A243099Q75088p34428k082083k450237j540066n38911o32902q07260N98611
$$ plain form
40685 7018166 6631162 5084841 3291194 1781424 1535435 3504307 6892171 9078739
40677 9078739 8331595 6177741 5983286 9109090 13421540 15952973 16151646 15770853 16160130
40668 16160130 16756564 16288121 14557788 12526359 10999530 9768511 8205160 6503090
40660 6503090 5782515 6407996 6579700 3952676 -833573 -3739367 -1906175 2368069 4236830
40651 4236830 2381405 77411 100749 1361566 1704627 1404943 1809460 2442674 1948833
40642 1948833 703601 35154 -311463 -1478193 -2896851 -2992589 -2151229 -2217124 -2981773
40633 -2981773 -2125973 669883 2430462 1044798 -1623746 -2407462 -810906 1243099
40625 1243099 2118187 1383759 -698324 -3148561 -4688627 -5227538 -5860440 -6667700 -6069089
40616f069089K827803L895739L996732M411890L838767O1257m858912n953906
40608B150281k803098n87906j934344k923734k79052K469914O36104l510897l761577
40599a0544309Q70428N249047N572647L019689J00054k292167l651806l384581
40591e060998k433545k458586k805844j146480K310248M268929K989896O37123
40583c699257k86416j23845J8770R46618L385795N009076K578739l086724o897305
40574b154549n241141m32438K034500J60317k349916j288730K183710L121196
40566c967051o9915l132697k013917J438655K738607J673815J814347L686252
40558B168096L258374j199623m939572k758057L252439N908690K206241l279454
$$ plain form
40616 -6069089 -3241286 654453 4651185 9063075 12901842 12963099 8104187 2150281
40608 2150281 -652817 -1240723 -3175067 -6098801 -6377853 -3907939 -3271835 -6782732 -10544309
40599 -10544309 -9673881 -4424834 1147813 4167502 4267556 1975389 -1676417 -5060998
40591 -5060998 -7494543 -9953129 -12758973 -13905453 -11595205 -7326276 -4336380 -3699257
40583 -3699257 -3985673 -4109518 -4090748 -3144130 241665 5250741 7829480 4742756 -2154549
40574 -2154549 -7395690 -7828128 -5793628 -5633311 -7983227 -9271957 -7088247 -3967051
40566 -3967051 -4036966 -7169663 -9183580 -7744925 -5006318 -3332503 -1518156 2168096
40558 2168096 5426470 4226847 -712725 -3470782 -218343 5690347 7896588 4617134
40550D617134m906097k748816r79033j564536k452240j599209P1164Q06193R25356
40541g830084J646331K451180K109575J561706K792639M784756L935667m07254
40533A1044516m090706l764254j348971l12164l40797P03531J790820J73470l219881
40524F35564m448255k571722o76525m15458J54576K075220K977702J180388j074497
40515b163007r55322R44338K288551K586555K789304K930747K260298O10164j696149
40506I595479l964808m435210j678694K294959L117410r3036k900920j811696
40498A23484O96331N21986j472279j394993R29666J838984M2180j460449l69509
40489e44599J644643J998316Q12622m5218K49838R56237R99526j909j309572j651344
$$ plain form
40550 4617134 -288963 -3037779 -4016812 -5581348 -8033588 -9632797 -9561633 -8755440 -7830084
40541 -7830084 -6183753 -3732573 -1622998 -61292 2731347 7516103 11451770 11044516
40533 11044516 6953810 3189556 1840585 1528421 1187624 1891155 3681975 3855445 635564
40524 635564 -3812691 -6384413 -7060938 -7476396 -7321820 -5246600 -2268898 -1088510 -2163007
40515 -2163007 -3118329 -2173991 114560 2701115 5490419 8421166 10681464 11291628 9595479
40506 9595479 5630671 1195461 -483233 1811726 4929136 4836100 1935180 123484
40498 123484 819815 1341801 -130478 -1525471 -595805 1243179 1285359 -175090 -544599
40489 -544599 1100044 3098360 3910982 3865764 4115602 5071839 6071365 6069456 4759884 3108540
40479C108540q90454m64507j122181j316692L94313K404830J968306m72716j636271
40470A973168k71980R92937m35013l473905m876309l109224K36777K217441J343297
40461e402811q66883j409983N08519K264471J480185m54763o02815R26186J390819
40452b167075q0574j430228j218123l12478M53718J580161L103371L927641L640689
40443G497102K742365P69145l000548o477962n807838q94690L240031K566900
40435F34505j100932l335522k690694q71112M98373R00626L95381M8714J259327
40426d261334L123092K742823n9209j229505J638187M788915L340623j409296
40418H674296l968071k494318j41018P65471J184749J707943R55866j080593j866711
$$ plain form
40479 3108540 2218086 1753579 631398 -685294 -290981 2113849 4082155 3609439 1973168
40470 1973168 1701188 2694125 2259112 -1214793 -6091102 -9200326 -8963549 -6746108 -5402811
40461 -5402811 -6269694 -7679677 -7171158 -4906687 -3426502 -3881265 -4484080 -3557894 -2167075
40452 -2167075 -2247649 -3677877 -4896000 -5208478 -4754760 -3174599 -71228 3856413 7497102
40443 7497102 10239467 11008612 8008064 1530102 -4277736 -5172426 -1932395 634505
40435 634505 -466427 -3801949 -6492643 -7363755 -6865382 -5964756 -5569375 -5520661 -4261334
40426 -4261334 -1138242 1604581 1545372 315867 1954054 6742969 10083592 8674296
40418 8674296 4706225 2211907 2070889 2836360 4021109 5729052 6684918 5604325 3737614
40409C737614k50442J442891J067514j55154r3928P44957L56111j373965k466546
40400C009052j543260O37559K108837J489063q13595k933415l481394k874748
40392d401901k031466n91304J953640M087446L630220J210363j90179M35319R10764
40383E012902j79402j169716m88022M46419k61826j549073j092841P29156J194311
40374B641908q14035l328731l825233j768591J318917L214343K624394M31117
40366D94089r84622m29323O86946M59669q30506j382368n80336L89865M17000
40357a759586k65369p27321m48135K52798N16995l4070n19767P9282R27760K8745
40347a948668k475877l641930j707763J169565K112447J659093K057735K876931
$$ plain form
40409 3737614 3487172 4930063 5997577 5842423 5748495 6493452 6849563 5475598 3009052
40400 3009052 1465792 2103351 4212188 5701251 4887656 1954241 -1527153 -4401901
40392 -4401901 -6433367 -7024671 -5071031 -983585 2646635 3856998 3666819 4102138 5012902
40383 5012902 4833500 3663784 3175762 3622181 3360355 1811282 718441 1447597 2641908
40374 2641908 1827873 -1500858 -5326091 -7094682 -5775765 -2561422 62972 494089
40366 494089 -490533 -919856 -232910 226759 -603747 -1986115 -2566451 -2176586 -1759586
40357 -1759586 -2024955 -2752276 -3200411 -2947613 -2430618 -2464688 -2984455 -2905173 -1977413 -1948668
40347 -1948668 -4424545 -8066475 -9774238 -8604673 -6492226 -4833133 -2775398 101533
40339A01533J797418o64567j024907J753397M042524K491451j252228k872371
40331D372250r27028J955024K664060P92076j483569j699933M66075K599832J943774
40322A0682561j270984l757905k926953K19844K541949K209320J2023j954680
40314E755175k131691n98190J017625J083971l44106j846608k465073k252612
40306a781509j287491K88816J207462k778k487304l458537j969814k31027k0498
40297i742680p4418J186554K537882J995327K61371o02062o39127j216941j763235
40288h057329m99473J990128L117819K200639R59572P1374j464841l152746k830581
40279g665438o91738J96458r98918r57713K215616N054463L732378R3478j369245
$$ plain form
40339 101533 1898951 1234384 209477 1962874 6005398 8496849 7244621 4372250
40331 4372250 3445222 5400246 8064306 8856382 7372813 5672880 6138955 8738787 10682561
40322 10682561 9411577 5653672 2726719 2946563 5488512 7697832 7709855 5755175
40314 5755175 3623484 3025294 4042919 5126890 4782784 2936176 471103 -1781509
40306 -1781509 -3069000 -2780184 -1572722 -1575500 -4062804 -7521341 -9491155 -9722182 -9742680
40297 -9742680 -9817098 -8630544 -6092662 -4097335 -3835964 -4438026 -5077153 -6294094 -8057329
40288 -8057329 -8556802 -6566674 -3448855 -1248216 -288644 -217270 -1682111 -4834857 -7665438
40279 -7665438 -8357176 -8160718 -9159636 -10117349 -7901733 -2847270 885108 978586 -390659
40270c90659m40894n02788k110708k260967j80112J029373j66932r95570O87833
40261e331424K391330R81806j972530k397248K20475K454407K145990P88665L95620
40252c22909P64930R07274J097095J949248K596114J353274j969386n333543o205245
40243e163148l822417J07130K842971K955202J332975j48697n50555q2041R02009
40234a626571J970450J983637J5750k649001l056538k59426K796868K664783j03031
40225A736921j746567l79304J799831J876171j08335j974695k426620j780858
40217c003456o80104K87479K19772j202760k552269j827829J059665M104865N530743
40208A936106N164234L593694J399441n70385j583599k046275k798590l181165
$$ plain form
40270 -390659 -831553 -1334341 -3445049 -5706016 -5886128 -4856755 -5023687 -6019257 -5331424
40261 -5331424 -2940094 -1958288 -3930818 -6328066 -6107591 -3653184 -1507194 -718529 -322909
40252 -322909 442021 1349295 2446390 4395638 6991752 8345026 6375640 1042097 -5163148
40243 -5163148 -8985565 -8878435 -6035464 -3080262 -1747287 -1895984 -2446539 -2528580 -1626571
40234 -1626571 343879 2327516 2343266 -305735 -3362273 -3621699 -824831 1839952 1736921
40225 1736921 -9646 -388950 1410881 3287052 3178717 1204022 -1222598 -3003456
40217 -3003456 -3683560 -3396081 -3176309 -4379069 -6931338 -8759167 -7699502 -3594637 1936106
40208 1936106 7100340 10694034 12093475 11523090 9939491 7893216 5094626 1913461
40200A913461j601575J385846K679399O65056k145641k280686K86191K752775
40192C654826L231319J784425j061766m205931n097297j974195K916357N075844
40184D323582L226402N45628j26687L78949J32406n99050m44139N72309J476103
40175I485503J898523J645949J74266j942033k598050j094215K3228j673472m497726
40166A421973m629255j437416J807986K395082R18719n40832p57955M02314K066516
40157A647132K395005M93447j567984q71149J935025K945657N11572k330554k373465
40148B784686m81464Q00604J390745K435245K745958K52961l470550l964064k9935
40139B464186L973804L606964j68619k941099k685029j363357j387116k716088
$$ plain form
40200 1913461 311886 1697732 4377131 5042187 2896546 615860 902051 3654826
40192 3654826 6886145 8670570 7608804 3402873 -1694424 -3668619 -752262 4323582
40184 4323582 7549984 8095612 7968925 8347874 8480280 7881230 7437091 8009400 9485503
40175 9485503 11384026 13029975 13204241 11262208 8664158 7569943 7593171 5919699 1421973
40166 1421973 -3207282 -4644698 -2836712 -441630 477089 -63743 -821698 -419384 1647132
40157 1647132 4042137 4535584 2967600 2096451 4031476 6977133 7488705 5158151 2784686
40148 2784686 2303222 3103826 4494571 6929816 9675774 9928735 6458185 2494121 2464186
40139 2464186 6437990 10044954 9876335 6935236 4250207 2886850 1499734 -1216354
40131a216354l771580l633778k590669j344456l38383M68862J468822K768029
40123h189507L645077L183327J635863N14847Q41313J824067J940927R53367j9543
40114F329738k93336m43167j058730j639902j411852o30177l16993r89269k202210
40105b655898l051383k684909q23066J620319K981445K664533J925544J935544
40097A912129J833587J29767k521738l793050k790859p70380J263990L335769
40089a400785M440436K557297j777824m502075k929253M16984J531728O65610
40081i97882R59895K601721K514709q5157k019490j227970J65827k42852j371192
40072B97609j211295m57676o89015j082318j82191O65396p36456k950711k228985
$$ plain form
40131 -1216354 -4987934 -8621712 -11212381 -12556837 -12895220 -12426358 -10957536 -8189507
40123 -8189507 -4544430 -1361103 274760 789607 1630920 3454987 5395914 6349281 6329738
40114 6329738 6036402 5593235 4534505 2894603 1482751 852574 535581 -453688 -2655898
40105 -2655898 -5707281 -8392190 -9215256 -7594937 -4613492 -1948959 -23415 1912129
40097 1912129 3745716 3875483 1353745 -2439305 -5230164 -6000544 -4736554 -1400785
40089 -1400785 3039651 5596948 3819124 -682951 -3612204 -3195220 -1663492 -997882
40081 -997882 -37987 2563734 5078443 4993286 2973796 1745826 1911653 1668801 297609
40072 297609 -913686 -1371362 -2060377 -3142695 -3324886 -2659490 -3395946 -6346657 -8575642
40063h575642J645088M495344L487842M32643j795119k924353l549672k660539
40055i444408L29527L003886K451377m53263j926401j52679K971895M871736M868718
40046F520388L460457J124459j278179k395175j753841m91865p9148q89344k287665
40037A930087l297469k901099p16684K050931L270944K246097O29581J84852M69256
40028C866496o5328j298972j468758o4035J068961M34433p16539k53562J435154
40019B937850J977985Q51976L04061J548541K351421L77818k753671l458910j360801
40010B776270N08293M78834J4621K37193O1056r21451j003584K21626K17064k075177
40000E14745l282317o45155K706903K058475j242744j729933J441168L427113
$$ plain form
40063 -8575642 -6930554 -2435210 1052632 1485275 -309844 -3234197 -6783869 -9444408
40055 -9444408 -9114881 -6110995 -3659618 -4112881 -6039282 -6191961 -3220066 1651670 6520388
40046 6520388 9980845 11105304 9827125 7431950 5678109 5186244 5107096 4217752 1930087
40037 1930087 -1367382 -4268481 -4985165 -2934234 336710 2582807 3212388 3397240 3866496
40028 3866496 3801168 2502196 1033438 969403 2038364 2472797 1756258 1502696 2937850
40019 2937850 4915835 5767811 6071872 7620413 9971834 10349652 7595981 4137071 2776270
40010 2776270 3284563 3763397 3778018 4015211 4076267 3154816 2151232 2372858 2589922 514745
40000 514745 -2767572 -3412727 -705824 1352651 109907 -1620026 -178858 3248255
39992C248255J778061j71174L64807J265316J59615j236177p93990r3240j205349
39983C316124k616843k125660r43964j043955j110010O26650J976356N3791k864863
39974d732374k005425K302967M948872L759119J726900J101024M01002j349802
39966F152283k106467n72290J305199J694226J488534J616093Q63915j424862
39958I016631l198576k546862o03623L38720k32576j508306k812723l296202k185380
39949g028897m15151J38065k73322K96880J458946N89564j998057k424071L02426
39940i353617K042069N97715j80194K462930M196081O84946l799570k330319L133297
39931b546662M624735J211322n4927L129431M136371q40011n487196l320478J839965
$$ plain form
39992 3248255 5026316 4855142 5219949 6485265 6644880 5408703 4614713 4521473 3316124
39983 3316124 699281 -1426379 -2370343 -3414298 -4524308 -3897658 -1921302 -1867511 -4732374
39974 -4732374 -6737799 -4434832 514040 4273159 6000059 7101083 7502085 6152283
39966 6152283 4045816 3473526 4778725 6472951 7961485 9577578 10441493 9016631
39958 9016631 5818055 3271193 2667570 3006290 2773714 1265408 -1547315 -4843517 -7028897
39949 -7028897 -7444048 -7305983 -7579305 -7282425 -5823479 -5233915 -7231972 -9656043 -9353617
39940 -9353617 -7311548 -6713833 -6894027 -4431097 -235016 449930 -3349640 -5679959 -2546662
39931 -2546662 2078073 3289395 3234468 6363899 10500270 9660259 4173063 852585 2692550
39922B692550K171125k003591l785591r61895J654341Q16244p08742L45766K755786
39913B975993L550210K360170P50934n78332j839522k685759k418162j181820
39905I33712J5721K50471o46056j909092k237384r38910J204534K614465K354326
39896A641787O20793j613159k826987j637727J512439L798255K611635j193376
39888B913660l881291k912276N74878L551744M230451K900345O95071j445450
39880F627132k883681l219720k458464j135585n8601M12487R19115K394483M343682
39871D940848M479763J160328l930323o742747m993481n80158K588272K508955
39863e68543L60659j368082j158270O97769K514607K456884J91412k479772l228806
$$ plain form
39922 2692550 4863675 2860084 -925507 -1887402 -233061 583183 -125559 220207 2975993
39913 2975993 6526203 8886373 9637307 9058975 7219453 4533694 2115532 933712
39905 933712 949433 1199904 553848 -1355244 -3592628 -4531538 -3327004 -712539 1641787
39896 1641787 2262580 649421 -2177566 -3815293 -2302854 1495401 4107036 2913660
39888 2913660 -967631 -3879907 -3305029 246715 4477166 7377511 8072582 6627132
39880 6627132 3743451 523731 -1934733 -3070318 -3128919 -2716432 -1797317 597166 4940848
39871 4940848 9420611 10580939 6650616 -92131 -5085612 -5665770 -3077498 -568543
39863 -568543 -207884 -1575966 -2734236 -2036467 478140 2935024 3126436 646664 -2582142
39854b582142j651224L91487R70229m3577j479850k299759j942147j86411K271575
39845f551819L737561L264820K070007J802605J783242l1318l132290l978588
39837a035780q13627L099509L326221J40361k092079j088033O20169k1640j955316
39828A79785j689478J409972L783352K194455j838927l606811j066946K482289
39820A847691K721143Q5366j055012J175992L483837K459285m22699j461510m96710
39811H337383o16462k816612m471302l495837r71392J228329K703880L294030
39803C192017K168663j97762j295545K31473K276688K099578J53295r89611o03595
39794G035201m44617j640139k983799k843150j463930n95525j262397k446807
$$ plain form
39854 -2582142 -4233366 -3841879 -2871650 -2915227 -4395077 -6694836 -8636983 -8823394 -6551819
39845 -6551819 -2814258 450562 2520569 4323174 6106416 6075098 2942808 -1035780
39837 -1035780 -1849407 1250102 4576323 4716684 2624605 1536572 2156741 2135101 179785
39828 179785 -1509693 -99721 3683631 5878086 4039159 432348 -634598 1847691
39820 1847691 4568834 4654200 3599188 4775180 8259017 10718302 10295603 8834093 8337383
39811 8337383 7720921 4904309 433007 -3062830 -4034222 -2805893 -102013 3192017
39803 3192017 5360680 5162918 3867373 4098846 6375534 8475112 8628407 7638796 7035201
39794 7035201 6590584 4950445 1966646 -876504 -2340434 -2935959 -4198356 -6645163
39786f645163k198549o5620K069654K167379N84836n31122m8785J228806K167670
39777a270894K237803J005813j364714k996191j881260R61635K213595P89579
39769c04634q76106r91756q94880j701097j495633J425101M816800N125972K429691
39760G533458j29460p10096J07544J474234K764941K733609Q07669j461478k524836
39751A0595585l220041m466430m281291p61780L194525K672250j881757m628116
39743b777055k471127J069822J598065m47527j874638j291563O71379L038116
39735b484528M244376K609222q71200k464920n40525J761715R67704j802149l024554
39726a604859k059020j175091j425990j571896p66430K98719J013509J634341
$$ plain form
39786 -6645163 -8843712 -8909332 -6839678 -4672299 -4087463 -4618585 -4667370 -3438564 -1270894
39777 -1270894 966909 1972722 608008 -2388183 -4269443 -3307808 -1094213 -304634
39769 -304634 -1180740 -2172496 -3067376 -4768473 -6264106 -4839005 -22205 5103767 7533458
39760 7533458 7403998 6693902 6801446 8275680 11040621 13774230 14581899 13120421 10595585
39751 10595585 7375544 2909114 -1372177 -2133957 1060568 3732818 1851061 -2777055
39743 -2777055 -5248182 -4178360 -2580295 -3027822 -4902460 -6194023 -5522644 -2484528
39735 -2484528 1759848 4369070 3497870 1032950 492425 2254140 3221844 1419695 -1604859
39726 -1604859 -3663879 -4838970 -6264960 -7836856 -8603286 -8304567 -7291058 -5656717
39718e656717K336074K903400L198793K825947J007096j895294l657152k685622
39710a623475m65590L06061o32548j256927m62613R96503K351138L261877K583077
39701E057503o78569m681472n592085k297257J747714K787659J192308n4959J17155
39692b402003J49412p24681p17693J813639N203343N656030J791664l107878m443055
39683C218778j602603J409895J126532j068141j263385J299092L246438K017441
39675H384047o54451j644688r60949j022536k286755k425789l46387J540129O77397
39666A260018j761960k541403r82332M95020K87224m43069l53733j10085o44892
39657d795212j136432n02756M70327M08150k60050r7740R86045K088332L122563
$$ plain form
39718 -5656717 -3320643 -417243 2781550 5607497 6614593 4719299 1062147 -1623475
39710 -1623475 -2089065 -1783004 -2415552 -3672479 -4135092 -3138589 -787451 2474426 5057503
39701 5057503 4378934 -302538 -5894623 -8191880 -6444166 -3656507 -2464199 -2519158 -2402003
39692 -2402003 -2252591 -2977272 -3694965 -1881326 3322017 8978047 10769711 7661833 3218778
39683 3218778 1616175 3026070 4152602 3084461 1821076 3120168 6366606 8384047
39675 8384047 7729596 6084908 5123959 4101423 1814668 -611121 -957508 582621 1260018
39666 1260018 -501942 -3043345 -4025677 -3530657 -3243433 -3686502 -4040235 -4150320 -4795212
39657 -4795212 -5931644 -6434400 -5964073 -5555923 -5815973 -5913713 -4927668 -2839336 283227
39648B83227M085538L406967j65898m385638n286048k468326L17720N01356l46873
39639d057975J01418J499918K306142K174796J267947m98181j984451j106932
39631b97318J696565K957704J162545o98283j63924L57463j902120m070134j359863
39622b317365M497780O195735P80270o194657p988967m328920J56925K066538
39614g132661J537729M65116M63849J639579K400932J420945j58698j31801J254277
39605A759267J504232j44209j598923j494953j140054j654166j818076n15491
39597e102373R27193Q28460j91283n81341m28561q00288j710386k376646k441316
39588a1876541j613493O10238L524069M923215L670342J185252q47832k426361
$$ plain form
39648 283227 4368765 7775732 7609834 3224196 -2061852 -4530178 -4212458 -3711102 -4057975
39639 -4057975 -3956557 -2456639 -150497 2024299 3292246 2794065 809614 -297318
39631 -297318 1399247 4356951 5519496 4821213 4657289 5014752 3112632 -957502 -2317365
39622 -2317365 2180415 8376150 9156420 2961763 -5027204 -9356124 -9199199 -7132661
39614 -7132661 -5594932 -5129816 -4665967 -3026388 -625456 795489 636791 504990 1759267
39605 1759267 3263499 3119290 1520367 25414 -1114640 -2768806 -4586882 -5102373
39597 -5102373 -4175180 -3346720 -3538003 -4119344 -4547905 -5348193 -7058579 -9435225 -11876541
39588 -11876541 -13490034 -12879796 -9355727 -4432512 -762170 423082 -424750 -2851111
39580b851111l441592k350993R61853L160299J395716k267355l652679k406585
39572a1452447j413109j189161O86704M282446N927041L642190K74404q40508
$$ plain form
39580 -2851111 -6292703 -8643696 -7681843 -4521544 -3125828 -5393183 -9045862 -11452447
39572 -11452447 -12865556 -14054717 -13368013 -9085567 -3158526 483664 758068 -82440
$$ [...]
##END NTUPLES=NMR SPECTRUM
##END=
