##TITLE=31Pdec_DE-145_4h
 ,24 sc
 24.4.2026
##JCAMPDX= 6.0         $$ Bruker NMR JCAMP-DX V2.0
##DATA TYPE= NMR SPECTRUM
##DATA CLASS= NTUPLES
##ORIGIN= UXNMR, Bruker Analytische Messtechnik GmbH
##OWNER= root
$$ XWIN-NMR		Version 3.5
$$ Fri Apr 24 15:27:59 2026 Russian Standard Time (UT+4h)  she@DPX200
##.OBSERVE FREQUENCY= 81.013821
##.OBSERVE NUCLEUS= ^31P
##.ACQUISITION MODE= SIMULTANEOUS
##.ACQUISITION SCHEME= undefined
##.AVERAGES= 24
##.DIGITISER RES= 17
##SPECTROMETER/DATA SYSTEM= spect
##.PULSE SEQUENCE= zgpg30
##.SOLVENT NAME= DMSO
##.SHIFT REFERENCE= (INTERNAL, DMSO, 0, 197.392)
##AUDIT TRAIL= $$ (NUMBER, WHEN, WHO, WHERE, WHAT)
$$ ##TITLE= Audit trail, XWIN-NMR		Version 3.5
$$ ##JCAMPDX= 5.01
$$ ##ORIGIN= Bruker BioSpin GmbH
$$ ##OWNER= she
$$ F:/spectra/data/she/nmr/P31/2/pdata/1/auditp.txt
$$ ##AUDIT TRAIL=  $$ (NUMBER, WHEN, WHO, WHERE, WHAT)
(   1,<2026-04-24 15:26:36.32 +0400>,<she>,<DPX200>,
      <created by zg, POWCHK disabled, PULCHK disabled
       configuration hash MD5:
       00 E9 B6 7A A2 85 ED C7 34 08 36 98 17 FE 4E 26
       data hash MD5: 32K
       3D 3B 53 67 E7 AC ED 1E 08 68 28 62 3E D0 73 BF>)
(   2,<2026-04-24 15:26:53.67 +0400>,<she>,<DPX200>,
      <Start of raw data processing
       efp BC_mod = 2 LB = 1.5 FT_mod = 6 PKNL = 1 PHC0 = 1277.602 PHC1 = 402.5004 SI = 64K 
       data hash MD5: 64K
       69 B6 03 D3 7E C6 C7 A3 38 27 3C 63 65 53 0B F3>)
(   3,<2026-04-24 15:27:17.26 +0400>,<she>,<DPX200>,
      <pk PHC0 = 16.64782 PHC1 = 0 
       data hash MD5: 64K
       D6 4E 10 4C 3F 9A F8 DA C2 7F 52 2F 91 4D CB 44>)
(   4,<2026-04-24 15:27:21.18 +0400>,<she>,<DPX200>,
      <abs ABSG = 5 
       data hash MD5: 64K
       5A 6B AE BB 28 2D 7A E2 60 C2 C2 71 C5 AD 5F FB>)
$$ ##END=
$$ 
$$ hash MD5
$$ 8A F1 66 36 ED DD 4E FA 9F 89 05 54 45 77 30 94
##$RELAX= 
##$RELAX= 
##$RELAX= 
##$RELAX= 
##$RELAX= 
##$RELAX= 
##$RELAX= 
##$RELAX= 
$$ Bruker specific parameters
$$ --------------------------
##$DU= <F:/spectra>
##$EXPNO= 2
##$NAME= <P31>
##$PROCNO= 1
##$TYPE= <nmr>
##$USER= <she>
##$AMP= (0..31)
100 100 100 100 100 100 100 100 100 100 100 100 100 100 100 100 100 100 
100 100 100 100 100 100 100 100 100 100 100 100 100 100 
##$AQSEQ= 0
##$AQ_mod= 1
##$AUNM= <au_zg>
##$AUTOPOS= <>
##$BF1= 81.014009
##$BF2= 200.13
##$BF3= 200.13
##$BF4= 200.13
##$BF5= 200.13
##$BF6= 200.13
##$BF7= 200.13
##$BF8= 200.13
##$BYTORDA= 1
##$CFDGTYP= 0
##$CFRGTYP= 5
##$CHEMSTR= <none>
##$CNST= (0..31)
1 1 145 1 1 1 1 1 1 1 1 1 1 1 1 1 1 1 1 1 1 1 1 1 1 1 1 1 1 1 1 1 
##$CPDPRG= <waltz16>
##$CPDPRG1= <>
##$CPDPRG2= <waltz16>
##$CPDPRG3= <>
##$CPDPRG4= <mlev>
##$CPDPRG5= <mlev>
##$CPDPRG6= <mlev>
##$CPDPRG7= <mlev>
##$CPDPRG8= <mlev>
##$CPDPRGB= <>
##$CPDPRGT= <>
##$D= (0..31)
0 1 0 0 0 0 0 0 0 0.06 0 0.03 2e-05 3e-06 0 0 0.0002 0 0 0 0 0 0 0 0 0 
0 0 0 0 0 0 
##$DATE= 1777029995
##$DBL= (0..7)
120 120 120 11 120 120 24 19 
##$DBP= (0..7)
150 150 150 150 150 150 150 150 
##$DBP07= 0
##$DBPNAM0= <>
##$DBPNAM1= <>
##$DBPNAM2= <>
$$ [...]
##$SUBNAM3= <"">
##$SUBNAM4= <"">
##$SUBNAM5= <"">
##$SUBNAM6= <"">
##$SUBNAM7= <"">
##$SUBNAM8= <"">
##$SUBNAM9= <"">
##$SW= 400.765351723535
##$SWIBOX= (0..15)
0 1 3 0 0 0 0 0 0 0 0 0 0 0 0 0 
##$SW_h= 32467.5324675325
##$TD= 32768
##$TD0= 1
##$TE= 0
##$TE2= 300
##$TE3= 300
##$TEG= 300
##$TL= (0..7)
0 120 53 12 22 120 120 120 
##$TP= (0..7)
150 150 150 150 150 150 150 150 
##$TP07= 0
##$TPNAME0= <>
##$TPNAME1= <>
##$TPNAME2= <>
##$TPNAME3= <>
##$TPNAME4= <>
##$TPNAME5= <>
##$TPNAME6= <>
##$TPNAME7= <>
##$TPOAL= (0..7)
0.5 0.5 0.5 0.5 0.5 0.5 0.5 0.5 
##$TPOFFS= (0..7)
0 0 0 0 0 0 0 0 
##$TUNHIN= 0
##$TUNHOUT= 0
##$TUNXOUT= 0
##$USERA1= <user>
##$USERA2= <user>
##$USERA3= <user>
##$USERA4= <user>
##$USERA5= <user>
##$V9= 5
##$VALIST= <valist>
##$VCLIST= <CCCCCCCCCCCCCCC>
##$VD= 0
##$VDLIST= <DDDDDDDDDDDDDDD>
##$VPLIST= <PPPPPPPPPPPPPPP>
##$VTLIST= <TTTTTTTTTTTTTTT>
##$WBST= 1024
##$WBSW= 4
##$XGAIN= (0..3)
0 0 0 0 
##$XL= 0
##$YL= 0
##$YMAX_a= 24331
##$YMIN_a= -28495
##$ZGOPTNS= <>
##$ZL1= 120
##$ZL2= 120
##$ZL3= 120
##$ZL4= 120
##$ABSF1= 197.3918
##$ABSF2= -203.3724
##$ABSG= 5
##$ABSL= 3
##$ALPHA= 0
##$AQORDER= 0
##$ASSFAC= 0
##$ASSFACI= 0
##$ASSFACX= 0
##$ASSWID= 0
##$AUNMP= <proc_1d>
##$AZFE= 0.1
##$AZFW= 0.5
##$BCFW= 0
##$BC_mod= 2
##$BYTORDP= 0
##$COROFFS= 0
##$CY= -3
##$DATMOD= 1
##$DC= 0
##$DFILT= <>
##$DTYPP= 0
##$F1P= 0
##$F2P= 0
##$FCOR= 1
##$FTSIZE= 65536
##$FT_mod= 6
##$GAMMA= 0
##$GB= 0
##$INTBC= 1
##$INTSCL= 9.790993e-09
##$ISEN= 30
##$LB= 1.5
##$LEV0= 0
##$LPBIN= 0
##$MAXI= 10000
##$MC2= 0
##$MEAN= 0
##$ME_mod= 0
##$MI= 50
##$NCOEF= 0
##$NC_proc= -7
##$NLEV= 6
##$NOISF1= 182.463
##$NOISF2= 159.3651
##$NSP= 0
##$NTH_PI= 0
##$NZP= 0
##$OFFSET= 197.3918
##$PC= 4
##$PHC0= 1294.25
##$PHC1= 402.5004
##$PH_mod= 1
##$PKNL= yes
##$PPARMOD= 0
##$PSCAL= 0
##$PSIGN= 0
##$REVERSE= no
##$SF= 81.014063255964
##$SI= 65536
##$SIGF1= 159.3651
##$SIGF2= -187.1042
##$SINO= 113.3802
##$SIOLD= 16384
##$SREGLST= <1H.CDCl3>
##$SSB= 0
##$STSI= 65536
##$STSR= 0
##$SW_p= 32467.5324675325
##$SYMM= 0
##$S_DEV= 0
##$TDeff= 32768
##$TDoff= 0
##$TI= <>
##$TILT= no
##$TM1= 0
##$TM2= 0
##$TOPLEV= 0
##$USERP1= <user>
##$USERP2= <user>
##$USERP3= <user>
##$USERP4= <user>
##$USERP5= <user>
##$WDW= 1
##$XDIM= 65536
##$YMAX_p= 373177293
##$YMIN_p= -33009111
$$ End of Bruker specific parameters
$$ ---------------------------------
##NTUPLES= NMR SPECTRUM
##VAR_NAME=  FREQUENCY,     SPECTRUM/REAL,   SPECTRUM/IMAG
##SYMBOL=    X,             R,               I
##VAR_TYPE=  INDEPENDENT,   DEPENDENT,       DEPENDENT
##VAR_FORM=  AFFN,          ASDF,            ASDF
##VAR_DIM=   65536,         65536,           65536
##UNITS=     HZ,            ARBITRARY UNITS, ARBITRARY UNITS
##FACTOR=    0.49542278885378, 1,            1
##FIRST=     15991.5117654749, 0,            0
##LAST=      -16476.0207020576, 0,           0
##MIN=       -16476.0207020576, -33009111,   0
##MAX=       15991.5117654749, 373177293,    0
$$ Real data points
##PAGE= N=1
##DATA TABLE= (X++(R..R)), XYDATA
$$ [...]
49122 -617692 -1652381 -2255318 -1915469 -1088454 -730825 -1304611 -2463842 -3422918 -3480489
49113 -3480489 -2599377 -1670178 -1721715 -2614344 -3058592 -2281047 -1070755 -644011 -1039249
49104 -1039249 -1366028 -1228865 -1027953 -998029 -811723 -260079 310359 419547 -98110 -1087736
49094 -1087736 -2089488 -2405981 -1674047 -420565 397895 427672 69369 -304520 -676042
49085 -676042 -909397 -655898 12047 436014 194352 -273076 -142803 931762 2544323
49076 2544323 3829650 4028989 3163608 2146799 1782812 1737488 1109813 -80334 -849737
49067 -849737 -761720 -429393 -203070 462181 1645789 2109448 900991 -1000857 -1869431
49058 -1869431 -1503778 -1073573 -1132666 -1195645 -1105024 -1296999 -1531919 -831493 798994 1851812
49048 1851812 1271369 -45635 -510740 152438 967084 1151386 677423 -192600 -1139939
49039 -1139939 -1775115 -1953227 -1875607 -1515639 -441648 1261591 2461766 2138773 699023
49030 699023 -625770 -1338557 -1801778 -2126818 -1974772 -1432573 -1114940 -1237359 -1383579
49021 -1383579 -1320975 -1265884 -1222183 -904952 -507536 -631163 -1154724 -1162208 -479862 -250132
49011 -250132 -1181010 -2136693 -1556141 348580 2011694 2744594 3213818 3741476 3555389
49002 3555389 2238381 800063 445092 897249 805833 -449144 -2095170 -3051904 -3035280
48993 -3035280 -2417508 -1493847 -336476 724481 937496 -195497 -2138848 -3583432 -3676774
48984 -3676774 -2777908 -1824977 -1270530 -975500 -834645 -924976 -1123626 -1168918 -1146898 -1361184
48974 -1361184 -1632245 -1348643 -450623 246527 97921 -515328 -834272 -777038 -796191 -1025370
48964 -1025370 -1186305 -1161169 -1077233 -931096 -687665 -696451 -1432344 -2753349 -3897322 -4303475
48954 -4303475 -4020571 -3273643 -2147098 -861922 114357 525155 593612 640529 732752 875007
48944 875007 1201678 1737192 2258593 2634011 3014298 3440067 3559843 3065090 2168357 1307841
48934 1307841 581540 -155622 -813312 -1136189 -1189643 -1316945 -1551951 -1488500 -898843 -149029
48924 -149029 243543 250432 268500 529815 847381 971543 977170 1126138 1391800 1318373 527448
48913 527448 -651967 -1267496 -638478 869506 2123011 2320059 1718261 1214809 1303870
48904 1303870 1616198 1530852 1048303 774489 1013650 1226969 701745 -434637 -1311529
48895 -1311529 -1419105 -1129642 -937101 -674908 52944 960784 1209837 473264 -619737
48886 -619737 -1290017 -1507275 -1819449 -2495845 -3149739 -3205538 -2550386 -1656727 -1120915 -1119056
48876 -1119056 -1306215 -1211380 -665519 157844 966476 1468255 1398052 724789 -113138 -462370
48866 -462370 -160436 167779 -209407 -1179613 -1788197 -1291089 4200 1110675 1379726
48857 1379726 872350 -128887 -1463980 -2785045 -3404658 -2965974 -2062367 -1640960 -1814260
48848 -1814260 -1816949 -1232898 -636170 -674548 -1074502 -1120175 -751060 -502943 -526093 -405619
48838 -405619 -28175 82632 -410257 -1070540 -1340555 -1325572 -1394538 -1323435 -538043 803279
48828 803279 1644541 1236562 56478 -845872 -1093743 -1097297 -1101457 -760256 137548 1004850
48818 1004850 957211 -189484 -1769426 -3014022 -3609094 -3565459 -2952008 -1919893 -772108
48809 -772108 121394 402043 -171301 -1411642 -2576461 -2967596 -2717387 -2585452 -2923742
48800 -2923742 -3330816 -3439950 -3422319 -3403650 -3035181 -2166715 -1381285 -1198186 -1207777 -753211
48790 -753211 -64139 199763 241689 854387 1861670 1993199 646008 -1222842 -2435123
48781 -2435123 -2933919 -3194657 -3120985 -2368847 -1251547 -473643 -231101 -264048 -536153 -1134199
48771 -1134199 -1661179 -1505097 -771829 -322202 -712933 -1540998 -1990069 -1715556 -1103875
48762 -1103875 -891936 -1514162 -2581266 -3089172 -2441106 -1170902 -333985 -306804 -585570
48753 -585570 -658847 -560666 -519011 -548596 -553617 -481915 -281988 -61525 -314561 -1461778 -2958011
48742 -2958011 -3415767 -2096622 38464 1271546 961143 -38875 -682033 -840046 -940488
48733 -940488 -1070736 -972647 -700472 -677203 -1004492 -1234692 -1114160 -1111659 -1716601 -2495616
48723 -2495616 -2500163 -1584607 -670562 -549628 -1013945 -1413515 -1487100 -1292756 -900444 -640738
48713 -640738 -1123730 -2397863 -3523649 -3640419 -3061841 -2608307 -2302883 -1661853 -925875
48704 -925875 -828190 -1217471 -1150257 -503693 -226589 -625109 -729196 -42810 359303 -486046
48694 -486046 -1722830 -1939551 -1356784 -1311012 -2046664 -2554151 -2408063 -2187665 -1966500 -984853
48684 -984853 690652 1647119 1084885 134902 283848 1437187 2529951 3152585 3351380
48675 3351380 2570081 355804 -2144664 -2982483 -1906859 -723793 -772191 -1293116 -937280
48666 -937280 233108 1170270 1456933 1466432 1400782 1171157 993353 1216003 1666916 1919355
48656 1919355 2077120 2535147 3075563 3048764 2470684 2090389 2235377 2418075 2300673 2194676
48646 2194676 2232508 1852839 644210 -945832 -2278129 -3299466 -4100518 -4327291 -3769380
48637 -3769380 -3061626 -2990059 -3369993 -3335900 -2531367 -1345711 -201878 685360 1048684
48628 1048684 835273 625157 1026752 1713612 1816149 1231465 724413 675969 592012 42118
48618 42118 -751567 -1558848 -2565535 -3712396 -4306686 -3842039 -2709521 -1610871 -711842
48609 -711842 143409 793065 901185 538945 184651 237579 743741 1386972 1573598 825356
48599 825356 -681770 -2203194 -3165693 -3536898 -3468446 -3079724 -2671839 -2530612 -2329663
48590 -2329663 -1415367 39347 942466 778558 387175 626469 1066217 880898 360484
48581 360484 421852 1010931 1168831 585670 -17105 -148545 -181796 -479076 -795093 -961402
48571 -961402 -1390578 -2309651 -2995539 -2431538 -586718 1417455 2435144 2324546 1790953
48562 1790953 1408983 1071595 490831 -112934 -327827 -413398 -1067978 -2132356 -2402516
48553 -2402516 -1329921 -148691 -414545 -1914690 -3020280 -2841257 -2030402 -1557258 -1664155
48544 -1664155 -2074244 -2338557 -1892280 -620462 536586 427564 -682482 -1201287 -190890
48535 -190890 1546986 2638009 2566930 1621701 272989 -880367 -1248886 -883032 -470458
48526 -470458 -373050 -268871 -26030 -125662 -745415 -1234758 -1159694 -1178673 -2128673 -3763230
48516 -3763230 -5101536 -5565678 -5126850 -3868964 -2203511 -1082256 -1122441 -1746290 -1910504
48507 -1910504 -1433729 -906177 -619817 -447314 -576348 -1424914 -2789533 -3870209 -4258727
48498 -4258727 -4260672 -4172284 -3878403 -3284993 -2579263 -1926149 -1384845 -1185531 -1580828 -2340330
48488 -2340330 -2877526 -2968206 -2898974 -2869999 -2764247 -2597618 -2652821 -2945367 -2991923 -2381900
48478 -2381900 -1316034 -404850 -124954 -518505 -1201034 -1657461 -1736680 -1764463 -1934320 -1815233
48468 -1815233 -884741 614934 1830120 2180392 1626885 286722 -1550026 -3131987 -3742404
48459 -3742404 -3546021 -3269609 -3046754 -2390966 -1369354 -794448 -918032 -933982 -345090
48450 -345090 104801 -340480 -1052065 -833774 337572 1384014 1669227 1497150 1168787
48441 1168787 514704 -452020 -1173588 -1129590 -313490 978011 2332797 3134607 2888150
48432 2888150 1865298 954759 647230 590131 313313 -118822 -450425 -711583 -953052
48423 -953052 -939218 -580574 -323890 -583553 -1039601 -1047736 -552744 -27176 317981 594078
48413 594078 636106 184912 -266576 223596 1521010 2139269 1174731 -291737 -652747
48404 -652747 11104 346478 -40975 -187042 354350 670517 18748 -1017899 -1622074
48395 -1622074 -1958450 -2409656 -2472966 -1528612 -146137 507410 247606 -169549 -396664
48386 -396664 -706039 -1002012 -806606 -324263 -391182 -1094639 -1488548 -1069018 -535180 -561856
48376 -561856 -770362 -633111 -556733 -1115913 -1773813 -1428835 -47977 1190767 1446236
48367 1446236 1133587 1078951 1357226 1371712 810793 116011 -74140 238760 375151 -138865
48357 -138865 -922039 -1299600 -1284645 -1406553 -1595260 -1025935 575533 2142526 2364194
48348 2364194 1163082 -453290 -1637286 -2198552 -2181842 -1701425 -1153478 -965784 -1059956
48339 -1059956 -1005944 -690479 -362397 -54308 467708 1090249 1272328 838624 393778 613093
48329 613093 1449613 2370076 3075964 3561404 3630754 2900374 1419445 -85760 -870034
48320 -870034 -902210 -680608 -457149 -50039 521987 703970 73104 -947501 -1526190 -1464676
48310 -1464676 -1320714 -1518992 -1871174 -2073864 -2131707 -2040521 -1540071 -535209 601223
48301 601223 1466816 2009572 2153676 1512119 10634 -1542616 -2186608 -2001065 -1940973
48292 -1940973 -2464116 -2966511 -2811095 -2340966 -2334559 -2682196 -2261242 -419937 1792333
48283 1792333 2478979 1072343 -903318 -1628930 -1059114 -549448 -829973 -1371960 -1721639
48274 -1721639 -2253526 -3146452 -3670848 -3280525 -2660782 -2827281 -3694569 -4328379 -4171710
48265 -4171710 -3272031 -1787950 -142465 757419 420567 -388418 -621745 -453818 -814264
48256 -814264 -1717631 -2261841 -2194080 -2199386 -2504706 -2465244 -1871761 -1466063 -1636137 -1671469
48246 -1671469 -969582 -81054 152365 -236062 -700652 -1045475 -1260699 -1100480 -502368
48237 -502368 70203 301443 524120 975651 1161923 686060 145090 294971 681162 79105
48227 79105 -1754097 -3583598 -4068655 -3082590 -1609450 -782178 -1071896 -2065378 -2958742
48218 -2958742 -3381869 -3577198 -3694210 -3363323 -2296208 -869122 338686 1196356 1726405
48209 1726405 1586901 508409 -1012252 -2108058 -2496013 -2517029 -2444437 -2307971 -2158401
48200 -2158401 -1889561 -1050165 454783 1694239 1590850 429946 -337287 135713 1298906
48191 1298906 2281799 2918002 3404612 3669566 3497557 2821054 1658529 240275 -741244
48182 -741244 -730375 -340027 -910063 -2607948 -3854333 -3334027 -1803168 -965344 -1130868
48173 -1130868 -1142120 -388580 338184 221051 -348280 -380920 519168 2004422 3486764
48164 3486764 4364791 4227486 3335569 2568710 2431502 2415137 1817253 853278 313523 350062
48154 350062 390684 228817 340452 890093 1240050 907923 321899 20647 -313318 -1259630
48144 -1259630 -2514678 -3213806 -3219079 -3226724 -3592363 -3845682 -3499322 -2647731 -1606398 -592811
48134 -592811 77872 106838 -308776 -702989 -1128841 -1994182 -3011870 -3243386 -2521997 -1898020
48124 -1898020 -2161818 -2808180 -3060752 -3004591 -2935144 -2504457 -1539926 -950193 -1616120 -2897014
48114 -2897014 -3439193 -3066022 -2633972 -2365550 -1737811 -908616 -751569 -1258835 -1308435 -481707
48104 -481707 104500 -607543 -2182695 -3488746 -4081579 -4145912 -3776890 -3020997 -2151061
48095 -2151061 -1365036 -614150 -55207 -118462 -777645 -1359776 -1463413 -1431929 -1511049 -1265941
48085 -1265941 -417760 400686 441253 -86481 -430424 -413240 -485018 -941721 -1659472 -2374514
48075 -2374514 -2783482 -2661423 -2267302 -2231490 -2633061 -2697001 -1921555 -939080 -562056 -477858
48065 -477858 244608 1649076 2757246 2816638 1957830 741611 -238290 -431875 218246
48056 218246 888435 567987 -849210 -2649127 -4228331 -5257681 -5231851 -3911228 -2252395
48047 -2252395 -1811716 -2837356 -3809502 -3340941 -1814318 -628974 -479790 -998993 -1578208
48038 -1578208 -1815149 -1424528 -407836 730007 1442258 1813633 2375987 3277808 4033010
48029 4033010 4128439 3512356 2398028 972416 -456955 -1327575 -1255411 -572682 -69131
48020 -69131 -89331 -199767 50005 360352 65720 -903983 -1922834 -2461911 -2464798 -1937077
48010 -1937077 -825000 469572 1113959 843384 424925 582441 874524 290496 -1279934
48001 -1279934 -2821334 -3355881 -2809197 -1798089 -1065410 -1089193 -1761777 -2383505 -2281324
47992 -2281324 -1430585 -305369 623454 970822 440079 -745183 -1746790 -2019995 -2000500
47983 -2000500 -2282283 -2523637 -2009921 -988683 -429875 -579656 -807277 -883741 -1263974
47974 -1263974 -1897211 -1920798 -992915 59756 427718 250908 -117708 -800987 -1699636
47965 -1699636 -2051540 -1523102 -942443 -1047104 -1239677 -624808 349384 516811 -102949
47956 -102949 -331774 255972 666232 31656 -1131934 -1710824 -1448035 -1142037 -1631649
47947 -1631649 -2805015 -3539356 -2750778 -712584 966353 1066058 110396 -544134 -568397
47938 -568397 -771541 -1579297 -2427412 -2768918 -2720077 -2425388 -1684711 -649474 -60214 -186281
47928 -186281 -220824 547493 1523690 1641257 1074556 1126778 2358329 3700427 3800014 2657032
47918 2657032 1429419 939129 936558 833070 649057 886582 1630588 2205608 1923185 961362
47908 961362 212502 285153 911118 1395812 1413572 1181348 971692 690889 38991 -972155
47898 -972155 -1822215 -1976216 -1552513 -1229454 -1355080 -1455211 -934786 14917 725569 1114010
47888 1114010 1716543 2520937 2549078 1158658 -782355 -1783022 -1539313 -1043753 -930697
47879 -930697 -660858 257170 1063944 594302 -1032322 -2429381 -2644842 -2101188 -1678285
47870 -1678285 -1577086 -1493235 -1343864 -1253361 -1173223 -1078162 -1263228 -1861214 -2330701 -2139694
47860 -2139694 -1765872 -2126052 -3034971 -3298058 -2607353 -2177659 -2810240 -3417267 -2622565
47851 -2622565 -1073079 -693127 -1891708 -3020634 -2813828 -1959405 -1639374 -1685156 -1152565
47842 -1152565 -5689 801383 621624 -306492 -1375105 -2020284 -1820526 -901539 -162136
47833 -162136 -416826 -1313581 -1721363 -1167034 -186304 768541 1860789 2977936 3219137
47824 3219137 2015465 199337 -861325 -872706 -561326 -263203 448540 1647185 2531621
47815 2531621 2457685 1821346 1456539 1685786 2371739 3300512 3967555 3614964 2276331
47806 2276331 1289850 1790338 2995761 3125840 1949200 1136060 1790932 2921227 3055576
47797 3055576 2288389 1694747 1483710 940299 -139219 -1078588 -1331769 -967188 -183913
47788 -183913 803992 1415666 1151935 540392 746065 1945741 2912121 2640416 1638237
47779 1638237 1023882 976660 830488 310273 -160442 -315792 -487954 -1016608 -1714806 -2181050
47769 -2181050 -2321327 -2262851 -1938718 -1149172 -99826 484042 133958 -604135 -656432 234088
47759 234088 1113990 1026302 145926 -697491 -1152652 -1369272 -1274501 -683659 13274 175738
47749 175738 -74904 -98710 -63538 -888863 -2481947 -3251863 -2236140 -729838 -640164 -1850275
47739 -1850275 -2506658 -1647438 -222708 598307 917286 1430649 2147031 2429767 1880669
47730 1880669 708859 -521872 -1243427 -1255356 -947819 -889390 -1088239 -1015452 -453433 162727
47720 162727 462444 660890 964347 943061 118188 -1091485 -1719363 -1552491 -1433216 -2053275
47710 -2053275 -3002462 -3415680 -3162956 -2829149 -2676875 -2300113 -1479554 -789679 -879166 -1484847
47700 -1484847 -1754621 -1450641 -1209310 -1496097 -1909536 -1858362 -1453870 -1266998 -1521410 -2025088
47690 -2025088 -2668243 -3423802 -3952894 -3795795 -3009767 -2108345 -1274178 -154563 1368727
47681 1368727 2725459 3327559 3316898 3244821 3271707 3094138 2481383 1456788 49239
47672 49239 -1677183 -3297044 -4116860 -3780753 -2624529 -1389269 -746210 -1010511 -1931015
47663 -1931015 -2664811 -2365991 -1092731 113635 335855 -239639 -745752 -791546 -723332
47654 -723332 -836390 -919617 -759339 -617214 -876054 -1478088 -1982069 -1973585 -1254554 47892
47644 47892 1310240 1731852 1238133 762743 1145075 2002083 2274485 1703246 1049497 863819
47634 863819 818458 505399 224008 533393 1417144 2254655 2364616 1418570 -271480 -1661126
47624 -1661126 -1655786 -265131 1268212 1819590 1517960 1229551 1335945 1478364 1201419
47615 1201419 378332 -796480 -1844938 -2235375 -1903350 -1304310 -692807 221607 1486594
47606 1486594 2263263 1651509 -68146 -1635342 -2133867 -1651942 -868783 -525587 -1051097
47597 -1051097 -2084779 -2557963 -1861428 -726755 -307822 -658158 -909771 -720647 -565674
47588 -565674 -663082 -690586 -716744 -1332456 -2472431 -3065939 -2400552 -1073778 -62389 467076
47578 467076 875873 1224176 1347242 1285982 1095997 638307 12024 -261355 57825 498774
47568 498774 587920 462260 311845 -166059 -1115103 -1904518 -1949502 -1666165 -1725057 -1742912
47558 -1742912 -780699 964202 2050545 1617651 470539 -39714 391434 982278 1042753
47549 1042753 768152 923959 1917962 3247701 4011390 4001434 3934838 4377077 4910705 4844009
47539 4844009 4292199 3859073 3582736 3057386 2417514 2198745 2173426 1390994 -288578
47530 -288578 -1690035 -1900973 -1488782 -1418316 -1507908 -933061 199019 868736 637128 136331
47520 136331 -38333 -31643 -49438 186502 782706 1101440 504306 -698288 -1659610 -2082531
47510 -2082531 -2242628 -2148693 -1516712 -649928 -506829 -1506359 -2862479 -3526544 -3289928
47501 -3289928 -2539240 -1495008 -322610 471282 556920 460817 953149 1882349 2353346
47492 2353346 1948061 994187 -235059 -1615449 -2476185 -1974457 -495419 415732 60543
47483 60543 -459322 50839 1172262 1721421 1467723 973118 349690 -676282 -1801877
47474 -1801877 -2317643 -2092897 -1534098 -788540 134919 713400 393621 -383361 -655618
47465 -655618 -428347 -666606 -1686728 -2563777 -2440075 -1575528 -757029 -380460 -424346 -668361
47455 -668361 -644601 -2297 796375 759282 -357760 -1623721 -2068696 -1707371 -1165566 -847459
47445 -847459 -799612 -924040 -1008010 -906333 -856715 -1194334 -1688558 -1737620 -1346820 -1253270
47435 -1253270 -1820543 -2425883 -2289655 -1422320 -441112 145319 250789 170105 296747 530533
47425 530533 158667 -1089722 -2213496 -2124634 -1396425 -1516778 -2424719 -2384863 -704186
47416 -704186 1079902 1520180 1248696 1583405 2501444 3257855 3842009 4426711 4393341 3389798
47406 3389798 2446261 2459857 2434206 1029931 -855426 -1167242 -21480 290488 -1206103
47397 -1206103 -2790050 -2720425 -1433535 -259882 460201 990129 1190992 951185 745708
47388 745708 930660 1200589 1315960 1521226 1720177 1241571 76183 -695329 -508166
47379 -508166 -317986 -1027304 -1874995 -1612341 -552217 -91721 -617627 -1225666 -1342739
47370 -1342739 -1326619 -1376363 -1054254 -270851 174380 -432145 -1735789 -2715906 -2743142 -1994127
47360 -1994127 -1098038 -565708 -387534 -102681 635877 1650818 2529094 3079417 3211196
47351 3211196 2643262 1242069 -463244 -1638949 -2051936 -2168956 -2322935 -2280774 -1795049
47342 -1795049 -1104919 -561630 -77577 641938 1434309 1655748 957675 -131939 -633254
47333 -633254 -105188 960845 1762882 1969543 1734029 1230359 600988 249540 624617
47324 624617 1537562 2122865 1740899 631097 -514063 -1262838 -1483481 -1078022 -120397
47315 -120397 947751 1661133 1962431 2003455 1699898 850199 -399296 -1545331 -2155551
47306 -2155551 -2095058 -1471863 -645148 -167018 -380472 -1086268 -1826497 -2415922 -2961813 -3472258
47296 -3472258 -3742383 -3598406 -3018734 -2056012 -872835 148827 517080 -90756 -1602878
47287 -1602878 -3408150 -4460979 -3978952 -2313822 -797805 -401199 -834840 -1283579 -1575953
47278 -1575953 -2044416 -2561863 -2534062 -1876221 -1290430 -1349710 -1816372 -2106808 -2015439 -1715876
47268 -1715876 -1376584 -1071060 -876267 -824661 -867791 -1030012 -1480858 -2304048 -3228294 -3689858
47258 -3689858 -3253749 -2082220 -966290 -672085 -1171553 -1760742 -2023999 -2277671 -2795933
47249 -2795933 -3072362 -2415265 -1018438 187615 678348 772082 950286 1293532 1662554
47240 1662554 1963291 2120344 2130321 2139485 2143805 1780134 897389 115237 105255 415492 -140136
47229 -140136 -1828201 -3575008 -4369506 -4189242 -3291337 -1701979 -27024 334887 -1135341
47220 -1135341 -2908547 -3103082 -1951749 -1389953 -2374671 -3857997 -4537190 -4402202 -4055442
47211 -4055442 -3487324 -2335366 -858856 98221 11281 -863551 -1823280 -2268303 -2094231
47202 -2094231 -1751841 -1761640 -2065759 -2131119 -1775818 -1438506 -1384195 -1182416 -485691 116037
47192 116037 -238177 -1345264 -2063330 -1799968 -1091722 -520867 89629 914127 1319808
47183 1319808 625386 -766367 -1821457 -2212512 -2372576 -2380572 -1781074 -627791 255324
47174 255324 390314 187344 -4278 -489617 -1309495 -1650203 -1042273 -401336 -806151 -1785691
47164 -1785691 -2034152 -1493413 -1358748 -2020996 -2391143 -1636428 -390212 337214 469472
47155 469472 434755 262571 -137480 -407472 -187941 279234 573859 733243 993802 1360910
47145 1360910 1901318 2913429 4248386 5036599 4773259 4147893 4022707 4087301 3456454
47136 3456454 2220898 1319863 1012146 597812 -199421 -614525 -24869 1013871 1432467
47127 1432467 896669 -630 -470457 -162467 657640 1302413 1171464 205746 -1175084
47118 -1175084 -2427592 -3035380 -2671097 -1666508 -1056004 -1548448 -2583330 -3028221 -2709183
47109 -2709183 -2503786 -2871146 -3101026 -2328323 -669534 995954 1891919 1719221 677860
47100 677860 -524398 -1090415 -921718 -710969 -1019504 -1589830 -1799202 -1456472 -892200
47091 -892200 -526953 -549406 -782159 -755771 -182795 615444 1091447 1225557 1408888 1620303
47081 1620303 1382523 626568 -121355 -616392 -1220237 -2072572 -2701695 -2818174 -2701948
47072 -2701948 -2374353 -1284057 548825 1962524 2074506 1523210 1373933 1516009 1242874
47063 1242874 777277 884888 1352986 1255300 580198 198741 212951 -194188 -1012874 -994102
47053 -994102 425121 2058680 2606955 2302611 2084869 2060656 1769025 1284483 1040412
47044 1040412 993917 854368 776297 999314 1141455 689983 -82333 -523309 -672788 -1049788
47034 -1049788 -1571034 -1670994 -1455879 -1673859 -2331335 -2361748 -1141011 494605 1341689
47025 1341689 1316940 1213240 1432258 1630220 1346421 370871 -1307751 -3283014 -4546924
47016 -4546924 -4207199 -2562057 -972231 -442096 -706515 -942600 -965131 -1267867 -2080619
47007 -2080619 -2920358 -3192352 -2879483 -2425070 -2157912 -2075367 -2055314 -2010695 -1882345 -1732121
46997 -1732121 -1824868 -2350007 -3063064 -3532811 -3788426 -4284465 -5036368 -5309424 -4620936 -3628499
46987 -3628499 -3347627 -3697019 -3596703 -2525182 -1187141 -423153 -228353 -251197 -529447
46978 -529447 -1094563 -1411010 -987110 -197225 272462 523138 1133431 1906130 1901139 822307
46968 822307 -550014 -1541254 -2263078 -2728611 -2304872 -833426 468350 239168 -1265333
46959 -1265333 -2548259 -2751639 -2266033 -1648160 -959857 -292791 -5235 -109161 -150353
46950 -150353 -4186 -88027 -442770 -358464 559839 1630238 2074512 2194886 2727100 3389787
46940 3389787 3084006 1543026 -130991 -869562 -886081 -1091559 -1732341 -2123842 -1560633
46931 -1560633 -82404 1641966 2910504 3417071 3277727 2801572 2293277 2010924 2096456
46922 2096456 2361401 2259580 1378326 34905 -848528 -643369 307809 1069298 1136055
46913 1136055 911443 1080893 1651761 1902700 1405541 812731 1222810 2789772 4389715
46904 4389715 4808839 3890890 2339916 875020 -17654 40510 966312 1848507 1655315
46895 1655315 468446 -527066 -497174 60155 52914 -903932 -2295996 -3513181 -4369932
46886 -4369932 -4871363 -4849936 -4029267 -2420501 -613359 446763 201388 -937607 -1934851
46877 -1934851 -2146658 -1825319 -1581281 -1641648 -1829050 -2015008 -2266927 -2615671 -2950775 -3183786
46867 -3183786 -3347095 -3465182 -3418614 -3043247 -2423581 -2029816 -2340968 -3188770 -3706643 -3263253
46857 -3263253 -2323877 -1961820 -2537904 -3350967 -3668005 -3520444 -3220537 -2689088 -1784381
46848 -1784381 -871307 -409338 -181843 400276 1254678 1520693 667737 -752814 -1693555
46839 -1693555 -1644004 -900894 -76409 450473 738101 1092117 1625513 2027287 1904066 1287397
46829 1287397 580033 54611 -297441 -437068 -189149 382940 854032 915384 737002 617763
46819 617763 472605 -24002 -822452 -1288324 -751883 736528 2269242 2850496 2393172
46810 2393172 1766695 1663528 1704120 1144066 276072 323479 1700862 3143288 3154439 1823937
46800 1823937 540939 260339 797308 1588274 2239670 2307180 1477100 294250 -69504
46791 -69504 766036 1826519 2104625 1794839 1586860 1376011 628781 -316635 -405391 632415
46781 632415 1852868 2338227 2033426 1148779 -315202 -1961343 -2801265 -2447212 -1886162
46772 -1886162 -2214377 -3043413 -3108551 -2211103 -1500920 -1733276 -2195476 -1749305 -275972
46763 -275972 1350350 2279348 2284534 1670515 948450 472008 228476 83389 116968 349476
46753 349476 245009 -866465 -2709635 -4035420 -4024547 -3227114 -2729014 -2848678 -3107251
46744 -3107251 -3069578 -2655455 -1880382 -846258 112752 702703 1015210 1299336 1543434
46735 1543434 1580220 1426654 1234318 1095349 1111714 1340327 1450747 941852 83589 28169
46725 28169 1313645 2777133 2827091 1460176 89417 -376847 -231288 132209 781807
46716 781807 1465415 1386919 266798 -1209026 -2409449 -3365544 -3922953 -3307893 -1342604
46707 -1342604 707636 1475853 1164395 939895 1089184 851241 -64994 -878582 -858373
46698 -858373 -243282 256186 295179 -28308 -429210 -471664 229211 1459107 2282197 1825647
46688 1825647 178539 -1638511 -2560618 -2248321 -1066650 472351 2049553 3336643
46680 3336643 3781976 2999980 1393862 37908 -237336 524366 1694215 2655485 3043002
46671 3043002 2802817 2264202 1889349 1783292 1710334 1621194 1677896 1649460 965915 -265566
46661 -265566 -980182 -457245 677400 1395069 1631789 1904388 2101999 1738799 1138246
46652 1138246 1196328 1948429 2457850 2275173 1929625 1683444 936230 -511713 -1567185
46643 -1567185 -1112155 390695 1398129 1084362 -52474 -1134316 -1757013 -1967097 -1984382
46634 -1984382 -2062603 -2294089 -2493741 -2460910 -2291819 -2246783 -2390377 -2515755 -2334144 -1668217
46624 -1668217 -644870 234453 485524 227456 97196 445792 932696 1074124 847547
46615 847547 558138 455637 671427 1130311 1324470 688508 -503387 -1212901 -1054230
46606 -1054230 -958440 -1709495 -2458268 -1778715 112187 1444348 1290497 651675 718301
46597 718301 1168126 1013808 325491 15319 253416 201533 -586726 -1406758 -1412979 -767019
46587 -767019 -302827 -418257 -778205 -931102 -785032 -536515 -485949 -886946 -1635840 -2142413
46577 -2142413 -1904627 -1231603 -937731 -1216805 -1354059 -805184 7759 408001 436178 513077
46567 513077 595362 422667 243291 400209 454102 -219470 -1069677 -887843 102415 61368
46557 61368 -1881474 -4062489 -4315144 -2704982 -1153060 -966824 -1879719 -3112486 -4187729
46548 -4187729 -4785446 -4786863 -4528518 -4360627 -4111214 -3600639 -3278630 -3501601 -3611841 -2830903
46538 -2830903 -1754220 -1676290 -2547050 -2989069 -2448463 -1878011 -1935626 -1966683 -1407042 -826329
46528 -826329 -703504 -401212 537046 1108022 197482 -1481855 -2184250 -1525437 -804163
46519 -804163 -1024584 -1750685 -2065670 -1737450 -1158430 -766381 -754714 -961411 -1008741 -854827
46509 -854827 -970499 -1506289 -1650462 -594987 1038449 1662638 742581 -477714 -584752
46500 -584752 343926 1137925 1100804 613161 341915 344461 119266 -623863 -1476995 -1763743
46490 -1763743 -1352959 -743457 -319420 67270 608504 1094372 1263786 1167929 825688 9136
46480 9136 -1139579 -1804067 -1502062 -983285 -1311274 -2342051 -2991840 -2829896 -2456519 -2342714
46470 -2342714 -2284656 -2159601 -2290885 -2733449 -2932465 -2422617 -1304179 116519 1499838
46461 1499838 2196696 1643314 305451 -569969 -480942 -178875 -325642 -534744 -279900
46452 -279900 101572 59550 -173512 -43937 324156 356640 -38827 -411642 -428577 -134006
46442 -134006 175478 -13267 -1097666 -2693342 -3816594 -4129567 -4358230 -4966480 -5201484
46433 -5201484 -4249068 -2648440 -1591091 -1338536 -1337001 -1422974 -1780758 -2046047 -1682002 -1107728
46423 -1107728 -1256357 -2039233 -2419765 -2035306 -1520256 -1121409 -376193 465238 141043
46414 141043 -1700016 -3434535 -3341626 -1770642 -484446 -461494 -1312419 -2387603 -3379015
46405 -3379015 -3964667 -3816481 -3108481 -2398417 -1907143 -1412326 -907756 -828167 -1375246 -1992787
46395 -1992787 -1904609 -1137200 -690957 -1456078 -3070170 -4243911 -4318607 -3985107 -4079046 -4231103
46385 -4231103 -3485815 -1906479 -570191 -47059 63903 -5837 -622336 -1643595 -2031335
46376 -2031335 -1267602 -248465 -15788 -425503 -880414 -1527200 -2650691 -3525022 -3102622
46367 -3102622 -1554137 -29657 928357 1705269 2465775 2724685 2160353 1049173 -163370
46358 -163370 -1057141 -1147859 -407134 271571 28256 -651948 -587186 196770 397412 -541769
46348 -541769 -1554494 -1542358 -734820 128201 912930 1577876 1457214 133938 -1487281
46339 -1487281 -2030985 -1386512 -752111 -1028491 -1887449 -2442261 -2218781 -1349241 -285080
46330 -285080 475681 614746 105487 -887342 -2080396 -2986533 -3048729 -2139432 -826667
46321 -826667 28965 -109298 -1187341 -2593716 -3402971 -2988979 -1626845 -240132 549248
46312 549248 803979 703590 183486 -591955 -952346 -394557 761060 1725356 1982452
46303 1982452 1486286 562588 -107987 80850 855285 1157102 456600 -527977 -868850
46294 -868850 -612001 -351936 -232855 -145475 -410322 -1344347 -2461139 -3000152 -3011491 -3041141
46284 -3041141 -3024713 -2523685 -1865096 -1867655 -2432840 -2623580 -2286946 -2291128 -2772591 -2521515
46274 -2521515 -874471 969319 1536858 1053928 695909 621975 103378 -787014 -1043157
46265 -1043157 -344593 400483 427944 58055 -135466 -264235 -687980 -1242959 -1510412 -1513241
46255 -1513241 -1642866 -2094558 -2723262 -3217837 -3102250 -1917033 84631 1666058 1707326
46246 1707326 597339 -113240 359413 1072760 727452 -564540 -1576598 -1743813 -1775903
46237 -1775903 -2374610 -3124848 -3141521 -2354574 -1593381 -1568025 -2196886 -2870230 -3058877 -2709601
46227 -2709601 -2260416 -2185772 -2407842 -2395674 -1993220 -1720462 -1890050 -1896276 -1030092 285316
46217 285316 842745 177922 -952952 -1619472 -1524041 -731894 543002 1588074 1424898
46208 1424898 -66834 -1743641 -2350308 -1690733 -397229 867683 1546076 1123822 -393146
46199 -393146 -2229722 -3566450 -4254795 -4488487 -4267786 -3695153 -3267641 -3177804 -2760159
46190 -2760159 -1427933 194388 967881 810348 569067 459996 -178116 -1370595 -1939882
46181 -1939882 -1063848 471589 1301201 1140259 699223 443360 243786 -13537 -267983
46172 -267983 -671647 -1445828 -2277753 -2442347 -1708859 -705908 -208309 -400601 -990512
46163 -990512 -1673948 -2228664 -2455927 -2391161 -2410472 -2761486 -3064210 -2686410 -1666491 -824929
46153 -824929 -718454 -870712 -474295 398335 884130 599967 149447 108760 135412 -371588
46143 -371588 -1141946 -1274026 -482074 588746 1391898 2193509 3433206 4807585 5441013
46134 5441013 4834779 3339518 1747690 661553 258140 436393 983579 1548692 1628235
46125 1628235 922986 -144889 -598617 20622 922027 908476 -63784 -746827 -227594
46116 -227594 858584 1185920 430707 -491477 -756757 -561229 -528456 -690325 -523644 141995
46106 141995 732716 644233 92593 -78106 570514 1518060 1887043 1362005 312952 -767408
46096 -767408 -1596058 -1969760 -1758101 -1180546 -772953 -834412 -1069846 -988102 -546446 -198545
46086 -198545 -337817 -850985 -1238654 -1092110 -446172 273464 624086 481566 29723 -531449
46076 -531449 -1201584 -2070047 -2985818 -3398117 -2727340 -1091586 455632 765421 -263586
46067 -263586 -1683260 -2652449 -3098815 -3073081 -2188395 -370408 1336733 1652698 654028
46058 654028 -343243 -497817 -191672 35675 317699 794906 987486 517733 -140736 -343518
46048 -343518 -256924 -452437 -889726 -1073726 -982179 -1011079 -1067949 -569771 480151 1148131
46038 1148131 690359 -443741 -1116676 -745596 271315 1193422 1695371 1979510 2302334
46029 2302334 2546383 2399375 1908130 1514639 1371614 1033396 250558 -305658 159742
46020 159742 1157380 1183824 -313899 -1992076 -2175499 -867339 431818 590561 -156064
46011 -156064 -933851 -1204402 -876315 -99353 673552 832150 242170 -484059 -695665 -494819
46001 -494819 -476505 -868410 -1366568 -1712342 -1924692 -1980124 -1840897 -1898107 -2719556 -4040183
45991 -4040183 -4640237 -3736987 -1968450 -413270 800885 2091637 3129034 3123895 2305738
45982 2305738 1887990 2304626 2573576 1846992 592595 -339291 -884872 -1277583 -1252485
45973 -1252485 -659653 -204548 -559567 -1184481 -1016330 -1587 1004148 1554208 1837215
45964 1837215 1861592 1521555 1338289 1963813 2943703 3200813 2889819 3400745 5040326
45955 5040326 6077041 5036854 2935818 2055525 3052754 4403848 4479106 3169128 1454561
45946 1454561 221036 -249031 -169116 8581 -80161 -450672 -788397 -657409 227236 1631830
45936 1631830 2695209 2625491 1664168 894925 854371 858847 114800 -1011442 -1438967 -779182
45926 -779182 316367 1044107 1126450 739075 343690 545966 1531443 2556342 2512856 1187285
45916 1187285 -417926 -1187079 -1002180 -583952 -523555 -748628 -814164 -429769 376954 1433244
45906 1433244 2479259 2977618 2222628 131625 -2136298 -2982109 -2070385 -757332 -470374
45897 -470374 -1135009 -1694142 -1701041 -1613115 -1715101 -1632840 -1060951 -277645 331615 735848
45887 735848 986485 972654 760191 731529 986484 950746 59415 -1359107 -2347354 -2396010
45877 -2396010 -1833906 -1155209 -434241 399818 1103995 1336912 1197739 1164814 1457108 1759069
45867 1759069 1680004 1202603 510327 -327174 -1189949 -1670715 -1437357 -748987 -192132 60370
45857 60370 287469 540013 470353 -42811 -643665 -1068306 -1420033 -1644979 -1374180 -685551
45847 -685551 -366630 -829688 -1353340 -1136832 -576002 -554372 -851782 -413278 860265 1778357
45837 1778357 1569233 835340 317614 -310861 -1636388 -3174900 -3785049 -3156513 -2126952
45828 -2126952 -1580617 -1617077 -1812949 -1812997 -1562704 -1282512 -1301389 -1722105 -2250145 -2513619
45818 -2513619 -2477535 -2346840 -2153170 -1689693 -830386 296078 1415923 2185410 2226965
45809 2226965 1424334 278616 -326590 31087 818988 1121664 640797 -128107 -688007
45800 -688007 -1106171 -1562835 -1726296 -1133988 -98154 420374 49074 -452030 -271038
45791 -271038 301386 347744 -355925 -1127960 -1355061 -1044709 -415299 405548 1079503 1016217
45781 1016217 16165 -1317783 -2109831 -2039954 -1525559 -1220422 -1408482 -1783253 -1834060
45772 -1834060 -1521982 -1352586 -1526823 -1332801 56464 2278258 3907728 4011498 3048321
45763 3048321 2057376 1470385 1027641 473457 -69206 -325369 -284691 -361890 -978786 -1846079
45753 -1846079 -2025127 -1132373 -104032 -78946 -811102 -1071540 -460318 236288 497974
45744 497974 674788 891683 625187 -83992 -224679 581571 1173615 527132 -623800
45735 -623800 -965246 -586370 -518259 -905439 -991385 -571217 -159209 101504 498812 868705
45725 868705 816132 692040 1158239 1866501 1844137 1194218 1015940 1426280 1128536 -500098
45715 -500098 -2191468 -2428854 -1300945 34058 839065 971484 398342 -515832 -777489
45706 -777489 274694 2028256 3234157 3331675 2715786 2090266 2005263 2608537 3380326
45697 3380326 3486188 2748646 1796134 968020 -171553 -1702479 -2573579 -1855119 -199360
45688 -199360 914798 1035602 909853 1078033 1283415 1220008 979524 666858 265187 -57020
45678 -57020 -88590 9352 9990 221810 1088328 2239237 2671102 1923197 439468 -1183113
45668 -1183113 -2544622 -3091657 -2420221 -1201569 -868069 -1867050 -2960191 -2805064 -1580914
45659 -1580914 -419592 195213 664366 1246355 1623232 1474937 880711 88252 -679174
45650 -679174 -1152213 -1127595 -683006 29934 1164375 2934612 4922200 6066869 5654791
45641 5654791 4125113 2645466 2000763 2122930 2595311 3234592 4029893 4803280 5251477
45632 5251477 5226528 4693219 3534677 1859538 497631 509745 1801735 2791766 2154798
45623 2154798 601179 101153 1361400 2908037 2951024 1468840 -19372 -274551 596605
45614 596605 1631806 2079856 2026458 2224549 3247503 4711939 5546920 5148231 3996768
45605 3996768 3023606 2738298 3145654 3994193 4701293 4506079 3295257 2004939 1630081
45596 1630081 2069181 2555898 2966920 3841430 5117919 5828837 5455627 4837801 5116658
45587 5116658 6215079 6993584 6708992 5761521 5036114 4953440 5255069 5435549 5266068
45578 5266068 5013351 5196144 6101240 7563571 9146691 10330205 10576679 9654670 8097952
45569 8097952 6935812 6616691 6533583 6016002 5388935 5383717 5773193 5542042 4551075 4095023
45559 4095023 5273197 7473538 9145576 9613478 9374090 8929505 8266795 7526255 7273199
45550 7273199 7700625 8162201 7965562 7240531 6599191 6273655 6069448 5925296 5957834 6011834
45540 6011834 5705630 5043795 4563106 4641617 4930637 4737682 3878905 2947585 2694700 3201734
45530 3201734 3757475 3676806 3206332 3304595 4333004 5322189 5026009 3538251 2230117
45521 2230117 2000422 2241705 1874348 823577 -124395 -589572 -987949 -1656801 -2231356
45512 -2231356 -2160274 -1464697 -679408 -214240 -13670 213572 589949 910536 861127 418807
45502 418807 -2312 93155 777233 1621638 2089829 1920970 1215440 337152 -259700 -283059
45492 -283059 228872 1012477 1785617 2283345 2266453 1748163 1145398 938031 1181764 1563506
45482 1563506 1838741 1897835 1515952 556629 -492770 -733486 113816 1292232 1888215
45473 1888215 1705707 966484 -300075 -1964173 -3293717 -3536776 -2903081 -2242733 -1755843
45464 -1755843 -798576 839894 2248248 2473963 1789171 1328608 1743151 2697721 3525289
45455 3525289 3889386 3811225 3434442 2894961 2279535 1697678 1462669 2050351 3637028
45446 3637028 5676389 7112556 7134886 5817810 4122271 3187863 3371535 3933065 3863452
45437 3863452 2995884 1999741 1347324 839512 295301 48295 305703 551802 217501
45428 217501 -411820 -620194 -331596 -43661 127816 521534 1044828 1040551 238288 -866200
45418 -866200 -1812344 -2648827 -3288371 -3126281 -1857304 -138035 1152056 1900614 2441278
45409 2441278 2645321 2072304 864438 -227745 -765294 -1003712 -1246236 -1311482 -895119
45400 -895119 -169170 251047 -89844 -969927 -1590055 -1326494 -443992 172077 122257 -12634
45390 -12634 416471 1076011 1032463 20046 -1223820 -1866594 -1726397 -1095624 -343446 175837
45380 175837 290877 309121 780323 1750783 2564096 2608554 1985458 1256843 835906 852960
45370 852960 1311906 2022123 2517898 2372530 1612632 701580 162289 234408 698068 941129
45360 941129 447834 -598632 -1401859 -1408741 -844514 -195718 503357 1446674 2349225 2585708
45350 2585708 2136829 1849605 2394107 3281905 3392303 2418862 1357078 1379234 2495137
45341 2495137 3595659 3709262 2938452 2159520 2070269 2631835 3224097 3189620 2377233 1303024
45331 1303024 662198 608618 734436 842314 1322470 2437793 3657395 4299405 4587699
45322 4587699 5312374 6455610 6970713 6174807 4639476 3321139 2491481 2056657 2255769
45313 2255769 3184312 3996727 3574050 2035612 800269 932692 2025674 2955697 3209892
45304 3209892 3139309 3310805 3968384 4848391 5209518 4327548 2371520 643393 506812
45295 506812 2001591 3761991 4348719 3471330 1916425 611926 -5099 88458 753981
45286 753981 1668833 2298573 2267261 1814364 1607480 1943470 2361416 2285463 1845972 1666019
45276 1666019 1886801 1902834 1278051 518836 519566 1425647 2503108 3124284 3424515 3816538
45266 3816538 4265088 4401756 4113795 3582870 2850864 1862647 1004995 1027378 2068792
45257 2068792 3183166 3342795 2676419 2158331 2218311 2356170 2215145 2280190 3086526 4290564
45247 4290564 5108454 5344247 5373187 5303198 4844108 4054526 3583548 3900009 4701348 5366230
45237 5366230 5659436 5685723 5449208 4900384 4316834 4199570 4699440 5445271 6068182 6647126
45227 6647126 7457800 8509609 9628239 10875892 12508608 14468335 16283539 17653528
45219 17653528 18820762 20118282 21470048 22743696 24367181 27063939 31026688 35850132
45211 35850132 41255180 47296127 53795938 60318599 67049707 75004304 84685110 94871583
45203 94871583 103327240 108470473 109849754 107377994 101039606 91497897 80283017 68982285
45195 68982285 58499684 49189147 41273322 34834848 29618927 25134632 21000672 17227842
45187 17227842 14224254 12381255 11485348 10711588 9447939 7953497 6910323 6536146
45179 6536146 6513705 6542062 6410037 5714336 4242340 2680875 2193239 3008958 4022972
45170 4022972 4115180 3337616 2435760 1745993 1130051 628478 492147 614963 485230 -167101
45160 -167101 -1021278 -1628616 -1994885 -2450475 -2968919 -2899222 -1666959 315284 1854491
45151 1854491 2286795 2182631 2393583 2795475 2544271 1308549 -417101 -2048627 -3225641
45142 -3225641 -3516286 -2703569 -1438515 -703440 -430621 414633 2074242 3347624 3279315
45133 3279315 2586384 2633125 3665451 4817392 5281873 4744832 3240367 1369087 167434
45124 167434 13201 170576 108873 512884 1974095 3410673 3170620 1343956 -401801
45115 -401801 -1098312 -1192667 -1080345 -488755 405279 729670 352421 312612 1174237 2074848
45105 2074848 2136459 1775577 1743955 1771457 1172027 146543 -539835 -759234 -953480 -1112870
45095 -1112870 -684500 526225 1947209 2710410 2219088 520391 -1509455 -2667481 -2520863
45086 -2520863 -1741050 -1112852 -728209 -498823 -742143 -1574211 -2301037 -2240106 -1744484 -1593657
45076 -1593657 -1722950 -1441041 -639385 159236 800197 1559668 2227670 2132320 1259984 458229
45066 458229 238715 153837 -320328 -1000258 -1464335 -1656501 -1596467 -1053547 -2345 997839
45056 997839 1323219 916187 135729 -636984 -957181 -349665 1136131 2677662 3418133
45047 3418133 3293310 2850461 2541939 2568954 3116633 4178684 5199537 5384880 4510467
45038 4510467 3174761 2180891 1845451 1925049 2016032 1928148 1741986 1576369 1378745 1064153
45028 1064153 828964 1071376 1846216 2570193 2494662 1463382 109106 -679288 -487654
45019 -487654 286040 765714 390763 -571840 -1402940 -1757374 -1871786 -1984486 -1973850 -1768445
45009 -1768445 -1710653 -2094200 -2546274 -2352882 -1424684 -551165 -523346 -1218271 -1731057 -1315956
44999 -1315956 -61555 1294000 2032916 1909118 1156407 322698 62608 715828 1847710
44990 1847710 2459186 2001142 1049811 616007 889407 1106828 632209 -350331 -1302864
44981 -1302864 -1926204 -2032635 -1358666 35702 1473100 2173291 1905830 921824 -408270
44972 -408270 -1535841 -1703910 -589696 1087164 2067231 1708602 415161 -921383 -1563848
44963 -1563848 -1192449 813 1449244 2701573 3678482 4244650 3909630 2499170 870453
44954 870453 248400 874136 1948993 2879044 3788023 4674986 4974436 4443113 3782380
44945 3782380 3737436 4053980 3996612 3587652 3646885 4726540 6596115 8728901 10738687
44936 10738687 12293334 13142160 13481439 13988635 15227262 17059188 18683375 19210536 18311227
44927 18311227 16479197 14625604 13306941 12429719 11729331 11215260 10916514 10528701 9728711
44918 9728711 8624583 7477267 6231689 4883495 4070945 4473261 5571684 5889667 4804388
44909 4804388 3336633 2628649 2372999 1531215 74188 -995749 -1191338 -1131345 -1454855
44900 -1454855 -1966887 -2160050 -1931953 -1434798 -765499 -192468 -200370 -862064 -1560809 -1777224
44890 -1777224 -1768287 -1978445 -2181144 -1860774 -1169940 -754248 -741621 -686874 -528782 -759025
44880 -759025 -1433685 -1854020 -1657635 -1484619 -1944333 -2515066 -2244169 -1167854 -188511
44871 -188511 323024 945047 2085168 3175315 3383426 2713547 1973603 1778930 1884384
44862 1884384 1563012 557366 -489853 -734529 -201820 227474 17347 -355610 -288763
44853 -288763 -31790 -106038 -203735 378010 1372173 1669811 953934 216256 318154 948160
44843 948160 1443955 1734899 1850650 1379955 301900 -333952 384333 1750773 2248668
44834 2248668 1656756 1281988 2042269 3308305 3923746 3567615 2722881 1921517 1460420
44825 1460420 1439771 1663006 1714197 1397274 968818 852061 1275661 2141591 3000320 3279988
44815 3279988 2900972 2514750 2652024 2777737 1845749 -207238 -2233003 -3273207 -3477347
44806 -3477347 -3377796 -2992884 -2120870 -961135 81191 833167 1214822 1100037 725904
44797 725904 778384 1558377 2421429 2534000 1859525 957903 229091 -105487 272279 1331946
44787 1331946 2277224 2367161 1977378 2028016 2459214 2225608 968829 -236350 -284691 475993
44777 475993 750349 -112596 -1589853 -2823766 -3441293 -3514837 -3126487 -2244469 -1003289
44768 -1003289 71835 353390 -261594 -1178681 -1745997 -1918056 -2055681 -2256246 -2250685 -1875937
44758 -1875937 -1257667 -539134 216460 883492 1405670 2014282 2874189 3575141 3562049 3118884
44748 3118884 3214228 4086647 4683945 4056349 2799067 2430271 3601910 5589033 7422073
44739 7422073 8825741 9948346 10817794 11438294 12055124 12903378 13814809 14397061 14590249
44730 14590249 14786871 15330045 16092108 16689523 16982835 17173780 17463968 17817436 18042268
44721 18042268 17900472 17177413 15944602 14742454 14073591 13638020 12638045 11074102 10013201
44712 10013201 10023080 10092119 9057341 7540947 7162497 8009619 8363006 7184071 5417437
44703 5417437 4206237 3225330 1848795 805953 1204340 2540539 3200924 2754288 2395200
44694 2395200 3069459 4383231 5560400 6308934 6338275 5103869 2740824 522774 -368346
44685 -368346 -144933 84191 -207867 -542217 -308599 464466 1277397 1808770 2234750 2864732
44675 2864732 3508593 3512220 2688457 1875455 1999598 2766026 3009020 2323629 1508537 1229405
44665 1229405 1200834 1154849 1663610 3147210 4740556 5205035 4666757 4423187 5074750
44656 5074750 5827288 5847076 5441373 5428466 5906687 6202511 5806435 4936096 4209615 3990503
44646 3990503 4085112 4050354 3798752 3754166 4236250 4857622 4875735 4118959 3239791 3021451
44636 3021451 3698448 4920801 6044923 6491574 6259441 6149630 7017809 8671310 10000664
44627 10000664 10411172 10561669 11289076 12325060 12680129 11949320 10544825 8825182 6780447
44618 6780447 4656637 3161522 2712801 2937465 3211072 3314672 3287260 3043119 2568134
44609 2568134 2248446 2544622 3396240 4275921 4795783 4996005 5087542 5195724 5375692 5638369
44599 5638369 5868729 5827328 5302242 4309265 3261578 2887310 3644428 5082325 6138882
44590 6138882 6311915 6150612 6252883 6294970 5727009 5027149 5258377 6390588 7118508
44581 7118508 6704498 6073015 6442718 7575968 8176634 7594954 6338231 5115791 4157763
44572 4157763 3480415 3185372 3337491 3909998 4897519 6218980 7598149 8831932 10027669
44563 10027669 11268552 12295405 12949898 13673724 15000135 16700607 18000462 18497411
44555 18497411 18278429 17356267 15817081 14423201 14032054 14208458 13455429 11311528 9270286
44546 9270286 8880511 9710048 10137699 9633340 9136255 9312391 9540547 8933704 7584920
44537 7584920 6304293 5548651 5114724 4760043 4706029 5359643 6661300 7938999 8579016
44528 8579016 8761921 9254673 10395994 11562825 11833867 10995247 9707927 8852971 8893840
44519 8893840 9687303 10634345 11060779 10665576 9660260 8475110 7410240 6534515 5730364
44510 5730364 4824286 3857644 3169844 2940669 2761002 2112821 1255796 1065275 1854975
44501 1854975 2931693 3534516 3637407 3548547 3346166 3109853 3093668 3169152 2680169 1437644
44491 1437644 324970 264824 1050655 1839849 2290596 2495058 2354849 1924393 1880475 2624442
44481 2624442 3328393 3010140 2216416 2334108 3414864 4145254 4035838 4087011 4912629
44472 4912629 5727224 5862469 5891775 6349125 6566878 5893067 5049855 5031996 5408736 5031438
44462 5031438 3928056 3177377 3152135 3152810 2782708 2561831 2983141 3845596 4743647 5492489
44452 5492489 5866488 5563747 4688860 3823327 3471470 3771547 4664089 5833403 6554976
44443 6554976 6229779 5147731 4204351 3872562 4047149 4826019 6526704 8632499 9622738
44434 9622738 8564386 6390546 4902210 4766620 5156413 5200790 4994604 4942943 4764521
44425 4764521 3762520 1915069 119007 -792691 -853026 -535124 36806 920204 1668520
44416 1668520 1596187 852243 531739 1384939 2955487 4322786 5109697 5335558 4942816
44407 4942816 4157197 3784751 4313100 5047005 4957038 4124099 3499045 3468066 3604862 3701514
44397 3701514 3996774 4362395 4323791 4026693 4120480 4477781 4188073 3187744 2648301 3101987
44387 3101987 3394828 2434450 921027 194120 238750 198946 246182 1362233 3422249
44378 3422249 4977945 5154022 4562816 4070582 3771619 3573221 3747181 4304506 4640128
44369 4640128 4424441 4174602 4306695 4239234 3217135 1631580 722806 1132983 2439241
44360 2439241 4029879 5707283 7255512 8048775 7596605 6318552 5369556 5527480 6352412
44351 6352412 6635865 5744999 4322548 3450150 3347831 3371748 3230049 3502273 4619727
44342 4619727 5924137 6374477 5911833 5468528 5685698 6217864 6380572 5959672 5205866
44333 5205866 4461475 4011681 3962223 4068027 4006288 3976059 4592630 5902058 6975068 6987474
44323 6987474 6368455 6259064 7026327 8003770 8634095 9060761 9416321 9357990 8778789 8295293
44313 8295293 8382254 8539850 8067290 7264955 6985156 7225175 7197519 6823767 7049566 8293646
44303 8293646 9581042 9876111 9492463 9381780 9647944 9729650 9668414 10109097 11068653 11684610
44293 11684610 11418833 10765391 10482051 10729280 11271461 12004892 12928786 13949272 14983367
44284 14983367 15983946 16742220 17014189 16913657 16754765 16483146 15859713 15294565 15691909
44275 15691909 17093023 18255618 18190485 17478515 17349340 17991304 18605464 18754109 18781498
44266 18781498 19122830 20011999 21655076 23817544 25425546 25588764 24996618 25258092 26776001
44257 26776001 28403494 29437283 30673017 32889676 35495075 37609255 39515421 41903129
44249 41903129 44435901 46422360 48482472 52066705 57274004 62465765 66400940 69681533
44241 69681533 73599679 78508313 84058806 90372116 98064349 107294775 117492919 128132170
44233 128132170 139422673 152154616 167002177 183963072 202394622 221640292 241606098
44226 241606098 262587662 284573112 306897135 328426764 347656926 362642624 371461174
44219 371461174 373177293 368195900 357548491 342172817 323061700 301606138 279220690
44212 279220690 256729645 234513638 213194431 193770211 176946682 162525631 149579782
44205 149579782 137239576 125377707 114589686 105477214 97972219 91440345 85327170
44198 85327170 79462824 73835906 68484774 63685378 59843833 57041571 55026588 53754257
44190 53754257 53445768 53847172 53931690 52810430 50668021 48435208 46829478 46055218 46032337
44181 46032337 46368663 46380852 45746758 45030330 45073669 45987572 47176669 48158584 48855631
44172 48855631 49316156 49776781 50814165 52701520 54700611 55790606 56118806 56849654 58364615
44163 58364615 59488103 58940534 56853220 54333634 52124618 50260148 48555812 46798818
44155 46798818 44750436 42519453 40706586 39686402 38975162 37831226 36309067 35156447
44147 35156447 34707142 34411297 33587021 32242490 30938161 30049375 29426992 28845785 28653458
44138 28653458 29668630 32209929 35464296 38251074 40291208 42195317 44335463 46576787
44130 46576787 49261951 53412097 59315295 65738739 71367754 76362080 81511022 86387915
44122 86387915 89553694 90371678 89379749 86844533 82255178 75668885 68447382 61966925
44114 61966925 56335380 50992897 45898893 41408133 37484124 33816817 30466113 27739653
44106 27739653 25600649 23759367 22215997 21165714 20411345 19360471 17667190 15569514
44098 15569514 13610732 12276929 11784638 11904169 12095456 12127390 12394295 13207436 13935393
44089 13935393 13445837 11489155 9123389 7553866 6955569 6667033 6145595 5386783 4698032
44080 4698032 4470892 5006222 6122409 6972303 6703309 5461996 4415122 4512122 5421492
44071 5421492 6000769 5732747 5305431 5631541 6639812 7421276 7450057 7161230 7136400 7150139
44061 7150139 6507198 5193920 4153714 4243301 5280443 6370163 6875087 6734343 6084526
44052 6084526 5101080 4226329 4024915 4534245 5070822 4986987 4425961 4035045 4087092 4235954
44042 4235954 4106228 3796952 3718321 4120734 4830134 5325321 5137147 4357556 3676200 3689897
44032 3689897 4288165 5007499 5797692 6903562 8039055 8399531 7784969 7108562 7319759
44023 7319759 8245447 8987678 9110086 8877095 8604334 8429639 8631618 9539872 11032854
44014 11032854 12559660 13719849 14489745 14947958 15201470 15528689 16127822 16737289 16965282
44005 16965282 16953938 17188826 17684059 18001540 18149740 18745476 20042834 21475345 22503668
43996 22503668 23302991 24234980 25280428 26478545 28264646 30676030 32756917 33598991
43988 33598991 33650394 34125126 35309547 36403021 37042929 37950477 39646509 41333649 41751106
43979 41751106 40760870 39419256 38545741 37781134 36277793 33994335 31873941 30661332
43971 30661332 29940002 28797786 27282649 26465862 26796037 27113521 25951662 23335461 20495518
43962 20495518 18144255 16041115 14180646 13232390 13394977 13753695 13397635 12513653 11778988
43953 11778988 11290411 10806633 10529533 10772600 11127623 10829831 9884071 9061467 8770745
43944 8770745 8664264 8434279 8252435 8221614 8104010 7902104 8039221 8538113 8642110 7837651
43934 7837651 6773407 6474530 6940264 7231356 6808052 6081316 5636700 5568636 5700552
43925 5700552 5883271 5906108 5651521 5529521 6178599 7431629 8173392 7715360 6815572
43916 6815572 6699619 7429637 8008987 7946900 7863217 8384959 9199832 9610005 9492767 9207116
43906 9207116 8874816 8315048 7622660 7324585 7786932 8682887 9227647 8933802 8096855
43897 8096855 7519486 7749820 8644090 9713119 10735434 11812916 12938600 13889397 14640091
43888 14640091 15562807 17029070 19037273 21394201 24028225 26927869 30018866 33385769
43880 33385769 37429890 42458491 48172674 53867827 59149437 64182306 69159441 73724255
43872 73724255 77036043 78334319 77412892 74652799 70702784 66163719 61549719 57397823
43864 57397823 54181823 52039110 50713143 49859892 49369683 49424898 50390429 52605909 56026577
43855 56026577 60007407 63676083 66590787 68806040 70289311 70656139 69605380 67204278
43847 67204278 63532668 58502806 52414266 46317631 41324324 37694569 34919074 32445483
43839 32445483 29971732 27350102 24709282 22466514 20761642 19133367 17253465 15625028
43831 15625028 14824820 14324050 13006376 10843741 9068774 8448727 8318075 7753184 6874652
43822 6874652 6370817 6368021 6458394 6402505 6153021 5534711 4559425 3816258 3908551 4625686
43812 4625686 5213350 5339830 5268332 5203447 5066444 4898674 4893919 4935351 4624799 3919484
43802 3919484 3258651 2859875 2353218 1426008 469059 193592 805237 1896836 3004427
43793 3004427 3905669 4458880 4590306 4551096 4809111 5422947 5779854 5313276 4346332 3769387
43783 3769387 3837966 3809456 3088989 2300603 2615553 4112711 5409481 5111750 3247981
43774 3247981 1074340 -208268 -296027 366545 1182678 1840257 2357588 2808603 3081746
43765 3081746 2981561 2463123 1620168 602552 -209355 -194384 845208 2116369 2555343
43756 2555343 2171006 2008605 2613495 3298099 3333732 3111042 3444446 4302982 5052962 5598324
43746 5598324 6411453 7600170 8817860 10136144 12189627 15169192 18194170 19935957
43738 19935957 19572783 17168980 13621389 10296070 8175197 7127663 6317562 5330383
43730 5330383 4455280 3884600 3282555 2356986 1292893 326140 -610042 -1460004 -1708651
43721 -1708651 -912572 670092 2282098 3280312 3403695 2858487 2404876 2853428 4005204
43712 4005204 4527088 3509412 1854378 1361476 2490012 3798137 3798472 2688569 1800684
43703 1800684 1817123 2173114 2107259 1656623 1341011 1271754 1091810 770225 922830 1988252
43693 1988252 3372737 3944991 3409647 2717863 2905118 3899557 4815941 5166928 5341483
43684 5341483 5942880 7075186 8417591 9719781 10996572 12349592 13835115 15560494
43676 15560494 17747786 20530803 23730177 27042352 30491153 34388430 38611999 42196536
43668 42196536 44068706 44083076 42890804 40875712 37835730 33821358 29599198 25892798
43660 25892798 22692630 19770781 17366572 15737901 14438064 12833606 11161709 10228479
43652 10228479 10018483 9453826 7839480 5843450 4568018 4165374 3937510 3480909 3111297
43643 3111297 3215557 3685789 4098536 4152709 3838555 3381477 3097186 3156603 3424885 3614778
43633 3614778 3625692 3661894 3990517 4612704 5186123 5306627 4934332 4517761 4588421 5247957
43623 5247957 6181973 7105681 7919408 8421050 8273699 7493648 6663676 6350010 6511417
43614 6511417 6748061 6851802 6740435 6169560 5101398 4180074 4124968 4654776 4788050
43605 4788050 4357597 4335923 5222870 6022325 5663495 4766584 4860327 6116651 7065181 6653897
43595 6653897 5447443 4376788 3354701 1906828 439757 -113827 345563 932091 978319
43586 978319 737652 789012 1255533 1796086 2048204 1942021 1785903 2084174 3062573 4345947
43576 4345947 5267283 5471949 5093235 4490484 4072412 4248063 5193697 6631751 8042889
43567 8042889 9054509 9472301 9163079 8275859 7430997 7229343 7577918 7893932 7954634
43558 7954634 8099559 8554931 9051174 9298884 9461571 9925968 10849245 12071940 13246143
43549 13246143 13972601 14075531 13820155 13641102 13707681 14078634 15144831 17325022 20248363
43540 20248363 22860134 24584839 25851160 27199608 28457184 29230355 29714970 30442268
43532 30442268 31497041 32491821 33149073 33513124 33744296 34035181 34552848 35160432 35385652
43523 35385652 34941939 34081190 33212400 32456060 31802136 31332512 30981250 30470774 29831813
43514 29831813 29539636 29715044 29701914 29022302 28273318 28323768 28963514 29204187 28778463 28506868
43504 28506868 29129362 30442526 31678549 32241997 32117920 32028275 33015031 35321717 37922420
43495 37922420 39746524 40944864 42074910 42529615 41174394 38505207 36646646 36759308
43487 36759308 37773646 38332900 38730420 39974152 41950465 43709368 45022978 46613187
43479 46613187 49118450 52593558 56703042 60778888 64153185 67118253 71028220 76664466
43471 76664466 83061044 88894852 94494839 101265060 109443220 117821704 125727370 133898431
43463 133898431 142985842 152342462 160937339 168618417 175786008 182404477 187921779 191681473
43455 191681473 192914321 190859365 185574743 178345136 170667187 162934078 154559540 145251539
43447 145251539 135667212 126777430 118936454 111685721 104312566 96558991 88859409 81889770
43439 81889770 75911840 70661383 65813319 61324562 57317482 53883175 51029362 48563190
43431 48563190 46030389 43108888 40077719 37485284 35320298 33064842 30731658 29158196
43423 29158196 28783131 28682861 27520814 25176722 22769377 21224008 20478119 20024626 19509196
43414 19509196 18675619 17414521 16169777 15739036 16272550 16886163 16684834 15822016 15074756
43405 15074756 14674251 14199006 13549413 13314923 13899021 14785424 15111013 14707116 14124439
43396 14124439 13719954 13165121 11957490 10114216 8227579 7042620 7024177 8003068 9070803
43387 9070803 9185857 8257809 7411952 7764496 9086802 10158234 10335343 10137226 10184110
43378 10184110 10276012 9939753 9322521 8935877 8855649 8812296 8851563 9195402 9516315 9136530
43368 9136530 8134181 7523156 7914740 8558864 8268958 6938675 5541476 4828416 4683214
43359 4683214 4782292 5226532 6163886 7174336 7520436 7000156 6243061 6027206 6427769
43350 6427769 6787531 6496773 5612697 4613177 3763176 3051543 2667344 3028995 4106458
43341 4106458 5128446 5390484 5132713 5169667 5765008 6321506 6146412 5098093 3519650
43332 3519650 2047946 1533134 2538419 4621379 6528452 7391397 7416261 7244816 7141776
43323 7141776 7105431 7228472 7464269 7478612 7246529 7335651 7974080 8328066 7574086 6326396
43313 6326396 5912435 6357970 6347304 5399995 4768790 5508939 6796329 7206308 6885223
43304 6885223 7217529 8685820 10283609 11095193 11442282 12199873 13720984 15711259 17568908
43295 17568908 18630720 18691438 18564773 19543784 21914528 24498650 26107788 27001589 28351569
43286 28351569 30596553 33008057 34790636 35944822 36882772 37694791 38091667 37796867 36752851
43277 36752851 35135038 33379762 32034610 31324680 30927892 30386353 29692900 29246993 29229563
43268 29229563 29268347 28830413 27781875 26452683 25291418 24548081 24092176 23356424 21667006
43259 21667006 18968434 16176198 14487307 14272751 14843935 15264380 15093572 14371700 13340195
43250 13340195 12372714 11803184 11533239 11078033 10274104 9679012 9933794 10915817 11858443
43241 11858443 12173525 11845670 11159274 10400815 9772882 9282795 8736211 8059964 7497007
43232 7497007 7206079 6865307 6090211 5123673 4623709 4773512 5071467 5055685 4783127 4502853
43222 4502853 4319168 4332637 4663121 5110762 5211338 4906555 4778449 5268122 5972048 6139992
43212 6139992 5712585 5459428 6099170 7558788 9114601 10062736 10219387 9904555 9541974
43203 9541974 9348834 9439490 10014843 11119782 12254159 12641718 12054849 11079071 10393473
43194 10393473 10074864 9803002 9442499 9116415 8902364 8763933 8690612 8691967 8753955 8962773
43184 8962773 9521732 10465851 11513813 12383270 13082470 13692926 14057000 13945325 13394347
43175 13394347 12605914 11628511 10454615 9397864 9019637 9508568 10291407 10474001 9733782
43166 9733782 8684994 8206576 8413682 8552731 8040785 7255183 6953384 7269046 7852275
43157 7852275 8713878 10107896 11652389 12520699 12655411 12782631 12906923 11974655 9748519
43148 9748519 7869583 7877013 8966776 9086231 7782873 6497973 6185864 6173557 5660015
43139 5660015 4988663 4819931 5045057 5219207 5386509 5856589 6641385 7562989 8485519
43130 8485519 9123044 9121077 8642255 8343933 8450439 8394390 7732246 6850901 6344550 6222802
43120 6222802 6203803 6301356 6606378 6891598 6930757 6870853 6872557 6767705 6485842 6386190 6707798
43109 6707798 7132425 7371721 7683471 8222058 8410347 7731687 6741218 6417136 6749168
43100 6749168 6861389 6430511 6091857 6378707 7049830 7605548 7785928 7432920 6537490
43091 6537490 5597878 5274976 5446765 5197085 4037737 2634857 2016010 2476464 3531675
43082 3531675 4535535 5052391 4973041 4579135 4290348 4198729 4080505 3875620 3757171 3682427
43072 3682427 3389796 3000888 3080698 3805094 4547470 4665054 4325354 4190125 4586511 5324176
43062 5324176 6057677 6515600 6598769 6495698 6481817 6485281 6200869 5726475 5568453 5835329
43052 5835329 6058786 6105609 6499699 7316227 7561375 6476269 4816202 3871808 3752440
43043 3752440 3736857 3841810 4624181 5595339 5451546 4199967 3536936 4439664 5712945
43034 5712945 5834033 5064874 4584838 4514806 4231247 3988290 4593483 5629945 5575204 3957099
43024 3957099 2082049 1181345 993618 791640 756091 1426743 2500762 3167950 3304199
43015 3304199 3481987 3952671 4349922 4371509 4160219 3993913 4077584 4618896 5622137 6589108
43005 6589108 6910852 6668135 6639951 7369185 8528150 9328887 9285908 8468445 7281526
42996 7281526 6189932 5528034 5434582 5905357 6734286 7340919 7051503 5954909 5184078
42987 5184078 5753508 7236758 8225782 8052776 7345494 6856836 6640551 6667652 7302382
42978 7302382 8525404 9447705 9420874 9091453 9484664 10468312 11102059 11234494 11628787
42969 11628787 12468828 12854536 12156559 10988320 10297124 10117672 9781651 8943871 7916418
42960 7916418 7273236 7476139 8586945 10012496 10818691 10618717 9912998 9337827 8948615
42951 8948615 8533804 8190889 8108157 8092322 7854910 7583390 7702404 8168986 8518412 8590639
42941 8590639 8705668 9013624 9116576 8606562 7770164 7488482 8372063 10019962 11240096
42932 11240096 11179287 10194562 9327905 8979921 8657624 8176050 8299053 9511312 10765177
42923 10765177 10505521 8798724 7374330 7331827 7758938 7148655 5488112 4236631 4546750
42914 4546750 6092438 7538138 7745081 6586296 4925825 3855721 3841007 4617401 5794655
42905 5794655 7182266 8470060 9107643 8859408 8179339 7723666 7746481 8189560 8924157
42896 8924157 9502394 9151233 7691215 6184088 5890122 6652918 7100751 6512989 5647128
42887 5647128 5440581 5752027 5973336 6166460 6713386 7257018 7040072 6272188 6111100
42878 6111100 6918051 7439219 6452470 4634931 3831140 4628972 5640212 5418105 4237479
42869 4237479 3394975 3310122 3119542 2030701 394676 -705076 -504938 896409 2657208
42860 2657208 3728211 3637548 2942035 2651372 3100649 3701166 3895853 3894949 4159859 4574489
42850 4574489 4627457 4220761 3813303 3814239 4225050 4840164 5410482 5616966 5313992 4914308
42840 4914308 5145737 6175190 7186242 7076784 5552922 3472884 2172284 2411658 3788619
42831 3788619 5108591 5459426 4987438 4563772 4750799 5258469 5380834 4755712 3657493
42822 3657493 2704917 2322956 2394745 2472816 2403946 2559122 3229605 4018490 4222311 3689922
42812 3689922 2866355 2111927 1559899 1583755 2585476 4061458 4680846 3816705 2351871
42803 2351871 1361108 666251 -417754 -1450505 -1224602 316752 1767352 2187726 2252218
42794 2252218 2869073 3598477 3383147 2309290 1600714 1963389 2782188 3053252 2444142
42785 2444142 1271292 29316 -758366 -675909 193044 1201953 1753115 1882722 2097143
42776 2097143 2761957 3774157 4701112 5132768 5014671 4693559 4504266 4345085 3928350
42767 3928350 3411457 3295809 3545923 3404462 2547722 1915325 2641479 4397672 5637472
42758 5637472 5498472 4616746 3864343 3203696 2349439 1785133 2220190 3388334 4263856
42749 4263856 4385968 4200586 4069941 3727663 2971685 2262696 2225067 2921903 3931088
42740 3931088 4821963 5292127 5165729 4596135 4049370 3791674 3575496 3080189 2453052
42731 2453052 2130724 2303398 2845637 3611288 4461389 5095267 5206264 4846828 4432416
42722 4432416 4367189 4773696 5483165 6115277 6275271 5887349 5285408 4842346 4636192 4614679
42712 4614679 4843991 5308380 5670443 5623281 5385914 5446499 5832277 6033191 5707908 5107628
42702 5107628 4707872 4760101 5338415 6480210 8012160 9433578 10249652 10395336 10210589
42693 10210589 10055471 10041619 10075483 10038899 9878756 9543065 8927958 8025286 7095381 6472648
42683 6472648 6160239 5919353 5883582 6655398 8404111 10186281 10711184 9710831 8148803
42674 8148803 7201838 7451171 8831382 10683368 11888124 11705758 10706354 10286461 11048667
42665 11048667 12216669 12848451 12949268 12989338 12953413 12492279 11675610 11030154 10969958 11518686
42655 11518686 12384689 13056079 13116010 12709968 12355673 12101164 11413383 10214388 9320948
42646 9320948 9224911 9063105 7703758 5512407 4085409 4325586 5637818 7019519 8083252
42637 8083252 8840279 9269616 9478848 9795109 10392162 11140159 11920340 12711163 13308101
42628 13308101 13376454 12868117 12052631 11173802 10440084 10164867 10349014 10295102 9376416 8125175
42618 8125175 7709063 8268094 8708414 8371536 7923264 8149860 8804050 9249311 9415322
42609 9415322 9403306 8903895 7848910 7014853 7067383 7502791 7460559 7121887 7251033 7695261
42599 7695261 7545138 6709965 6138883 6317446 6653339 6681105 6839048 7515828 8180413 8116598
42589 8116598 7410609 6607474 5916805 5364901 5256783 5805451 6629136 7256721 7845104
42580 7845104 8728139 9524606 9529816 8937227 8776982 9419777 9956546 9507609 8450847 7696783
42570 7696783 7294028 6677854 6075319 6533014 8217266 9658061 9447712 8079995 7147780
42561 7147780 7037837 6598873 5243522 4168235 4754357 6585979 8023643 8287006 7950959
42552 7950959 7601635 7149625 6665121 6852937 8134552 9901062 11189983 11606736 11169986
42543 11169986 9887457 8147553 6996536 7114760 7710565 7308709 5653366 4024280
42535 4024280 3536762 3940480 4410263 4724352 5071754 5309638 5214132 5188118 5935589 7447897
42525 7447897 8927334 9744400 9915626 9620241 8917402 8146433 7949377 8488882 9138712
42516 9138712 9366428 9420608 9613545 9459518 8381617 7015165 6791981 8066963 9506358
42507 9506358 9695339 8684874 7531285 6918430 6807464 6996120 7331485 7520909 7284040
42498 7284040 6682827 5991352 5382670 5028913 5237725 6073129 7077000 7816828 8451894
42489 8451894 9214167 9608418 8904630 7376632 6254650 6310819 7201541 8347416 9605793
42480 9605793 10693596 10838305 9784348 8592294 8564978 9631326 10583153 10762800 10669274
42471 10669274 10841153 11032552 10916571 10927109 11700565 12923334 13402943 12412844 10571955
42462 10571955 9181236 8909443 9352002 9738207 9752058 9595745 9522443 9553962 9587186 9574974
42452 9574974 9576568 9697524 9900438 9808306 8934875 7387802 6146966 6191707 7360249 8495459
42442 8495459 8735510 8180439 7253445 6111581 5034063 4697179 5361720 6171703 6022707
42433 6022707 4987644 4179203 4219750 4542819 4346910 3614861 2916885 2695264 3055787
42424 3055787 3865992 4700955 4973420 4484741 3725764 3405690 3796744 4645033 5466112
42415 5466112 5737842 5095837 3685238 2205188 1335551 1172920 1370257 1648395 1938767
42406 1938767 2178503 2252536 2108773 1793815 1498621 1647129 2592949 3935954 4512282
42397 4512282 3613557 2053048 1433659 2377995 4038712 5350487 6069404 6393494 6324286
42388 6324286 5930403 5711741 6052707 6567648 6523345 5722277 4517396 3221550 2066001
42379 2066001 1506712 1853721 2644116 3088053 3183328 3662343 4696832 5461475 5347306
42370 5347306 4862816 4773711 4966353 4876710 4618020 4868383 5773525 6642035 6730485 5861018
42360 5861018 4390654 3085835 2848284 3880095 5127169 5218052 4053723 2860184 2564720
42351 2564720 2798832 2750947 2339143 2110577 2461446 3383155 4600898 5578579 5750469
42342 5750469 5154250 4522924 4362340 4255996 3515252 2226866 1149949 743993 776955
42333 776955 817240 716993 654654 985951 1934571 3188496 4050590 4308545 4625783 5601043
42323 5601043 6775509 7235665 6980379 6857378 7127441 6997709 5942926 4746873 4605948
42314 4605948 5577477 6508367 6367086 5189295 3746024 2691142 2185277 2124855 2438065
42305 2438065 3004097 3404741 3142571 2335453 1874066 2434557 3490053 3843003 3116151
42296 3116151 2121989 1655320 1588572 1478929 1423197 1724923 2140698 2163056 1903889 2046130
42286 2046130 2866404 3819106 4231669 4031069 3626348 3373605 3323494 3271917 2918602 2171208
42276 2171208 1412997 1250778 1825587 2576423 2923030 3004148 3380683 4066190 4331815 3695745
42266 3695745 2708790 2304283 2554962 2631342 2032531 1284741 1148520 1614038 2108501 2351329
42256 2351329 2499398 2671228 2865728 3235337 3916056 4645846 5042510 5167776 5270966
42247 5270966 5123534 4369583 3500830 3507702 4300697 4497850 3357045 1988400 1802486
42238 1802486 2530484 2886833 2688142 3015799 4362963 5866312 6633955 6789697 6768035
42229 6768035 6461580 5675280 4785074 4288019 4101538 3888943 3776896 4177541 5056016
42220 5056016 5869838 6180897 5960716 5367355 4588608 3893397 3507282 3354200 3113313
42211 3113313 2610309 2099398 2172257 3340667 5478494 7602803 8517266 7919749 6670447
42202 6670447 5753075 5255646 4710150 4122166 4050309 4673338 5359312 5393102 4765750 4008394
42192 4008394 3516835 3280425 3089559 2785167 2397930 2157761 2241480 2467734 2491975 2411003
42182 2411003 2835065 4085676 5606501 6549643 6740192 6603666 6280489 5437019 4095430
42173 4095430 3079735 3219813 4358459 5479305 5697876 4932778 3784519 2986032 2837347
42164 2837347 2992752 2931535 2703816 2866353 3494286 3766772 3042883 1949395 1672216
42155 1672216 2355484 3017313 3037978 2821747 2760051 2507490 1876697 1643470 2561388 4013687
42145 4013687 4602852 3986061 3290987 3600041 4694785 5519480 5378683 4427656 3349427
42136 3349427 2785783 2851991 3060639 2873839 2315936 1822504 1601872 1531573 1616810 2043524
42126 2043524 2698658 3125775 3113535 2895521 2640664 2265977 1967369 2346935 3602416
42117 3602416 5066379 6003577 6416202 6547617 6107053 4797854 3322116 2889629 3667136
42108 3667136 4575775 4840580 4902858 5376717 5886999 5663085 4772318 3907458 3172877 1997569
42098 1997569 382383 -584833 64765 1917342 3615638 4323889 4296407 4125357 3980991
42089 3980991 3783730 3737669 4268767 5421803 6591616 7050184 6699314 6131328 5892934
42080 5892934 5880885 5670437 5299371 5332146 6047388 6929510 7238191 6840511 6186567 5683292
42070 5683292 5458717 5560285 5916961 6177990 6080309 5971912 6454094 7459468 8263117
42061 8263117 8525341 8649567 8852664 8674647 7979043 7720910 8826052 10690749 11730476
42052 11730476 11292826 10194483 9451492 9400208 10147124 11853977 14102709 15764941 16176179
42043 16176179 16029034 16549851 18063813 19850892 21235701 22355582 23808579 25753332
42035 25753332 27458464 27886931 26874413 25440917 24497363 23580096 21708625 19357654
42027 19357654 18358946 19452904 21115795 21585176 20993961 20424121 19799157 18275395 16254830
42018 16254830 15218094 15379647 15126905 13402485 11301027 10392156 10490245 10210104 9079758
42009 9079758 7892459 7214214 6685378 5919649 5181525 4837658 4765717 4679183 4602475 4669684
41999 4669684 4780522 4819271 4977668 5465871 6028366 6175916 5942593 6022938 6931564 8247692
41989 8247692 8959657 8479516 7108587 5569860 4340728 3482307 2896354 2601495 2781443
41980 2781443 3526405 4468375 4880328 4438739 3750400 3685206 4237177 4609424 4489660 4510281
41970 4510281 5107879 5687825 5579210 5205803 5416204 6034366 6104535 5451633 4910543 4850528
41960 4850528 4542443 3470070 2400473 2460617 3688007 5126089 5965394 6016250 5382893
41951 5382893 4292053 3126435 2185744 1514308 1227072 1687244 2945420 4312791 5036029
41942 5036029 5213471 5495677 6007171 6176484 5661010 4862890 4348152 4188389 4095001 3885375
41932 3885375 3594324 3334914 3229099 3340744 3563018 3679444 3601846 3453760 3387795 3405336
41922 3405336 3377266 3219015 3094841 3416480 4432614 5801006 6918681 7827587 9338685
41913 9338685 11893642 14767227 17030489 19005871 21945277 26237916 30652074 33500645
41905 33500645 33958759 32161645 28809036 25028366 21895672 19514012 17035108 14045471
41897 14045471 11356627 9823337 8995217 7874571 6647702 6508752 7680682 8698170
41889 8698170 8144603 6346619 4758567 4201527 4357152 4651190 4889399 5023108 4883816
41880 4883816 4388624 3736267 3221792 2961755 2849315 2692501 2408255 2157661 2212974 2578001
41870 2578001 2859928 2719359 2380508 2460285 3273834 4478025 5398543 5548344 4865001
41861 4865001 3681492 2526452 1777327 1441571 1368379 1591758 2228833 3095490 3771192
41852 3771192 4105525 4309155 4435648 4198271 3566729 3150029 3548047 4528018 5243973
41843 5243973 5128462 4225635 2878393 1583112 990276 1415419 2302893 2741275 2602781
41834 2602781 2580899 2951519 3023924 2260471 1315405 1278781 2237991 3293364 3837610 4121174
41824 4121174 4535324 4984127 5157901 4934113 4278581 3175405 1960803 1406178 2085603
41815 2085603 3754580 5581427 6889748 7499304 7533722 7263845 7155323 7693083 8866576
41806 8866576 9939900 10048182 9132879 8081118 7756578 8067722 8292292 8189490 8280164
41797 8280164 8903792 9553965 9574956 9128821 8894062 9000321 8893817 8238770 7320919 6431863
41787 6431863 5468039 4415070 3661275 3388880 3097716 2295945 1389458 1253078 1982207
41778 1982207 2690295 2704920 2466196 2907306 4221941 5611339 6183207 5808556 5033230
41769 5033230 4364549 3846690 3301893 2755242 2435805 2443292 2661823 3048036 3750208 4771767
41759 4771767 5715708 6135003 6069771 5974146 6093840 6152982 5752205 4909408 4075829 3694360
41749 3694360 3833374 4194368 4379972 4172354 3658917 3178516 3147303 3814229 5014271
41740 5014271 6144450 6589697 6343612 6096968 6501761 7385480 7905936 7487384 6383187
41731 6383187 5280761 4623634 4456255 4643921 4927677 4907915 4369151 3681649 3573082
41722 3573082 4346506 5517117 6351549 6566384 6332739 5841389 5222917 4833136 5221301
41713 5221301 6649367 8842288 11349666 14004796 16900141 20032338 23102419 25597749
41705 25597749 27017410 27163507 26321832 25030817 23569887 21826682 19771816 17803200
41697 17803200 16326342 15152286 13700380 11816937 10062887 9079699 8911781 9085167
41689 9085167 9164578 9073669 8979074 9019203 9140635 9125244 8742950 7873025 6561206 5128498
41679 5128498 4184075 4158682 4637408 4571130 3579676 2694483 3156143 4667771 5673728
41670 5673728 5430925 4884415 5117369 5809723 5926573 5275394 4508325 3995517 3651978
41661 3651978 3687603 4490946 5631776 5913685 4826830 3279036 2439704 2389861 2396066 2079548
41651 2079548 1731450 1690238 1937938 2258781 2414328 2201487 1646191 1084237 770763 502449
41641 502449 -44094 -680752 -846619 -439549 -68873 -242709 -654872 -659327 -255714 -118832
41631 -118832 -603155 -1175768 -1113210 -439046 255082 748857 1379063 2197226 2566728 2052277
41621 2052277 1290881 1323648 2204142 2961656 3019819 2951299 3505934 4497389 5181385 5317225
41611 5317225 5232633 5099895 4851278 4733777 5196874 6080669 6621701 6594027 6765796 7633389
41601 7633389 8252340 7247876 4869091 3071300 3234214 4560750 5311390 5055120 4863350
41592 4863350 5501925 6405478 6695251 6404628 6112212 5876208 5282847 4368909 3757528
41583 3757528 3806190 4256280 4923313 6106989 7893741 9549719 10239022 10140627 10226624
41574 10226624 10929144 11594408 11427357 10510465 9577867 9058757 8655648 7748366 6024982
41565 6024982 3846313 2128454 1652739 2255841 2871574 2656306 1964079 1914440 3059412
41556 3059412 4772238 5909681 5757155 4352148 2318524 561914 -216584 -14964 545933
41547 545933 887454 906099 745009 498270 306549 371507 590758 513893 9421 -361433
41537 -361433 -95626 430029 487876 160748 267243 1139517 2198544 2882453 3289709 3645607
41527 3645607 3839225 3904144 4307033 5200562 5939942 5996949 5890262 6440319 7449693 8010379
41517 8010379 7940156 7924494 8175027 7987856 7028917 6145538 6213283 6817607 6937408 6631415
41507 6631415 7139527 9208865 12015828 14080654 14837480 14926814 15168630 15677733 16003036
41498 16003036 15760149 14893848 13536222 11965804 10680143 10104568 10045378 9755743 8830627
41489 8830627 7767749 7259520 7149604 6624996 5397751 4113503 3433440 3242911 3086264
41480 3086264 2946802 3106744 3449203 3450447 2961779 2616157 3161568 4458156 5393513 4977275
41470 4977275 3468998 2192942 2167756 3180358 4365502 5306177 6097402 6600048 6385227
41461 6385227 5551467 4938953 5134828 5663625 5581763 4646541 3517187 2907089 2863918 2913107
41451 2913107 2722920 2511371 2740680 3449054 4152027 4569773 5065708 5913228 6501925
41442 6501925 6051251 4962550 4503725 5019975 5455927 5020771 4314525 4155028 4205570
41433 4205570 3681306 2748911 2214616 2253321 2413572 2549255 2774857 2761407 2111456 1300080
41423 1300080 1183223 1559243 1280670 -13998 -1259580 -1381250 -530612 442018 1026636
41414 1026636 1214933 1270357 1666236 2662537 3678516 3712515 2651740 1506983 1075994
41405 1075994 1107122 1111963 1142271 1202806 724577 -565948 -1850685 -2160596 -1707766 -1429649
41395 -1429649 -1496432 -1171200 -82979 1193728 1955865 2111294 1896910 1384147 590348
41386 590348 -199603 -566345 -439812 -298827 -675138 -1347751 -1311389 45562 1934979
41377 1934979 2979773 2965588 2944314 3459071 3705990 2972774 1899205 1466353 1564661 1575569
41367 1575569 1659108 2248244 2806538 2517586 1958176 2526960 4087853 4745916 3523629
41358 3523629 1922061 1948858 3557845 5004817 5097820 4143543 3034296 2300239 2029887
41349 2029887 2096619 2314017 2565360 2755165 2679372 2293945 2087409 2579649 3308372 3067412
41339 3067412 1541258 -52501 -552040 -383034 -672462 -1370522 -1319924 -53445 1467186
41330 1467186 2052504 1493981 420155 -405581 -435736 435538 1670267 2437705 2372972
41321 2372972 1783865 1146506 769158 891293 1564759 2324844 2480698 1897202 1061565
41312 1061565 320192 -351970 -697080 -99888 1364982 2535094 2525246 1963549 2038837 2711353
41302 2711353 2883770 2232490 1763264 2277017 3237299 3692404 3612259 3655398 4054616 4373813
41292 4373813 4152361 3333343 2275661 1696518 2240014 3630418 4611352 4294628 3252203
41283 3252203 2644342 2616783 2383376 1637610 864269 305414 -243376 -414733 729061
41274 729061 3112865 5130636 5500724 4798469 4318766 4248992 4019552 3755654 4041696
41265 4041696 4570945 4383928 3437208 2701121 2558478 2305072 1573411 1102439 1486486
41256 1486486 2082981 1929042 1130164 598914 789090 1309741 1565809 1318499 791171
41247 791171 531838 946260 1734206 2068837 1528186 521763 -343999 -870140 -1052687
41238 -1052687 -823253 -334016 1956 127494 519855 1368767 2086763 2114464 1755241 1703017
41228 1703017 2163323 2944501 3944493 4918562 5176663 4252665 2668651 1429351 963272
41219 963272 1059319 1457193 1827842 1554175 383043 -919094 -1401099 -1253774 -1435570
41210 -1435570 -2111768 -2452173 -1996154 -1206368 -530643 41129 230029 -571070 -2019371
41201 -2019371 -2544749 -1192995 1019861 2480749 3033981 3597560 4232472 3987320 2740500
41192 2740500 1865702 2414258 3551118 3744125 3075323 3307706 5519581 8528613 10187320
41183 10187320 9746850 8304120 7184503 6665316 6349971 6009978 5632274 5142036 4551486
41174 4551486 4078351 3794483 3532761 3424037 3949865 4991683 5497495 4851947 3984959
41165 3984959 4135363 4991020 5272283 4876758 4994316 6019324 6859135 6755747 6367243
41156 6367243 6311328 5947050 4638016 3173019 2714880 3070775 3209164 2921654 2734046
41147 2734046 2602829 2042303 1368303 1482453 2357495 2981592 3022107 3321095 4291536 4960818
41137 4960818 4350212 2956661 2013903 1864308 1941482 2002218 2443391 3419286 4406713 4827208
41127 4827208 4589336 3855046 2739407 1511211 739835 873702 1781105 2923265 3843473
41118 3843473 4274210 3977530 2911527 1552908 620386 318065 201039 -26157 23249
41109 23249 819005 2114323 3184151 3650187 3652059 3426035 3212801 3391612 4115149 4886526
41099 4886526 5047002 4601719 4037397 3543628 3121842 3200288 4137874 5211711 5275379 4523274
41089 4523274 4292940 4825249 4728352 3342172 2102057 2445750 3694767 4356477 4340239
41080 4340239 4295892 3819715 2279249 716102 731077 1715848 1441225 -403821 -1464900
41071 -1464900 -142774 2244957 3690159 4115011 4502357 4870076 4669737 4271961 4504298
41062 4504298 5150582 5174976 4216617 2895007 1855358 1345261 1510403 2318559 3308030
41053 3308030 4004237 4416547 4694802 4680489 4303445 3940847 3759497 3225478 2064195
41044 2064195 1233595 1912957 3709346 4908541 4598432 3647802 3328715 3720215 3900070
41035 3900070 3248194 2113080 1335056 1359752 1821640 1975853 1527351 894489 638593
41026 638593 913984 1569620 2392976 3006692 2914075 2021368 875746 115994 -58971 271152
41016 271152 980368 1715756 2020182 2004539 2361454 3286429 3972744 3718484 2960308 2580359
41006 2580359 2734432 3041042 3357310 3594890 3352750 2632846 2348196 3067867 3783276
40997 3783276 3171491 1715536 1179222 2127061 3391559 4005578 4156290 3993717 3066308
40988 3066308 1558917 749718 1410410 2750556 3664736 4084031 4383907 4415435 4004570
40979 4004570 3652637 3864771 4365517 4693801 4924711 5090751 4650344 3450058 2555269
40970 2555269 3048972 4417534 5153734 4682645 3746403 3145391 3092480 3653426 4774610
40961 4774610 5793383 5832894 4905343 3949193 3626254 3689108 3629612 3306274 2751438 1952016
40951 1952016 1119563 792150 1400132 2862497 4572324 5595878 5180682 3572027 2151215
40942 2151215 2151253 3261404 4067583 3834413 3197457 3037396 3400721 3819010 4092818 4341216
40932 4341216 4641942 4964317 5219545 5203539 4802677 4392471 4597354 5384809 5823122 5169959
40922 5169959 3923259 3281776 3641733 4137145 3825862 2926347 2470764 2850589 3237774
40913 3237774 2737650 1711842 1336284 1947414 2598140 2482599 2006546 1892270 1939041
40904 1939041 1551834 1016318 1133618 1720800 1654839 642177 -137735 315245 1401779
40895 1401779 1877267 1598997 1475456 1994922 2665698 2944680 3023446 3395479 4030082 4371661
40885 4371661 4126748 3749913 3896619 4464085 4574480 3723814 2551225 2008370 2064029
40876 2064029 1875927 1096051 232831 -313588 -727750 -1047944 -813390 60234 760030
40867 760030 575027 -96176 -398898 -289341 -451979 -1182690 -2002327 -2295843 -1844852 -825225
40857 -825225 318724 1145468 1717993 2599456 3978532 5134167 5255518 4460351 3448467
40848 3448467 2528537 1714442 1441500 2206479 3531643 4231234 3874627 3183825 2815284
40839 2815284 2599403 2279548 2131713 2326364 2383296 1891480 1253861 1099518 1376875 1661762
40829 1661762 2023121 2875371 4104778 4976992 4947023 4132913 3004567 1991576 1378725
40820 1378725 1214454 1278077 1382177 1654242 2263591 2983200 3372177 3357962 3298470 3446462
40810 3446462 3643103 3579253 3126713 2413153 1799527 1739261 2359035 3154025 3378024 2800960
40800 2800960 1867189 1099084 611819 259712 -32290 -227825 -283705 -173398 88685 414887
40790 414887 737735 1077850 1376254 1427499 1282367 1528330 2624954 3958944 4218538
40781 4218538 2987340 1395399 749033 993836 1117923 711884 360441 557488 981785
40772 981785 1048043 634743 39933 -315073 105987 1725379 4166518 6131297 6525420
40763 6525420 5638728 4769759 4705937 5024249 4966901 4513567 4248635 4451425 4752622 4660534
40753 4660534 4080011 3239374 2414998 1909375 2015612 2620108 2931211 2094285 303200
40744 303200 -1048908 -728786 947310 2463917 2814033 2431363 2316829 2710244 3008090
40735 3008090 2718366 1990105 1215505 569337 117495 34444 386251 830989 864773 414848
40725 414848 -49997 -134407 -66670 -390039 -1141498 -1644468 -1294895 -344958 381266 456016
40715 456016 188961 4134 -88086 -182915 -33545 663442 1708881 2568101 3057802 3432015
40705 3432015 3724460 3490816 2520111 1488815 1435451 2568880 3934000 4427034 3973338
40696 3973338 3489371 3726093 4419347 4741755 4373408 3750705 3290273 2878230 2390040
40687 2390040 2237515 2832920 3739018 4018345 3442368 2727763 2434495 2269662 1794228
40678 1794228 1219110 1003918 1130948 1373393 1944219 3189993 4801479 6026615 6669994
40669 6669994 7251860 8117454 9026476 9771786 10544681 11401947 12020951 12439636 13436206
40660 13436206 15453279 17466943 17729992 15680007 12540895 9962050 8561086 7899048
40652 7899048 7333164 6560080 5644687 4862681 4419875 4200751 3953180 3749777 3928214
40643 3928214 4422302 4545495 3788551 2589783 1951618 2441099 3847496 5563968 6873505
40634 6873505 7099974 6144631 4933807 4748232 5891279 7427337 8343053 8453037 8011273
40625 8011273 7129641 6043685 5344274 5258477 5109931 4256858 3278288 3329237 4385897
40616 4385897 5107218 4669946 3837368 3720648 4227316 4439300 4043946 3586555 3462243
40607 3462243 3383164 2965015 2361789 2097588 2455295 3128808 3439846 2993843 2177475 1785452
40597 1785452 2036853 2281506 1915218 1216719 874628 991436 1089278 938876 818772 972353
40587 972353 1299624 1615675 1798353 1697067 1335994 1178659 1695245 2667371 3450558 3914731
40577 3914731 4463680 5041984 4933773 3894876 2735523 2258245 2274358 2311064 2664821
40568 2664821 3844312 5315857 5802466 4838006 3229806 1921037 1142624 806135 945942
40559 945942 1441463 1918810 2276824 2778707 3322364 3262645 2438294 1754695 2050777 2862877
40549 2862877 3165016 3025702 3475773 4687887 5387461 4575944 3017433 2289226 2870766
40540 2870766 3950076 4811406 5535303 6305831 6826097 6743332 6156118 5386569 4604702
40531 4604702 3937111 3605282 3654167 3805154 3832489 3793966 3626925 2921875 1584183 420531
40521 420531 415141 1470464 2455465 2548725 1958288 1198194 317711 -761152 -1652627 -1824689
40511 -1824689 -1301287 -572514 111415 951073 2096019 3254711 3898956 3710951 2817084
40502 2817084 1677657 702343 -80077 -842562 -1425940 -1305656 -322284 861700 1429232
40493 1429232 1351242 1241521 1414753 1612710 1646837 1718006 1915007 1928529 1588035 1252158
40483 1252158 1263047 1375285 1246411 1252064 2149588 3879505 5293866 5364383 4301116 3188266
40473 3188266 2799062 3103664 3710932 4305523 4625685 4455848 3906012 3492621 3666182
40464 3666182 4281936 4698373 4397865 3406551 2137263 989586 188985 -93836 325412
40455 325412 1456204 2911018 4039102 4402477 4079416 3463144 2919202 2754595 3225501
40446 3225501 4144437 4630793 3901737 2452311 1757370 2386556 3079780 2410076 847014
40437 847014 166490 1022695 2253912 2736233 2742069 2941441 3150648 2991195 2995887 3884577
40427 3884577 5120333 5398717 4554472 3841952 4038631 4290513 3443522 1792919 723817
40418 723817 948943 1827787 2364130 2269025 1903749 1628172 1520757 1566310 1800346 2178028
40408 2178028 2446878 2334566 1902968 1585025 1754538 2321684 2867585 3127710 3204945 3317817
40398 3317817 3483547 3522920 3340752 3138094 3250181 3686722 3937218 3477626 2483255 1758971
40388 1758971 1862490 2556542 3224670 3490713 3255440 2531764 1607780 1092055 1404944
40379 1404944 2365193 3486121 4382020 4687398 4114549 3034243 2438100 2687254 2848965
40370 2848965 2119964 1395504 2293516 4925994 7963566 10847876 14406146 18886329 22884509
40361 22884509 25071296 25822621 26151285 25959920 24473607 21762458 18753644 16170672
40353 16170672 14388403 13843042 14529242 15424061 15449778 14785925 14274730 13850465 12737925
40344 12737925 11064735 9952258 9803285 9709120 8966793 8105609 7816834 7762584 7186609
40335 7186609 6095587 5122916 4617485 4463722 4495806 4551973 4336555 3706686 2986712 2647014
40325 2647014 2734874 2837379 2537388 1836492 1276812 1587969 2870598 4162996 4326954
40316 4326954 3467887 2918638 3587430 4878487 5576899 5250027 4315863 3223815 2183819
40307 2183819 1407974 1013857 833983 808734 1377577 2908294 4822906 5908414 5624240
40298 5624240 4639067 3908669 3631529 3373095 2900705 2494637 2496715 2904799 3531882 4284662
40288 4284662 4990781 5128305 4258273 2867618 2231064 3001283 4354972 5088084 5135337
40279 5135337 5203871 5248659 4494534 3037006 2121776 2297609 2434861 1423813 -77170
40270 -77170 -638591 -126577 405492 491152 675120 1224969 1550673 1144208 291970 -376349
40260 -376349 -473327 44015 751923 802794 -182796 -1288340 -1160514 259783 1691407
40251 1691407 2263336 2364960 2560647 2729899 2760344 3077744 3762627 3983374 3175236 2121677
40241 2121677 1905192 2269460 2069894 1092025 338649 484296 1034400 1283146 1285524 1432765
40231 1432765 1648747 1562981 1213753 1100697 1553184 2301448 2717711 2404578 1549708 716261
40221 716261 277791 120315 -66236 -337574 -447111 -125617 709509 1868982 2861693
40212 2861693 3146953 2676841 2062123 1926735 2193004 2297505 2035951 1826585 2075115
40203 2075115 2587911 2775051 2280446 1311705 455260 214208 614685 1205492 1502986
40194 1502986 1458803 1460348 1886953 2665654 3204236 2831032 1527824 237966 105855 1229889
40184 1229889 2476329 2776637 2295249 1977368 2272118 2818348 3194732 3371031 3417720
40175 3417720 3318202 3170414 3123534 3024695 2564440 1852022 1373500 1276160 1230063 1176790
40165 1176790 1608378 2748489 4010846 4758407 5143868 5632127 6077031 5959330 5303017
40156 5303017 4595868 3848829 2507343 478968 -1403248 -2269869 -2109004 -1474068 -723547
40147 -723547 76058 822216 1396485 1869880 2349042 2724539 2855214 2889395 3114850 3568148
40137 3568148 4040182 4350239 4333152 3713280 2414599 953960 58000 -192745 -380633
40128 -380633 -754882 -733384 212247 1559522 2170904 1596757 460827 -411424 -757394
40119 -757394 -692995 -268672 460163 1165051 1381390 905942 -46922 -1017782 -1607644 -1795855
40109 -1795855 -2034968 -2799211 -3857945 -4212111 -3077852 -909217 842911 1109766 219510
40100 219510 -535929 -230366 907508 1926218 2132818 1578261 833668 580928 1273549
40091 1273549 2724279 3962138 4039512 3244280 2929993 3670643 4237625 3277753 1498713
40082 1498713 896209 1873846 2598142 1670318 35250 -682110 -557934 -792762 -1550837
40073 -1550837 -1876256 -1448234 -982000 -856685 -610145 -4782 517212 750109 1111791
40064 1111791 1756115 2190741 2178522 2192788 2531284 2740414 2417661 1929135 1847998 2253242
40054 2253242 2971373 3880176 4574650 4411861 3362482 2204872 1476453 936530 450816
40045 450816 498026 1204513 1815656 1886071 2035146 2582626 2463236 839666 -988605 -894681
40035 -894681 1203642 3286863 3880506 3300401 2327791 1211285 256772 13314 400873
40026 400873 710063 732779 807458 623961 -622326 -2522755 -3369145 -2411903 -856142
40017 -856142 95624 759799 1605563 1882325 1004769 90164 460982 1474704 1576768
40008 1576768 898808 934118 1907396 2452600 2109918 2242090 3740404 5338719 5248505
39999 5248505 3478377 1522886 413331 17179 -152712 -343182 -680048 -1200995 -1658855
39990 -1658855 -1641985 -987050 29516 867031 1077759 660878 94965 -140503 -32110
39981 -32110 166945 424849 838143 1193952 1159325 901706 956183 1383816 1641212 1480430
39971 1480430 1416361 1998508 3091275 4189043 4987459 5284804 4784453 3515984 2169881
39962 2169881 1495555 1485648 1547111 1350628 1116270 1129911 1362998 1613075 1759100 1830523
39952 1830523 1983862 2395245 3028137 3543681 3594711 3202457 2729079 2467261 2311993 1857024
39942 1857024 860540 -344811 -1026447 -783099 27691 798910 1397470 1968582 2193949
39933 2193949 1444240 -144681 -1395176 -1338856 -344949 443415 471678 67303 -404209
39924 -404209 -1063093 -2107166 -3297499 -4082409 -4123784 -3595657 -2944555 -2342606 -1503284
39915 -1503284 -249619 871635 1018413 194412 -546046 -334741 466890 805114 162369
39906 162369 -1124513 -2420705 -3193797 -3121975 -2332291 -1435066 -926938 -674586 -295857
39897 -295857 209006 619902 1000653 1495843 1831562 1620978 1060441 737479 819814 1017624
39887 1017624 1269628 1793181 2425764 2590948 2047248 1096659 5217 -1111167 -1767950
39878 -1767950 -1339444 -115435 672995 352536 -355545 -495119 -164023 4480 -20600
39869 -20600 83445 82996 -469691 -1193673 -1196304 -478951 -84420 -592455 -1308723 -1394934 -1110539
39858 -1110539 -1280827 -1944435 -2265815 -1736578 -867977 -529409 -995309 -1874374 -2681799
39849 -2681799 -3115854 -2887887 -1772064 -73022 1262065 1426837 630599 -138331 -246598
39840 -246598 12303 34328 -296479 -627877 -653768 -372643 -54868 -106260 -660787 -1143953
39830 -1143953 -678953 737709 1903639 1737512 556949 -559756 -1300411 -2133858 -2941051
39821 -2941051 -2704386 -944560 1308798 2542102 2320516 1409433 739868 686748 1041348
39812 1041348 1246488 885840 309200 497082 1873712 3507637 4021677 3178586 2035050
39803 2035050 1539243 1510057 1155900 175798 -935244 -1471411 -1178815 -402386 282557
39794 282557 525105 275868 -431698 -1442962 -2198982 -2027425 -1096178 -605714 -1378673
39785 -1378673 -2538650 -2414943 -744657 879286 981242 -156114 -1208905 -1469304 -1243087
39776 -1243087 -1142339 -1583308 -2558169 -3306524 -2636512 -290865 2314702 3476367 3097863
39767 3097863 2412665 2062984 1531409 547272 -134459 94436 653956 662153 270219 319170
39757 319170 988472 1533105 1301609 481833 -187841 -144113 512390 1088157 1041037 731425
39747 731425 1012997 1920052 2404906 1802010 867944 677123 1100124 1302314 1258651 1585060
39737 1585060 2076509 1758059 577261 -224256 94034 720433 694138 353056 482283
39728 482283 813859 500836 -321290 -576433 188566 1211611 1634879 1490113 1324800
39719 1324800 1400993 1591582 1751334 1884528 2016558 2020272 1615711 676445 -430427 -1079445
39709 -1079445 -1107529 -972132 -956877 -634578 433471 1790662 2456917 2068223 1124290
39700 1124290 200626 -555269 -1174627 -1632759 -1924124 -1992646 -1622211 -781302 43744 345831
39690 345831 311864 471226 736104 508317 -237718 -788427 -817104 -871582 -1338793 -1652630
39680 -1652630 -1115981 22236 929795 1256394 1260641 1175306 1022283 862449 714609 380817
39670 380817 -199467 -623019 -543620 -321000 -558331 -1082703 -1041433 -125421 878875 1027680
39660 1027680 313627 -483688 -796776 -805208 -1031039 -1643683 -2309204 -2713458 -3010905 -3445815
39650 -3445815 -3618941 -2741586 -943928 270310 -372382 -2114376 -2858310 -1756128 -260562
39641 -260562 -200055 -1518460 -2594803 -2370037 -1335092 -488682 -134137 -15416 -29548
39632 -29548 -196113 -149830 651010 2017927 2837400 2249869 849990 226168 1225766 3021364
39622 3021364 4025211 3452412 1870268 530069 349102 1228186 2091404 1857875 652968
39613 652968 -222591 164368 1227553 1723698 1421448 1201350 1623472 2208332 2298977 1907922
39603 1907922 1358511 674922 -196445 -963390 -1293152 -1323365 -1434313 -1635980 -1567416 -1086548
39593 -1086548 -565196 -510255 -976720 -1396537 -1097118 -144196 494423 7591 -1116612
39584 -1116612 -1562929 -890810 -104007 -201092 -818035 -901140 -242463 397844 474351 263010
39574 263010 336855 981502 2075744 3071524 3211124 2294309 1111888 544986 377052
39565 377052 -291617 -1532317 -2381284 -2309240 -2003466 -2268899 -2905199 -3225033 -3084561 -2793991
39555 -2793991 -2483786 -2190326 -2198774 -2661790 -3139190 -3097104 -2619084 -2056255 -1262778 118031
39545 118031 1778621 2911734 3236635 3189666 3097228 2875167 2618600 2702803 3031623 2886094
39535 2886094 1897799 595339 -393340 -1118494 -1864929 -2505121 -2850573 -3143360 -3517621
39526 -3517621 -3362401 -2026309 15384 1491360 1829269 1605817 1454999 1301911 937968
39517 937968 628366 633991 605699 45301 -834378 -1214604 -616578 575967 1536601 1737334
39507 1737334 1310331 822520 648555 531785 -42108 -981705 -1461344 -923375 106909
39498 106909 611270 273327 -361730 -751310 -816939 -578824 28774 794376 1254238 1387535
39488 1387535 1778370 2678685 3385919 3130350 2245392 1772534 2078615 2609211 2978996
39479 2978996 3439292 3990994 3856747 2451550 380878 -1163108 -1686642 -1507510 -929232
39470 -929232 -62306 673747 722900 235582 43893 516298 1025270 899289 372592 129706
39460 129706 301250 413058 89561 -629019 -1469450 -2022184 -1855479 -967500 1194 380772
39450 380772 146710 -362805 -1103583 -2108784 -2785323 -2194501 -238703 1949272 3036833
39441 3036833 2599285 1182606 -261449 -913351 -599417 -8251 12854 -470561 -593405
39432 -593405 -22722 480656 200393 -495077 -850747 -919227 -1253988 -1719611 -1521788 -460339
39422 -460339 621050 867555 339811 -323514 -690318 -704528 -480671 -299065 -561639 -1375828
39412 -1375828 -2246634 -2458736 -1805137 -808403 -195835 -220403 -506415 -502479 -12525 729025
39402 729025 1359482 1582026 1171452 164221 -859530 -1074101 -262682 898656 1669847
39393 1669847 2036309 2320494 2383942 1825083 815008 83956 24606 347784 710080 1145102
$$ [...]
##END NTUPLES=NMR SPECTRUM
##END=
