##TITLE=31Pdec_DE-141k_d6_TFA2
 DMSOd6,24 sc
 3.6.2026
##JCAMPDX= 6.0         $$ Bruker NMR JCAMP-DX V2.0
##DATA TYPE= NMR SPECTRUM
##DATA CLASS= NTUPLES
##ORIGIN= UXNMR, Bruker Analytische Messtechnik GmbH
##OWNER= root
$$ XWIN-NMR		Version 3.5
$$ Wed Jun  3 16:31:40 2026 Russian Standard Time (UT+4h)  she@DPX200
##.OBSERVE FREQUENCY= 81.013821
##.OBSERVE NUCLEUS= ^31P
##.ACQUISITION MODE= SIMULTANEOUS
##.ACQUISITION SCHEME= undefined
##.AVERAGES= 24
##.DIGITISER RES= 17
##SPECTROMETER/DATA SYSTEM= spect
##.PULSE SEQUENCE= zgpg30
##.SOLVENT NAME= CDCl3
##.SHIFT REFERENCE= (INTERNAL, CDCl3, 0, 197.392)
##AUDIT TRAIL= $$ (NUMBER, WHEN, WHO, WHERE, WHAT)
$$ ##TITLE= Audit trail, XWIN-NMR		Version 3.5
$$ ##JCAMPDX= 5.01
$$ ##ORIGIN= Bruker BioSpin GmbH
$$ ##OWNER= she
$$ F:/spectra/data/she/nmr/P31/2/pdata/1/auditp.txt
$$ ##AUDIT TRAIL=  $$ (NUMBER, WHEN, WHO, WHERE, WHAT)
(   1,<2026-06-03 16:30:10.23 +0400>,<she>,<DPX200>,
      <created by zg, POWCHK disabled, PULCHK disabled
       configuration hash MD5:
       00 E9 B6 7A A2 85 ED C7 34 08 36 98 17 FE 4E 26
       data hash MD5: 32K
       E7 A2 99 AC B9 1D E9 12 99 93 CC E5 AD 4C CF 28>)
(   2,<2026-06-03 16:30:28.67 +0400>,<she>,<DPX200>,
      <Start of raw data processing
       efp BC_mod = 2 LB = 1.5 FT_mod = 6 PKNL = 1 PHC0 = 1338.314 PHC1 = -221.8995 SI = 64K 
       data hash MD5: 64K
       C9 2C DC 89 51 37 F3 B4 CD DE DF B5 74 3A 43 6A>)
(   3,<2026-06-03 16:30:46.70 +0400>,<she>,<DPX200>,
      <pk PHC0 = 4.474181 PHC1 = 0 
       data hash MD5: 64K
       E1 45 1F 57 84 1D 55 88 6B C5 93 7D 1D 0B D5 33>)
$$ ##END=
$$ 
$$ hash MD5
$$ 0D E2 0B 12 2E 65 E1 64 22 33 A6 CF B4 CC 6E F3
##$RELAX= 
##$RELAX= 
##$RELAX= 
##$RELAX= 
##$RELAX= 
##$RELAX= 
##$RELAX= 
##$RELAX= 
$$ Bruker specific parameters
$$ --------------------------
##$DU= <F:/spectra>
##$EXPNO= 2
##$NAME= <P31>
##$PROCNO= 1
##$TYPE= <nmr>
##$USER= <she>
##$AMP= (0..31)
100 100 100 100 100 100 100 100 100 100 100 100 100 100 100 100 100 100 
100 100 100 100 100 100 100 100 100 100 100 100 100 100 
##$AQSEQ= 0
##$AQ_mod= 1
##$AUNM= <au_zg>
##$AUTOPOS= <>
##$BF1= 81.014009
##$BF2= 200.13
##$BF3= 200.13
##$BF4= 200.13
##$BF5= 200.13
##$BF6= 200.13
##$BF7= 200.13
##$BF8= 200.13
##$BYTORDA= 1
##$CFDGTYP= 0
##$CFRGTYP= 5
##$CHEMSTR= <none>
##$CNST= (0..31)
1 1 145 1 1 1 1 1 1 1 1 1 1 1 1 1 1 1 1 1 1 1 1 1 1 1 1 1 1 1 1 1 
##$CPDPRG= <waltz16>
##$CPDPRG1= <>
##$CPDPRG2= <waltz16>
##$CPDPRG3= <>
##$CPDPRG4= <mlev>
##$CPDPRG5= <mlev>
##$CPDPRG6= <mlev>
##$CPDPRG7= <mlev>
##$CPDPRG8= <mlev>
##$CPDPRGB= <>
##$CPDPRGT= <>
##$D= (0..31)
0 1 0 0 0 0 0 0 0 0.06 0 0.03 2e-05 3e-06 0 0 0.0002 0 0 0 0 0 0 0 0 0 
0 0 0 0 0 0 
##$DATE= 1780489809
##$DBL= (0..7)
120 120 120 11 120 120 24 19 
##$DBP= (0..7)
150 150 150 150 150 150 150 150 
##$DBP07= 0
##$DBPNAM0= <>
##$DBPNAM1= <>
##$DBPNAM2= <>
##$DBPNAM3= <>
##$DBPNAM4= <>
##$DBPNAM5= <>
##$DBPNAM6= <>
##$DBPNAM7= <>
##$DBPOAL= (0..7)
0.5 0.5 0.5 0.5 0.5 0.5 0.5 0.5 
##$DBPOFFS= (0..7)
$$ [...]
##$SUBNAM2= <"">
##$SUBNAM3= <"">
##$SUBNAM4= <"">
##$SUBNAM5= <"">
##$SUBNAM6= <"">
##$SUBNAM7= <"">
##$SUBNAM8= <"">
##$SUBNAM9= <"">
##$SW= 400.765351723535
##$SWIBOX= (0..15)
0 1 3 0 0 0 0 0 0 0 0 0 0 0 0 0 
##$SW_h= 32467.5324675325
##$TD= 32768
##$TD0= 1
##$TE= 0
##$TE2= 300
##$TE3= 300
##$TEG= 300
##$TL= (0..7)
0 120 53 12 22 120 120 120 
##$TP= (0..7)
150 150 150 150 150 150 150 150 
##$TP07= 0
##$TPNAME0= <>
##$TPNAME1= <>
##$TPNAME2= <>
##$TPNAME3= <>
##$TPNAME4= <>
##$TPNAME5= <>
##$TPNAME6= <>
##$TPNAME7= <>
##$TPOAL= (0..7)
0.5 0.5 0.5 0.5 0.5 0.5 0.5 0.5 
##$TPOFFS= (0..7)
0 0 0 0 0 0 0 0 
##$TUNHIN= 0
##$TUNHOUT= 0
##$TUNXOUT= 0
##$USERA1= <user>
##$USERA2= <user>
##$USERA3= <user>
##$USERA4= <user>
##$USERA5= <user>
##$V9= 5
##$VALIST= <valist>
##$VCLIST= <CCCCCCCCCCCCCCC>
##$VD= 0
##$VDLIST= <DDDDDDDDDDDDDDD>
##$VPLIST= <PPPPPPPPPPPPPPP>
##$VTLIST= <TTTTTTTTTTTTTTT>
##$WBST= 1024
##$WBSW= 4
##$XGAIN= (0..3)
0 0 0 0 
##$XL= 0
##$YL= 0
##$YMAX_a= 4529
##$YMIN_a= -6400
##$ZGOPTNS= <>
##$ZL1= 120
##$ZL2= 120
##$ZL3= 120
##$ZL4= 120
##$ABSF1= 0
##$ABSF2= 0
##$ABSG= 0
##$ABSL= 0
##$ALPHA= 0
##$AQORDER= 0
##$ASSFAC= 0
##$ASSFACI= 0
##$ASSFACX= 0
##$ASSWID= 0
##$AUNMP= <proc_1d>
##$AZFE= 0.1
##$AZFW= 0.5
##$BCFW= 0
##$BC_mod= 2
##$BYTORDP= 0
##$COROFFS= 0
##$CY= -3
##$DATMOD= 1
##$DC= 0
##$DFILT= <>
##$DTYPP= 0
##$F1P= 0
##$F2P= 0
##$FCOR= 1
##$FTSIZE= 65536
##$FT_mod= 6
##$GAMMA= 0
##$GB= 0
##$INTBC= 1
##$INTSCL= 9.790993e-09
##$ISEN= 30
##$LB= 1.5
##$LEV0= 0
##$LPBIN= 0
##$MAXI= 10000
##$MC2= 0
##$MEAN= 0
##$ME_mod= 0
##$MI= 50
##$NCOEF= 0
##$NC_proc= -7
##$NLEV= 6
##$NOISF1= 182.463
##$NOISF2= 159.3651
##$NSP= 0
##$NTH_PI= 0
##$NZP= 0
##$OFFSET= 197.3918
##$PC= 4
##$PHC0= 1342.788
##$PHC1= -221.8995
##$PH_mod= 1
##$PKNL= yes
##$PPARMOD= 0
##$PSCAL= 0
##$PSIGN= 0
##$REVERSE= no
##$SF= 81.014063255964
##$SI= 65536
##$SIGF1= 159.3651
##$SIGF2= -187.1042
##$SINO= 113.3802
##$SIOLD= 16384
##$SREGLST= <1H.CDCl3>
##$SSB= 0
##$STSI= 65536
##$STSR= 0
##$SW_p= 32467.5324675325
##$SYMM= 0
##$S_DEV= 0
##$TDeff= 32768
##$TDoff= 0
##$TI= <>
##$TILT= no
##$TM1= 0
##$TM2= 0
##$TOPLEV= 0
##$USERP1= <user>
##$USERP2= <user>
##$USERP3= <user>
##$USERP4= <user>
##$USERP5= <user>
##$WDW= 1
##$XDIM= 65536
##$YMAX_p= 428246197
##$YMIN_p= -51802276
$$ End of Bruker specific parameters
$$ ---------------------------------
##NTUPLES= NMR SPECTRUM
##VAR_NAME=  FREQUENCY,     SPECTRUM/REAL,   SPECTRUM/IMAG
##SYMBOL=    X,             R,               I
##VAR_TYPE=  INDEPENDENT,   DEPENDENT,       DEPENDENT
##VAR_FORM=  AFFN,          ASDF,            ASDF
##VAR_DIM=   65536,         65536,           65536
##UNITS=     HZ,            ARBITRARY UNITS, ARBITRARY UNITS
##FACTOR=    0.49542278885378, 1,            1
##FIRST=     15991.5117654749, 0,            0
##LAST=      -16476.0207020576, 0,           0
##MIN=       -16476.0207020576, -51802276,   0
##MAX=       15991.5117654749, 428246197,    0
$$ Real data points
##PAGE= N=1
##DATA TABLE= (X++(R..R)), XYDATA
$$ [...]
43822D15920Q2625J72122N83327M79803l89114j052685p10704Q107O9855l19048
$$ 415920 498545 670667 1253994 1733797 1344683 291998 -418706 -410599 -340744 -659792
43812f59792k29120K61656K28520l11910k67758N86280R90457J73562q46437q52384
$$ -659792 -888912 -627256 -398736 -710646 -978404 -392124 598333 771895 -74542 -926926
43802i26926k35497r2509l67482k01825L82747N26130R7924n2501M56221R23836
$$ -926926 -1162423 -1254932 -1622414 -1824239 -1441492 -915362 -817438 -869939 -413718 510118
43792E10118P05287R4789k86226k90167q5859J80836K06296l96642j371966j672206
$$ 510118 1215405 1310194 1023968 733801 647942 828778 1035074 638432 -733534 -2405740
43782b405740o51787Q75899J416486N63052o00666r48024n76361k93368l08906
$$ -2405740 -3057527 -2181628 -765142 -202090 -802756 -1750780 -2327141 -2620509 -2929415
43773b929415p5067O58089J285975J118898K84218m87173p02982m26118j4142
$$ -2929415 -3004482 -2346393 -1060418 58480 342698 -144475 -847457 -1273575 -1287717
43764a287717J26732j95804n82670k70347P97371J519731R22654m44619j206111
$$ -1287717 -1160985 -1356789 -1939459 -2209806 -1412435 107296 1029950 585331 -620780
43755f20780r81161n37876l07826N0485N29429N23305P7393J15222Q36419J141131
$$ -620780 -1601941 -2139817 -2447643 -2397158 -1867729 -1344424 -1267031 -1151809 -315390 825741
43745H25741M57466r7268M88807J241689N75573j135804j937877j010553M23048
$$ 825741 1283207 1185939 1674746 2916435 3492008 2356204 418327 -592226 -169178
43736a69178R45922M85611j94580n28795l68296R3727L63165J07618l86878o54005
$$ -169178 776744 1262355 1067775 538980 170684 264411 627576 735194 348316 -305689
43726c05689p24549p98071n94888J45375Q06737N33895l86388q09927m13832l7128
$$ -305689 -1030238 -1828309 -2423197 -2277822 -1471085 -937190 -1323578 -2133505 -2547337 -2584465
43716b584465j91014k93308K34002J006003J296656R45723K46024m79508q47609
$$ -2584465 -2775479 -3068787 -2834785 -1828782 -532126 413597 659621 180113 -667496
43707f67496n30082K59602Q60517R70226Q82929Q00003N03554p8257n69090o70857
$$ -667496 -1197578 -937976 -77459 892767 1775696 2575699 3079253 3000996 2431906 1761049
43697A761049n19178l48624k62367l78179o62557o55433l6575N94707L57794m86451
$$ 1761049 1241871 893247 630880 252701 -409856 -1065289 -1101864 -507157 -149363 -635814
43687f35814p54182j10052M98169M66511L82902P31223R71583O66557L68438M50529
$$ -635814 -1389996 -1500048 -1001879 -535368 -152466 578757 1550340 2216897 2585335 3035864
43677C035864J71722r17943j666162r12661L53552J84648j298424j917724o50885
$$ 3035864 3207586 2289643 623481 -289180 64372 249020 -1049404 -2967128 -3618013
43668c618013R27687J073993K57980O2839P39203J156887P44834K23659L07730
$$ -3618013 -2690326 -1616333 -1358353 -1295514 -556311 600576 1345410 1569069 1876799
43659A876799O05748K32997r47595k100653k285458j332380N0871R02587Q10143
$$ 1876799 2482547 2715544 1767949 -332704 -2618162 -3950542 -3899671 -2997084 -2186941
43650b186941K16203r5586J65881O09212Q09557Q05401O98953J70843r81764k022934
$$ -2186941 -1970738 -2066324 -1900443 -1291231 -481674 323727 1022680 1193523 211759 -1811175
43640a811175j868439o41793K77228J59431q3340M84631J194198Q88746q0936
$$ -1811175 -3679614 -4321407 -4044179 -3884748 -3968088 -3483457 -2289259 -1400513 -1481449
43631a481449m20405l5308l012m77688l48452O56898J191728L75511p48463q23113
$$ -1481449 -1901854 -1937162 -1940174 -2417862 -2766314 -2109416 -917688 -542177 -1290640 -2113753
43621b113753j01919L29125L27940M90150P89784O18567j00900p79612r76050
$$ -2113753 -2215672 -1886547 -1558607 -1068457 -278673 339894 238994 -540618 -1516668
43612a516668p03578k03775P8528k67017r08166q79826M8320Q18331N76950n4072
$$ -1516668 -2220246 -2424021 -2345493 -2612510 -3520676 -4400502 -4352182 -3533851 -2956901 -3010973
43602c010973o6494L28468K44589l26320o36837m25671K0992O18197J248496J284872
$$ -3010973 -3077467 -2748999 -2504410 -2830730 -3467567 -3893238 -3872246 -3254049 -2005553 -720681
43592g20681N03957n1252N53432J406574R49250m53116r54227j81820K38095n08815
$$ -720681 -216724 -267976 285456 1692030 2641280 2188164 1233937 1052117 1290212 781397
43582G81397j068059k48862R80339J061034J58251m28168l10689j59742k93814
$$ 781397 -286662 -535524 444815 1505849 1664100 1235932 925243 765501 471687
43573D71687l01942Q5591O04109Q75622O98035R3838n37693o17526r9498L74877
$$ 471687 169745 255336 859445 1735067 2433102 2526940 1989247 1371721 1272223 1647100
43563A647100L60281J81463K44563L06641m7007o41817j002499j077380j141033
$$ 1647100 2007381 2188844 2433407 2740048 2693041 2051224 1048725 -28655 -1169688
43554a169688j218370j071410n78218J98238J067549J593581J326000M87661j5958
$$ -1169688 -2388058 -3459468 -4037686 -3839448 -2771899 -1178318 147682 635343 619385
43545F19385K83511P08004L77069m93916q87986m25141J26291j30659j097643
$$ 619385 902896 1610900 1987969 1494053 606067 180926 307217 176558 -921085
43536i21085j755345j243113J95210J387285J443020O51493o4094l26106m14825
$$ -921085 -2676430 -3919543 -3724333 -2337048 -894028 -242535 -306629 -632735 -1047560
43527a047560m17831r3964L60388L18791k15110m32343j2883L00068k6153l91105
$$ -1047560 -1465391 -1559355 -1198967 -880176 -1095286 -1527629 -1540512 -1240444 -1266597 -1657702
43517a657702j85120M8329l92577r29317n23623M80423O96782j84439r12259n38039
$$ -1657702 -1842822 -1794493 -2187070 -3116387 -3640010 -3159587 -2462805 -2647244 -3559503 -4097542
43507d097542L57418P31210M61497R6202j13946k91729m02983k04128L69874J052876
$$ -4097542 -3740124 -3008914 -2547417 -2451215 -2565161 -2856890 -3259873 -3464001 -3094127 -2041251
43497b041251J434120J229661N30382j84462m66209l27877q4502J09517K61859
$$ -2041251 -607131 622530 1152912 968450 502241 174364 89862 199379 461238
43488D61238K30202j22515m78708k97607L56384O93408J87347o74951r89976n59177
$$ 461238 691440 568925 90217 -207390 148994 842402 1029749 354798 -635178 -1194355
43478a194355j8661Q5713n9263K0783L08509L50253N3178k5228N55517J385782
$$ -1194355 -1213016 -1127303 -1186566 -1165783 -857274 -507021 -453843 -479071 76446 1462228
43468A462228J636725J029047l1604j052465j652098j425673m11123M21953J29378
$$ 1462228 3098953 4128000 4096396 3043931 1391833 -33840 -444963 -23010 106368
43459A06368o90183m75596R03992J665621P13549o38644o99091N8975P2409n77508
$$ 106368 -583815 -1059411 -155419 1510202 2223751 1585107 886016 944991 1017400 439892
43449D39892m57254N37721Q56739j05339r56693n30132M03195N61895P4114q2741
$$ 439892 -17362 520359 1377098 1271759 315066 -215066 188129 750024 824138 741397
43439G41397K87970N48361K80115l95300j130119j409566p99426L37718R38622
$$ 741397 1029367 1577728 1857843 1462543 332424 -1077142 -1876568 -1538850 -600228
43430f00228N86258J22646L04680N68358n459j072566j417249o93780K04260M56638
$$ -600228 -13970 108676 413356 981714 976255 -96311 -1513560 -2207340 -2003080 -1546442
43420a546442J66079j33857j14369K74851P80147Q42704J51928p65603j009754
$$ -1546442 -1380363 -1514220 -1628589 -1353738 -573591 269113 421041 -344562 -1354316
43411a354316l99850L52218N78643L03763p2405k56962j20217L14668P70908Q83813
$$ -1354316 -1754166 -1401948 -823305 -519542 -591947 -848909 -969126 -654458 116450 1000263
43401A000263N74862Q4131l24245m73236k54512J39787J26449o14359j421070
$$ 1000263 1575125 1659256 1335011 861775 607263 747050 873499 259140 -1161930
43392a161930j165712L28977J849967K059519R08876m66431j037256p84395m06214
$$ -1161930 -2327642 -1998665 -148698 1910821 2819697 2353266 1316010 531615 125401
43383A25401l97723n66139m51342n6176J19865j82986n58890m73264O1504O33494
$$ 125401 -272322 -838461 -1289803 -1345979 -1226114 -1409100 -1967990 -2441254 -2379750 -1746256
43373a746256R70889R83386N67202j53856o28033m62785m7996k7378l14062l04242
$$ -1746256 -775367 208019 775221 621365 -6668 -469453 -517449 -544827 -858889 -1163131
43363a163131L6341R9729k97981o05187m82147k44284p8049L17387Q54238P18002
$$ -1163131 -1126790 -1027061 -1325042 -1930229 -2412376 -2656660 -2734709 -2417322 -1563084 -845082
43353h45082l66940j279915q52700M04955R26161J91035p59818q53064r9678R02578
$$ -845082 -1212022 -2491937 -3344637 -2939682 -2013521 -1822486 -2582304 -3435368 -3535046 -2632468
43343b632468J692953J887797J170493j67878j160125j108328l42684K72193L44325
$$ -2632468 -939515 948282 2118775 1950897 790772 -317556 -660240 -388047 -43722
43334d3722J87584K47840N79838Q38660O56017O0970m88494o06674m20579l09937
$$ -43722 143862 391702 971540 1810200 2466217 2527187 2038693 1432019 1011440 701503
43324G01503l58504l95459m35463o01354o69116k57948M63781Q49049O91299M64470
$$ 701503 342999 -52460 -487923 -1089277 -1758393 -2016341 -1552560 -703511 -12212 452258
43314D52258M34755K17100m00880q63275o37197n7265K40345K50605K93717K43221
$$ 452258 887013 1104113 703233 -160042 -797239 -854504 -614159 -363554 -69837 173384
43304A73384j20017l53843P4259O50499L13902q47411j440491n94736R64082K035554
$$ 173384 53367 -300476 -226217 424282 738184 -109227 -1549718 -2144454 -1180372 855182
43294H55182K271694J898050R69972l41044j319494j381931q57631m48868k46182
$$ 855182 3126876 5024926 5994898 5653854 4334360 2952429 2094798 1645930 1399748
43285A399748P2963M08139L64633K4206j64217j54502k28200k40162K25011Q95291
$$ 1399748 1472711 1880850 2245483 2269689 2105472 1950970 1722770 1482608 1707619 2602910
43275B602910R09712J33426m89157l36852m8550l89506q91158n92386K42269K84513
$$ 2602910 3512622 3646048 3156891 2820039 2771489 2381983 1490825 898439 1140708 1425221
43265A425221q76478j932477j531498n7415R30883O49243k40412p77155p70517
$$ 1425221 548743 -1383734 -2915232 -2972647 -2041764 -1392521 -1632933 -2410088 -3180605
43256c180605n29011j54440L90822Q26327P36890K02213k02403j30381J70694
$$ -3180605 -3709616 -3864056 -3473234 -2646907 -1910017 -1707804 -1910207 -2040588 -1869894
43247a869894L41304L80078L96672K51832j67136n46618m97142k10805k55328
$$ -1869894 -1528590 -1148512 -751840 -500008 -667144 -1213762 -1710904 -1921709 -2177037
43238b177037o57177p20034o113R47874J291094R19574L89297l4484o13469j356693
$$ -2177037 -2834214 -3554248 -3560361 -2612487 -1321393 -401819 -12522 -47006 -660475 -2017168
43228b017168j643621j013742Q0372Q04701R89048J091329J242243J015825K97047
$$ -2017168 -3660789 -4674531 -4594159 -3789458 -2800410 -1709081 -466838 548987 846034
43219H46034l21041m37835n59698j244794j925076j467278J29513J481708J528743
$$ 846034 524993 87158 -472540 -1717334 -3642410 -5109688 -4980175 -3498467 -1969724
43210a969724P41727J92741P8344j63208o88227j007068q40298n30786m44719
$$ -1969724 -1227997 -1035256 -956912 -1120120 -1808347 -2815415 -3655713 -4186499 -4631218
43201d631218m37884j55180M11978Q86053R26743N93185K81697K56330K83266
$$ -4631218 -5069102 -5224282 -4812304 -3926251 -2999508 -2406323 -2124626 -1868296 -1585030
43192a585030k7944n02455m75901J53579M90061j54440j020454p13426Q44275
$$ -1585030 -1612974 -2115429 -2591330 -2437751 -1947690 -2102130 -3122584 -3836010 -2991735
43183b991735K178723K164375J310279P41978O62445M94425L7372l32136m40132
$$ -2991735 -813012 1351363 2661642 3403620 4066065 4560490 4597862 4265726 3825594
43174C825594n61934q33373r88811q56453o89831p74901r80690r31608m83693
$$ 3825594 3263660 2430287 1441476 585023 -104808 -879709 -1860399 -2792007 -3275700
43165c275700J45542O49806R09029R94520R49342O31951o9701q09848q52595O4903
$$ -3275700 -3130158 -2480352 -1571323 -576803 372539 1004490 934789 124941 -727654 -662751
43155f62751J053850Q15483p26883k040741j702196j58362Q79384O35500m070
$$ -662751 391099 1206582 479699 -1561042 -3263238 -3421600 -2542216 -1906716 -1910786
43146a910786j25091j21298o72777j204880n97522Q24671J361608K81422j087752
$$ -1910786 -2035877 -2157175 -2829952 -4034832 -4632354 -3807683 -2446075 -2164653 -3252405
43137c252405j228847m13729O5655j08360j56872L04527P77899Q47125O70202
$$ -3252405 -4481252 -4894981 -4829326 -4937686 -5094558 -4790031 -4012132 -3165007 -2494805
43128b494805M04624k1355l87115k08537M31108P63106L98729p3689L5510N34017
$$ -2494805 -2090181 -2111536 -2498651 -2707188 -2276080 -1512974 -1114245 -1187934 -1152424 -618407
43118f18407P13979L70393l0422o6461J39925J66430j50806m96067m64860j39239
$$ -618407 95572 465965 435543 369082 509007 675437 524631 28564 -436296 -575535
43108e75535k160j60667r4809M46218P88458K43263o93419r04075k14653N16007
$$ -575535 -577695 -738362 -833171 -386953 401505 644768 -48651 -952726 -1167379 -651372
43098f51372P49497O92551M16847k49982q10714l93624O48954Q01059l18338j096083
$$ -651372 98125 790676 1207523 957541 146827 -246797 402157 1203216 884878 -211205
43088b11205k96424J024652J213738M64504M2749l868n57199j381150j290833
$$ -211205 -507629 517023 1730761 2195265 2238014 2234146 1676947 295797 -995036
43079i95036l14567J18627n59365j200492q35724k3082L36412L17746L61700L63525
$$ -995036 -1309603 -1190976 -1750341 -2950833 -3786557 -3809639 -3473227 -3155481 -2793781 -2430256
43069b430256J81758K35581P63401J120414O26079l44287q37557n51552K5362
$$ -2430256 -2248498 -2012917 -1249516 -129102 496977 152690 -684867 -1236419 -1211057
43060a211057L97199M22771J52290j84247k08974J78343N82809O11297L27434
$$ -1211057 -813858 -391087 -238797 -423044 -632018 -453675 129134 740431 1067865
43051A067865l9399m63867q75774r49018n66643j47099o3913r0310Q0120J26853
$$ 1067865 1028466 564599 -311175 -1260193 -1826836 -1973935 -2037848 -2128158 -2048038 -1921185
43041a921185m09910j143867j119399j42514Q37476R25697L43473n5711N4389
$$ -1921185 -2331095 -3474962 -4594361 -4736875 -3899399 -2973702 -2630229 -2685940 -2631551
43032b631551K77676L01573L40275N86760O61272R9215p50120r31148j72735O20599
$$ -2631551 -2353875 -2052302 -1712027 -1125267 -463995 -364780 -1114900 -2046048 -2218783 -1598184
43022a598184O06137K01454L46938R49007J003116J97384o09738p14211m21955
$$ -1598184 -992047 -790593 -443655 505352 1508468 1705852 1096114 381903 -40052
43013d0052k16822q464K27357m6134r67502j548831q95403L43700Q00135L41338
$$ -40052 -256874 -265338 -37981 -84115 -1051617 -2600448 -3495851 -3152151 -2352016 -2010678
43003b010678O0892M11596N64406j05479r67984j106379n36106J34744O23848
$$ -2010678 -1949786 -1538190 -973784 -1079263 -2047247 -3153626 -3689732 -3554988 -2931140
42994b931140R01580P11486n5757p62149n82601L20986Q51254L78345m55883o55743
$$ -2931140 -2029560 -1318074 -1373831 -2135980 -2718581 -2397595 -1546341 -1167996 -1623879 -2279622
42984b279622j80797J36933j86412o72990o14503l1408L99127K08462l63289o91470
$$ -2279622 -2460419 -2323486 -2509898 -3182888 -3797391 -3828799 -3429672 -3221210 -3584499 -4275969
42974d275969l60803N32875J429298J659347J033533J24432l12002k37618k92111
$$ -4275969 -4636772 -4103897 -2674599 -1015252 18281 142713 -169289 -406907 -699018
42965f99018p43896r78258m08761N12868P94033K39593l34649k52626K54580O11138
$$ -699018 -1442914 -2421172 -2829933 -2317065 -1523032 -1283439 -1618088 -1870714 -1616134 -1004996
42955a004996O73127N97122L78613P327j95602M9275L77817J30147o46764j121314
$$ -1004996 -331869 265253 643866 651193 455591 504866 882683 1012830 366066 -755248
42945g55248q19505k83311j77247k50255J43140Q09386Q83166K32277k24799O6057
$$ -755248 -1574753 -1858064 -2035311 -2285566 -2142426 -1333040 -449874 -217597 -442396 -376339
42935c76339L97826p1899r39099j089040k54291P40031J105361P76604J25872
$$ -376339 21487 -50412 -989511 -2078551 -2332842 -1592811 -487450 289154 415026
42926D15026l35371j16483O86221J130872M93497n93262r69303p20873r25638
$$ 415026 79655 -36828 649393 1780265 2273762 1680500 711197 -9676 -935314
42917i35314j630195j580563m13804M39253k3152o31942J27793J600189J885311
$$ -935314 -2565509 -4146072 -4559876 -4120623 -4143775 -4775717 -4647924 -3047735 -1162424
42908a162424O80016m73980n66892j57694L6697J03984J50908j47425o96180p44756
$$ -1162424 -482408 -956388 -1523280 -1680974 -1644277 -1540293 -1389385 -1536810 -2232990 -2977746
42898b977746p3769M67789J85578m54403n91700q0170O64815J279149J427347
$$ -2977746 -3051515 -2583726 -2398148 -2852551 -3444251 -3524421 -2859606 -1580457 -153110
42889a53110Q39014r2445l96819K09553P92752N50705j9248q9889P5187k65143
$$ -153110 685904 593459 196640 406193 1198945 1749650 1730402 1640513 1715700 1450557
42879A450557q31279p27460j24036j49937r59089j253295k50373J031647J241630
$$ 1450557 619278 -108182 -232218 -382155 -1341244 -2594539 -2844912 -1813265 -571635
42870e71635N37097J401j08266l77747q10002o24963L36290J051215O77349k29837
$$ -571635 -34538 -33137 -141403 -519150 -1329152 -1954115 -1617825 -566610 110739 -119098
42860a19098m90388J29458P67342P01801J27748l39001m38031l51664l17126l77361
$$ -119098 -609486 -480028 287314 989115 1116863 777862 339831 -11833 -328959 -706320
42850g06320m07300k70766p562J31322m5507l62544l97869M1287O85677J088313
$$ -706320 -1113620 -1384386 -1391948 -1260626 -1306133 -1668677 -2066546 -2025259 -1339582 -251269
42840b51269J036139O48876J79448k08177m72957n38868k36343L76986P13308
$$ -251269 784870 1433746 1613194 1405017 932060 393192 156849 533835 1247143
42831A247143J59191r14931j219474j46618J169271J170095m8305r34856o71724
$$ 1247143 1406334 491403 -728071 -874689 294582 1464677 1416372 481516 -190208
42822a90208o9156p2567m89526p02090o62622n25408j56286K64435Q436r59976
$$ -190208 -259364 -331931 -821457 -1523547 -2186169 -2711577 -2867863 -2603428 -2594992 -3554968
42812c554968j345015k17484J339306J553586M44822l99317k34259J32906L0126
$$ -3554968 -4899983 -5117467 -3778161 -2224575 -1779753 -2179070 -2413329 -2280423 -2250297
42803b250297j59415l8350J44597K63114N83219Q75954M18672o46891j107371
$$ -2250297 -2409712 -2448062 -2303465 -2040351 -1457132 -581178 -162506 -809397 -1916768
42794a916768m06318N23853P90921P54574R22730Q21030M3983n95506k75025K55493
$$ -1916768 -2323086 -1799233 -1008312 -253738 668992 1490022 1534005 938499 663474 918967
42784I18967k79248j566221k092842j375367l57784L34841J060355J852936J872267
$$ 918967 639719 -926502 -3019344 -4394711 -4752495 -4417654 -3357299 -1504363 367904
42775C67904P80249l86909m73398L47580J013520R33810L28969l83484r60138
$$ 367904 1148153 761244 287846 635426 1648946 2582756 2911725 2528241 1568103
42766A568103j273215j290897j043836m82483L75405J061312Q81429j52690j013910
$$ 1568103 294888 -996009 -2039845 -2522328 -2146923 -1085611 -204182 -356872 -1370782
42757a370782p67574J96889N48082l44565j563821j655935k90076J348639J822106
$$ -1370782 -2138356 -1941467 -1393385 -1737950 -3301771 -4957706 -5247782 -3899143 -2077037
42748b077037Q94286l90990r25462n66148K9151K67739J40435M8408K77677N89712
$$ -2077037 -1182751 -1573741 -2499203 -3065351 -3036200 -2768461 -2628026 -2579618 -2301941 -1712229
42738a712229L96085m03022q77286K5667J855424K681946J339641q91123j670966
$$ -1712229 -1316144 -1719166 -2596452 -2570785 -715361 1966585 3306226 2415103 744137
42729G44137m14836J167604J346138K90988o11021o54678m07076o31214j168236
$$ 744137 329301 1496905 2843043 3134031 2523010 1868332 1461256 830042 -338194
42720c38194j113674k6241J287619J531868M75304p42716j103816r13434r74750
$$ -338194 -1451868 -1478109 -190490 1341378 1816682 1073966 -29850 -943284 -1918034
42711a918034j160115p36349J94793O85692M12861J09573K81288M76145K61338
$$ -1918034 -3078149 -3814498 -3619705 -2934013 -2521152 -2411579 -2130291 -1654146 -1392808
42702a392808J5844J46907K81531m4551m94682m99585k57920l46728o20041l43799
$$ -1392808 -1376964 -1230057 -948526 -993077 -1487759 -1987344 -2245264 -2591992 -3212033 -3555832
42692c555832O19596J496603J595318J074941N48228K85498K0585n85532j379648
$$ -3555832 -2936236 -1439633 155685 1230626 1778854 2064352 2084937 1499405 119757
42683A19757j676224r85398K26262R04092O64923J83498O5047j5387m90349q37480
$$ 119757 -1556467 -2541865 -2315603 -1411511 -746588 -563090 -498043 -513430 -1003779 -1841259
42673a841259k47889R36280J443740P62210k69824p40376p32257p65087q40696
$$ -1841259 -2089148 -1152868 290872 1053082 783258 42882 -689375 -1454462 -2295158
42664b295158n72804R2631P49150R92591P75569M03497K46384L15275K17107k10025
$$ -2295158 -2867962 -2775331 -2026181 -1033590 -258021 145476 391860 707135 924242 714217
42654G14217m60754j06933K38690m03586j658204j821511j66277J711810J757239
$$ 714217 253463 146530 385220 -18366 -1676570 -3498081 -3664358 -1952548 -195309
42645a95309O5566j379484j252116j21919P78649R79616P26989L58412J43781
$$ -195309 -129743 -1509227 -2761343 -2883262 -2104613 -1124997 -398008 -39596 104185
42636A04185K01027K43058j44220p62630q79329l08807J81362l6257n19432n08652
$$ 104185 305212 548270 404050 -358580 -1237909 -1546716 -1365354 -1401611 -1921043 -2429695
42626b429695j49536j92431o73366p25701J53320J298154J665076J045810J71484
$$ -2429695 -2579231 -2771662 -3445028 -4170729 -4017409 -2719255 -1054179 -8369 163115
42617A63115j86023O1288M17489M21908J07523j38281j17641q1423l49733q20732
$$ 163115 -22908 38380 455869 877777 985300 847019 729378 647955 298222 -522510
42607e22510j057578q07720k59465J88594K86732J26277P1227L63941O99776M55310
$$ -522510 -1580088 -2387808 -2647273 -2458679 -2171947 -2045670 -1974443 -1610502 -910726 -455416
42597d55416m34540j142272r05815q6107K86979o2309l25277J59650R26422R94576
$$ -455416 -889956 -2032228 -2938043 -3024150 -2737171 -2799480 -3124757 -2965107 -2038685 -1044109
42587a044109J37790q28014r44935j16312P96587Q96092K54940k48801j91526
$$ -1044109 -906319 -1734333 -2679268 -2795580 -1998993 -1102901 -847961 -1096762 -1288288
42578a288288j62921o28073q73164j7227J334156J691914Q69379J79816K28828
$$ -1288288 -1451209 -2079282 -2952446 -2969673 -1635517 56397 925776 1105592 1334420
42569A334420O1481q27350j220930j48503J161231R06185n47471j285447p32208
$$ 1334420 1395901 568551 -652379 -800882 360349 1266534 719063 -566384 -1298592
42560a298592j25558k38912m30048k04456n5648k13374k8649O79775R67799L11709
$$ -1298592 -1424150 -1663062 -2093110 -2297566 -2353214 -2566588 -2595237 -1915462 -947663 -635954
42550f35954l31460j5583N97955K99786o84921j019383k54203O32931O84194N0343
$$ -635954 -967414 -982997 -385042 -85256 -770177 -1789560 -2043763 -1410832 -726638 -676295
42540f76295m92879m57623Q9513P26443J007604Q47388N74353M53226L25776o6438
$$ -676295 -1169174 -1626797 -1537284 -810841 196763 1044151 1618504 2071730 2397506 2331068
42530B331068o20103r72375q78021l32831M03172P90163M34153k84350m95534
$$ 2331068 1710965 738590 -139431 -472262 -69090 721073 1155226 870876 375342
42521C75342j0935L41812q7060q12542r27480k67140O25444J210941J179067N39397
$$ 375342 364407 706219 619159 -193383 -1120863 -1388003 -762559 448382 1627449 2166846
42511B166846l5064L27838J300742J312909k31939j675733j317272k9100L8154
$$ 2166846 2131782 2459620 3760362 5073271 4841332 3165599 1848327 1819227 1857381
42502A857381j179036j615207l70409J055723J308018R67101Q94895N87580n10190
$$ 1857381 678345 -936862 -1307271 -251548 1056470 2023571 2918466 3506046 2995856
42493B995856j478395j247000m32127k97619o40435l13125O32716R67308L07166
$$ 2995856 1517461 270461 -161666 -459285 -1099720 -1412845 -780129 187179 494345
42484D94345l88717m46819k76438l08747l18336j39405n2692j11649K8313L11385
$$ 494345 105628 -341191 -617629 -926376 -1244712 -1384117 -1436809 -1548458 -1520145 -1208760
42474a208760J98584l13172n05621j39934R9130j69052l03557K22158Q66532R64783
$$ -1208760 -1010176 -1323348 -1828969 -1968903 -1869773 -2038825 -2342382 -2120224 -1253692 -288909
42464b88909Q09148R00118Q56314J23486p86886r18696l91290j59422m53056o02597
$$ -288909 520239 1420357 2276671 2400157 1613271 694575 303285 143863 -309193 -911790
42454i11790l60319k39615m23795m30384r4650J21688P1600J79974M62706L38784
$$ -911790 -1272109 -1511724 -1935519 -2365903 -2460553 -2338865 -2267265 -2087291 -1624585 -1285801
42444a285801j77378k11052M63156P69745o589r56763r48500l70096k95758o59313
$$ -1285801 -1463179 -1674231 -1211075 -441330 -447919 -1404682 -2353182 -2723278 -3019036 -3678349
42434c678349n80260L871L74256L68304L91933L75927M0305o1582P57913J715636
$$ -3678349 -4258609 -4254738 -3880482 -3512178 -3120245 -2744318 -2704013 -2765595 -2007682 -292046
42424b92046J308701k20435r33137j16013O56575J47313o19730k53377O81888
$$ -292046 1016655 796220 -136917 -252930 403645 550958 -68772 -322149 359739
42415C59739P48106l4995n21198l86632k37206k41851p1314J00885j74519o16390
$$ 359739 1107845 1072850 551652 165020 -72186 -314037 -385351 -284466 -458985 -1075375
42405a075375o08139l52723m60332o56801k00868N85668O19944p9527k65682N42517
$$ -1075375 -1683514 -2036237 -2496569 -3153370 -3354238 -2768570 -2148626 -2228153 -2493835 -1951318
42395a951318J292578J075511L58521l4548j27063l21180n69660o34853n06537
$$ -1951318 -658740 416771 775292 740744 613681 292501 -277159 -912012 -1418549
42386a418549j19752O42160J319938J103805J06402n04298j63914K60971l8097
$$ -1418549 -1538301 -896141 423797 1527602 1634004 1129706 965792 1226763 1188666
42377A188666n07345l32301O1705k24976r38153j069247n26917j66404k79887
$$ 1188666 681321 349020 410725 185749 -752404 -1821651 -2348568 -2514972 -2794859
42368b794859k59791J36764L08569o3466l39664R0898P80250P93292J9018o20586
$$ -2794859 -3054650 -2917886 -2609317 -2672783 -3012447 -2921549 -2141299 -1348007 -1328989 -1949575
42358a949575k96206O75901J114299L79485o85679o41356O64202J677465R95776
$$ -1949575 -2245781 -1569880 -455581 -76096 -761775 -1403131 -738929 938536 1934312
42349A934312q71158k189394k059004j049037l3331P01269J117740J047276N15327
$$ 1934312 1063154 -1126240 -3185244 -4234281 -4267612 -3566343 -2448603 -1401327 -886000
42340h86000o5120l48679l66059k13611J60034O54511Q92513O52605J47057l13303
$$ -886000 -951120 -1299799 -1665858 -1879469 -1719435 -1064924 -172411 480194 627251 313948
42330C13948o24522o87186k78621N50410J215304J103943K52190p22600j247475
$$ 313948 -310574 -997760 -1276381 -725971 489333 1593276 1845466 1122866 -124609
42321a24609j144541n28652L08609R35827J016663O20659J29149k37736o12375
$$ -124609 -1269150 -1797802 -1489193 -553366 463297 1083956 1213105 975369 362994
42312C62994j079684j305220q80041r300N14435K30656l58906m08644J54156N27802
$$ 362994 -716690 -2021910 -2901951 -2911251 -2396816 -2166160 -2525066 -2933710 -2779554 -2251752
42302b251752Q0896q65804j441124j129338j23668R67867J566475J457311Q97734
$$ -2251752 -2170856 -3036660 -4477784 -5607122 -5730790 -4762923 -3196448 -1739137 -841403
42293h41403L35399m0185l44980o20949o74523l69624J60583O73075R67325Q79775
$$ -841403 -506004 -546189 -891169 -1512118 -2186641 -2556265 -2395682 -1722607 -755282 124493
42283A24493M33425p847r8461m069j00203k70300j52351l5074n83408j484567
$$ 124493 557918 550071 451610 447541 347338 77038 -75313 -110387 -693795 -2178362
42273b178362j466706k00925R12774P02154m8408M7873P65744Q30156J19654k84170
$$ -2178362 -3645068 -3845993 -2933219 -2231065 -2279473 -2231600 -1465856 -635700 -516046 -800216
42263h00216l1444J06510j60676k01950Q7705j05625r42361j340180o60845K30331
$$ -800216 -831660 -725150 -885826 -1087776 -1000071 -1105696 -2048057 -3388237 -4049082 -3818751
42253c818751L96905K12273L85135O17429L44145K1540M50896J294761J436639
$$ -3818751 -3421846 -3209573 -2824438 -2207009 -1862864 -1841324 -1390428 -95667 1340972
42244A340972N99118l77739p40099m82331M2011M08716J70121o61777j308869
$$ 1340972 1940090 1562351 822252 339921 381932 790648 960769 298992 -1009877
42235a009877j062181k46854K88466L68702M10654M22040L7146n43659o52712
$$ -1009877 -2072058 -2318912 -2030446 -1661744 -1251090 -829050 -791904 -1335563 -1988275
42226a988275k76473j07851k81209n8456P98578J291921N59852o67104q85772
$$ -1988275 -2264748 -2372599 -2653808 -2712264 -1913686 -621765 -61913 -729017 -1614789
42217a614789J33839R64679L64614j062707j523985k61802J378535J514950J13000
$$ -1614789 -1480950 -516271 -151657 -1214364 -2738349 -3000151 -1621616 -106666 6334
42208F334r56624m27232P02466P17777l76145j114570q44555l45412j85459Q0800
$$ 6334 -950290 -1377522 -675056 42721 -333424 -1447994 -2292549 -2637961 -2823420 -2742620
42198b742620O54119P82628P9524n57522k76014L83561M81004K17367L07080M63546
$$ -2742620 -2088501 -1305873 -1226349 -1783871 -2059885 -1676324 -1195320 -977953 -670873 -207327
42188b07327q5397r07551p06682N83692J473151J054480J98988l239J13141l90616
$$ -207327 -292724 -1200275 -1906957 -1323265 149886 1204366 1403354 1400115 1513256 1122640
42178A122640j352310j655117p80748N97671J472550J384806N85354j87179k25994
$$ 1122640 -229670 -1884787 -2665535 -2067864 -595314 789492 1374846 1187667 961673
42169I61673L88751P04909K3650j073402j374760o09678K61116L70371p7084l81553
$$ 961673 1350424 2055333 2078983 1005581 -369179 -978857 -717741 -347370 -424454 -806007
42159h06007l46673k75950k98740j78009K51741P65887R44459N93151l5419m36408
$$ -806007 -1152680 -1428630 -1727370 -1905379 -1653638 -887751 56708 649859 614440 178032
42149A78032l42813p180J16991q5702l69787n68852p17483p16439l29768K69504
$$ 178032 -164781 -171961 -54970 -140672 -510459 -1079311 -1796794 -2513233 -2843001 -2573497
42139b573497L99807k50955r50456o87247M80441J413134J312919O23331K68442
$$ -2573497 -2173690 -2424645 -3375101 -4062348 -3581907 -2168773 -855854 -232523 35919
42130C5919M71297P47001P33676M71383k0967q22123j622538j724280r10186M9377
$$ 35919 507216 1254217 1987893 2459276 2438309 1616186 -6352 -1730632 -2640818 -2591441
42120b591441K30422l00943o70395m11990P2982L21574M48444P14915J005885
$$ -2591441 -2361019 -2661962 -3332357 -3744347 -3671365 -3349791 -2901347 -2186432 -1180547
42111a180547J127507J159208J062472M33751p31683j491533j038095n5786L5559
$$ -1180547 -53040 1106168 2168640 2602391 1870708 379175 -658920 -714706 -679147
42102f79147q23798j127830j2161J409240J551068L59149r54452j526630j363353
$$ -679147 -1502945 -2630775 -2642936 -1233696 317372 676521 -277931 -1804561 -3167914
42093c167914p25031J22080P61027R49960R36441R23324N73460l23560j101383
$$ -3167914 -3892945 -3770865 -3009838 -2059878 -1123437 -200113 373347 49787 -1051596
42084a051596r40903n7882O42993Q21643P51696M46666j96208n92919m2523R11571
$$ -1051596 -1992499 -2050381 -1407388 -585745 165951 612617 416409 -176510 -219033 692538
42074F92538R72808Q7979m04735M7891L52660k66851q97132n65548m654m22026
$$ 692538 1665346 1753325 1348590 1396481 1749141 1482290 585158 19610 14956 -407070
42064d07070j368988j357683k01279P03807M13720m21757o34122J06550J203277
$$ -407070 -1776058 -3133741 -3335020 -2631213 -2217493 -2639250 -3273372 -3166822 -1963545
42055a963545J806332J486296O39798J15427J23444n9140q28570j351772p55328
$$ -1963545 -157213 1329083 1968881 2084308 2207752 2148612 1320042 -31730 -787058
42046g87058L74081P85981M43261L10561M97613J17557q70287j229769m09478
$$ -787058 -412977 373004 816265 1126826 1624439 1741996 871709 -358060 -767538
42037g67538M44985K78892k36498N1186P68658N78944o27473j395077o78432Q00496
$$ -767538 -322553 -43661 -280159 -228973 539685 1118629 491156 -903921 -1582353 -781857
42027g81857J523429R18854k38158q40392n07791K75026Q01498P85750M30385
$$ -781857 741572 1660426 1422268 581876 74085 349111 1150609 1936359 2366744
42018B366744O4379j42693k29691l88131p52089j076831q34109Q0479R54404R95064
$$ 2366744 2431123 2288430 2058739 1670608 918519 -158312 -992421 -911942 42462 1037526
42008A037526L12975k98171m39528m20064n53930p50734q53273q13826m75235
$$ 1037526 1350501 1052330 612802 192738 -361192 -1111926 -1965199 -2779025 -3254260
41999c254260K32947Q06234N37518m31934j068520p24150R6446N14993L07264
$$ -3254260 -3021313 -2215079 -1677561 -2109495 -3178015 -3902165 -3805719 -3290726 -2983462
41990b983462j16532k81411M9133P25208J229483J254783J194493J449043J444186
$$ -2983462 -3099994 -3381405 -3332272 -2607064 -1377581 -122798 1071695 2520738 3964924
41981C964924L49228j244522j663255n18062O04889M59154j82430q6726M48479
$$ 3964924 4314152 3069630 1406375 888313 1493202 1952356 1769926 1683200 2131679
41972B131679L95699k01252n84453o80589p97426o10422J36897N69166j15221
$$ 2131679 2527378 2326126 1741673 1061084 263658 -346764 -209867 359299 244078
41963B44078r29391l68374R74479J077349k54361r81814j32105O64699o3683j239821
$$ 244078 -685313 -1053687 -79208 998141 743780 -238034 -370139 294560 230877 -1008944
41953a008944j072043J31651O81811J84791j87137K36977P74644O74528J43171
$$ -1008944 -2080987 -1949336 -1267525 -1082734 -1269871 -1032894 -258250 416278 559449
41944E59449j85088j27023m6999l62726r75015j139454k76767R74327J194910
$$ 559449 374361 247338 200339 -162387 -1137402 -2276856 -2553623 -1579296 -384386
41935c84386O7448r54750n46159O47293J031964L89253m4036L64294P79598L41665
$$ -384386 -316938 -1271688 -1817847 -1170554 -138590 250663 206627 570921 1350519 1692184
41925A692184o01637j194404j212701r26627m09226L52967R76861R61309M19135
$$ 1692184 1090547 -103857 -1316558 -2243185 -2652411 -2299444 -1322583 -361274 57861
41916E7861O7878L91446J080366J408852J008931J82966m48415n13061j52326
$$ 57861 125739 517185 1597551 3006403 4015334 4198300 3749885 3236824 3084498
41907C084498J72094J07435k94495o62408o90055m21014j19312N6722R6409o6236
$$ 3084498 3256592 3364027 3069532 2407124 1717069 1296055 1176743 1233465 1329874 1263638
41897A263638m81817q66329p48859j39703L39740K89433Q2191J83204L63202J61386
$$ 1263638 781821 -84508 -833367 -973070 -633330 -343897 -261706 -78502 284700 446086
41887D46086k60785m27765l80210m07671k77512L03447P20908J41028r06690r90457
$$ 446086 185301 -242464 -622674 -1030345 -1307857 -1004410 -283502 -142474 -1049164 -2039621
41877b039621N533N69907q9104q71781o93034j02507K9238P7336N79440P69129
$$ -2039621 -2034088 -1464181 -1553285 -2425066 -3118100 -3220607 -3191369 -3114033 -2534593 -1765464
41867a765464j73169j251599q29794P77705J641513R84917l1103l21449j01522
$$ -1765464 -1938633 -3190232 -4020026 -3242321 -1600808 -615891 -646994 -968443 -1069965
41858a069965J48606N09424R54171R97129M77512j57467n96233q85011q83595
$$ -1069965 -921359 -411935 542236 1539365 2016877 1859410 1263177 378166 -505429
41849e05429m48469j17823n14199j110346q51881J1186K02827l52546k94176P85355
$$ -505429 -953898 -1071721 -1585920 -2696266 -3548147 -3536961 -3334134 -3686680 -3980856 -3195501
41839c195501J544475J219309Q89898J324593J362367j7207j541520j426119j90092
$$ -3195501 -1651026 -431717 458181 1782774 3145141 3127934 1586414 160295 -29797
41830b9797K78624l01284n80611q7130K55186K7778j23267J5042j58165o51509
$$ -29797 248827 -52457 -633068 -720198 -465012 -437234 -560501 -545459 -703624 -1355133
41820a355133o29177M3162M13797P3833j61579K34032N58828J64439m12519l92965
$$ -1355133 -1984310 -1941148 -1527351 -1453518 -1615097 -1381065 -822237 -657798 -1070317 -1463282
41810a463282M9653K82220J45255k46500q47930j189183m25528J290477K327589
$$ -1463282 -1413629 -1131409 -986154 -1232654 -2080584 -3269767 -3695295 -2404818 -77229
41801g7229J504367j60339p72802j35906L11159j24121n28530j22811N02961N44752
$$ -77229 1427138 1266799 493997 358091 669250 545129 16599 -106212 396749 941501
41791I41501L18039N05198P57114J62133j100912j671172q09375N53235J050976
$$ 941501 1259540 1764738 2521852 2683985 1583073 -88099 -897474 -344239 706737
41782G06737N42000j12039m62236p89718j140216j017815l03698L52166M97438
$$ 706737 1248737 1136698 674462 -115256 -1255472 -2273287 -2576985 -2224819 -1727381
41773a727381M92791O20045L81095m77696r91892k42324Q80193O52822q17654
$$ -1727381 -1234590 -614545 -233450 -711146 -1703038 -1945362 -1065169 -412347 -1230001
41764a230001j522975n08985P04234N05347m27795m25188N29009J015101N09244
$$ -1230001 -2752976 -3261961 -2557727 -2052380 -2480175 -2905363 -2376354 -1361253 -852009
41755h52009j03801k40454l25722n43811k43984Q20994J711213J487009M65588
$$ -852009 -955810 -1196264 -1521986 -2065797 -2309781 -1488787 222426 1709435 2175023
41746B175023l63824n79568l55443J50096O64982N45733m47629j394209j183494
$$ 2175023 1811199 1231631 876188 1026284 1691266 2236999 1789370 395161 -788333
41737g88333j47197K93902k79758o62593M3328R41707O94399m04439q95344l44595
$$ -788333 -935530 -641628 -921386 -1583979 -1540651 -598944 95455 -308984 -1204328 -1548923
41727a548923K14465Q6145r7443L51230R70730R66367M76342J76410J24640j28858
$$ -1548923 -1334458 -1248313 -1345756 -994526 -23796 942571 1418913 1595323 1719963 1591105
41717A591105n66172o56957j84008N26991J060959J038399J07601j426866k263602
$$ 1591105 1024933 367976 183968 710959 1771918 2810317 2917918 1491052 -772550
41708g72550j388831L59503J054335J41652q92204o20130N68112J322228J074480
$$ -772550 -2161381 -1801878 -747543 -605891 -1498095 -2118225 -1550113 -227885 846595
41699H46595K79950m11752n70737q4407N94184P31374K50262j65116k34153n25053
$$ 846595 1126545 714793 144056 59649 653833 1385207 1635469 1470353 1236200 711147
41689G11147j182561j182336J63097J715968J753696K62302j220495j755055j692350
$$ 711147 -471414 -1653750 -1490653 225315 1979011 2241313 1020818 -734237 -2426587
41680b426587j332358l57386J037623J730890J102725J5004l57703n0674M9183
$$ -2426587 -3758945 -4116331 -3078708 -1347818 -245093 -230089 -587792 -638466 -589283
41671e89283l59798o72400l64349L01476O61316M22424q9146l47809j96165N3459
$$ -589283 -949081 -1621481 -1985830 -1684354 -1023038 -600614 -689760 -1037569 -1233734 -1180275
41661a180275M1147k77782o94290q90910m79528O40769J743551J676123K83167
$$ -1180275 -1139128 -1416910 -2111200 -3002110 -3481638 -2840869 -1097318 578805 861972
41652H61972j095627j170431k42804N29374Q29054J082945J115436L05471r30864
$$ 861972 -233655 -1404086 -1646890 -1117516 -288462 794483 1909919 2215390 1284526
41643A284526j245987k98183O65165O43972J50948O0147L14378N23616Q03748
$$ 1284526 38539 -259644 405521 1049493 1200441 1260588 1574966 2098582 2902330
41634B902330J109847O69098q27968k179857j992060o03818L95059K72484k53363
$$ 2902330 4012177 4681275 3853307 1673450 -318610 -922428 -527369 -254885 -508248
41625e08248l39801M5620M80521N80645J73000m09438m24678K71787P41658K83777
$$ -508248 -848049 -802429 -321908 258737 431737 22299 -402379 -130592 611066 894843
41615H94843l06520O7354Q30289M93837p59652j075615Q0110P77940m76942k240812
$$ 894843 588323 655677 1485966 1979803 1220151 144536 224646 1002586 525644 -1715168
41605a715168k085442j02762J300091P82049m36845o79747L368M25750J17268
$$ -1715168 -3800610 -3903372 -2603281 -1821232 -2258077 -2937824 -2934456 -2508706 -2391438
41596b391438k62622l3509O21269R06786L29954o60061j020537k92093P37050
$$ -2391438 -2654060 -2687569 -2066300 -1159514 -829560 -1489621 -2510158 -2802251 -2065201
41587b065201R51400L59571j6574K58305M01262j94816p79017l16199Q06772J253071
$$ -2065201 -1113801 -754230 -770804 -512499 -111237 -306053 -1085070 -1401269 -594497 658574
41577F58574P19198K40894L72500L28487m84411j241223r84141k44536j37801
$$ 658574 1377772 1618666 1991166 2319653 1835242 594019 -390122 -634658 -772459
41568g72459m41826n6549Q62362Q99278k21750q80040l653J121551P10573q28232
$$ -772459 -1214285 -1270834 -408472 490806 269056 -610984 -614637 506914 1217487 389255
41558C89255j520070o73929L57791K65453o32569j197968r11527q3014O96671
$$ 389255 -1130815 -1804744 -1446953 -1181500 -1814069 -3012037 -3923564 -4006578 -3309907
41549c309907R02308L55972m90590q79515n48366Q4934N70568Q20439Q01741M02146
$$ -3309907 -2407599 -2051627 -2542217 -3421732 -3970098 -3885164 -3314596 -2494157 -1692416 -1290270
41539a290270j81942m42207k53756j26405m09295o70804l47625L03461N03887
$$ -1290270 -1472212 -1914419 -2168175 -2294580 -2703875 -3374679 -3722304 -3418843 -2914956
41530b914956J27015l7255N82616J379236J213510o2277j225812j088523O3431
$$ -2914956 -2787941 -2825196 -2242580 -863344 350166 287889 -937923 -2026446 -1963015
41521a963015R03266P71483K90747J80544K36124k5887l49419j37953M76672P76419
$$ -1963015 -1059749 -288266 2481 183025 419149 393262 43843 -94110 382562 1158981
41511A158981N40003K43692K17325K87503K63770J30515k24128p88069r90508
$$ 1158981 1698984 1942676 2160001 2447504 2711274 2841789 2617661 1829592 839084
41502H39084l07810O76309P66049j06064o39549l7009Q91557J054530N45251L0126
$$ 839084 531274 1207583 1973632 1867568 1228019 1191010 2082567 3137097 3682348 3712474
41492C712474m57849j144481j582289j174984k80147K01484J23652Q4257K91478
$$ 3712474 3254625 2110144 527855 -647129 -927276 -725792 -602140 -517883 -226405
41483b26405L42532P2916k24191m45695p67384j040850q50653k61772J91979L51943
$$ -226405 116127 189043 -35148 -480843 -1248227 -2289077 -3139730 -3401502 -3209523 -2857580
41473b857580N54636Q07411O34253l521l87948m6321N41986O76271L55631J3728
$$ -2857580 -2302944 -1495533 -861280 -864801 -1252749 -1299070 -757084 -80813 274818 288546
41463B88546k25602n15520p93816p97236m36528J47883P51809J113757R94343
$$ 288546 62944 -452576 -1246392 -2043628 -2480156 -2332273 -1580464 -466707 527636
41454E27636N05277J32548J62398K87343N3842m84462q51486p58854l56729O0792
$$ 527636 1032913 1165461 1327859 1615202 1669044 1184582 333096 -425758 -782487 -721695
41444g21695L66197N91533P16362N21526k09950j200051j595776q07063O19136
$$ -721695 -355498 236035 952397 1473923 1263973 63922 -1531854 -2338917 -1719781
41435a719781J461917J232740N83715J98269j9489k86811k27646M58147J116126
$$ -1719781 -257864 974876 1558591 1756860 1737371 1450560 1222914 1681061 2797187
41426B797187Q19303k64091j028042r31182n41286m69369n49738l95784j12369
$$ 2797187 3616490 3352399 2324357 1393175 851889 382520 -167218 -563002 -675371
41417f75371n443n0527r6595k25709m56399m15102J61420P96788P38353L8222
$$ -675371 -680814 -731341 -827936 -1053645 -1510044 -1925146 -1763726 -966938 -228585 -190363
41407a90363l80944R1230R29582J106077K84915q84549j502350j188776k50888
$$ -190363 -571307 -480077 449505 1555582 1840497 955948 -546402 -1735178 -1986066
41398a986066O06743P52670J33640n65025n09138L41569J061974P79450k58253
$$ -1986066 -1379323 -626653 -493013 -1058038 -1567176 -1225607 -163633 615817 357564
41389C57564r43513o17576K15947N82439J33467o43663j075058q97680l41119
$$ 357564 -585949 -1203525 -987578 -405139 -271672 -915335 -1990393 -2888073 -3229192
41380c229192J34583K27515Q5780J46136N68258R84403R75968N97365J78020j80967
$$ -3229192 -3094609 -2867094 -2781314 -2635178 -2066920 -1082517 -106549 490816 668836 487869
41370D87869n45673p44461n02379K3236L06671J64442Q721K38977P16132J008795
$$ 487869 -57804 -802265 -1304644 -1281408 -974737 -810295 -801574 -562597 153535 1162330
41360A162330Q85101M26993q8732l51215l40431m79025j047557j488090r36546
$$ 1162330 2047431 2474424 2385692 2034477 1694046 1215021 167464 -1320626 -2257172
41351b257172M18768J282086R16830P7621k86896m29370r97766j528082r98729
$$ -2257172 -1838404 -556318 360512 438133 151237 -278133 -1275899 -2803981 -3802710
41342c802710L84949J254418R81458L31528O832k74755q00156j072617o93470
$$ -3802710 -3417761 -2163343 -1181885 -850357 -843525 -1118280 -1918436 -2991053 -3684523
41333c684523j43269P0167K76927Q54020J283693R50598L01949J51291K52914
$$ -3684523 -3827792 -3757625 -3480698 -2626678 -1342985 -392387 -90438 60853 313767
41324C13767k39034j097454j111218L479R91251Q00784n2640m47693j61523K64302
$$ 313767 74733 -1022721 -2133939 -2130460 -1139209 -338425 -391065 -838758 -1000281 -735979
41314g35979M99838N03438J22113n52083p65417M8764J143608J143548m1557r59877
$$ -735979 -236141 267297 389410 -162673 -928090 -879326 264282 1407830 1366273 406396
41304D06396o49317L3409j33713p54105m74654P03268J199088K24820r36771q17016
$$ 406396 -242921 -209512 -343225 -1097330 -1571984 -868716 330372 555192 -381579 -1198595
41294a198595J10938L35490l36284p08291k50430K17179R7961m5592L34391P55990
$$ -1198595 -1087657 -752167 -1088451 -1796742 -2047172 -1829993 -1732032 -1777624 -1443233 -687243
41284f87243N85300Q9281j28190n9547L1295K09801M39652K25466n18260r05945
$$ -687243 -101943 -12662 -140852 -200399 -169104 40697 480349 705815 187555 -718390
41274g18390l01069N28447N19699J3044J17967P96339R59095L21139k43378k71184
$$ -718390 -1019459 -491012 28687 41731 159698 956037 1915132 2236271 1992893 1721709
41264A721709k77867n09739m41430L6458J30188n47444j198656j043195m39634
$$ 1721709 1443842 934103 492673 529131 659319 111875 -1086781 -2129976 -2569610
41255b569610j24607q2451J11296M11598M50056J36065l83096r24191j071780
$$ -2569610 -2694217 -2776668 -2665372 -2253774 -1803718 -1667653 -2050749 -2974940 -4046720
41246d046720l81119P83627J262301N19998n10650o25244J04552O37642M37346
$$ -4046720 -4427839 -3644212 -2381911 -1861913 -2372563 -2997807 -2893255 -2255613 -1818267
41237a818267m2925j52633K48546Q18434J103669R25417N45300L14710J77710
$$ -1818267 -1861192 -2013825 -1765279 -946845 156824 1082241 1627541 1942251 2119961
41228B119961j57318o04458p27785l73478K09939P99835J200169J043667L51176
$$ 2119961 1962643 1358185 630400 256922 466861 1266696 2466865 3510532 3861708
41219C861708j102O24256J377647J088139M12542J046762K717853L068577J165390
$$ 3861708 3860606 4484862 5862509 6950648 7363190 8409952 11127805 14196382 15361772
41210A5361772j004982j604689j434480j867223k253964j411110j71433j44669
$$ 15361772 14356790 12752101 11317621 9450398 7196434 5785324 5613891 5469222
41202E469222r17580p83073L17665P55080j41456j306977j700808j236249j73349
$$ 5469222 4551642 3768569 4086234 4841314 4699858 3392881 1692073 455824 282475
41193B82475R26363J027345o2136p34320L43448J816560J358678o65485j620879
$$ 282475 1208838 2236183 2174047 1439727 1783175 3599735 4958413 4292928 2672049
41184B672049n99936M83931J61616o22152n79680m2537J57122J10488J65313J70433
$$ 2672049 2072113 2556044 2717660 2095508 1515828 1473291 1630413 1740901 1906214 2076647
41174B076647J45709M83683R36325O77240j89207n63612k00627j08137o27011
$$ 2076647 2222356 2706039 3642364 4319604 4130397 3566785 3366158 3258021 2631010
41165B631010p41330L1757O51919K68671n07516q55491r17783r51879o26103O6777
$$ 2631010 1889680 1921437 2573356 2842027 2334511 1479020 561237 -390642 -1016745 -949968
41155i49968M44713L69149N76492J190524J298248O27648J68517M38601O50189
$$ -949968 -505255 -136106 440386 1630910 2929158 3556806 3725323 4163924 4814113
41146D814113L26916J71824N27506N78389m2387m46107j62413Q225l22556l27459
$$ 4814113 5141029 5312853 5840359 6418748 6376361 5930254 5767841 5776066 5453510 5126051
41136E126051K64823M69936J04074M92373J929174K578498J374302j09901l53032
$$ 5126051 5390874 5860810 5964884 6457257 8386431 10964929 12339231 12229330 11876298
41127A1876298l07560j192747j935665j094109M01867P82739K63678J02611K13931
$$ 11876298 11568738 10375991 8440326 7346217 7748084 8530823 8794501 8897112 9111043
41118I111043q2201k63381K69755N87179j20572o62376K06193J362713J095851
$$ 9111043 9028842 8765461 9035216 9622395 9501823 8839447 9045640 10408353 11504204
41109A1504204o6197n25957j99582K33313J065212K335292K658940J581409J095157
$$ 11504204 11438007 10912050 10712468 10945781 12010993 14346285 17005225 18586634 19681791
41100A9681791K424920L667105L251597K958110M439393N942665O096081P328475
$$ 19681791 22106711 25773816 29025413 31983523 36422916 42365581 48461662 55790137
41092E5790137J1151025J4052001J3396149J3019411J6672476K1381870K5884143
$$ 55790137 66941162 80993163 94389312 107408723 124081199 145463069 171347212
41085A71347212L8801378O4049446Q1737394O3087201R223566m2261570n9119549
$$ 171347212 210148590 274198036 355935430 419022631 428246197 385984627 326865078
41078C26865078m8842785l9883040m2023387m2494610l3407945k2847225j8315188
$$ 326865078 278022293 238139253 196115866 153621256 120213311 97366086 79050898
41071G9050898j5949622j0950818o438066o049929o740312m796056k341339k563581
$$ 79050898 63101276 52150458 45712392 39662463 32922151 28126095 25784756 23221175
41063B3221175l751979k932255j198403r93017j487685p13963M29227l6147j456333
$$ 23221175 19469196 16536941 15338538 14345521 12857836 12143873 12573100 12536953 11080620
41054A1080620j777063q79380j19330Q9243J65411Q9992j57304j17715Q2585l77113
$$ 11080620 9303557 8424177 8304847 8394090 8559501 8649493 8492189 8374474 8457059 8079946
41044H079946j276821j275856k62603K48224k16957k81001O04540J091511N50979
$$ 8079946 6803125 5527269 5264666 5512890 5295933 5014932 5619472 6710983 7261962
41035G261962K72601Q60331R08720l43045j386509q88244M65476J794127L280605
$$ 7261962 7534563 8394894 9303614 8960569 7574060 6685816 7151292 8945419 12226024
41026A2226024M484908M311825M059843O993184J2529755J4391961Q081811k401100
$$ 12226024 16710932 21022757 25082600 32075784 44605539 58997500 67079311 64678211
41018F4678211r124045r569286p529014o280354n432053m221223l544688l746125
$$ 64678211 55554166 45984880 38455866 32175512 26743459 22522236 18977548 15231423
41010A5231423l588138k534234j661326j481862j035591N4241O36805N6717o24105
$$ 15231423 11643285 9109051 7447725 5965863 4930272 4984513 5621318 5678035 5053930
41001E053930m19819O250l83393j217942j252579j09377J269937J683123Q80567
$$ 5053930 4634111 4640361 4256968 3039026 1786447 1677070 2947007 4630130 5510697
40992E510697j30387r0020J002191J811970J449050N81597J45039j15433p33030
$$ 5510697 5380310 5290290 6292481 8104451 9553501 10135098 10280137 10164704 9431674
40983I431674j012842Q7202K048962L275840L270304K930176K786922K327078
$$ 9431674 8418832 8506034 10554996 13830836 17101140 20031316 22818238 25145316
40975B5145316J125048n50030k307111l741326m075706k898686j243470p20830
$$ 25145316 26270364 25720334 23413223 19671897 15596191 12697505 11454035 10733205
40967A0733205j487520k174343j860187r91672l13580n4296k58532p78631q54368
$$ 10733205 9245685 7071342 5211155 4219483 3905903 3851607 3593075 2814444 1960076
40958A960076J05070J219632R06169q19439k109659j734426n07881K32068L50095
$$ 1960076 2065146 3284778 4190947 3371508 1261849 -472577 -980458 -748390 -398295
40949c98295M14912N02250L42258k762k94928m85005n03489k05495J92288K28885
$$ -398295 16617 518867 861125 858363 563435 78430 -425059 -630554 -438266 -209381
40939b09381k844J36025P56972J107230O45314k01459o58096l81233N40039J635881
$$ -209381 -212225 -76200 680772 1788002 2433316 2231857 1573761 1192528 1732567 3368448
40929C368448J971517Q93691q76052j776965j324959n59740k93207o7995N68729
$$ 3368448 5339965 6233656 5357604 3580639 2255680 1695940 1402733 1334738 1903467
40920A903467R41352L40859o44934r30565m38123J49320N78694R68363J000675
$$ 1903467 2844819 3185678 2540744 1610179 1172056 1321376 1900070 2868433 3869108
40911C869108K70664p15809q93391o7854P64812O79683j46435q05175o73599M9047
$$ 3869108 4139772 3423963 2530572 2462718 3227530 3907213 3760778 2955603 2282004 2331051
40901B331051O17094N37195J12913k7592R8466j20840p38555r05460j53800O81086
$$ 2331051 2948145 3485340 3598253 3570661 3669127 3548287 2809732 1904272 1750472 2431558
40891B431558N41251l82636j066721j124830r64356p52060k33855M28398N85225
$$ 2431558 2972809 2590173 1523452 398622 -565734 -1317794 -1551649 -1123251 -538026
40882e38026N3993o05744r48058j058001r33428k50787Q63547J539769J195230
$$ -538026 -484033 -1089777 -2037835 -3095836 -4029264 -4280051 -3416504 -1876735 -681505
40873f81505L43051j76152l02941m63696n71307j57168O24074R83202O36339J95753
$$ -681505 -338454 -514606 -817547 -1281243 -1852550 -2009718 -1385644 -402442 233897 429650
40863D29650J22679K0605m99072q85562m03978N22138O84639j84621r88434q40399
$$ 429650 552329 572934 73862 -811700 -1215678 -693540 -8901 -193522 -1181956 -2022355
40853b022355k22625n0715k93780k78141R6514L17089K60469L83951Q27337J049377
$$ -2022355 -2244980 -2295695 -2589475 -2867616 -2771102 -2454013 -2193544 -1809593 -982256 67121
40843F7121O20730j43388o31659o43358l97108j45095l2408j19136l18417m45856
$$ 67121 687851 544463 -87196 -730554 -1127662 -1272757 -1305165 -1424301 -1742718 -2188574
40833b188574m58756n03492o31702o27519k38259M99178J215001J457787J059242
$$ -2188574 -2647330 -3150822 -3782524 -4410043 -4648302 -4149124 -2934123 -1476336 -417094
40824d17094L46409j12300j06878l524k01168n41212n07041R6907Q89486J245426
$$ -417094 -70685 -182985 -289863 -293387 -494555 -1035767 -1542808 -1445901 -556415 689011
40814F89011P56190m07519j412642j383932m22898L32941O1469o95216q36119
$$ 689011 1445201 1037682 -374960 -1758892 -2181790 -1848849 -1787380 -2482596 -3318715
40805c318715k00134L99856M16728J24845l299J57492M57049N78290J80472n64709
$$ -3318715 -3518849 -3118993 -2702265 -2577420 -2580719 -2423227 -1966178 -1387888 -1207416 -1772125
40795a772125q18818q2540R24607J142296O18881J57004j73789r28544j771009
$$ -1772125 -2590943 -2673483 -1748876 -606580 12301 169305 -4484 -933028 -2704037
40786b704037j523808p8444J107273J028466M35767L68841N44003K18270k82453
$$ -2704037 -4227845 -4306289 -3199016 -2170550 -1734783 -1365942 -821939 -603669 -886122
40777h86122j32002M69781N76127O7322j71588L03791P83886M19215o15463j306970
$$ -886122 -1018124 -548343 27784 95106 -76482 227309 1011195 1430410 814947 -492023
40767d92023r54643O6160P36108N57603L8943j88918k98324o97720r55261l26781
$$ -492023 -1446666 -1380506 -644398 -86795 -47852 -236770 -535094 -1232814 -2188075 -2514856
40757b514856P71507J066498L75130q2715K65977M17045l27465r57295l91603
$$ -2514856 -1743349 -676851 -301721 -384436 -118459 298586 -28879 -986174 -1377777
40748a377777O61803Q79349M38293M23487P75204M93477m06258p82076k67698
$$ -1377777 -715974 163375 601668 1025155 1800359 2293836 1887578 1105502 837804
40739H37804J57149k15427q19970q35472l01516J77622K20340p3055k01815L37539
$$ 837804 994953 779526 -40444 -875916 -1177432 -999810 -779470 -852525 -1054340 -716801
40729g16801J241903J300170j28783j837584j990290n33056O94063L77556p71460
$$ -716801 525102 1825272 1696489 -141095 -2131385 -2664441 -1970378 -1592822 -2364282
40720b364282j247551n78774N26640J200812J129096O40551L57020M83564M56155
$$ -2364282 -3611833 -4190607 -3663967 -2463155 -1334059 -693508 -336488 147076 603231
40711F03231l15887j466469j960939j318928n7641R79413J242963O38645l29082
$$ 603231 287344 -1179125 -3140064 -4458992 -4516633 -3537220 -2294257 -1655612 -1984694
40702a984694p59203k95841L70366N08570L96729N93571P43674K36667l93918
$$ -1984694 -2743897 -3039738 -2669372 -2160802 -1764073 -1170502 -426828 -190161 -584079
40693e84079j22703P12811P09513l85476j251646j050395m44567j40362J57446
$$ -584079 -706782 6029 715542 330066 -921580 -1971975 -2416542 -2556904 -2399458
40684b399458P03659R25790M52273j47344l61784m66959o09818k61450O48272
$$ -2399458 -1695799 -770009 -317736 -465080 -826864 -1293823 -1903641 -2165091 -1516819
40675a516819J131006N77581j82222k20401P898l92374j108431j104211k56969
$$ -1516819 -385813 191768 9546 -210855 -202957 -595331 -1703762 -2807973 -3064942
40666c064942N63631P28612L08748l42959p24019l21567O73522J264076R28687
$$ -3064942 -2501311 -1772699 -1463951 -1806910 -2530929 -2852496 -2178974 -914898 13789
40657A3789M23902N76123R51052O38792k43822q56581r61675r24064p89659l79242
$$ 13789 437691 1013814 1964866 2603658 2359836 1503255 541580 -382484 -1172143 -1551385
40647a551385K9789Q3660Q5661M20407O56985K52575k76909o7604N52364N29499
$$ -1551385 -1521596 -1437936 -1352275 -931868 -274883 -22308 -299217 -366821 185543 715042
40637G15042j15448l45974M5452R0706o03806j115094p09516L7340K26927j38110
$$ 715042 599594 253620 299072 389778 -214028 -1329122 -2038638 -2001298 -1774371 -1912481
40627a912481m78120m63532m2023P06541J315447J137079K04848o35231p59987
$$ -1912481 -2390601 -2854133 -2896156 -2189615 -874168 262911 467759 -167472 -927459
40618i27459m12766r2013R2027J84159J23169K3178J63007M32874L51372j46127
$$ -927459 -1340225 -1432238 -1340211 -1156052 -1032883 -1009705 -846698 -413824 -62452 -208579
40608b08579n53671o40720p36413q88402n57453L64920J005303O40224k12433
$$ -208579 -762250 -1402970 -2139383 -3027785 -3585238 -3220318 -2215015 -1574791 -1787224
40599a787224n33243j72854K10987K16019j9450l41921o93057q18751m97223j8549
$$ -1787224 -2320467 -2493321 -2282334 -2066315 -2085765 -2427686 -3120743 -3939494 -4436717 -4455266
40589d455266J04411j09396j39420K39880O79968Q56899Q80667R14371P90386
$$ -4455266 -4350855 -4460251 -4599671 -4359791 -3679823 -2822924 -1942257 -1027886 -237500
40580b37500L40886j33762j54472J90355K02873m92153j271779j190587k33238
$$ -237500 103386 -30376 -184848 5507 208380 -283773 -1555552 -2746139 -2979377
40571b979377O14933O46893K46779J29946K87445K11866j65188l73827j22077
$$ -2979377 -2364444 -1717551 -1470772 -1340826 -1053381 -841515 -1006703 -1380530 -1502607
40562a502607L74214O82497M19634n13393j535271j600764m30280Q28360R11691
$$ -1502607 -1128393 -445896 -26262 -539655 -2074926 -3675690 -4105970 -3277610 -2365919
40553b365919R0642l62799m7623L19852L61791M56303O12309K77981l86806l90259
$$ -2365919 -2275277 -2638076 -2685699 -2365847 -2004056 -1547753 -935444 -657463 -1044269 -1434528
40543a434528L74075N98176m47852j600845j506350n87032j00381q3264L57752
$$ -1434528 -1060453 -462277 -910129 -2510974 -4017324 -4604356 -4704737 -4788001 -4430249
40534d430249J216549J495306Q26417l9266m31175m45968l30147n0920L23823
$$ -4430249 -3213700 -1718394 -891977 -931243 -1362418 -1808386 -2138533 -2189453 -1865630
40525a865630M85804L06948m4642m09573o71955o46514l39240o6449Q5459M81463
$$ -1865630 -1379826 -1072878 -1117520 -1527093 -2199048 -2845562 -3184802 -3251251 -3165792 -2684329
40515b684329J110033J149014J47394r54237r99151l06232m335j11285K80496
$$ -2684329 -1574296 -425282 -277888 -1232125 -2231276 -2537508 -2541843 -2653128 -2372632
40506b372632J105993J250867N19644L7949K56161J83401o44133j013862n988
$$ -2372632 -1266639 -15772 503872 541821 797982 981383 337250 -676612 -682600
40497f82600J194683R04997n19837j274251p09868J37590M19714M32298N59144
$$ -682600 512083 1417080 897243 -377008 -1086876 -949286 -529572 -97274 461870
40488D61870M97951k8723o44174q33337n21760J16175Q77319J341905J044344
$$ 461870 959821 931098 286924 -546413 -1068173 -951998 -74679 1267226 2311570
40479B311570J42137n70081o37757m90204o39248p85648l01625O38112J104886
$$ 2311570 2453707 1883626 1245869 755665 116417 -669231 -970856 -332744 772142
40470G72142O83100O3546N710J93120k19955j111376j308965k88184Q46320P66905
$$ 772142 1455242 1518788 1524498 1717618 1497663 386287 -922678 -1210862 -364542 402363
40460D02363k30841p10573j54349N35529O26933M99370O14998O36361K51817m6037
$$ 402363 171522 -539051 -693400 -157871 469062 968432 1583430 2219791 2471608 2425571
40450B425571J17502Q6690p41847j538409j045305L28562Q30880j11513j042119
$$ 2425571 2543073 2629763 1887916 349507 -695798 -367236 463644 352131 -689988
40441f89988o14429N62045R63634K24233o98995r69174o68021l21080k54241m30038
$$ -689988 -1304417 -742372 221262 445495 -253500 -1222674 -1890695 -2211775 -2466016 -2896054
40431b896054n58677l72719N5311M07557N86341P46206P66437K36894o99568j072288
$$ -2896054 -3454731 -3827450 -3772139 -3364582 -2778241 -2032035 -1265598 -1028704 -1728272 -2800560
40421b800560k74383Q65209R86515M0041o05916m8728R26364R76196M5655n83378
$$ -2800560 -3074943 -2209734 -1223219 -1183178 -1789094 -1837822 -911458 64738 110393 -472985
40411d72985P334J226432J766597J162200J25585n38729p94573r42340q73522
$$ -472985 -465651 760781 2527378 3689578 3815163 3276434 2481861 1539521 665999
40402F65999l59047J79907j1210q23207j159364l78738P69258J175054Q01936
$$ 665999 306952 486859 475649 -347558 -1506922 -1885660 -1116402 58652 860588
40393H60588M23827L45998K24389k0683k2334K03831R3491m88121q24933l94120
$$ 860588 1284415 1630413 1854802 1834119 1811785 2015616 2109107 1620986 796053 401933
40383D01933K31385J51321n33789q63158m08984J45310L2429n01738n73717O5056
$$ 401933 633318 784639 250850 -612308 -1021292 -875982 -843553 -1345291 -1919008 -1853952
40373a853952O42157L97945l64885o48375n7336P13976Q00085J75785n03514p62390
$$ -1853952 -1211795 -813850 -1178735 -1827110 -1884446 -1170470 -370385 -194600 -698114 -1460504
40363a460504o53824m29995k22147J2594M43550J130521J685835J510938O65872
$$ -1460504 -2114328 -2544323 -2766470 -2753876 -2310326 -1179805 506030 2016968 2682840
40354B682840O6043L06872P26088L50983n90930j039111p51507m68879m43412
$$ 2682840 2748883 3055755 3781843 4132826 3541896 2502785 1751278 1282399 838987
40345H38987q9832N93263O09343l38368r77622l11984O91640N17717n49388r14228
$$ 838987 749155 1342418 1951761 1613393 635771 323787 1015427 1533144 983756 69528
40335F9528q7656Q38251J018055P62736M92252P5006m37603n47458k56616l11082
$$ 69528 -18128 820123 1838178 2600914 3093166 3168172 2730569 2183111 1926495 1615413
40325A615413r66289j371758q05622K01448O49582M16844J58728K76623N99761
$$ 1615413 649124 -722634 -1528256 -1326808 -677226 -260382 -101654 174969 774730
40316G74730Q01123O27768j5711p95375j055057n86840J8018J57235q341K4652
$$ 774730 1575853 2203621 2187910 1392535 337478 -249362 -231344 -74109 -82450 -57798
40306e7798L03837N35038O36507O40509L64299k32034o45469m48429r3370l61949
$$ -57798 246039 781077 1417584 2058093 2422392 2190358 1544889 1096460 1003090 641141
40296F41141j096736j271436m37133O31151J003276O95365L22799J39564p5656
$$ 641141 -455595 -1727031 -2164164 -1533013 -529737 165628 488427 627991 552335
40287E52335m22877o52281n18129o9800M28021O83684N03774o0392o06246n79365
$$ 552335 129458 -522823 -1040952 -1110752 -682731 953 504727 444335 -161911 -741276
40277g41276J97120J154215J355154M64917p50231j178259o12058Q6648J38655
$$ -741276 -544156 610059 1965213 2430130 1679899 501640 -110418 -23770 114885
40268A14885k66050m84127l92071l42661l77844j13488N09317Q97047N59239r4898
$$ 114885 -151165 -635292 -1027363 -1370024 -1747868 -1861356 -1352039 -454992 104247 9349
40258I349j38266O73891J416222R86452m85883j583344j153860L49729J425332
$$ 9349 -128917 544974 1961196 2947648 2461765 878421 -275439 74290 1499622
40249A499622J219687K07625o94221j050727q72758l60261J3226k34256q47157
$$ 1499622 2719309 2926934 2232713 1181986 309228 -51033 -37807 -272063 -1119220
40240a119220r00864n8486P97486P30574N550m70711m46911k76129r679N10053
$$ -1119220 -2020084 -2078570 -1281084 -550510 -544960 -1015671 -1462582 -1738711 -1748390 -1238337
40230a238337R12231O55218M3794o9434L88053O15176K35853k73047n91894r75118
$$ -1238337 -326106 329112 372906 303472 691525 1306701 1542554 1269507 677613 -297505
40220b97505j378188j212837m45931L0203k62733n61774r3911O71925Q60570N95818
$$ -297505 -1675693 -2888530 -3334461 -3304258 -3566991 -4128765 -4222676 -3550751 -2690181 -2094363
40210b094363N71509O94305K48879p45062j347574r72786j02340M30524L36917
$$ -2094363 -1522854 -828549 -579670 -1324732 -2672306 -3645092 -3747432 -3316908 -2979991
40201b979991m9103j90108J71643O62573N76296j60735o69165k54645N41793P45152
$$ -2979991 -3029094 -3219202 -3047559 -2384986 -1808690 -1969425 -2638590 -2893235 -2351442 -1606290
40191a606290M34739M67790Q86043P66847j32244p31674k00064P62631R78698
$$ -1606290 -1171551 -703761 182282 949129 816885 85211 -114853 647778 1626476
40182A626476M41627L3136M1723p4158n80034j020800j011303p49154m70045K8487
$$ 1626476 2068103 2101239 2142962 2068804 1488770 467970 -543333 -1292487 -1762532 -1734045
40172a734045R11651J735064J836317J185815M36986Q2256j07815o10183j334589
$$ -1734045 -822394 912670 2748987 3934802 4371788 4454044 4346229 3736046 2401457
40163B401457j626264j104955j86360M10974M18905J3310o51085j381778j582012
$$ 2401457 775193 -329762 -516122 -105148 313757 327067 -324018 -1705796 -3287808
40154c287808p13264O74758J170327L02618n61666L2337J467569J774898L81385
$$ -3287808 -4001072 -3326314 -2155987 -1853369 -2415035 -2382698 -915129 859769 1241154
40145A241154j139503j350449o97893k63875N0562Q87591J758892J506172K10773
$$ 1241154 101651 -1248798 -1946691 -2210566 -2160004 -1272413 486479 1992651 2203424
40136B203424p68856p62332m91967n50059m90772o029K11437l64666j036097r49555
$$ 2203424 1434568 672236 180269 -369790 -860562 -866591 -655154 -1019820 -2055917 -3005472
40126c005472m24249j94458o0088N18274J061373O83519k39529m31832L02888
$$ -3005472 -3429721 -3624179 -3684267 -3165993 -2104620 -1421101 -1660630 -2092462 -1789574
40117a789574Q44404O17212K91216K95955M6300p16192j086948l98859N58936
$$ -1789574 -945170 -327958 -36742 259213 305513 -410679 -1497627 -1896486 -1337550
40108a337550P20411L32552L04703N96607M11998l42433r05970q79251o25536
$$ -1337550 -617139 -284587 20116 616723 1028721 686288 -219682 -1098933 -1724469
40099a724469m09857J6818P65822J376934J325563O33641j69940n16600k65621
$$ -1724469 -2134326 -2117508 -1351686 25248 1350811 1984452 1814512 1297912 1032291
40090A032291J32443J00294l01782m15851n612K70788j52793p90020p69160j02124
$$ 1032291 1164734 1265028 963246 547395 541783 812571 659778 -130242 -899402 -1001526
40080a001526M26589M19342K05020J34520J93922K70101K40987j04995p06971
$$ -1001526 -574937 -155595 49425 183945 377867 647968 888955 783960 76989
40071G6989r66008m48266L32453N16077J10082j58521o7792r7729m04919n22817
$$ 76989 -889019 -1337285 -1004832 -488755 -378673 -537194 -604986 -702715 -1107634 -1630451
40061a630451k49278K0665Q0202K20986M93411M67518P6287q5212K80978O51529
$$ -1630451 -1879729 -1859064 -1778862 -1557876 -1064465 -596947 -520660 -605872 -324894 326635
40051C26635N71022L51444L77977M22335K32112J10916K22413n778r22021j676202
$$ 326635 897657 1249101 1627078 2049413 2281525 2392441 2614854 2609076 1687055 10853
40041A0853j260759j64757J95521l71729m92067O52476J984149K003190P96246
$$ 10853 -1249906 -1414663 -1219142 -1590871 -2082938 -1430462 553687 2556877 3353123
40032C353123l09666o20869o09437p08156o40429k81648k67337r98686j629485
$$ 3353123 3043457 2422588 1813151 1104995 464566 182918 -84419 -1083105 -2712590
40023b712590j028541M51735J235672O93561l1030J61132P34464O24092P5163
$$ -2712590 -3741131 -3289396 -2053724 -1360163 -1391193 -1230061 -495597 128495 203658
40014B03658J32476P39845P36884k37860j116211r93571l07979K3483j91445n53881
$$ 203658 336134 1075979 1812863 1575003 458792 -534779 -842758 -819275 -1010720 -1564601
40004a564601p35778n80719r8260L50054M09816L96773Q59211J400980R82422
$$ -1564601 -2300379 -2881098 -2979358 -2629304 -2219488 -1822715 -963504 437476 1419898
39995A419898l13609j026522m34278K88802o8536q75961q54403k17081j47521
$$ 1419898 1106289 79767 -354511 -65709 -134245 -1010206 -1864609 -2081690 -2229211
39986b229211p13259q48041k00805M53046O68427Q58664J167022J032701K76900
$$ -2229211 -2942470 -3790511 -3991316 -3538270 -2869843 -2011179 -844157 188544 465444
39977D65444l73757l10400J62879M23773K75597j72258p33675j025110p35811
$$ 465444 91687 -218713 -55834 367939 643536 471278 -262397 -1287507 -2023318
39968b023318k05962j00096l74002l15182K12161M41826j5916m57740k13415L01905
$$ -2023318 -2229280 -2329376 -2703378 -3018560 -2806399 -2364573 -2380489 -2838229 -3051644 -2749739
39958b749739L87521K58497N62583J104116J012166J08882p28227p30792j36346
$$ -2749739 -2362218 -2103721 -1541138 -437022 575144 684026 -44201 -774993 -911339
39949i11339L42410M75205N54957P14091O55802J88636k65761p5598O73975J078643
$$ -911339 -568929 -93724 461233 1175324 1831126 2019762 1754001 1678403 2352378 3431021
39939C431021N43803l11793l99082L34676P72851J13553j093718j696142j292569
$$ 3431021 3974824 3663031 3263949 3598625 4371476 4485029 3391311 1695169 402600
39930D02600m65180O0622Q0332j74438m55310p32146j066324j299931j035875
$$ 402600 -62580 -1958 78374 -96064 -551374 -1283520 -2349844 -3649775 -4685650
39921d685650j21365R65048J502825J269815O33197J3345l72966l48394J16790
$$ -4685650 -4807015 -3841967 -2339142 -1069327 -436130 -422785 -795751 -1144145 -1027355
39912a027355N93793N27463J9179k17239J50663O34400P00697M51661J99521j20018
$$ -1027355 -433562 93901 113080 -104159 46504 680904 1381601 1833262 2032783 1912765
39902A912765o28837r84049p40402p4210L36448J34844l38896n04181j66650L20913
$$ 1912765 1283928 299879 -440523 -514733 -178285 -43441 -382337 -886518 -1053168 -732255
39892g32255M47071J23051j81645l0235M03679O46208O05169M49508L1879p83035
$$ -732255 -285184 -162133 -343778 -374013 29666 675874 1281043 1730551 1762430 979395
39882I79395j299290n78836Q89830J314957O6214j137234n73524R20029J185265
$$ 979395 -319895 -898731 -8901 1306056 1372270 235036 -338488 581541 1766806
39873A766806o8033j028189o31487J09479L6486m74483n80799m50505n96523o46935
$$ 1766806 1698773 670584 39097 148576 185062 -289421 -870220 -1320725 -1917248 -2564183
39863b564183J9842R59673J155468N51401K4399l6477o7544k44502j35812L25257
$$ -2564183 -2544341 -1584668 -429200 122201 146600 110123 42579 -201923 -337735 -12478
39853a2478N15204J64424j73223j88444m34969j162616j426459m36445Q49122
$$ -12478 502726 667150 493927 305483 -129486 -1292102 -2718561 -3155006 -2305884
39844b305884Q21885l51681q47980J62903J436218J695782J361337J358378J401511
$$ -2305884 -1483999 -1835680 -2683660 -2520757 -1084539 611243 1972580 3330958 4732469
39835D732469P18157l15781o69029l78033m01649q97417j002901m57524j30766
$$ 4732469 5450626 5134845 4465816 4087783 3686134 2788717 1785816 1328292 1197526
39826A197526n18344q54667l72250M31556N42430j31477p73152p62491j92804
$$ 1197526 679182 -175485 -547735 -116179 426251 294774 -478378 -1240869 -1433673
39817a433673N04880J004256J223539J232995R83294K60669p89856j380653r59873
$$ -1433673 -928793 75463 1299002 2531997 3515291 3775960 2986104 1605451 645578
39808F45578j63161j7008l15301N9930J096709J339406J64157j027005q48969
$$ 645578 482417 465409 150108 210038 1306747 2646153 2810310 1783305 934336
39799I34336L0629J47642m29116n25515j5949P3759n43818r45195o08804k20542
$$ 934336 964965 1112607 683491 157976 142027 215786 -328032 -1273227 -1882031 -2102573
39789b102573m41570q38262n68335M54619J475930J653959P95016l68461p51151
$$ -2102573 -2544143 -3382405 -3950740 -3496121 -2020191 -366232 428784 60323 -690828
39780f90828j28783N04544K74892l13676k06907N24669Q44405L85820j58714k96984
$$ -690828 -819611 -315067 -40175 -353851 -560758 -36089 808316 1194136 1035422 738438
39770G38438l17981m44769m07952j58420j16678l65741l85155N2367M31059K96671
$$ 738438 420457 -24312 -432264 -590684 -707362 -1073103 -1458258 -1405891 -974832 -678161
39760f78161j12137l41754k57922J22587P36815J215737J119917N88877J61203
$$ -678161 -790298 -1132052 -1389974 -1267387 -530572 685165 1805082 2393959 2555162
39751B555162q0528m59712q38994p49893m34086o30344j122979p79716N12610
$$ 2555162 2474634 2014922 1175928 426035 -8051 -638395 -1761374 -2541090 -2028480
39742b028480J280553N78312n63019p64575k77041j71358m66094l84904J29677
$$ -2028480 -747927 -169615 -732634 -1497209 -1774250 -1945608 -2411702 -2796606 -2666929
39733b666929M65527N17749O22013O06656O0942o45691p00881q8870M82196P09990
$$ -2666929 -2201402 -1683653 -1061640 -454984 -394042 -1039733 -1740614 -1829484 -1347288 -637298
39723f37298P45206L50770p55216j766357j356007L30178J492741J013850q9908
$$ -637298 107908 458678 -296538 -2062895 -3418902 -3088724 -1595983 -582133 -672041
39714f72041k24400O62588J354767J150747M83028L1906n963K04166M27533M47779
$$ -672041 -896441 -233853 1120914 2271661 2754689 2786595 2780632 2984798 3412331 3860110
39704C860110J92423j69836m36901o39485r16610j168971j056834m25490L86988
$$ 3860110 4052533 3882697 3445796 2806311 1889701 720730 -336104 -761594 -374606
39695c74606Q17840O83837L81197L49819M75558L12704j57626m13046j45162K94169
$$ -374606 443234 1127071 1508268 1858087 2333645 2646349 2488723 2075677 1930515 2224684
39685B224684M28142K49021o569l05732o94857j027813j134984r84619m86683
$$ 2224684 2652826 2901847 2895278 2589546 1894689 866876 -268108 -1252727 -1739410
39676a739410L85659J050738O39331o17575j152716j01349J159867P45308r60474
$$ -1739410 -1353751 -303013 336318 -281257 -1433973 -1535322 -375455 369853 -590621
39667e90621j775516q79673J68852O079n44332m5271J175143J570972P31914j37796
$$ -590621 -2366137 -3245810 -3076958 -3070879 -3615211 -3660482 -2485339 -914367 -182453 -320249
39657c20249l2641O38424R01935N23604M0836r7421P37l5871l45621o95512p65092
$$ -320249 -352890 285534 1187469 1711073 1751909 1654488 1655225 1619354 1273733 578221 -186871
39646a86871m98595j36873P3071J28186K13911M44441O91682P05184M19631M3340
$$ -186871 -685466 -822339 -749268 -621082 -407171 37270 728952 1434136 1853767 1897107
39636A897107k59017n89994r65725r72617l10405M38149L36234n06077r30303
$$ 1897107 1638090 1048096 82371 -890246 -1200651 -762502 -426268 -932345 -1862648
39627a862648m33384J11699L156r6821N38612J202798Q69567N4580J4477N68753
$$ -1862648 -2296032 -2184333 -2181177 -2277998 -1739386 -536588 332979 387559 402036 970789
39617I70789M38714m33644p47297j61711J20297m31904p13340n9144M19333k73719
$$ 970789 1409503 975859 228562 66851 187148 -244756 -958096 -1017240 -597907 -871626
39607h71626j234198j127584k93628P4807m4200J67362O45019O13528J55240J35516
$$ -871626 -2105824 -3233408 -3527036 -3452229 -3496429 -3329067 -2684048 -2070520 -1915280 -1779764
39597a779764O38991P91121K27213l90828m99698l08301j23118J72178O72538
$$ -1779764 -1140773 -349652 -122439 -513267 -1012965 -1321266 -1444384 -1272206 -599668
39588e99668J090052J076131N32003l98369j269765j451102q02436m5078Q8228
$$ -599668 490384 1566515 2098518 1700149 430384 -1020718 -1823154 -1868232 -1780004
39579a780004j60410o5341L49203L55792k52462p54006m57850M59174J179132
$$ -1780004 -1940414 -2005755 -1656552 -1300760 -1553222 -2307228 -2765078 -2305904 -1126772
39570a126772R77660j59855j331356j400737k76602Q79037J150793R71327J062936
$$ -1126772 -149112 -308967 -1640323 -3041060 -3317662 -2438625 -1287832 -316505 746431
39561G46431J033683J32684j136606j515250q97206l98072n37227o71095l54805
$$ 746431 1780114 1912798 776192 -739058 -1636264 -2034336 -2571563 -3242658 -3597463
39552c597463M0415L12780P54950J157462P58347l53692j010840o77115j91113
$$ -3597463 -3557048 -3244268 -2489318 -1331856 -573509 -927201 -1938041 -2615156 -2806269
39543b806269k15794k10025K99812O89683M41330J93522M74289N12205l41073
$$ -2806269 -3022063 -3232088 -2932276 -2242593 -1801263 -1607741 -1133452 -621247 -962320
39534i62320j010919j64771J411789J711366M89946m52305n0954O98442O39857
$$ -962320 -1973239 -2138010 -726221 985145 1475091 1022786 971832 1670274 2310131
39525B310131J27915J5716J89374Q9672j34445M828L13631J94328l06906n50371
$$ 2310131 2438046 2453762 2643136 2732808 2598363 2603191 2916822 3111150 2804244 2253873
39515B253873l32891j46978l13836m85852l07705r7258l66689q67881p31910K78713
$$ 2253873 1920982 1774004 1460168 974316 666611 569353 202664 -665217 -1397127 -1118414
39505a118414J202345J023731L0491o15492m81833k33688l49014m11502q0449
$$ -1118414 83931 1107662 1138153 522661 40828 -192860 -541874 -953376 -1033825
39496a033825J60358m9225l7551Q32356J721666J207221n05744j554884q95447
$$ -1033825 -873467 -922692 -960243 -127887 1593779 2801000 2295256 740372 -155075
39487a55075L31309N03169l10626p41296j57903O50479P55532K33523k37477l74434
$$ -155075 176234 679403 368777 -372519 -530422 120057 875589 1109112 871635 497201
39477D97201m05972m06820q0687O09674J035348O05285l00779o85071k32135L75285
$$ 497201 91229 -315591 -396278 213396 1248744 1854029 1553250 868179 636044 1011329
39467A011329N78144O13346O89253L38994o66358j477612j233360m49440k15387
$$ 1011329 1589473 2202819 2892072 3231066 2564708 1087096 -146264 -595704 -811091
39458h11091l98245j116Q56233R09744m5644n64581J42520Q34927K60479p57256
$$ -811091 -1209336 -1210452 -354219 555525 509881 -54700 87820 922747 1183226 425970
39448D25970o96800J57847L03638m01873n79367K56756Q87204M57806j78632j0858
$$ 425970 -270830 -112983 190655 -211218 -790585 -533829 353375 811181 632549 621691
39438F21691M76897K70932m40386p14427m92499n07374p51248l58729P45247J274462
$$ 621691 1098588 1369520 929134 214707 -277792 -785166 -1536414 -1895143 -1149896 124566
39428A24566L13435j214005j649568o99894M16396O69349J86896m40729r01021
$$ 124566 438001 -776004 -2425572 -3125466 -2709070 -2039721 -1852825 -2293554 -3194575
39419c194575r34297k16990R57161J490755P08692n67200q97767j4726R72112
$$ -3194575 -4128872 -4345862 -3388701 -1897946 -1189254 -1756454 -2654221 -2668947 -1696835
39410a696835J087841M75267k22956p17809r87446r24235n18827o0414K02817
$$ -1696835 -608994 -133727 -356683 -1074492 -2061938 -2986173 -3505000 -3565414 -3362597
39401c362597L56894N27967N70594K94603k37349q07632j149680q62331K86335
$$ -3362597 -3005703 -2477736 -1907142 -1612539 -1849888 -2657520 -3807200 -4669531 -4383196
39392d383196J698370K129573J046152n52085j197741o12748K00894L31818j22618
$$ -4383196 -2684826 -555253 490899 -61186 -1258927 -1871675 -1670781 -1338963 -1461581
39383a461581m53305j90147M86814R13442N65406l10541q95921q05134m93620
$$ -1461581 -1914886 -2105033 -1618219 -704777 -139371 -449912 -1345833 -2150967 -2644587
39374b644587l62290k7631Q88484J744189J563346N01892l35339m98315o23801
$$ -2644587 -3006877 -3034508 -2146024 -401835 1161511 1663403 1328064 829749 205948
39365B05948j133530j504028j211820n45940J3856N00519J001208J148213O98953
$$ 205948 -927582 -2431610 -3643430 -4189370 -4175514 -3674995 -2673787 -1525574 -826621
39356h26621J18982n1262j4030k76539p19190p35306j18860P05068J177984R46565
$$ -826621 -707639 -758901 -772931 -1049470 -1768660 -2503966 -2622826 -1917758 -739774 206791
39346B06791m256j109078j455694q05607n9881j09732n77138m53110L16228Q36698
$$ 206791 202535 -906543 -2362237 -3167844 -3227725 -3337457 -3914595 -4367705 -4051477 -3214779
39336c214779P49273O35984P80257N96926k34201r89068r20700l52863l0816K2258
$$ -3214779 -2465506 -1829522 -1049265 -452339 -686540 -1675608 -2596308 -2949171 -2979987 -2957729
39326b957729J75852K16876k76544q16689l84006R43281J771589J228685J64888
$$ -2957729 -2781877 -2565001 -2841545 -3658234 -4042240 -3098959 -1327370 -98685 66203
39317F6203r5273M72608Q49786N62222J12714l0275p757l8103m9897m7088j97100
$$ 66203 -29070 443538 1293324 1855546 1968260 1937985 1930228 1892125 1842228 1795140 1598040
39306A598040l43420j05431K68171n8297j128194j690142q61310M21632O38226
$$ 1598040 1254620 1149189 1417360 1359063 230869 -1459273 -2320583 -1898951 -1260725
39297a260725j76523p48258o45534n82145p02028k15243Q50316J146235P3594
$$ -1260725 -1437248 -2185506 -2831040 -3413185 -4115213 -4330456 -3480140 -2333905 -2260311
39288b260311j047664r39674k42118j22380j31478Q65792K326138K470038R36006
$$ -2260311 -3307975 -4247649 -4489767 -4612147 -4743625 -3877833 -1551695 918343 1854349
39279A854349o88280j107419o24978k1858M48168N97552J53769m80508m74456
$$ 1854349 1166069 58650 -566328 -588186 -140018 457534 611303 130795 -343661
39270c43661L5931m750p42167r87899k12602M59682J13883m71916l32314m4101
$$ -343661 -307730 -312480 -1054647 -2042546 -2255148 -1795466 -1681583 -2153499 -2485813 -2529914
39260b529914n35025j179012p14534N84687J305703J086087P97406P23676J95194
$$ -2529914 -3064939 -4243951 -4958485 -4373798 -3068095 -1982008 -1184602 -460926 -265732
39251b65732q40336j404395j009945l07553J93827Q21290J614838J677757M66234
$$ -265732 -1106068 -2510463 -3520408 -3827961 -3634134 -2812844 -1198006 479751 945985
39242I45985j091159j600008q30772L01692R69686J056206Q45942O14045M31235
$$ 945985 -145174 -1745182 -2575954 -2274262 -1304576 -248370 597572 1211617 1642852
39233A642852J52285k83617n89331n17263l84416o23839r02445n01034L60292
$$ 1642852 1795137 1511520 922189 404926 20510 -603329 -1505774 -2006808 -1646516
39224a646516N60519k25827q73981m49563M12391N99623K39962K81872Q14612
$$ -1646516 -1085997 -1311824 -2185805 -2635368 -2222977 -1623354 -1383392 -1101520 -286908
39215b86908R38615K40455n82333p56793l83125p7315j30012k83590j26903M03917
$$ -286908 651707 892162 309829 -446964 -830089 -907404 -1037416 -1321006 -1447909 -1043992
39205a043992Q40083O15381j78258p24087m22559L70040Q56712P52659L30721
$$ -1043992 -203909 411472 233214 -490873 -913432 -543392 313320 1065979 1396700
39196A396700j58863n68092n88733p5795M21844J31153q08734j275809n35824
$$ 1396700 1237837 669745 81012 5217 427061 558214 -250520 -1526329 -2062153
39187b062153P31781J161416K67646j045267j517487q32749K43412R02856J156406
$$ -2062153 -1330372 -168956 98690 -946577 -2464064 -3296813 -3053401 -2150545 -994139
39178i94139J453382J739210J467946N81395j90076l44628l51261q37823j491007
$$ -994139 459243 2198453 3666399 4247794 4057718 3713090 3361829 2524006 1032999
39169A032999j478783p37484p5955p710j89618j79081j08575k54336l83810j7677
$$ 1032999 -445784 -1183268 -1259223 -1266933 -1456551 -1635632 -1744207 -1998543 -2382353 -2400030
39159b400030P84174J295942R22792k6122n92592k87724K90231L03543l9520K86405
$$ -2400030 -1615856 -319914 602878 576756 -15836 -303560 -13329 290214 250694 537099
39149E37099J469237K221770J366237n18512j783576j692929r33086l58568r4859
$$ 537099 2006336 4228106 5594343 5075831 3292255 1599326 666240 307672 212813
39140B12813Q6430K85275N57475Q85977R08955K20112q98108j556500j279194
$$ 212813 299243 584518 1141993 2027970 2936925 3157037 2258929 702429 -576765
39131e76765n25672l4780l2507k30847k67362k0959K69628K31470o8294l4432
$$ -576765 -1102437 -1137217 -1169724 -1400571 -1667933 -1688892 -1419264 -1187794 -1256088 -1290520
39121a290520N44636Q72050J58778j015155j308504m99648L01339M02483L22231
$$ -1290520 -745884 126166 284944 -730211 -2038715 -2538363 -2237024 -1834541 -1512310
39112a512310N17898N45518J16015j22009K89599O47987K39118l37185j28188
$$ -1512310 -994412 -448894 -332879 -454888 -165289 482698 721816 384631 256443
39103B56443M99384M21262l66765p70245m31217k22259o52180r67133m03125N66559
$$ 256443 755827 1177089 810324 40079 -391138 -613397 -1265577 -2232710 -2635835 -2069276
39093b069276R53160O41956L19529L05706J70167m55241j200284j350174p20622
$$ -2069276 -1116116 -474160 -154631 151075 321242 -133999 -1334283 -2684457 -3405079
39084c405079J15941N07544M40388M01498O25292P86600N13823q6544n79284o45563
$$ -3405079 -3289138 -2781594 -2341206 -1939708 -1314416 -527816 -13993 -100537 -679821 -1325384
39074a325384k46009L95077Q14278O18416k5612m85416m14453p7515K03679M24452
$$ -1325384 -1571393 -1176316 -362038 256378 230766 -254650 -669103 -746618 -542939 -118487
39064a18487M75712M325q09307r86478l0348J021525P68466n88372j445565r10004
$$ -118487 357225 361550 -447757 -1434235 -1464583 -443058 325408 -262964 -1708529 -2618533
39054b618533K68725R95026J084058Q84703N12660J4589k98862k52374j58994
$$ -2618533 -2349808 -1354782 -270724 613979 1126639 1141228 842366 589992 430998
39045D30998l26940n55063n37384m37518n65106o88870k20071Q74194J744140
$$ 430998 104058 -451005 -988389 -1425907 -1991013 -2679883 -2899954 -2025760 -281620
39036b81620J481353J79928j021101j103144l20520J17651l67259r25461n26726
$$ -281620 1199733 1379661 358560 -744584 -1065104 -947453 -1314712 -2240173 -2766899
39027b766899M30559O19398k10083p76083j68181P64916O78656l00436q47652
$$ -2766899 -2336340 -1716942 -1927025 -2703108 -2871289 -2106373 -1427717 -1728153 -2575805
39018b575805l61732M16521P24219P09655O78619K90002p28352j568285j045766
$$ -2575805 -2937537 -2521016 -1796797 -1087142 -408523 -118521 -846873 -2415158 -3460924
39009c460924O50285J808529J234893j91599o70452J88159J030094P22212k52152
$$ -3460924 -2810639 -1002110 232783 41184 -629268 -441109 588985 1311197 1059045
39000A059045p32342m90150k47280m69970q31053p91882k25785N26157Q96681
$$ 1059045 326703 -163447 -410727 -880697 -1711750 -2503632 -2729417 -2203260 -1306579
38991a306579M94454m23013j027870p90970q9136L66091M15860L45857K20854
$$ -1306579 -812125 -1235138 -2263008 -3053978 -3143114 -2777023 -2361163 -2015306 -1794452
38982a794452o0515k41100R0234P92391J234333J056854M13761m08975j088350
$$ -1794452 -1854967 -2096067 -2005833 -1213442 20891 1077745 1491506 1082531 -5819
38973e819j182746o01993K2894J35305J64866P70209J438668J033958k74761r83710
$$ -5819 -1188565 -1790558 -1767664 -1632359 -1467493 -697284 741384 1775342 1500581 516871
38963E16871m62718J52287j45623p37236o42944j69447j90264n98659o38007k32442
$$ 516871 54153 206440 60817 -676419 -1319363 -1488810 -1679074 -2277733 -2915740 -3148182
38953c148182R2750K26245M12127M93674J61041k80863k55719J80942N53222P86454
$$ -3148182 -3055432 -2829187 -2417060 -1923386 -1762345 -2043208 -2298927 -2117985 -1564763 -778309
38943g78309J004334Q56870K2492q72692r03554l03387j74846p21085r10112j49442
$$ -778309 226025 1082895 1105387 232695 -670859 -974246 -1149092 -1870177 -2780289 -2929731
38933b929731P94866J027771P58465O72090P48135M35134l37856r59846r03013
$$ -2929731 -2134865 -1107094 -348629 323461 1071596 1506730 1168874 209028 -693985
38924f93985l43122K4808k73216r10849j065328m62707J64724M4303n10648n40439
$$ -693985 -1037107 -1012299 -1285515 -2196364 -3261692 -3724399 -3559675 -3515372 -4026020 -4566459
38914d566459J58904P95321P84065M86566N07725P98029P93677J84185o62258
$$ -4566459 -4407555 -3612234 -2828169 -2341603 -1833878 -1035849 -242172 -57987 -720245
38905g20245r60407k99298O96147Q54437o5706q88340n68476L53847P06219N30393
$$ -720245 -1680652 -1979950 -1283803 -429366 -495072 -1383412 -1951888 -1598041 -891822 -361429
38895c61429P46869J291609J087532k3166q20109o09136k07321l95756o77600
$$ -361429 385440 1677049 2764581 2741415 1921306 1312170 1104849 709093 31493
38886C1493m22100j06935l90049q41798o87847j29810J31571J32806L56646O28541
$$ 31493 -390607 -497542 -887591 -1729389 -2417236 -2547046 -2415475 -2282669 -1926023 -1297482
38876a297482L38792m68648j107899j180315q05339k01074L31587L99618J54452
$$ -1297482 -958690 -1427338 -2535237 -3715552 -4520891 -4721965 -4390378 -3990760 -3836308
38867c836308M32368J489272K189953J464225N7424l75893L84815R61485M42375
$$ -3836308 -3403940 -1914668 275285 1739510 1796934 1421041 1805856 2767341 3209716
38858C209716o54496j530383j979008j904989j141737j09214L57365K03509K56082
$$ 3209716 2555220 1024837 -954171 -2859160 -4000897 -4110111 -3752746 -3549237 -3293155
38849c293155Q11103J111624O60493P2558M9103L63851M76973L80071K19767j59101
$$ -3293155 -2482052 -1370428 -709935 -637377 -588274 -224423 252550 632621 852388 693287
38839F93287o38212n49100K64190P93583J59006r89466j285012m66284N11541
$$ 693287 55075 -494025 -229835 563748 722754 -266712 -1551724 -2018008 -1506467
38830a506467Q68925N96264q8374q91988j152953l93621P31034R42846P901r42885
$$ -1506467 -637542 -41278 -129652 -1021640 -2174593 -2568214 -1837180 -894334 -886433 -1829318
38820a829318j039795p39871p37765o23051M42554K054089K611284J288284p41017
$$ -1829318 -2869113 -3608984 -4346749 -4969800 -4527246 -2473157 138127 1426411 685394
38811F85394j558991o69021O35240R79310L74796k52109m14848l36678j66619
$$ 685394 -873597 -1542618 -907378 71932 446728 194619 -220229 -556907 -723526
38802g23526K68767Q57031J075704P46284K93350m4360n67407j232044j193786
$$ -723526 -454759 402272 1477976 2224260 2517610 2473250 1905843 673799 -519987
38793e19987l3954J159071R78838l22414j138487p32144l3132j7521l84931l65420
$$ -519987 -553941 605130 1583968 1261554 123067 -609077 -642209 -659730 -1044661 -1410081
38783a410081L4995K88657K52667J36225m0923l40739n44879m51277l08126m50720
$$ -1410081 -1375086 -1086429 -833762 -697537 -738460 -1079199 -1624078 -2075355 -2383481 -2834201
38773b834201o86582n05342K28405J157873J825594J858975J081850j03359p62180
$$ -2834201 -3520783 -4026125 -3797720 -2639847 -814253 1044722 2126572 2023213 1261033
38764A261033m38121J33423k8413p22768r12780m02543j49933o66954j131232
$$ 1261033 822912 956335 927922 205154 -707626 -1110169 -1260102 -1927056 -3058288
38755c058288o95513J50981L89538P7265J19095O62823Q20931J80865l86562J2766
$$ -3058288 -3753801 -3602820 -3213282 -3136017 -3016922 -2354099 -1533168 -1352303 -1738865 -1726099
38745a726099Q97551J031183J40202p70894q47701m13127k45300l83745k52744
$$ -1726099 -828548 202635 342837 -428057 -1275758 -1688885 -1934185 -2317930 -2570674
38736b570674K53504N01382O9313n92858p95919m97003j14061K31809O98557J076756
$$ -2570674 -2317170 -1815788 -1746475 -2339333 -3135252 -3632255 -3746316 -3514507 -2815950 -1739194
38726a739194Q43561K960p17446p89152n09577l60749k11441L38391J148322J658104
$$ -1739194 -895633 -892673 -1610119 -2399271 -2908848 -3269597 -3481038 -3142647 -1994325 -336221
38716c36221J663188J416062J027492L48532m83691r37722p56691l37058j90537
$$ -336221 1326967 2743029 3770521 4119053 3635362 2697640 1940949 1603891 1413354
38707A413354l39169m97635n79792o89868p49656m90210J18990O50571O12137
$$ 1413354 1074185 576550 -3242 -693110 -1442766 -1932976 -1813986 -1163415 -551278
38698e51278N0173m08540k77280J47300J85148k05937l29438J09812L93332j05910
$$ -551278 -501105 -909645 -1186925 -1039625 -854477 -1060414 -1389852 -1280040 -886708 -992618
38688i92618p37306l85205P95829J505835J178686O33380N55737M45316k88366
$$ -992618 -1729924 -2115129 -1319300 186535 1365221 1998601 2554338 2999654 2711288
38679B711288j121601j182288n73705n0437J54992L30856N03179N01327M80931
$$ 2711288 1589687 407399 -166306 -216743 -61751 269105 772284 1273611 1754542
38670A754542N60066K95764n60924j170603o13189M30822L38434j042301k008855
$$ 1754542 2314608 2610372 2049448 878845 265656 696478 1034912 -7389 -2016244
38661b016244j409833j27566M84347M53874N59460P86343N40477j24671n41485
$$ -2016244 -3426077 -3553643 -3069296 -2615422 -2055962 -1269619 -729142 -853813 -1395298
38652a395298m39204j02414K62321N95781O43601K55653j41446l8804L41153L73860
$$ -1395298 -1834502 -1936916 -1674595 -1078814 -435213 -179560 -321006 -359810 -18657 355203
38642C55203K1176j91294p6532M8890P4993K44449M93416L28485m08557j171143
$$ 355203 376379 185085 108553 157443 232436 476885 970301 1298786 890229 -280914
38632b80914j333395q12095N2359Q54747J265292J167334P50523K33997l84712
$$ -280914 -1614309 -2426404 -2374045 -1519298 -254006 913328 1663851 1897848 1513136
38623A513136r75600r71223o4561R62334R37830j28025j018599j022385p54389
$$ 1513136 537536 -433687 -498248 464086 1401916 1273891 255292 -767093 -1521482
38614a521482q94952j033055m47295O43998J395236J463410J130067O55752J84782
$$ -1521482 -2416434 -3449489 -3896784 -3252786 -1857550 -394140 735927 1391679 1576461
38605A576461k2376O2523n8634o61733j066711n06022M74852N23848n18287j193669
$$ 1576461 1554085 1616608 1557974 896241 -170470 -676492 -201640 322208 -196079 -1389748
38595a389748m41086Q85607J234322M33085l58106m51041l79095p33754j146556
$$ -1389748 -1830834 -945227 289095 722180 364074 -86967 -466062 -1199816 -2346372
38586b346372r49408k98605N9654m6915j1200M83445Q69307N78483j5240j77279
$$ -2346372 -3295780 -3594385 -3534731 -3581646 -3592846 -3109401 -2240094 -1661611 -1676851 -1854130
38576a854130j376k07362q22120r60448j65962Q46358J233243J098245R54818
$$ -1854130 -1855506 -2062868 -2884988 -3845436 -4011398 -3165040 -1931797 -833552 121266
38567A21266P72261L10790j06157m1531J52372k09202r61323j269926r02050l85921
$$ 121266 893527 1204317 1098160 1056629 1209001 999799 38476 -1231450 -2133500 -2519421
38557b519421P3883Q15427J699704J909630J127718K0002q01936j368770j535513
$$ -2519421 -2445538 -1630111 69593 1979223 3106941 3126943 2325007 956237 -579276
38548e79276p20488Q29092J609252P32092o35920q70998j98766m6593o19336p26456
$$ -579276 -1299764 -470672 1138580 1870672 1234752 363754 164988 118395 -500941 -1227397
38538a227397O3263P00514M22745j36941j75518Q3158R9421l770Q8415J71041
$$ -1227397 -1164134 -463620 -40875 -177816 -353334 -270176 -170755 -174525 -86110 84931
38528H4931j404j40880j2073q023m21645o89455j89767O07661O65702j54601r43541
$$ 84931 83527 -57353 -69426 -77449 -499094 -1188549 -1378316 -770655 -104953 -259554 -1203095
38517a203095r48163k46086O58333J235145J054048K29795l34100J00792R37508
$$ -1203095 -2151258 -2397344 -1739011 -503866 550182 779977 445877 546669 1484177
38508A484177Q46285l85557j487514j438580o76445j14460K12326P72085J379582
$$ 1484177 2330462 1944905 457391 -981189 -1657634 -1772094 -1559768 -787683 591899
38499E91899J313373M23724o01945j095361j007075o38674k46588K631M7916K0073
$$ 591899 1905272 2328996 1727051 631690 -375385 -1014059 -1260647 -1258016 -1210100 -1190027
38489a190027Q6639J98586K25122K89813O25887J041976R05519r2449j348480
$$ -1190027 -1103388 -904802 -679680 -389867 236020 1277996 2183515 2091066 742586
38480G42586j811062j057843K35549R66774O80701j05856n94796n08530r7349
$$ 742586 -1068476 -2126319 -1890770 -923996 -243295 -349151 -943947 -1452477 -1549826
38471a549826L80300Q11727R79788O66188J00235j89381j65962l91861j016969
$$ -1549826 -1169526 -357799 621989 1288177 1388412 1199031 1033069 641208 -375761
38462c75761j260313m85163P21136J326973J327572J451168J600733Q20206r66181
$$ -375761 -1636074 -2121237 -1400101 -73128 1254444 2705612 4306345 5126551 4160370
38453D160370k391748k414087j632373j084522o76531J42677R09051P22571m5195
$$ 4160370 1768622 -645465 -2277838 -3362360 -4038891 -3896214 -2987163 -2264592 -2309787
38444b309787q0133P80970J190138M10854n05369l89022L03984M19541m6049k32536
$$ -2309787 -2389920 -1608950 -418812 -7958 -513327 -902349 -598365 -178824 -224873 -457409
38434d57409q1220l82042j168866j322389k19670J126787J243245L3177j154233
$$ -457409 -538629 -920671 -2089537 -3411926 -3631596 -2504809 -1261564 -1228387 -2382620
38425b382620j102299M6510J082394J012298P2698n24425n747R23343Q87358l10131
$$ -2382620 -3484919 -3438409 -2356015 -1343717 -1271019 -1795444 -1801191 -877848 9510 -300621
38415c00621j299723r29385K09918O85205J95039k45237K3029M17820K11936l05466
$$ -300621 -1600344 -2529729 -2319811 -1634606 -1439567 -1684804 -1661775 -1243955 -1032019 -1337485
38405a337485l92228p7389n6877n22361q30670m79286J66857M29841K10977l9839
$$ -1337485 -1729713 -1807102 -1863979 -2386340 -3217010 -3696296 -3529439 -3099598 -2888621 -2928460
38395b928460j9997J37748J97545J37850J33756L93221R24431J304320R09801
$$ -2928460 -2948457 -2810709 -2613164 -2475314 -2341558 -1948337 -1023906 280414 1190215
38386A190215k70539j270634j135324j84862L85871K16530K11681Q99332J337333
$$ 1190215 919676 -350958 -1486282 -1671144 -1285273 -1068743 -857062 42270 1379603
38377A379603N34135p58552r02516K41162J067444M93920p07500j226274q16707
$$ 1379603 1913738 1155186 252670 493832 1561276 2055196 1347696 121422 -695285
38368f95285l7905O81141J019117N98924l38009p24328J0308R20330P21298m55256
$$ -695285 -733190 -52049 967068 1565992 1227983 503655 513963 1434293 2155591 1700335
38358A700335j388465j445172r48616k40695M86376O61664q3835q47994l24322
$$ 1700335 311870 -1133302 -2081918 -2322613 -1836237 -1174573 -1258408 -2106402 -2430724
38349b430724J095169J516869K92494q81596m21266Q95052J269107M59666l24594
$$ -2430724 -1335555 181314 473808 -407788 -829054 65998 1335105 1794771 1470177
38340A470177m55350m14188n75635p21501p23396o66643l19375N51222J353155
$$ 1470177 1014827 600639 25004 -696497 -1419893 -2086536 -2405911 -1854689 -501534
$$ [...]
##END NTUPLES=NMR SPECTRUM
##END=
