##TITLE=31Pdec_DE-140_ORG_TFA_TMS
 ,64 sc
 6.4.2026
##JCAMPDX= 6.0         $$ Bruker NMR JCAMP-DX V2.0
##DATA TYPE= NMR SPECTRUM
##DATA CLASS= NTUPLES
##ORIGIN= UXNMR, Bruker Analytische Messtechnik GmbH
##OWNER= root
$$ XWIN-NMR		Version 3.5
$$ Mon Apr  6 13:40:05 2026 Russian Standard Time (UT+4h)  she@DPX200
##.OBSERVE FREQUENCY= 81.013821
##.OBSERVE NUCLEUS= ^31P
##.ACQUISITION MODE= SIMULTANEOUS
##.ACQUISITION SCHEME= undefined
##.AVERAGES= 64
##.DIGITISER RES= 17
##SPECTROMETER/DATA SYSTEM= spect
##.PULSE SEQUENCE= zgpg30
##.SOLVENT NAME= CDCl3
##.SHIFT REFERENCE= (INTERNAL, CDCl3, 0, 197.392)
##AUDIT TRAIL= $$ (NUMBER, WHEN, WHO, WHERE, WHAT)
$$ ##TITLE= Audit trail, XWIN-NMR		Version 3.5
$$ ##JCAMPDX= 5.01
$$ ##ORIGIN= Bruker BioSpin GmbH
$$ ##OWNER= she
$$ F:/spectra/data/she/nmr/P31/2/pdata/1/auditp.txt
$$ ##AUDIT TRAIL=  $$ (NUMBER, WHEN, WHO, WHERE, WHAT)
(   1,<2026-04-06 13:37:54.18 +0400>,<she>,<DPX200>,
      <continue with go, POWCHK disabled, PULCHK disabled
       configuration hash MD5:
       00 E9 B6 7A A2 85 ED C7 34 08 36 98 17 FE 4E 26
       data hash MD5: 32K
       7E B5 A8 4E 5F 67 8E 87 39 A9 36 AE 1A 42 88 36>)
(   2,<2026-04-06 13:38:40.82 +0400>,<she>,<DPX200>,
      <Start of raw data processing
       efp BC_mod = 2 LB = 1.5 FT_mod = 6 PKNL = 1 PHC0 = 1369.291 PHC1 = 116.9007 SI = 64K 
       data hash MD5: 64K
       D6 76 0E EC 56 10 A2 5E D6 7E A1 4A 14 30 CE 3E>)
(   3,<2026-04-06 13:39:06.07 +0400>,<she>,<DPX200>,
      <pk PHC0 = 17.16319 PHC1 = 0 
       data hash MD5: 64K
       34 93 94 09 41 AA D0 4F BD FE 5D 99 4B 58 F6 15>)
(   4,<2026-04-06 13:39:13.67 +0400>,<she>,<DPX200>,
      <abs ABSG = 5 
       data hash MD5: 64K
       1A 21 02 83 51 49 F0 81 F3 5E F9 AA AA AC 0F 76>)
$$ ##END=
$$ 
$$ hash MD5
$$ 33 1B C0 C5 8D F8 F4 5A A9 87 AE B7 E5 69 23 BF
##$RELAX= 
##$RELAX= 
##$RELAX= 
##$RELAX= 
##$RELAX= 
##$RELAX= 
##$RELAX= 
##$RELAX= 
$$ Bruker specific parameters
$$ --------------------------
##$DU= <F:/spectra>
##$EXPNO= 2
##$NAME= <P31>
##$PROCNO= 1
##$TYPE= <nmr>
##$USER= <she>
##$AMP= (0..31)
100 100 100 100 100 100 100 100 100 100 100 100 100 100 100 100 100 100 
100 100 100 100 100 100 100 100 100 100 100 100 100 100 
##$AQSEQ= 0
##$AQ_mod= 1
##$AUNM= <au_zg>
##$AUTOPOS= <>
##$BF1= 81.014009
##$BF2= 200.13
##$BF3= 200.13
##$BF4= 200.13
##$BF5= 200.13
##$BF6= 200.13
##$BF7= 200.13
##$BF8= 200.13
##$BYTORDA= 1
##$CFDGTYP= 0
##$CFRGTYP= 5
##$CHEMSTR= <none>
##$CNST= (0..31)
1 1 145 1 1 1 1 1 1 1 1 1 1 1 1 1 1 1 1 1 1 1 1 1 1 1 1 1 1 1 1 1 
##$CPDPRG= <waltz16>
##$CPDPRG1= <>
##$CPDPRG2= <waltz16>
##$CPDPRG3= <>
##$CPDPRG4= <mlev>
##$CPDPRG5= <mlev>
##$CPDPRG6= <mlev>
##$CPDPRG7= <mlev>
##$CPDPRG8= <mlev>
##$CPDPRGB= <>
##$CPDPRGT= <>
##$D= (0..31)
0 1 0 0 0 0 0 0 0 0.06 0 0.03 2e-05 3e-06 0 0 0.0002 0 0 0 0 0 0 0 0 0 
0 0 0 0 0 0 
##$DATE= 1775468178
##$DBL= (0..7)
120 120 120 11 120 120 24 19 
##$DBP= (0..7)
150 150 150 150 150 150 150 150 
##$DBP07= 0
##$DBPNAM0= <>
##$DBPNAM1= <>
$$ [...]
##$SUBNAM3= <"">
##$SUBNAM4= <"">
##$SUBNAM5= <"">
##$SUBNAM6= <"">
##$SUBNAM7= <"">
##$SUBNAM8= <"">
##$SUBNAM9= <"">
##$SW= 400.765351723535
##$SWIBOX= (0..15)
0 1 3 0 0 0 0 0 0 0 0 0 0 0 0 0 
##$SW_h= 32467.5324675325
##$TD= 32768
##$TD0= 1
##$TE= 0
##$TE2= 300
##$TE3= 300
##$TEG= 300
##$TL= (0..7)
0 120 53 12 22 120 120 120 
##$TP= (0..7)
150 150 150 150 150 150 150 150 
##$TP07= 0
##$TPNAME0= <>
##$TPNAME1= <>
##$TPNAME2= <>
##$TPNAME3= <>
##$TPNAME4= <>
##$TPNAME5= <>
##$TPNAME6= <>
##$TPNAME7= <>
##$TPOAL= (0..7)
0.5 0.5 0.5 0.5 0.5 0.5 0.5 0.5 
##$TPOFFS= (0..7)
0 0 0 0 0 0 0 0 
##$TUNHIN= 0
##$TUNHOUT= 0
##$TUNXOUT= 0
##$USERA1= <user>
##$USERA2= <user>
##$USERA3= <user>
##$USERA4= <user>
##$USERA5= <user>
##$V9= 5
##$VALIST= <valist>
##$VCLIST= <CCCCCCCCCCCCCCC>
##$VD= 0
##$VDLIST= <DDDDDDDDDDDDDDD>
##$VPLIST= <PPPPPPPPPPPPPPP>
##$VTLIST= <TTTTTTTTTTTTTTT>
##$WBST= 1024
##$WBSW= 4
##$XGAIN= (0..3)
0 0 0 0 
##$XL= 0
##$YL= 0
##$YMAX_a= 3541
##$YMIN_a= -18796
##$ZGOPTNS= <>
##$ZL1= 120
##$ZL2= 120
##$ZL3= 120
##$ZL4= 120
##$ABSF1= 197.3918
##$ABSF2= -203.3724
##$ABSG= 5
##$ABSL= 3
##$ALPHA= 0
##$AQORDER= 0
##$ASSFAC= 0
##$ASSFACI= 0
##$ASSFACX= 0
##$ASSWID= 0
##$AUNMP= <proc_1d>
##$AZFE= 0.1
##$AZFW= 0.5
##$BCFW= 0
##$BC_mod= 2
##$BYTORDP= 0
##$COROFFS= 0
##$CY= -3
##$DATMOD= 1
##$DC= 0
##$DFILT= <>
##$DTYPP= 0
##$F1P= 0
##$F2P= 0
##$FCOR= 1
##$FTSIZE= 65536
##$FT_mod= 6
##$GAMMA= 0
##$GB= 0
##$INTBC= 1
##$INTSCL= 9.790993e-09
##$ISEN= 30
##$LB= 1.5
##$LEV0= 0
##$LPBIN= 0
##$MAXI= 10000
##$MC2= 0
##$MEAN= 0
##$ME_mod= 0
##$MI= 50
##$NCOEF= 0
##$NC_proc= -9
##$NLEV= 6
##$NOISF1= 182.463
##$NOISF2= 159.3651
##$NSP= 0
##$NTH_PI= 0
##$NZP= 0
##$OFFSET= 197.3918
##$PC= 4
##$PHC0= 1386.454
##$PHC1= 116.9007
##$PH_mod= 1
##$PKNL= yes
##$PPARMOD= 0
##$PSCAL= 0
##$PSIGN= 0
##$REVERSE= no
##$SF= 81.014063255964
##$SI= 65536
##$SIGF1= 159.3651
##$SIGF2= -187.1042
##$SINO= 113.3802
##$SIOLD= 16384
##$SREGLST= <1H.CDCl3>
##$SSB= 0
##$STSI= 65536
##$STSR= 0
##$SW_p= 32467.5324675325
##$SYMM= 0
##$S_DEV= 0
##$TDeff= 32768
##$TDoff= 0
##$TI= <>
##$TILT= no
##$TM1= 0
##$TM2= 0
##$TOPLEV= 0
##$USERP1= <user>
##$USERP2= <user>
##$USERP3= <user>
##$USERP4= <user>
##$USERP5= <user>
##$WDW= 1
##$XDIM= 65536
##$YMAX_p= 231622856
##$YMIN_p= -386694408
$$ End of Bruker specific parameters
$$ ---------------------------------
##NTUPLES= NMR SPECTRUM
##VAR_NAME=  FREQUENCY,     SPECTRUM/REAL,   SPECTRUM/IMAG
##SYMBOL=    X,             R,               I
##VAR_TYPE=  INDEPENDENT,   DEPENDENT,       DEPENDENT
##VAR_FORM=  AFFN,          ASDF,            ASDF
##VAR_DIM=   65536,         65536,           65536
##UNITS=     HZ,            ARBITRARY UNITS, ARBITRARY UNITS
##FACTOR=    0.49542278885378, 1,            1
##FIRST=     15991.5117654749, 0,            0
##LAST=      -16476.0207020576, 0,           0
##MIN=       -16476.0207020576, -386694408,  0
##MAX=       15991.5117654749, 231622856,    0
$$ Real data points
##PAGE= N=1
##DATA TABLE= (X++(R..R)), XYDATA
$$ [...]
44046A2299406q07494J398016M170788J941642m784954j0060522r883796n161235
44038a0888149J121438N946484O540141K315556l200267m840255r97938M483994
44030D81004N899476J250322n392412p698618l991076J000102K620057K149132
44022c682013L300351N415292M851916J625528q62585k095025m411555o629279
44014b487370m392956J730655N178857K799627r40500j938842k200909l974039
44006f225477m590753j994022L46738m62325q51254K948175P220365N969337L48798
43997B709582l694204m340464l911955k584406Q37507L646151K033785j580380
43989f884384j068774L575146N731570K220044k547071l924585k660357j086296
$$ y = [12299406, 11491912, 12889928, 17060716, 19002358, 14217404, 4156882, -5726914, -10888149, -9766711, -3820227, 2719914, 5035470, 1835203, -3005052, -4002990, 481004, 6380480, 7630802, 2238390, -5460228, -9451304, -8451202, -5831145, -3682013, -381662, 5033630, 9885546, 11511074, 10648489, 8553464, 4141909, -2487370, -6880326, -5149671, 29186, 2828813, 1888313, -50529, -2251438, -6225477, -10816230, -12810252, -12463514, -12925839, -13777093, -10828918, -3608553, 2360784, 2709582, -984622, -5325086, -9237041, -11821447, -10983940, -7337789, -5304004, -6884384, -7953158, -4378012, 1353558, 3573602, 1026531, -2898054, -5558411, -6644707]
43981f644707J026380L924399N244523L111404n86409k487417j869389r55722
43973G63062j995990m586781n546899k458843K064233K292566k562326n804025
43965a7835003k423367K882881K430062k503110l477092K331079Q438721Q853637
43957a302192M995433J227567q53191j690639j958935l011155n192753n396367
43949a3182232q49398N085187O674177M883471N430328P715532M779489l641348
43941A6895206p907606k957711L202547J933763l288769m360703j665440n53826
43933A297461l35002K968898O481205L711812l555606o744078l855096j861976
43925a892382m622941p480260o344290l792703k432671M26296O586465J1352769
$$ y = [-6644707, -5618327, -1693928, 3550595, 6661999, 6075590, 3588173, 1718784, 763062, -1232928, -5819709, -11366608, -13825451, -11761218, -9468652, -12030978, -17835003, -20258370, -17375489, -14945427, -17448537, -20925629, -18594550, -10155829, -1302192, 3693241, 4920808, 4067617, 2376978, 418043, -2593112, -7785865, -13182232, -14031630, -8946443, -2272266, 2611205, 8041533, 15757065, 20536554, 16895206, 8987600, 6029889, 9232436, 11166199, 7877430, 3516727, 1851287, 1297461, 962459, 3931357, 10412562, 14124374, 10568768, 3824690, -30406, -1892382, -6515323, -13995583, -20339873, -24132576, -26565247, -26138951, -19552486, -8199717]
43917h199717R781728M591952K329435M065460M929309J664404l723626p584372
43909G854573q361165o364357k582335J191280K608693O00298k962315m209444
43901a2224772j057206L613507M217516n83082m925392k622052M130999P053917
43893b396565L141255r76151J504580P641873Q588055J530437o884752r321052
43885B827680n862086j540960J037243L093758M864322L684623j406502o153254
43877E44824n480600k88215L601247L168432J170342N81826K23054j620916k917741
43868a017747j101454J890622K190533J92243m38012O15776m05291m677415p905251
43859a0655996o020288m82998M148305N446998M087970J798562K87280O08233
$$ y = [-8199717, 1582011, 6173963, 8503398, 12568858, 17498167, 19162571, 15438945, 7854573, -506592, -6870949, -9453284, -8262004, -5653311, -5053013, -8015328, -12224772, -13281978, -9668471, -5450955, -6034037, -10959429, -13581481, -9450482, -2396565, 744690, -231461, 1273119, 8914992, 17503047, 19033484, 12148732, 2827680, -3034406, -4575366, -3538123, -444365, 4419957, 8104580, 6698078, 544824, -4935776, -5223991, -1622744, 1545688, 2716030, 3297856, 3520910, 1899994, -1017747, -2119201, -228579, 1961954, 2154197, 1716185, 2331961, 1926670, -2750745, -10655996, -16676284, -17159282, -13010977, -7563979, -3476009, -1677447, -1390167, -781934]
43851g81934J890369J854529k35485k330933k229612k53497J424622J017279j548880
43842a193542m126323l380702J447322N878029M314192k449049p041661m332553
43834a0884287K525256O727773N681056J951108j010956j292819J227288M074432
43826H998851L218383k194147p479004p522539k891657J931409M720091O277216
43818E058603O309100L096375k414667o263135o390505m750235l442167j893481
43810a0690112N56392K144046R87338j947148m109611m209771k343800J083615
43802a8529051M835631O659288N542546L208679J740648P72518j133011l239422
43794a42174k978459N79670N227642P586432N613874j0861n538759o235162j063638
$$ y = [-781934, 1108435, 2962964, 2727479, 396546, -1833066, -2086563, -661941, 355338, -1193542, -5319865, -8700567, -7253245, -1375216, 2938976, 489927, -6551734, -10884287, -8359031, -1631258, 4049798, 6000906, 4989950, 3697131, 4924419, 8998851, 12217234, 10023087, 2544083, -4978456, -7870113, -5938704, -1218613, 5058603, 11367703, 14464078, 12049411, 5786276, -604229, -5354464, -8796631, -10690112, -10133720, -7989674, -7002336, -8949484, -13059095, -17268866, -19612666, -18529051, -13693420, -7034132, -1491586, 1717093, 3457741, 4230259, 3097248, -142174, -3120633, -2540963, 2686679, 10273111, 15886985, 15876124, 10337365, 4102203, 3038565]
43785C038565N168808O590185K808924j717757m165814n561736o327452m194773
43777d361050J288929O161252P225081O642698P502403P644157K955501m805940
43769C0253031r170144p855426n153330m699221n135448m502580l714149l136446
43761a3113713n55038M137688O590088M250155J078287J521752L306064J562525
43753H777808k579259l556183j11113L423546M032239K689734L89354k903762
43745A0162364n114965l549996k81808m10131l810332m518607j65713M061609
43737c627579L617846P72250r58263k506312m574954l093753L951733R559208
43729C140176N667784m063905p777757j717461M954210L654549k385220m467323
$$ y = [3038565, 8207373, 14797558, 17606482, 15888725, 11722911, 6161175, -166277, -4361050, -3072121, 3089131, 10314212, 16956910, 24459313, 32103470, 35058971, 30253031, 21082887, 13227461, 8074131, 3374910, -1760538, -6263118, -9977267, -13113713, -13668751, -9531063, -2940975, 1309180, 2387467, 3909219, 7215283, 8777808, 6198549, 2642366, 2531253, 5954799, 9987038, 12676772, 13066126, 10162364, 5047399, 1497403, 1215595, 805464, -3004868, -7523475, -7689188, -3627579, -9733, 762517, -195746, -2702058, -7277012, -10370765, -6419032, 3140176, 8807960, 4744055, -3033702, -4751163, 203047, 3857596, 1472376, -2994947]
43721b994947q65615K496877J395601j968748l623856l051973j985073m49697
43713a1047431L092690P818205R421204M768461l452360q908129q188173l187307
43705i682840K691329P746430J0822148J0260134N983359M71729l945031o739506
43697A7607752p182178l997346R61067K278359k472084q507234r580794n394687
43689a6287145J48540M931030Q300185P851890K627094k278587r78289L951083
43681H265801M398745p36190l392740J124862O667415N435789r91980m995071
43673A5776631l512110j44874J156274k9967j993037k801974j600596j95628j794960
43664D859759o070920p806997l431859L186978N143582J442740k206578j127437
$$ y = [-2994947, -3860562, -1363685, 31916, -1936832, -5560688, -8612661, -10597734, -11047431, -7954741, -136536, 9284668, 14053129, 10600769, 1692640, -6495533, -9682840, -6991511, 754919, 11577067, 21837201, 27820560, 28292289, 24347258, 17607752, 10425574, 6428228, 7389295, 9667654, 7195570, -1311664, -10892458, -16287145, -16138605, -11207575, -2907390, 4944500, 7571594, 5293007, 4314718, 8265801, 12664546, 11928356, 8535616, 9660478, 16327893, 21763682, 20771702, 15776631, 12264521, 12119647, 13275921, 13245954, 11252917, 8450943, 6850347, 6654719, 4859759, -1211161, -9018158, -12450017, -9263039, -4119457, -2676717, -4883295, -6010732]
43656f010732L297158O634607O468402L575774J52441k047558k749989k802325
43648F517778k578979j607692m51616j263489m632361p367873o134829k548333
43640b0067394j503883m174613n772008j710126O215988J1747448J1090996O155563
43632A981971J466639l48077J80218J050555O97826j163830l500872m724559m204843
43623h564972k974253k141145r28535K077026N554189N741736J547079k925215
43615b614090l367352q83409N65667P32783K714560O359895P052029K579522k983853
43606A0155752m666346k667105n69185j74194o56632p13813O39849L338098M598591
43597I285015Q80850o270069r769570n691861Q32343K578234q2j336455n97096
$$ y = [-6010732, -2713574, 3921033, 10389435, 13965209, 14117650, 12070092, 9320103, 6517778, 3938799, 2331107, 1879491, 616002, -4016359, -11384232, -17519061, -20067394, -21571277, -25745890, -31517898, -33228024, -27012036, -15264588, -4173592, 1981971, 3448610, 3100533, 3280751, 4331306, 5029132, 3865302, 364430, -4360129, -8564972, -11539225, -13680370, -14608905, -12531879, -6977690, -1235954, 311125, -2614090, -5981442, -6864851, -6299184, -5566401, -2851841, 3508054, 10560083, 13139605, 10155752, 5489406, 2822301, 2253116, 2078922, 1422290, 708477, 1348326, 4686424, 9285015, 10165865, 3895796, -5873774, -11565635, -10733292, -8155058, -8155140, -9491595, -10088691]
43588a0088691j857508m834945l294926M657396J1262729Q754960J3702n577769
43580i65052m280251o71922O25886L11540O52234J221361R67659J246328L435842
43571B543625N396695L898822j87124k838114l068530l986359o345065n667790
43563a0253840O84855P291877O737799M1488m563496k732297J719940L945552
43555B871878L546452J523910k262726n889371n068667M08793M602908L346205
43547C079382l89636k627232m381305o664448n378686J795695Q174724O130429
43539b61077q33500l012160O17666K239245o85278j742027K129739M798709J509087
43530D760404l307946m025829k470176k686134k981752J98834M610483N005222
$$ y = [-10088691, -11946199, -16781144, -20076070, -15418674, -4155945, 4599015, 4612717, -965052, -5245303, -5917225, -5291339, -4979799, -4327565, -3106204, -2138545, -892217, 2543625, 7940320, 11839142, 11652018, 8813904, 5745374, 1759015, -4586050, -10253840, -9568985, -2277108, 4460691, 4502179, -61317, -2793614, -1073674, 2871878, 6418330, 7942240, 5679514, -209857, -5278524, -4869731, -266823, 3079382, 2689746, 62514, -4318791, -10983239, -16361925, -14566230, -6391506, -261077, -1094577, -4106737, -3489071, -1249826, -1935104, -3677131, -1547392, 3251317, 4760404, 1452458, -2573371, -5043547, -7729681, -10711433, -10512599, -5902116, -896894]
43522h96894J305993j497184l25334L149023N350840L634741j719350o017559
43514B984276l773528L458245O800892J401807n998884n929722P83875M968984
43506D695945J981008l832365o871654o303542l710410j22598K863273K846812
43498h453531n81604m853300o797944m482793K152881R688465J1644626M739805
43490C056605n415695r061418l441807M373647O641623L296673l30831r42656
43482a823859q838n72192l081617m245435l73144P120686J1029516O128934l059023
43473A1115028o341565n93749N643248K929479o639496j1711750n786463M721966
43465f663302Q290240K042617n537770n967015j152769R08227j571549k130202
$$ y = [-896894, 409099, -1088085, -1413419, 1735604, 7086444, 10721185, 9001835, 2984276, -789252, 2668993, 9469885, 10871692, 4872808, -1056914, -273039, 4695945, 6676953, 2844588, -4027066, -10330608, -14041018, -14163616, -11300343, -8453531, -9035135, -13888435, -20686379, -25169172, -23016291, -13327826, -1683200, 3056605, -2359090, -11420508, -14862315, -10488668, -3847045, -550372, -881203, -1823859, -1832697, -2404889, -5486506, -9731941, -10105085, -2984399, 8045117, 14174051, 11115028, 4773463, 4179714, 9822962, 12752441, 6112945, -5598805, -11385268, -6663302, 1626938, 3669555, -1868215, -7835230, -8987999, -8079772, -9651321, -11781523]
43457a1781523K914876P828105N867030m90516l387545p57185K417447K558636
43449E169325J096753k08406j780055l138412k202200R30236L343494L384613
43441F595348J926218n75016m155055o381129m235393K40935J314721j993113
43433g262484l983304q46482L932119N493747M191418K837987J437933j419478
43425D381456m689758n741425l291439K089537P743467Q726415K509821n055436
43417F672638m620070L462447P918259K548928m355324l109550K222849J045659
43409A1785836o632139j1001952p832747k375591J300399M381251O083933K816324
43401a474686l016755l132167L867522Q663973M925086j339128k027633Q75181
$$ y = [-11781523, -8866647, -1038542, 4828488, 4337972, 950427, 193242, 2610689, 5169325, 6266078, 6057672, 4277617, 1139205, -1062995, -132759, 3210735, 6595348, 8521566, 7946550, 3791495, -2589634, -6825027, -6584092, -5269371, -7262484, -11245788, -12092270, -8160151, -2666404, 1525014, 4363001, 5800934, 4381456, -308302, -6049727, -9341166, -7251629, 491838, 9218253, 11728074, 6672638, 2052568, 5515015, 13433274, 15982202, 11626878, 8517328, 10740177, 11785836, 5153697, -5848255, -13681002, -16056593, -14756194, -10374943, -4291010, -1474686, -4491441, -7623608, -3756086, 4907887, 9832973, 8493845, 6466212, 7341393]
43393G341393P84617j718487j219141K010378K561150l88931j927632k99924J30656
43384G274079l385367o889465n160229J260732O952409P414128K474089m214312
43376E726064p722087n313886J212136O884637P610513L077298l297309o711867
43368A465499m743344L901K311321N01877j653146n20368K511777M058238L800112
43359G735867L044558Q88740l399103o027881k639168L709298M762545j508659
43351F566197p646556p258924l250834j826402l020747k140338K365690P400303
43343h811611R929526R085775M976693p66911m522159m448832l416782m458379
43335b432680n166326j538152M007043M716248j71948l744924j875196R93732
$$ y = [7341393, 8126010, 6407523, 5188382, 7198760, 9759910, 9370979, 7443347, 7143423, 7274079, 3888712, -3000753, -8160982, -6900250, 52159, 7466287, 9940376, 5726064, -1996023, -7309909, -6097773, 786864, 8397377, 11474675, 8177366, 1465499, -3277845, -3273944, -962623, -460746, -2113892, -2634260, -122483, 3935755, 7735867, 10780425, 11669165, 8270062, 2242181, -396987, 3312311, 8074856, 6566197, -1080359, -8339283, -11590117, -13416519, -16437266, -18577604, -16211914, -8811611, 1117915, 10203690, 15180383, 14413472, 9891313, 5442481, 2025699, -2432680, -7599006, -9137158, -5130115, -413867, -585815, -4330739, -6205935, -5212203]
43327e212203j66930l063779l090876j527769k423362m189272j333077O018017
43319a4989251J0837428Q581163K586328j670069l074517l082205j388039K779637
43311E80475P001090O998873J620548n511582r458737q150687l508858P25554
43303i703324K340783J998942J181338j26914k276936l581654j818760K026482
43295i960043M495061M516831M255131M218679J505064m717809r573616q007902
43287a3268604j754363K975125L420523K282252K519405L611554L186989l6721
43279B936160m943884q048834n852513Q67717O547783O913001L775079J132314
43271C326823q38109l733503n480754k905115J481736J990144q76266o95338L966778
$$ y = [-5212203, -5379133, -8442912, -11533788, -13061557, -15484919, -19674191, -21007268, -14989251, -4151823, 4429340, 7015668, 5345599, 2271082, -811123, -2199162, 580475, 7581565, 14580438, 16200986, 10689404, 1230667, -6920020, -10428878, -9703324, -7362541, -5363599, -4182261, -4309175, -6586111, -10167765, -11986525, -9960043, -5464982, -948151, 3306980, 7525659, 9030723, 4312914, -5260702, -13268604, -15022967, -12047842, -8627319, -6345067, -3825662, -214108, 2972881, 2936160, -2007724, -10056558, -15909071, -15041354, -8493571, -1580570, 2194509, 3326823, 2488714, -1244789, -6725543, -9630658, -8148922, -6158778, -7035044, -7730382, -3763604]
43262c763604O557617L373867k64960N22438J694213j917798o148750l489644
43254c436621L869366O282578J135970l647671j806634L148166M629819J661650
43246A1836623k457653n535242p041218o501924m344507k194913n16095J734388
43238a5020541L951964L562874N13982j234773R14293M105951L920797J80732
43230H95279l578922m661810l103849o08027O92418K5787l68725K235353N916086
43221b556410N153928r20845n551371l228912K339755M017007J722372Q70213
43213A845737K286822J196621l305348n261159j220514L515891K494851k297507
43205g44606l598075P24036N519651N959658K843158k15399j349028r08466J9559
$$ y = [-3763604, 2794013, 6167880, 5902920, 6425358, 8119571, 6201773, 53023, -3436621, 432745, 6715323, 7851293, 4203622, 2396988, 5545154, 10174973, 11836623, 9378970, 3843728, -3197490, -9699414, -14043921, -16238834, -16754929, -15020541, -11068577, -7505703, -6991721, -8226494, -7312201, -3206250, 714547, 895279, -2683643, -7345453, -10449302, -11057329, -10364911, -10339124, -10707849, -8472496, -2556410, 2597518, 1676673, -3874698, -7103610, -4763855, -746848, 975524, 1845737, 4132559, 5329180, 2023832, -3237327, -4457841, -941950, 1552901, -744606, -4342681, -3618645, 1901006, 7860664, 10703822, 10488423, 9139395, 8230929, 8250488]
43196H250488r2718k614706o585017q185743m481406K337835O271369L916810
43188a183088j557924m038210j484264K125910K007670j708700m484355l004173
43180a3327134Q93805K434915k46302l414826k026825L499523P008341M443205
43172g35298l69002p56647L607767O830369N620476K796350R52105j693265o194263
43163A0058592q819111o452257j923720Q03386K835024O225556P619645L187878
43155A3534993k956285l559565J51142P14094k213552j151987M838331O168073
43147A5525244k093104j0967409j0395197l040266K552449N182330Q106850R107947
43139A3978844M371609j531992r31911L499519K030866n587384q716656l147898
$$ y = [8250488, 8157770, 5543064, -1041953, -9227696, -13709102, -11371267, -5099898, -1183088, -2741012, -6779222, -8263486, -6137576, -4129906, -5838606, -10322961, -13327134, -12433329, -9998414, -10244716, -13659542, -15686367, -12186844, -5178503, -735298, -1104300, -1860947, 1746820, 8577189, 14197665, 16994015, 17946120, 16252855, 10058592, 1239481, -5212776, -7136496, -6333110, -3498086, 2727470, 10347115, 13534993, 10578708, 7019143, 7170285, 7884379, 5670827, 4518840, 9357171, 15525244, 13432140, 2464731, -7930466, -10970732, -8418283, -3235953, 4870897, 13978844, 18350453, 16818461, 15886550, 19386069, 21416935, 15829551, 7112895, 3964997]
43131C964997J735529j963238q401677p852543j240670L145504K353464K11639
43123h046995p93398j533054j537394J008014M615676N284232K483434N7461N63737
43114B101713K413706L360573L439169L181124J589896k268516o834618q590570
43106a607523n206147J586326O288056M268680k855580p904657n756159R15204
43098a0271800N227053M123951N40571j524865j181848L28277K161134M107137
43090C509610N644357O056124N162849L245646L41113l748038q182471j0207352
43082A821838p214865o89158L770582K793943J39456J551303N511115M507402
43074A2191616l134453q631101m067615O172506J0951233O631901m33188m440266
$$ y = [3964997, 5700526, 3737288, -4664389, -12516932, -13757602, -10612098, -8258634, -8046995, -8840393, -10373447, -11910841, -10902827, -6287151, -1002919, 1480515, 1537976, 2101713, 4515419, 7875992, 11315161, 14496285, 16086181, 13817665, 6983047, -1607523, -6813670, -5227344, 1060712, 5329392, 2473812, -5430845, -11187004, -10271800, -5044747, -920796, -380225, -1905090, -3086938, -2758661, -597527, 3509610, 9153967, 15210091, 20372940, 23618586, 23959699, 20211661, 12029190, 1821838, -5393027, -6082185, -2311603, 482340, 621796, 2173099, 7684214, 12191616, 9057163, 426062, -3641553, 2530953, 13482186, 20114087, 19680899, 15240633]
43066A5240633o284526q082117p920454l652961K078911M763391M071358L439132
43058C653367M386456M516689J749454j923218k771062o20440M23054k407834
43050G006466n909955m513174J825259O683151N363172P42579j559322r12548
43042H725628p29599j708240r09675K377550M368644J995318k666026n105500
43034F348100l760876j197449q40411l296405n533834m092815L38911L070137
43026h964642J585298o24322O91870L548708K422838k927202o452458m245190
43018a4965100P71278L973872M445917L326138R92574j350264p89202L375425
43010b19362P284511O920095K887229j336396l562791l151606L7072L966641M173787
$$ y = [15240633, 8956107, 873990, -7046464, -10699425, -8620514, -3857123, 214235, 3653367, 8039823, 12556512, 14305966, 12382748, 9611686, 8991246, 9414300, 7006466, 1096511, -3416663, -1591404, 5091747, 10454919, 11197498, 9638176, 8725628, 7996029, 6287789, 5378114, 7755664, 12124308, 14119626, 11453600, 6348100, 2587224, 1389775, 549364, -2747041, -8280875, -12373690, -12034779, -8964642, -7379344, -8003666, -7311796, -3763088, -1340250, -4267452, -10719910, -14965100, -14193822, -10219950, -5774033, -2447895, -1455321, -2805585, -3594787, -219362, 7065149, 13985244, 16872473, 15536077, 11973286, 8821680, 8858752, 12825393, 16999180]
43001A6999180j211644p665576q780523l672216K781218N994295N259146K264917
42993A1968797j081594l540238n162999o662645p202389m574814Q65955M836324
42985a0553603M211721J364123N32236J936258K856012K561789K136626R72194
42977F017356j946071m208086k500276J125104Q09918m258591p701248m819615
42969a7481509Q91109L180877J409698k94040J29397Q26065K95468j70562R65703
42960a0247794K904555L764878L229320K527679K019284M05814k497474l538310
42952a432048K80865N811224N229399l676557j1976766r237679K659367J0918015
42944a424180P636490j219626m981868j645079K097814J326154j672968k395016
$$ y = [16999180, 15787536, 8121960, -658563, -4330779, -1549561, 4444734, 9703880, 11968797, 10887203, 7346965, 2183966, -4478679, -11681068, -16255882, -15389927, -10553603, -6341882, -4977759, -4445523, -2509265, 346747, 2908536, 5045162, 6017356, 4071285, -136801, -2637077, -1511973, -702055, -4960646, -12661894, -17481509, -16590400, -13409523, -11999825, -12293865, -12164468, -11338403, -11042935, -11213497, -10247794, -7343239, -3578361, -349041, 2178638, 4197922, 4603736, 2106262, -1432048, -1151183, 4660041, 9889440, 6212883, -5763883, -15001562, -12342195, -1424180, 6212310, 4992684, 10816, -1634263, 463551, 1789705, 116737, -2278279]
42936b278279o12536M1856k442140n297240m009841J958851P848912Q840500N359820
42927I409903J531147m44885j676139k850589k586048n12728Q73968o80042l881799
42918h17212n311166l302670M25718K358250L42058l955600o310529m805600k005786
42909b3382537m09661J751018O335220R394150N598287k235782n209030p98612
42901h956947M205116N080591N011777N829963K353125p032242j2735564o937392
42893a3181573K217750J453939o537703o639813M468808J2154526N942551n101257
42885e222772o645648J060815O932527O035862K925959J430058M37585p85871
42877F168515o63394N61370L94071j249315j376450J138477L551224L190707P23605
$$ y = [-2278279, -2890815, -2848959, -5291099, -10588339, -14598180, -12639329, -4790417, 4050083, 9409903, 10941050, 10496165, 8820026, 5969437, 3383389, 2870661, 3744629, 3064587, -817212, -6128378, -9431048, -9005330, -6647080, -6305022, -10260622, -16571151, -21376751, -23382537, -23792198, -22041180, -15705960, -6311810, -713523, -2949305, -8158335, -8956947, -4751831, 328760, 5340537, 11170500, 13523625, 6491383, -6244181, -13181573, -10963823, -9509884, -16047587, -22687400, -18218592, -6064066, -121515, -5222772, -11868420, -10807605, -3875078, 2160784, 5086743, 6516801, 6954386, 6168515, 5505121, 6066491, 6460562, 5211247, 3834797, 4973274, 8524498, 11715205, 12438810]
42868A2438810j193824n54230K652263N825195N113828l32267o122342p065892
42860A0761541l203712J083004L005494L144574J867831j935627p486533j0793240
42852c556668q704824k660938K867006M612281K759976K49662J06398K306078
42844b021029L452329Q30301l887388o742921o402778m549032k235015Q43344
42836b0712189L608095L921089K484105K790697N607604O838362L220222k495231
42828E262754m859990k632474K55785n9006l097896m844026k012624M047427P845734
42819i4316N512915k84168l409128j853402R46997K271273L072080L716794K063281
42810A1942326j484803k206450J531448L945646L70804m153459j831547N303289
$$ y = [12438810, 11244986, 10690756, 13343019, 19168214, 24282042, 23949775, 17827433, 10761541, 7557829, 8640833, 11646327, 14790901, 16658732, 14723105, 7236572, -3556668, -12261492, -14922430, -12055424, -7443143, -4683167, -4433505, -4327107, -2021029, 1431300, 2261601, -1625787, -8368708, -14771486, -19320518, -21555533, -20712189, -17104094, -13183005, -10698900, -7908203, -2300599, 4537763, 7757985, 5262754, 402764, -2229710, -1973925, -2032931, -5130827, -9974853, -11987477, -7940050, -94316, 5418599, 5134431, 1725303, -128099, 818898, 3090171, 6162251, 9879045, 11942326, 10457523, 8251073, 9782521, 13728167, 14098971, 9945512, 8113965, 13417254]
42802A3417254P906207L334883j427296j674733j289383m273968p588108p014723
42794A390133m240606k886736k057515P07956L587170L324720J626932K907969
42786D360023O533828O717187Q11487o356779p962127k831764L539166M983836
42778I794857J479645o39474L071189P779246M628811o064846j3076669r135252
42770b162493j220767J58520l378022k068940N200332Q762319L787500k059547
42762G018902p20570M561868N581185J508352j817031j720699j318066l201605
42754I892336n616680n448914k020827K417570M474513K609103o00818q64911
42746D841372K038267L523357R90337j974510j188374J541829J581771j280081
$$ y = [13417254, 21323461, 24658344, 23231048, 21556315, 20266932, 15992964, 8404856, 1390133, -2850473, -5737209, -7794724, -7086768, -3499598, -174878, 1452054, 4360023, 10893851, 17611038, 18422525, 12065746, 4103619, 1271855, 4811021, 9794857, 11274502, 10635028, 13706217, 21485463, 26114274, 20049428, 6972759, -2162493, -3383260, -3224740, -6602762, -8671702, -3471370, 5290949, 9078449, 7018902, 6298332, 10860200, 16441385, 17949737, 16132706, 14412007, 13093941, 9892336, 4275656, -1173258, -3194085, -776515, 3697998, 6307101, 5706283, 4841372, 6879639, 10402996, 11393333, 9418823, 8230449, 9772278, 11354049, 10073968]
42738A0073968l632085m741078o447273p423580l765968L549137P615425M652601
42730a18853n82844j750558O29693J731716M37231o5375J629946L237889L084390
42721H233235K177865R68245k273587p680648j1071721q107641l28625N679356
42713a2403521N522544J465253j285036j283220j829336n133129p661923l755783
42705b6364151O129247J3672232J1615004L018304j975939J053348N272750K269212
42697A4690007o279487j1148357q031978j849354J733980L127222M608778M804360
42689A655171K161125J2943K028952M698551J283978o792898r686930k558769
42681g197877O987823Q965817L649335j047626j434879j017122k783871m865796
$$ y = [10073968, 6441883, 1700805, -4746468, -12170048, -15936016, -12386879, -4771454, -118853, -701697, -2452255, -1822562, -90846, 346385, 281010, 1910956, 5148845, 8233235, 10411100, 11379345, 9105758, 1425110, -9646611, -17754252, -18082877, -12403521, -6880977, -5415724, -6700760, -7983980, -9813316, -14946445, -22608368, -26364151, -20234904, -6562672, 5052332, 8070636, 6094697, 7148045, 12420795, 14690007, 8410520, -2737837, -10769815, -12619169, -10885189, -7757967, -3149189, 1655171, 3816296, 3829239, 5858191, 10556742, 11840720, 5047822, -4639108, -7197877, -210054, 8755763, 12405098, 11357472, 9922593, 8905471, 6121600, 1255804]
42673A255804n061010m573213m721002l711765k7204L465334K750070q63922j568865
42664a3055773K821130P130242N530645n09350m344869k976217K13270J519715
42656c671207J246859M83803j805389n166186n202036L21592N802067M238032
42648c752465k207420m782355j033975K262679N63030j708785L58362L680763
42640f620166K744483j279882l127052j773182j87867P75330K305568L161938
42632d000830J113723k106401k729024j117474o91522j353312J73668L383612
42624g327560L532611n31453l696765j928629K409531M926639M739430L166258
42616E290062P39591j580901j388301J904041N100722N220343L440853K551108
$$ y = [1255804, -3805206, -8378419, -13099421, -16811186, -16838390, -13373056, -10622986, -11486908, -13055773, -10234643, -3104401, 2426244, 1916894, -2427975, -5404192, -5190922, -3671207, -2424348, -1940545, -3745934, -8912120, -14114156, -13792564, -7990497, -3752465, -5959885, -10742240, -11776215, -9513536, -8950506, -10659291, -10300929, -6620166, -3875683, -5155565, -8282617, -10055799, -10243666, -9468336, -7162768, -4000830, -2887107, -4993508, -7722532, -8840006, -9531528, -10884840, -10711172, -7327560, -3794949, -4326402, -8023167, -9951796, -7542265, -2615626, 2123804, 5290062, 6029653, 4448752, 3060451, 4964492, 10065214, 15285557, 18726410, 21277518]
42608B1277518K362417N35872l014313n265809l886977m55521Q02389k292776
42600A0062800o497097n954815K85256N524520L193858l985122o826986j553744
42592e751330N691616P279113K827401k371589m016730j528227K961074N838057
42584A0929385M274481p13697m895489n393568k781420J359475N706396P537220
42576A6022783L962019l397497q510835p691266l187683J230560M339845N530613
42568H298539L567467N9807l56590L188140M976538O41059n909823p945845m956435
42559A562857j522807l0193N13346N85719k597J05113J892106L328513K396501
42550H828558P51270O28845O86485q44496j771367K75443K448264P58650k848493
$$ y = [21277518, 23639935, 24175807, 21161494, 15895685, 12008708, 11553187, 12355576, 10062800, 3565703, -2389112, -2103856, 3420664, 6614522, 2629400, -4197586, -5751330, -59714, 7219399, 10046800, 7675211, 3658481, 2130254, 5091328, 10929385, 15203866, 14490169, 9594680, 4201112, 1419692, 2779167, 8485563, 16022783, 19984802, 16587305, 8076470, 385204, -2802479, -1571919, 2767926, 8298539, 11866006, 11925813, 11569223, 14757363, 19733901, 20374960, 14465137, 6519292, 1562857, 40050, 9857, 523203, 1108922, 1106325, 1211438, 3103544, 6432057, 8828558, 9579828, 10208673, 10895158, 10050662, 8279295, 8554738, 11003002, 11761652, 8913159]
42541H913159l565836j655418p20652j77982K887494N749095K671669m347406
42533I754123o549904j847252J709906p76986k953070K042198R584761R427072
42525B0390848j33077j0236042j2094764n274351L605336P293707L760845k474783
42517D837719n362267l549746J07483L666533O469427N645584j188974r026117
42509A599642q610990P32230Q342174O306614k28128k099347M86508N57613l645652
42500C440664o780384m977315k39858L276710L114577m81862m052602l011995
42492i712065K661734P004546N292239j96165m667163p049940p680041m447450
42484a8794305K811292Q019830O007222J109417J213167N411741N760988K88475
$$ y = [8913159, 5347323, 3691905, 2971253, 2793271, 5680765, 11429860, 14101529, 9754123, 3204219, 1356967, 3066873, 2289887, -663183, 1379015, 10963776, 20390848, 20257771, 10021729, -2073035, -7347386, -3742050, 3551657, 7312502, 4837719, -524548, -4074294, -3966811, -300278, 6169149, 11814733, 10625759, 1599642, -7011348, -6279118, 2063056, 8369670, 8141542, 6042195, 6528703, 7086316, 3440664, -3339720, -8317035, -8556893, -5280183, -2165606, -2647468, -6700070, -9712065, -7050331, -45785, 5246454, 5050289, 383126, -6666814, -14346855, -18794305, -15983013, -7963183, -1955961, -846544, 366623, 5778364, 11539352, 11827827]
42476A1827827m366886l818081j239603k04057K44190R40852k02809l394198n036639
42467e249404l282481l90121K262660N558159P120881J728796q948045j4091145
42459a5290700o883877N512210J1089459P580801J749156j762473l508206l606781
42451e120411p98363K906385L008901r54667m293353l419480N36926M784947P844324
42442D495209Q813395O971015L082829j105403m793188p520953p557493l899153
42434a513742Q10630K785901K130875J813183K112876N03935k747861l901128
42426A994669k029936j008445k788251l549378k79977L084518J272529l384202
42418f688473l597166K238097P905239Q382778N499559K841368J86003l629681
$$ y = [11827827, 7460941, 3642860, 2403257, 2199200, 2443390, 3384242, 3181433, -212765, -5249404, -8531885, -8922006, -6659346, -1101187, 6019694, 7748490, -1199555, -15290700, -22174577, -16662367, -5572908, 2007893, 3757049, 1994576, -1513630, -5120411, -5918774, -3012389, -3488, -958155, -5251508, -8670988, -8134062, -3349115, 4495209, 13308604, 20279619, 23362448, 22257045, 17463857, 9942904, 2385411, -1513742, -703112, 2082789, 4213664, 6026847, 8139723, 8643658, 5895797, 1994669, -35267, -1043712, -3831963, -7381341, -7661318, -4576800, -3304271, -6688473, -10285639, -8047542, -142303, 8240475, 13740034, 16581402, 16767405, 13137724]
42410A3137724o359983n455549l187214l852028o826099p114260k858341K344040
42402b0171710N497339P784121R967895Q979841L042706l309209m301160j028039
42394F461784N76717j287972k882220k334828k348256l906050l140262K161395
42386f699692P544806P569913L186402p26236k400023l353817l868430l130030
42378a877107k295537k559502j576439K793922O337327K775367n488579q299615
42370a0190163j797258N531774M945741q62136l988774l696848m630695o022647
42362b0711006k121344O505783J0987967O419048q66331k565145L91678J151898
42354h07452k117363m461351k131978K609362N041028L059323j637076n099534
$$ y = [13137724, 6777741, 1322192, -1865022, -5717050, -12543149, -19657409, -22515750, -20171710, -14674371, -6890250, 3077645, 12057486, 15100192, 11790983, 7489823, 6461784, 7038501, 5750529, 2868309, 533481, -1814775, -5720825, -8861087, -6699692, 845114, 8415027, 11601429, 10875193, 8475170, 5121353, 1252923, -1877107, -4172644, -6732146, -8308585, -5514663, 822664, 3598031, -1890548, -10190163, -11987421, -6455647, -1509906, -2372042, -6360816, -10057664, -14688359, -20711006, -22832350, -16326567, -5338600, 1080448, 214117, -2351028, -1959350, -807452, -2924815, -7386166, -9518144, -6908782, -1867754, 1191569, -445507, -5545041]
42346e545041l940463J354311O247296P015159M740635K433049K43023k724370
42338I823599l650633J078904P844517P259275l114613j2879035j0727117J053444
42330c311659R648490P681280L39826l457331j415830K486994M260873K641757
42322A8874400j782033o778399q768514n723067M9383L689155K734393o58779
42314A636539k633975j917685n88548q84273k190952k047918J93302K210032J851490
42305d371988K516j071851j102086j539227k418188j783250J358885N311234P617141
42296B003186P450860N497291K562502r20600m431761o753322o082531j912155
42288b586530K719545L007951j536307m774676j083497O401259Q920058L292583
$$ y = [-5545041, -9485504, -8131193, -1883897, 5131262, 9871897, 12304946, 12547969, 9823599, 6172966, 7251870, 15096387, 22355662, 19241049, 6362014, -4365103, -3311659, 6336831, 14018111, 14357937, 10900606, 9484776, 11971770, 16232643, 18874400, 17092367, 10313968, 1545454, -4177613, -4128230, -439075, 2295318, 1636539, -997436, -2915121, -3503669, -4387942, -6578894, -8626812, -8433510, -6223478, -4371988, -4369472, -5441323, -6543409, -8082636, -10500824, -12284074, -10925189, -5613955, 2003186, 9454046, 14951337, 17513839, 16593239, 12161478, 5408156, -674375, -2586530, 133015, 3140966, 1604659, -3170017, -4253514, 2147745, 11067803, 14360386]
42280A4360386m657039q588033q393516o399476k239859M188114Q625686O806349
42272C702612J159414j717712M45750L750024M212747J719797j872708m699842
42264F700082m782580j610545J744012J494533j440211k362801K83830K763902
42256B790222K075262K49901L72436J535365P61351k074397m158732l583852j075063
42247c107507J517039K867322K708499J580419k52800l210145o306669n768291
42239i972133Q34031R151625J1317414O024861M92923j32777J85097l523107p572005
42230F805929n464835M2228p5456o502563r351645k842267O263026R107735O289040
42221D271192L363743J138329k371784m883399k868595R75881J328573k62650
$$ y = [14360386, 9703347, 1115314, -7278202, -13677678, -15917537, -11729423, -3103737, 3702612, 4862026, 3144314, 3590064, 7340088, 11552835, 13272632, 11399924, 6700082, 1917502, 306957, 2050969, 3545502, 2105291, -257510, 26320, 2790222, 4865484, 5115385, 5487821, 7023186, 7784537, 5710140, 1551408, -2032444, -3107507, -1590468, 1276854, 3985353, 5565772, 5312972, 2102827, -4203842, -9972133, -9138102, 13523, 11330937, 17355798, 17848721, 17715944, 17901041, 14377934, 6805929, 1341094, 1383322, 1307866, -5194697, -14546342, -17388609, -11125583, -2017848, 4271192, 7634935, 8773264, 6401480, 1518081, -1350514, -374633, 953940, 691290]
42213F91290K042520O794590N697884k636364q881480o947729k844686l495646
42205i579621m735978Q75906J0014095J2505470O486734l07737l368130n583932
42197F306807q024755o652783j110517K320454Q23281m1083L333831N299355R18545
42188C173135l775819m78825P226232Q415310J235286n262063n495319l775874
42180A262063m406325m428719o46899L062109J237246m389019o879370k929151
42172a8118065M111928Q858701Q757015N120127J205484r45084j952224k712862
42164D325020k098780L55389J351309j935548n653765l513950K650019L986714
42156e33592j753419n781975j656645M799043N417750K480923K866941M701244
$$ y = [691290, 2733810, 9528400, 15226284, 12589920, 3708440, -3239289, -6083975, -9579621, -14315599, -13439693, -3425598, 9079872, 15566606, 15258869, 11890739, 6306807, -1717948, -8370731, -9481248, -7160794, -6337513, -6378596, -3044765, 2254590, 3173135, -602684, -1081509, 6144723, 14560033, 15795319, 10533256, 5037937, 1262063, -3144262, -7572981, -8219880, -5157771, -3920525, -8309544, -15188914, -18118065, -14006137, -5147436, 3609579, 8729706, 9935190, 8990106, 7037882, 4325020, 2226240, 2581629, 3932938, 1997390, -3656375, -7170325, -4520306, -533592, -2287011, -8068986, -9725631, -4926588, 491162, 2972085, 5839026, 10540270]
42148A0540270N74522q112026j1161063m887973K532482L857542K074121K448236
42140b133889K981049o26747n546882m824671J948207P321487N799102L85248
42132E302904k259076k50976K394665K175244Q18469J840118M092930K742736
42124A6857014k633599n830059l218864m61911m077075r732745p187357L868893
42116a2415703J1812938Q804268L47276m255944l467893p95775K565997O022200
42108H617364N897171O00095m279243l043066R44040M53649l570661l490426J938416
42099D067339M521407j051137q802521r395790k066736N444046O636337K612400
42091A965345p04302K86933L189321L340478N45868o12175J800384L318516J61395
$$ y = [10540270, 11114792, 3002766, -8158297, -13046270, -10513788, -6656246, -4582125, -2133889, 847160, 220413, -5326469, -10151140, -8202933, -881446, 4917656, 5302904, 3043828, 2792852, 5187517, 7362761, 8181230, 10021348, 14114278, 16857014, 14223415, 8393356, 5174492, 4712581, 635506, -9097239, -16284596, -12415703, -602765, 8201503, 8548779, 4292835, 824942, 29167, 2595164, 8617364, 14514535, 15114630, 10835387, 7792321, 8736361, 9190010, 5619349, 2128923, 4067339, 8588746, 7537609, -1264912, -10660702, -12727438, -7283392, -647055, 1965345, 1261043, 1547976, 4737297, 8077775, 8623643, 8011468, 9811852, 13130368, 13291763]
42082A3291763l712444k172192K945036M160073K03676j844622K183015O872025
42074B1926330N213530j602275o256305m250287K174558P028285N642635j269335
42066B8607136p579266p846051l553337m81565n24175m37207J495600L044727
42058A2725862L159213L753216M658885K575313k604265o120098n660991m524963
42050G962172m656813l123701P68587K077334r30019j849333L299082P666091
42042A1213400M054532k535608k826959J311157P53273m824163p142651m443779
42034d440798l628259o161281m556282L438064Q812592N156099j264718j916282
42026d560865J752835L618458L386747L954286L751648r4396m561419m320686
$$ y = [13291763, 9579319, 7407127, 10352163, 14512236, 14715912, 12871290, 15054305, 21926330, 27139860, 25537585, 19281280, 15030993, 17205551, 24233836, 29876471, 28607136, 21027870, 13181819, 9628482, 9146917, 8622742, 8185535, 9681135, 12725862, 15885075, 19638291, 24297176, 26872489, 24268224, 18148126, 12487135, 7962172, 3305359, 181658, 950245, 3027579, 2097560, 248227, 3547309, 11213400, 15267932, 12732324, 9905365, 11216522, 11969795, 7145632, 2981, -4440798, -8069057, -14230338, -18786620, -15348556, -6535964, -1379865, -2644583, -4560865, -2808030, 810428, 4197175, 8151461, 11903109, 11808713, 7247294, 2926608]
42018B926608k86327K000648P82181j019771j749131k176668j796285O94371L712751
42009C088377M233200K583225J810013K733703L311916K417322Q59772q07876
42001B0229652k504450l423168l273283l473324m582077m431091j651131J287996
41993a820876J869450J687285K895820L436950P14888k617895k254506N34528
41985D445644J495588J341474L887073P301564N478388j234785n042143k604138
41977A5068665N6442k000893m838174l242682L14224M75722j950025k221318R8220
41968A760181J291135J56749q73877m22128M46030Q49048N79503r54976k997179
41959a65514k270429K656545P366050O288959M40609m013347m365153l711800
$$ y = [2926608, 2640281, 4640929, 5423110, 4403339, 2654208, 477540, -1318745, -624374, 3088377, 7321577, 9904802, 11714815, 14448518, 17760434, 20177756, 21037528, 20229652, 17725202, 14302034, 11028751, 7555427, 2973350, -1457741, -3108872, -1820876, 48574, 1735859, 4631679, 8068629, 8783517, 6165622, 3911116, 4445644, 5941232, 7282706, 11169779, 18471343, 23949731, 22714946, 17672803, 15068665, 15125107, 13124214, 8286040, 5043358, 5357582, 5833304, 3883279, 1661961, 1760181, 3051316, 3208065, 2334188, 1912060, 2358090, 3207138, 3786641, 2831665, -165514, -2435943, 220602, 7586652, 13875611, 14316220, 10302873, 5937720, 2225920]
41951B225920m440133m377053j124411L762523P107485P653637N403385L58393
41943A6569746n713988q707879o316236j493093P07022j028366l683814m358974
41935a4025582k859123j22083L173600N539342M613768K62717l431398j832954
41927h681713M346369Q954826P279852J365257l046195l316410j252107J264087
41919F913966M314945O988206O216029J258269l161551j836697L674614O387852
41911C0755633K871036k416550l405761n28695K73856m122614r630541r932412
41903C863952m032881L022985O260087N414449L181863J238162k74258r45761
41895A7728598l31714M89318j30218j974440l448481m106847m334713l087497
$$ y = [2225920, -2214213, -6591266, -7715677, -3953154, 3154331, 10807968, 16211353, 16569746, 10855758, 2147879, -4168357, -5661450, -4954428, -5982794, -9666608, -14025582, -16884705, -17006788, -13833188, -8293846, -3680078, -3417361, -6848759, -8681713, -4335344, 4619482, 11899334, 13264591, 10218396, 6901986, 5649879, 6913966, 11228911, 18217117, 24433146, 25691415, 22529864, 20693167, 24367781, 30755633, 33626669, 31210119, 27804358, 27275663, 27549519, 23426905, 13796364, 3863952, -168929, 2854056, 9114143, 14528592, 17710455, 18948617, 18674359, 17728598, 17396884, 17886202, 17755984, 15781544, 12333063, 8226216, 3891503, 804006]
41887H04006O55809M180038L096955j618356l265939J282631O321533N192275
41879A6648952m65193m318375n001930n911352p112573m589091J993265P232236
41871a524061P382703M392173R03345l046253n926469l558262L604869P457527
41863I685572K417634n269527n211825K390855P108722L225549k990941l142600
41855H213439K140757N730740L923806l21550k430376j231689P13935J03167l431676
41846A3410553o195633m386409N75225L179296J228078j094514K47515K768450
41838I732561J431365l088483m910972j485044K933729L528721R51106r43429
41830H149554p77881o41195k617482o111808q174618n953518J86867N942682P214071
$$ y = [804006, 1459815, 5639853, 8736808, 7118452, 3852513, 5135144, 11456677, 16648952, 16183759, 11865384, 6863454, 952102, -6160471, -10749562, -8756297, -1524061, 5858642, 10250815, 11154160, 8107907, 2181438, -1376824, 2228045, 9685572, 12103206, 6833679, 1621854, 4012709, 11121431, 14346980, 11356039, 8213439, 10354196, 16084936, 20008742, 19687192, 17256816, 16025127, 16739062, 16842229, 13410553, 7214920, 2828511, 3403736, 6583032, 7811110, 6716596, 6964111, 9732561, 11163926, 8075443, 3164471, 1679427, 4613156, 8141877, 9092983, 8149554, 7371673, 6730478, 4112996, -1998812, -10173430, -16126948, -15940081, -9997399, -2783328]
41821b783328N043961L953619N063505M480014J32022l847782l088546j62304
41813H791161r48920n387334p163888k847129L423671N819122L707436P94050
41805F188169P5260J474726K680050J173094k941137n807899l884358O97933K205036
41796A860874m24548j537509K727041P988765P593364K097379k014162j716073
41788A6575131o45048k767494p095849r905604r034909m591951J989668P901670
41780g574386R969740P685651M185441K637789K416557L85263m423949r098733
41772F183373j0239491p767975m268713j309961J766788N111342O544368M258567
41764B78298J33549j886663k62300L345248P040711R699576R484617N091259r09938
$$ y = [-2783328, 2260633, 6214252, 11277757, 15757771, 15889793, 12042011, 8953465, 8791161, 7842241, 2454907, -4708981, -7556110, -4132439, 1686683, 5394119, 6188169, 6263429, 7738155, 10418205, 11591299, 8650162, 2842263, -1042095, -344162, 1860874, 1436326, -101183, 2625858, 10614623, 18207987, 20305366, 18291204, 16575131, 15930083, 13162589, 6066740, -3838864, -12873773, -17465724, -15476056, -7574386, 2395354, 10081005, 14266446, 16904235, 19320792, 19706055, 15282106, 6183373, -4056118, -11824093, -16092806, -17402767, -15635979, -10524637, -3980269, 278298, 411847, -1474816, -1737116, 1608132, 8648843, 18348419, 27833036, 32924295, 32014357]
41755C2014357l773058k814679j995407k809557j665035K575030L998316j815536
41747B3714431q998195q506355j627850J897085j144557l194633J124444O164979
41739I429349M283511k544894o357565m460439p06579K077684M486029O042444
41731A2249540M408930Q0063k981108l002986k665552l822273l861283k65000
41723A40331M324946N421502L122689J066691R8261k097994m816093l402367K974156
41714F832122P677203N171848o07574k205145j63225j147210n398694m979513
41706E179812K976126R830041P761219J587473O84847M011116K525465n368874
41698B9187225j0620003p220349o72115R84144j721421k502275P91960M377471
$$ y = [32014357, 28241299, 25426620, 23431213, 20621656, 18956621, 21531651, 25529967, 23714431, 14716236, 6209881, 4582031, 6479116, 5334559, 2139926, 3264370, 9429349, 13712860, 11167966, 4810401, 349962, -356617, 1721067, 6207096, 12249540, 16658470, 16738533, 13757425, 10754439, 8088887, 4266614, 405331, 140331, 4465277, 9886779, 13009468, 14076159, 14174420, 12076426, 7260333, 3857966, 6832122, 14509325, 19681173, 19073599, 16868454, 16705229, 15558019, 10159325, 5179812, 8155938, 17985979, 25747198, 27334671, 28019518, 32030634, 34556099, 29187225, 18567222, 11346873, 10674758, 11658902, 9937481, 7435206, 8227166, 12604637]
41690A2604637M986147L610097K599921K038126L32379k610383m197266j997549
41682A7366109K578934N214037M002838J773263J612861K436785J416086j399631
41674C5001282l897073n269783n228676k176979L589204P040238L953809k257728
41666C0754294m852852l544300l528340n556245m620889O12840M802749M646683
41658A8713940L497100M249188M376403J891858Q0467J784628M276028M403634
41650D3273246M009585N473641O300603L184765k176382o001558p763438q271441
41642C8029021o045159l73893N081683O416810M696261L167661K200301P61498
41634E3934183k97528k42210m07171p23383J484299N477085N139536j812140p880549
$$ y = [12604637, 17590784, 21200881, 23800802, 25838928, 26171307, 23560924, 19363658, 17366109, 19945043, 25159080, 29161918, 30935181, 32548042, 34984827, 36400913, 35001282, 31104209, 25834426, 20605750, 18428771, 22017975, 29058213, 33012022, 30754294, 25901442, 22357142, 18828802, 13272557, 8651668, 9264508, 14067257, 18713940, 22211040, 26460228, 30836631, 32728489, 32808956, 34593584, 38869612, 43273246, 47282831, 52756472, 59057075, 62241840, 60065458, 54063900, 46300462, 38029021, 31983862, 31609969, 36691652, 43108462, 47804723, 50972384, 53172685, 53934183, 53636655, 53394445, 52987274, 52263891, 53748190, 59225275, 64364811, 62552671, 54672122]
41625E4672122n499348J674200M163679j59287n296449o446808l260622L226151
41617D3073638R928285J0913998M481795j725720J02406O678826R090491O034563
41609H8578282K880536Q38415k878340o304400m749975l72911Q46017O88002N943660
41600H5469286J4512307J6651589J1161925P578017R828808J0757205O878192
41593A62837329N421116J0562216J4792373J1622754O250619N401952O189783
41586B23078142L717798R37967J747422K141527k318365p313670p504270o578612
41578B07907939r579817j1927417p493478j966516n330291j4530447j6938913
41571A40141060r884708l734793m684792o932806n061166k975351n147788p736030
$$ y = [54672122, 49172774, 50846974, 55010653, 54851366, 49554917, 43108109, 39847487, 43073638, 53001923, 63915921, 68397716, 66671996, 66774402, 73453228, 82543719, 88578282, 91458818, 92297233, 89418893, 83114493, 78364518, 77991607, 78837624, 79525626, 85469286, 99981593, 116633182, 127795107, 135373124, 145201932, 155959137, 162837329, 168258445, 178820661, 193613034, 205235788, 211486407, 216888359, 223078142, 226795940, 227733907, 229481329, 231622856, 229304491, 221990821, 214486551, 207907939, 198328122, 186400705, 178907227, 176940711, 171610420, 157079973, 140141060, 130256352, 126521559, 121836767, 114903961, 109842795, 106867444, 101719656, 93983626]
41563I3983626n063606P39933K888197n61609n563462q523736r428467r129675
41555E9341201p317145m378780k990457n296708q667384p379540n24557M929260
41547B7715890L125576j464141l55239N211140N912176K08045k344752K601657
41539D0610352N921866K59824o809245m873621K418355M278492L59405j254309
41531D0911119N79286j37320l486419l282524P69541K779563K602658N740803
41523D6476707J0431563P776295k497514r076089o299780k367286m392271o686151
41515C3365474k079540M648861M522338j023146l264034j59683J907224j040866
41507C6876628n415220o087626k749574N36108l4362l624876m713436N08362P989491
$$ y = [93983626, 88920020, 89659953, 92548150, 91986541, 86423079, 77899343, 68470876, 59341201, 52024056, 47645276, 44654819, 39358111, 30690727, 23311187, 22786630, 27715890, 30841466, 29377325, 29022086, 34233226, 40145402, 40353447, 38008695, 40610352, 46532218, 46792042, 39982797, 35109176, 37527531, 41806023, 42165428, 40911119, 41490405, 41353085, 37866666, 34584142, 35353683, 38133246, 40735904, 46476707, 56908270, 64684565, 62187051, 53110962, 46811182, 44443896, 40051625, 33365474, 31285934, 35934795, 40457133, 39433987, 36169953, 36010270, 37917494, 36876628, 31461408, 25373782, 22624208, 23160316, 23125954, 19501078, 14787642, 15296004, 23285495]
41498B3285495R944550N207646L80796j28757P73445m26061k274066k476986j911143
41489C2374919j242532J021598L843215K768812k490535n429905k129168K392701
41481C1109105K159468r43937k021917j675711l042354m501136k528734Q99511
41473A9454295P54432k661718l952707n73739M563238P914340Q484929O765630
41465D0748700M070460K366127K185896J864123N96886m2713P00607J333096J665568
41456E5488750L618607O438632O375326L814979M309303Q586873Q995258J857846
41448I9485574m279808j076974N749696N442277j53858k29430O357858R243262
41440A20538597L933735j366378L73295M765363M557135L14867k890439l628516
$$ y = [23285495, 33230045, 38437691, 38818487, 38689730, 39463175, 39037114, 36763048, 34286062, 32374919, 31132387, 32153985, 35997200, 38766012, 36275477, 30845572, 28716404, 31109105, 33268573, 32324636, 30302719, 28627008, 25584654, 21083518, 18554784, 19454295, 20208727, 17547009, 13594302, 13020563, 17583801, 25498141, 33983070, 40748700, 44819160, 47185287, 49371183, 51235306, 51832192, 51789479, 52490086, 53823182, 55488750, 59107357, 65545989, 71921315, 75736294, 80045597, 88632470, 97627728, 99485574, 95205766, 94128792, 99878488, 105320765, 105166907, 104937477, 111295335, 120538597, 124472332, 123105954, 123479249, 128244612, 132801747, 133116614, 130226175, 126597659]
41432A26597659l873438m567408n319455n792743n195896l106092j648400l383194
41424I3711033o658961p213021m684863k921107l472280l786910k339054l13183
41416F2321654K227065O059412Q113190L670723n138184r636362n834225O55618
41408F2438891L341128K308244K58915k401792m929718m776571k673969l351404
41400E0213724p250746p893279k366736K129603j414220q735505j0904835p290244
41392F487762l811894j968420J335766N005874M263642Q9778o62832L580945N703445
41383B0024066Q46018n769031o312235r05559L941748M315724J756300j091017
41375A6806014l314737m444666l773655j821869l67901r4415L88765K268197M460202
$$ y = [126597659, 122724221, 118156813, 112837358, 107044615, 101848719, 98742627, 97094227, 93711033, 87052072, 79839051, 75154188, 72233081, 68760801, 64973891, 62634837, 62321654, 64548719, 70608131, 78721321, 82392044, 77253860, 67617498, 61783273, 62438891, 65780019, 68088263, 68347178, 65945386, 61015668, 56239097, 53565128, 50213724, 42962978, 35069699, 32702963, 34832566, 33418346, 24682841, 13778006, 6487762, 2675868, 707448, 2043214, 7049088, 11312730, 11402508, 10739676, 14320621, 20024066, 20870084, 15101053, 8788818, 7883259, 11825007, 16140731, 17897031, 16806014, 13491277, 9046611, 5272956, 3451087, 3083186, 2988771, 3377536, 5645733, 10105935]
41366A0105935N104449M286829L481474K667487N83714j544887J47097O110071
41358C0942169J0050575N842575l666734r526777q090553m483763l875616m694887
41350A2496989l075636N08851K643647J866271j132484n505079r254663q860054
41342a0312158l511569K192144L215589J99902k463367k793206j853401J82932
41334a5143134M275551R029685J0704134P429603J159656m638131p272105n352312
41326A92947M01212O627018R475313P725984L095797j731001m423455l789805
41318A7574010q61576J809296K995376L355463K410496j918623q570032j1578169
41310E216241o992640P70063M083498K310690J850218O012306R904859P370900
$$ y = [10105935, 15210384, 19497213, 22978687, 25646174, 26229888, 24685001, 24832098, 30942169, 40992744, 46835319, 43168585, 33641808, 25551255, 21067492, 17191876, 12496989, 9421353, 9930204, 12573851, 14440122, 13307638, 7802559, -1452104, -10312158, -13823727, -11631583, -8415994, -8216092, -10679459, -13472665, -15326066, -15143134, -10867583, -1837898, 8866236, 16295839, 17455495, 12817364, 5545259, 192947, 594159, 7221177, 16696490, 24422474, 27518271, 25787270, 21363815, 17574010, 16712434, 18521730, 21517106, 24872569, 27283065, 25364442, 16794410, 5216241, -1776399, -1006336, 3077162, 5387852, 7238070, 13250376, 23155235, 30526135]
41302C0526135l81637n816950l634974L377637P139496K749198o005607j0511527
41294A7441771o705195J149791O282045O250692K943692q66706k765213j609359
41286B2121518J67269j806346p200547r594280n109508J583085M211602L497092
41278G869885L141251J680473l872090r364769p705747p46240K304340j131978
41270g824875l717695p09715L131910K406620j016577k846478k261279P15385
41262a2122704O782636J2300192R885798q61001r935140r723595m648634k066755
41254a0389203p52624L536188P437610M953209j140081l237555j692325l055675
41246d340456o817519n234575K506283O990419L044807j950481N61610Q045134
$$ y = [30526135, 30144498, 24327548, 20692574, 24070211, 31209707, 33958905, 27953298, 17441771, 10736576, 11886367, 18168412, 24419104, 27362796, 26496090, 23730877, 22121518, 22288787, 20482441, 13281894, 3687614, -1421894, 161191, 4372793, 7869885, 11011136, 12691609, 8819519, -545250, -8250997, -8997237, -6692897, -7824875, -11542570, -12252285, -9120375, -6713755, -7730332, -10576810, -12838089, -12122704, -5340068, 6960124, 16845922, 15984921, 6049781, -3673814, -8322448, -10389203, -11141827, -7605639, -168029, 4785180, 3645099, 407544, -1284781, -4340456, -11157975, -16392550, -13886267, -6895848, -3851041, -5801522, -5239912, 2805222]
41238B805222J1834148Q894940K934134k190049m855727m363438j781402k0739
41230A3257089J03503J152912L695638L682771q87601m898088l143703R77460
41222A3939981M07101m111978n087612m95656K987326R91090j642345P28937M892190
41213A2609034L536329l374214q220301o182570q54192J557736k98393l002924
41205d229495l303762j032640J536548J875870l61498k390872r24710L632158
41197e198401P045761O200790K662884N8439m87980l80024l48594N4218J33806
41188I740899j782009n017106n902902k198774L376875N967749M236023J425221
41180I845976Q72715K062251J836624j283880n006732n745851k747406R86859
$$ y = [2805222, 14639370, 23534310, 26468444, 24278395, 19422668, 15059230, 13277828, 13257089, 13360592, 14513504, 18209142, 21891913, 21004312, 16106224, 12962521, 13939981, 14347082, 10235104, 5147492, 4651836, 7639162, 8630252, 6987907, 7716844, 12609034, 16145363, 12771149, 4550848, -1631722, -2485914, -928178, -1226571, -4229495, -7533257, -8565897, -7029349, -5153479, -5514977, -7905849, -8830559, -5198401, 1847360, 8048150, 10711034, 10769473, 10281493, 9901469, 9552875, 9607093, 9740899, 7958890, 2941784, -2961118, -5159892, -1783017, 4184732, 8420755, 9845976, 10718691, 12780942, 14617566, 13333686, 8326954, 2581103, -166303, 820556]
41172H20556K108094M88801j259393j069182Q47381K826158K778927r59872p508886
41163i27416j2180058j0217097k914481K661188J958155j413700r27819L958477
41155b0002751P732850O759070L212984N81323q69576k236443k711608j154109
41147h688260P97053M31743j647256j884498Q78041L015177P01976m742665q127190
41138a9265879o375055j351786L151004N235889N116899L473628J153780n47609
41130i409129r66078r31877j220803q22138J545265M717915O027507M905181L266188
41121G112031J994446l65594m345059p414316o868886l138736J322474M673149
41113g030491N630022L048101j900648m978097l455728k28742k2481k425815k668305
$$ y = [820556, 2928650, 3417451, 2158058, 1088876, 1936257, 4762415, 7541342, 6581470, -927416, -13107474, -23324571, -26239052, -23577864, -21619709, -23033409, -23961228, -20002751, -12269901, -5510831, -2297847, -1716524, -2586100, -4822543, -7534151, -8688260, -7891207, -7459464, -9106720, -10991218, -10113177, -7098000, -6396024, -11138689, -19265879, -25640934, -26992720, -23841716, -18605827, -13488928, -10015300, -8861520, -9409129, -10375207, -11307084, -12527887, -13350025, -11804760, -7086845, -1059338, 3845843, 7112031, 9106477, 8740883, 4395824, -3018492, -9887378, -13026114, -11703640, -7030491, -1400469, 1647632, -253016, -5231113, -8686841, -8915583, -8938064, -11363879, -14032184]
41104a4032184Q30202M154436M192636K847226K675844K324569o9128j913532
41096A010069N66897N228706N303944j187143p585494o775800m59757L250447
41088f48131M81014l968411l802250M24943L056981J790458K67998J511727K818289
41079A932618K49719m471895n959060l104295j78377N54950K122596O315526Q754577
41070F216359N019555j532082l622751k56023K633995J505636p42540j272501
41062G949648j969098m586029o139939l391946J518596M295981M597147M378846
41054F653206K765977j727014n416556k643861M753294P710919J978363n691798
41046H382530o810233k101351J055028j007490m993584o246493l692395M35882
$$ y = [-14032184, -13201982, -9047546, -4854910, -2007684, 668160, 2992729, 2923601, 1010069, 1576966, 6805672, 12109616, 10922473, 3336979, -3438821, -3898578, -648131, -167117, -4135528, -7937778, -7512835, -4455854, -2665396, -2397398, -885671, 1932618, 2182337, -2289558, -8248618, -11352913, -11531290, -10976340, -8853744, -2538218, 6216359, 11235914, 9703832, 6081081, 5825058, 8459053, 9964689, 9222149, 7949648, 5980550, 1394521, -4745418, -8137364, -6618768, -2322787, 2274360, 6653206, 9419183, 7692169, 2275613, -368248, 4385046, 12095965, 14074328, 8382530, 1572297, -529054, 525974, -481516, -5475100, -11721593, -15413988, -14978106]
41038a4978106L315434M203964N222452P900085Q917037L333291o548540j1083886
41030B81731n831834J272796J042468l692764l826980P73848J772085k981651
41022a1190301n934582k637131J907543L139276L912891O594832O697091J094468
41014C584087m351485l082570J375649P97602n135019r064827o371194J148130
41006b1099627R632390J5089969J3580659N697644j610947l392599l132444m642792
40998A0122253l569912L111973N209071q092132k5839947k3494056K525981K5700092
40990a4326677K3656200O434160k199482J011039P10419q013377j2467934n139551
40982a0335203L826350L382202j960891j429780M531220O137098j9778o380742
$$ y = [-14978106, -11662672, -7458708, -2236256, 5663829, 14580866, 17914157, 11365617, 281731, -5550103, -4277307, -3234839, -6927603, -10754583, -9980735, -8208650, -11190301, -17124883, -19762014, -17854471, -14715195, -10802304, -4207472, 2489619, 3584087, -767398, -3849968, -2474319, -1676717, -6811736, -15876563, -22247757, -21099627, -11467237, 3622732, 17203391, 22901035, 21290088, 17897489, 14765045, 10122253, 6552341, 9664314, 14873385, 6781253, -19058694, -42552750, -40026769, -14326677, 9329523, 15763683, 13564201, 14575240, 15285659, 7272282, -5195652, -10335203, -6508853, -3126651, -5087542, -6517322, -1986102, 4150996, 4131218, -2249524]
40974b249524n856334r66811J211507p50667j506993K649721P892838P682073
40966H105810J836090k865756j772902J601832J064524l562630o746046m747829
40958g086907O64085N295731O189436K723902k907154o509777n779361k994041
40950a0404086j586504j348616j03685J516285J349144P21783K858289O188653
40942h08737N080897j234034o122985m679110l32570J298745O92343J828282M491912
40933B14743M450476J1763n904315r546220q861493l489702M082717Q317114N568611
40924e156306q88234m202447k150752J380785K870279L097335L863515M556821
40916C370996L716195J458694j086926k841167k650660m12267J310230k90099
$$ y = [-2249524, -8105858, -9072669, -7861162, -8611829, -10118822, -7469101, 423737, 8105810, 9941900, 7076144, 5303242, 6905074, 7969598, 4406968, -2339078, -7086907, -6422822, -1127091, 5062345, 7786247, 4879093, -1630684, -7410045, -10404086, -11990590, -13339206, -13442891, -11926606, -10577462, -9855679, -6997390, -808737, 4272160, 3038126, -3084859, -7763969, -8096539, -6797794, -6105451, -4277169, 214743, 4665219, 4676982, -1227333, -10773553, -19635046, -23124748, -19042031, -10724917, -5156306, -6044540, -10246987, -12397739, -11016954, -8146675, -5049340, -1185825, 3370996, 7087191, 8545885, 7458959, 4617792, 1967132, 1554865, 2865095, 2574996]
40908B574996l584793l634357Q39630N229861N510226L041006M81062k776669
40900G680962p085304q303377k761535N529804Q544100M553465o28166k548261
40892D981688k503608k304093q22049J795742J956841j642751m390449k057775
40884d986454K515953L409355j51410l995948n615346n826303m724222q67188
40876b0241563M849897Q322908O631405J157320m214009o230440l844766J093190
40868a2476058M667186M329150J361963j533553l831143n996630o305039k578356
40860b2362480L362701O775531N819895L078289J188879L97003N71714J802009
40852F33541K378251Q0817l539292m002196k28651L746723M662910L652831K498042
$$ y = [2574996, -1009797, -4644154, -3804524, 1425337, 6935563, 9976569, 10457631, 7680962, 595658, -7707719, -10469254, -4939450, 3604650, 8158115, 7529949, 4981688, 2478080, 173987, -648062, 1147680, 3104521, 1461770, -2928679, -4986454, -2470501, 938854, 787444, -3208504, -8823850, -14650153, -19374375, -20241563, -15391666, -7068758, -437353, 719967, -3494042, -9724482, -13569248, -12476058, -7808872, -3479722, -2117759, -3651312, -7482455, -13479085, -19784124, -22362480, -18999779, -12224248, -6404353, -3326064, -2137185, -1740182, -1168468, 633541, 3011792, 3092609, -446683, -4448879, -4677530, -930807, 3732103, 7384934, 9882976]
40843I882976O54386j760157k312225m94079J93798k480175n569637n435614k837621
40834a0158348n25195P50552P02883k015319n973787n668528J230030Q837118
40826a2820594J0158988N893265J164400k521672n730170n313002J674688J0189179
40818B695082J1653382N726016m0061j904785l106066n025672m206965l45764
40810E445167J269976j211625k347283J284352M868654L288201r56310l145949
40802H495183m157650o810258q771658n644627J416936O736068P038969L218352
40794A521315k430117o688110n904777m96132L472028J559863k716552l311090
40786a4993572n14515J042102Q18030K331440N587315N919500J109854n345221
$$ y = [9882976, 10537362, 8777205, 6464980, 5970901, 6164699, 3684524, -1885113, -7320727, -10158348, -10683543, -9932991, -9230108, -11245427, -17219214, -22887742, -21657712, -12820594, -2661606, 3231659, 4396059, 1874387, -3855783, -9168785, -7494097, 2695082, 14348464, 20074480, 20034419, 18129634, 15023568, 9997896, 5790931, 5445167, 6715143, 5503518, 3156235, 4440587, 9309241, 12597442, 11641132, 8495183, 4337533, -2472725, -11244383, -16889010, -15472074, -8736006, -1697037, 1521315, -908802, -7596912, -13501689, -13997821, -10525793, -8965930, -11682482, -14993572, -15508087, -14465985, -13647955, -11316515, -5729200, 190300, 1300154, -4045067]
40778d045067r012750q595035m806660Q75154N690098P258610O375163N454509
40770h05978M549836K080669j034344j683480J072266N263383R173184J1675250
40762C0290786J0260416L289917n761849j0777210j0119621p253983m475014j047247
40754D406195K152065K096180n99979j086408J862059K770634k111369p997487
40746A491890p741450j556425L917716M009712m28796n845467q541547o074160
40738b0768527Q0475M344571K882858j327103k345413R51624M350763M748526
40730g082226L393551K607783K635350K577367K005993Q21184p05292j284488
40722D969222L00932L033196M117507K163146j162307l040190k388518q37819
$$ y = [-4045067, -13057817, -21652852, -26459512, -25584358, -19894260, -12635650, -6260487, -805978, 3743858, 5824527, 4790183, 3106703, 4178969, 9442352, 18615536, 30290786, 40551202, 43841119, 38079270, 27302060, 17182439, 9928456, 5453442, 4406195, 6558260, 8654440, 8054461, 6968053, 8830112, 11600746, 9489377, 1491890, -6249560, -7805985, -3888269, 121443, -307353, -6152820, -14694367, -20768527, -20688052, -16343481, -13460623, -14787726, -17133139, -16181515, -11830752, -7082226, -3688675, -1080892, 1554458, 4131825, 6137818, 6959002, 6253710, 4969222, 5270154, 8303350, 12420857, 14584003, 13421696, 10381506, 7992988, 7155169]
40714G155169j216051m443822p479922n709570J416038Q497674R670427M818968
40706A2708911j505465n805379p432706n974096j118171M344359N599874K011237
40698B828564j024356P18184L851756K039897m334918p971521m743722O27115
40690h009001J599001j089838j540609J974416M822600L282698q03254m173323
40682c937310o450918p614280n414114M57729M905765L424426n46773j24969M343411
40673a0957033N774300J680302k190734j502142L63685q88553l671575m981893
40665a6373643n822158o802449l967698M174463J0439880Q185161K964775M986909
40657b214760J1891448J0725112j568498j1500479p922662K461029N931091M26275
$$ y = [7155169, 5939118, 1495296, -5984626, -11694196, -10278158, -1780484, 7889943, 12708911, 11203446, 5398067, -2034639, -8008735, -9126906, -4782547, 817327, 2828564, 1804208, 2522392, 6374148, 8414045, 4079127, -3892394, -8636116, -8009001, -6410000, -7499838, -9040447, -7066031, -2243431, 1039267, 236013, -3937310, -10388228, -18002508, -23416622, -22958893, -18053128, -14628702, -15175475, -15300444, -10957033, -5182733, -3502431, -5693165, -7195307, -6831622, -7720175, -11391750, -16373643, -22195801, -28998250, -32965948, -28791485, -18351605, -10166444, -7201669, -2214760, 9676688, 20401800, 18833302, 7332823, -589839, 1871190, 7802281, 8228556]
40649H228556n491282o966754o236591m350552L63260N375461M682663j241541
40641e636780l977960Q13299O554582N645036N42520j261181O77800L48827l466466
40632B39677m714080n08105L235791R06682l552661k683776K425348L571269j458988
40623b538843m939403j076247M781522M034269k523324o549794m581157j582915
40615a4975892j825070k878273j161995J839586K669470J640641J488671K473463
40607a0729399K558644J240063J2099j83946O20587K568673M967176N278040K126424
40598H458361j557070j741047Q55001J805645j27403j426962l08611l05471m405653
40589A246790r028251q089118j510223M602449O039946M631343L385845J603137
$$ y = [8228556, 2737274, -4229480, -10466071, -14816623, -14453363, -9077902, -4395239, -5636780, -9614740, -8801441, -2246859, 3398177, 3940697, 2679516, 3357316, 3706143, 239677, -4474403, -4982508, -1746717, -840035, -4392696, -7076472, -4651124, -1079855, -2538843, -7478246, -8554493, -3772971, 261298, -2262026, -8811820, -13392977, -14975892, -16800962, -19679235, -20841230, -19001644, -16332174, -14691533, -13202862, -10729399, -8170755, -6930692, -6918593, -7102539, -6481952, -3913279, 1053897, 6331937, 8458361, 6901291, 5160244, 6015245, 7820890, 7693487, 6266525, 5957914, 5652443, 1246790, -7781461, -15870579, -17380802, -12778353, -6738407, -2107064, 1278781, 2881918]
40581B881918k286670n830293m907943n75304Q24888l879728r436500q413096
40573c1622728p71766O370072P784007N113425K567173J694668K034103L260531
40565c570515M032229J711007l530628o841098m670725m31448L11444j489023
40557a4478757k17574M464670O293941K504952j499587j075613K08415k534166
40549f333719o041767l555914L587287O868453L110421j173742Q7803M202918
40541G51740M878290J075781l291910n437439n549930m492544l097702k545453
40533a7709167k732736j576070J612498L825386K429248k27608p3733K054138
40525a2398044J610029j969384l694855m68878M348921O173690N226117M255222
$$ y = [2881918, 595248, -5235045, -10142988, -10718292, -9893404, -13773132, -23209632, -31622728, -32394494, -26024422, -18240415, -13126990, -10559817, -8865149, -6831046, -3570515, 461714, 2172721, -1357907, -8199005, -12869730, -13301178, -12989734, -14478757, -14696331, -10231661, -3937720, -1432768, -2932355, -4007968, -3799553, -6333719, -12375486, -15931400, -12344113, -5475660, -2365239, -3538981, -3451178, 751740, 5630030, 6705811, 3413901, -2023538, -7573468, -12066012, -15163714, -17709167, -20441903, -22017973, -20405475, -16580089, -14150841, -14378449, -14452182, -12398044, -10788015, -12757399, -16452254, -16921132, -12572211, -6398521, -1172404, 3082818]
40517C082818L378102J162588j115156p11088J644679K175558j20789j822679
40509G674033n98292Q80050j104444n563198p829986n556840j185442J628817
40501a1655302J948594J200017O15669N31236J369542L390168N185240M182949
40493F768113j47187m774321o379565n220256l617633j483191L088683Q323919
40485c441438Q438281J748892m715469l561736K347053L681011j559156n144441
40477b207003j582181L011897J87645p564686r786017k444116P386079J1402982
40469a595400Q611835K628044l720294p863963o243766J454060Q942487Q964052
40461A1177055J960306m527214n133281j816059Q77216J842698K401012K193987
$$ y = [3082818, 6460920, 7623508, 6508352, 5797264, 7441943, 9617501, 9496712, 7674033, 7075741, 7955791, 6851347, 1288149, -6541837, -12098677, -13284119, -11655302, -9706708, -8506691, -7891022, -7359786, -5990244, -2600076, 2585164, 6768113, 6620926, 1846605, -4532960, -9753216, -13370849, -14854040, -11765357, -3441438, 4996843, 6745735, 2030266, -1531470, 815583, 4496594, 2937438, -2207003, -3789184, -777287, -589642, -8154328, -17940345, -20384461, -12998382, -1595400, 7016435, 9644479, 5924185, -1939778, -8183544, -6729484, 2213003, 11177055, 13137361, 8610147, 3476866, 1660807, 2538023, 4380721, 6781733, 8975720]
40453H975720p4496k695556j785793K865921O050030L622661j522017l277990
40445A2158480r32822K98719k170516l916535n49964M569677M438144j380965
40437A2514218n932243m629790q96029j07405k082652k841993j054062J012543
40429d017413J640471J429192J411730K061589L771523N944667O135467K713606
40421B1090832j854213l127955l45603K531831J802781k262939o921453r509117
40413A404164q061938k512737L461051M727734P11381l322875k868835M14553
40405f047502K050286Q37908j309976l247211m692587m224832j231373J267880
40397a6597407L0816k792488k062801K367819N121114L627510J722364K821076
$$ y = [8975720, 8901224, 6205668, 4419875, 7285796, 13335826, 16958487, 15436470, 12158480, 11225658, 11524377, 9353861, 5437326, 4887362, 9457039, 13895183, 12514218, 6581975, 1952185, 1056156, 948751, -1133901, -3975894, -5029956, -4017413, -2376942, -947750, 463980, 2525569, 6297092, 12241759, 18377226, 21090832, 19236619, 16108664, 15763061, 18294892, 20097673, 17834734, 10913281, 1404164, -6657774, -9170511, -5709460, -981726, -270345, -3593220, -6462055, -6047502, -3997216, -3159308, -4469284, -7716495, -12409082, -16633914, -17865287, -16597407, -16566591, -19359079, -21421880, -19054061, -13932947, -10305437, -8583073, -5761997]
40389e761997M544541L425485O75978o78992q13951r73737L22653L931724N773423
40380A0445127J790600m597517o412481l585383k538563n114853n661186j330944
40372a7005200K406977R73359j204970J989035P689610Q021417K322895j922908
40364C270215q5121M065289M892487J902979j539124k799967j613226K33497j31271
40355H195758l733403p541515p637795m298244r03036J498534M315807O435785
40347c668109M627463O5281j442384J605280K987764j630332p044116o191836
40339a0690989j231838K21395k589941l122983Q34341L330788M54128k705791
40331a5500890J78556O761843R216737M904146j043140l077603j237969N70100
$$ y = [-5761997, -1217456, 2208029, 2884007, 2205015, 1391064, 417327, 739980, 4671704, 10445127, 12235727, 7638210, 1225729, -2359654, -4898217, -10013070, -15674256, -17005200, -14598223, -13624864, -14829834, -12840799, -5151189, 2870228, 5193123, 3270215, 3185094, 7250383, 12142870, 14045849, 12506725, 9706758, 8093532, 8327029, 8195758, 4462355, -3079160, -10716955, -15015199, -15918235, -14419701, -10103894, -3668109, 959354, 1024635, -417749, 1187531, 4175295, 2544963, -4499153, -10690989, -11922827, -11701432, -14291373, -17414356, -16580015, -13249227, -12795099, -15500890, -15322334, -8560491, 656246, 5560392, 4517252, 1439649, 201680, 771780]
40323G71780l88674l154768m312184j550684L370790N890728L754545j97463j700903
40314B483167m27082L66097r34347j861102M76872M882342O752149L187854l474596
40305A1451354p836051o972748k973062L87293K072991L229614L447075R11898
40297C718364l310401m875821k136659O57331p27034l992643l857555l00468J946141
40288a2878745J666113K897876O892540Q401184L841018j721350j320260L269930
40280A1048306M204388k39135l237509m88983K987731P98201n204734q339173
40272A529092o823572m293218k221837J824833P734418J0443215O619130k52952
40264A4559109m413295m469304k629141j67325K654835M178493L053333J411563
$$ y = [771780, 383106, -2771662, -7083846, -8634530, -5263740, 626988, 4381533, 4184070, 2483167, 2056085, 2422182, 1487835, -373267, 103605, 4985947, 11738096, 14925950, 11451354, 3615303, -3357445, -6330507, -5943214, -3870223, -640609, 2806466, 3718364, 407963, -4467858, -6604517, -5947186, -6674220, -10666863, -14524418, -14824886, -12878745, -11212632, -8314756, -1422216, 6978968, 10819986, 9098636, 7778376, 11048306, 15252694, 15013559, 11776050, 11287067, 14274798, 15072999, 9868265, 1529092, -5294480, -9587698, -11809535, -9984702, -2250284, 8192931, 14812061, 14559109, 10145814, 5676510, 3047369, 2880044, 5534879, 9713372, 12766705, 14178268]
40256A4178268K265029M135392K593008k479781n749009m144762j409442k134838
40248G253865m847567m943316k210739r39560l139942n736712n165088j628751
40240b1357810K354465N229169O712274O465455M257805J087332r56904k59423
40232C532363K812577N777841N774826J994279l691857q580162j0905674r756491
40224a3042298n005131J415171N676445N501922K789718J203308J938723L418915
40216C896773L939880K576933j089718n421594o352046k170496K460047J766809
40208c93412k446826k992069J289026L068722j672977o207646k943250M486772
40200g811660O374632J339577k378960L15387M731742M230009j140013o378522
$$ y = [14178268, 16443297, 20578689, 23171697, 20691916, 14942907, 10798145, 9388703, 7253865, 2406298, -2537018, -4747757, -5687317, -8827259, -14563971, -19729059, -21357810, -19003345, -13774176, -7061902, -596447, 3661358, 4748690, 3791786, 3532363, 6344940, 12122781, 17897607, 19891886, 16200029, 7619867, -3285807, -13042298, -18047429, -16632258, -10955813, -5453891, -2664173, -1460865, 477858, 3896773, 7836653, 10413586, 9323868, 3902274, -2449772, -4620268, -2160221, -393412, -2840238, -5832307, -4543281, -1474559, -3147536, -9355182, -12298432, -7811660, -1437028, -97451, -2476411, -2161024, 2570718, 6800727, 5660714, -717808]
40192g17808p631190m251793J645308N674660M485291L20930r66624K145094M819010
40183E522878L508718R40475M72796K30138k705234o169361o216718l516500r77544
40174h910352K121409P079104R224127K767466q008698j1383982m244671L047791
40166h307806J940685k353928p83612M513335M328287k120082n891819k352631
40158a1027571K645248K882787N02690P14403L420006M803718L634164J541037
40150I116482o80766l114464m518211l413010n76532J914691L174153L282790
40142E185133K180887O12103J18731N1501k670769p913169r673872l669094M968211
40133a0810338P448478L434382O35521K333478L093578p25242l947126j159836
$$ y = [-717808, -8348998, -12600791, -10955483, -5280823, -795532, -474602, -1441226, 703868, 5522878, 9031596, 9972071, 10444867, 10675005, 7969771, 1800410, -4416308, -7932808, -8910352, -6788943, 290161, 9514288, 12281754, 4273056, -7110926, -11355597, -8307806, -6367121, -8721049, -9504661, -4991326, -663039, -2783121, -8674940, -11027571, -8382323, -5499536, -4996846, -4282443, -862437, 3941281, 7575445, 9116482, 8435716, 5321252, 803041, -2609969, -3186501, -1271810, 1902343, 5185133, 7366020, 7978123, 8096854, 8148355, 5477586, -2435583, -12109455, -15778549, -10810338, -3361860, 72522, 708043, 3041521, 6135099, 5409857, 1462731, 302895]
40125C02895L804303L723168p15254k841161r26324N82767K03333J854396O602825
40116A2590948R188223O019233O44671k777073n998361j1265193j3938295p955913
40108a3491760L102724Q154769K900203m462606m431634K050802O776993N422169
40100F021660R59845k110945k499047j447208p56586j601436k836360j030817
40092e300894M860049R541268O324256l256577r280644n241045L827603Q360259
40084I834275O127073K537201J282336M84614j759588l633039l481414l090449
40076H301009m066219m133857o90150L833550M062478j069825o192640n402278
40068e357932J297825Q027899Q810219L401261k318829k579452J458237L051312
$$ y = [302895, 4107198, 7830366, 7115112, 4273951, 3347627, 3930394, 4133727, 5988123, 12590948, 21779171, 27798404, 28443075, 25666002, 19667641, 8402448, -5535847, -13491760, -10389036, -2234267, 665936, -3796670, -8228304, -6177502, 599491, 6021660, 6981505, 4870560, 2371513, 924305, 167719, -1433717, -4270077, -5300894, -440845, 9100423, 15424679, 12168102, 2887458, -2353587, 1474016, 9834275, 15961348, 18498549, 19780885, 20265499, 18505911, 14872872, 11391458, 8301009, 4234790, 100933, -589217, 3244333, 7306811, 6236986, 44346, -5357932, -4060107, 3967792, 12778011, 16179272, 13860443, 11280991, 12739228, 15790540]
40060A5790540r70443n341895l709690J537825J965116m338922q583502k795614
40052f446585Q462303J2868818N670934m717071p639261k734532J567781p5355
40044F957032l884743l454701J344763M738176K681233k992192p832675r283132
40036a1726239p262443k899701J729020M380295M826664N085131O267715O721026
40028G121468M814471K005246J011185J842490J649642j871160q125694j3744297
40020e296649j4145615p035823L741286J0058869Q035777K796296J375988K995954
40012B526083J349300m382764p031083j659869O899106J0012441N445119j684249
40004A1474084n963428o485710n529509n006317m482425k052830K584488O514409
$$ y = [15790540, 14820097, 9478202, 5768512, 7306337, 9271453, 4932531, -3650971, -6446585, 2015718, 14884536, 20555470, 15838399, 8199138, 5464606, 7032387, 6957032, 3072289, -382412, 962351, 5700527, 8381760, 5389568, -2443107, -11726239, -18988682, -21888383, -20159363, -15779068, -10952404, -5867273, 400442, 7121468, 11935939, 13941185, 14952370, 16794860, 18444502, 16573342, 8447648, -5296649, -19442264, -26478087, -22736801, -12677932, -4642155, -1845859, -469871, 2526083, 3875383, -507381, -7538464, -9198333, -2299227, 7713214, 13158333, 11474084, 5510656, -975054, -6504563, -11510880, -15993305, -18046135, -15461647, -8947238]
39996h947238O657894L803510J087275r59884m166751p370402n979229J185176
39988a4689649Q643698J0569452P161340K232970k060925m863837m333960o9839
39980B589250M134254M074246N79039k191903k640730k521560k908391k869809
39972a755604j712971L29055L161651O196106P575523O351360M183256K613219
39964B6941595N48722k791843m824028l287290r39160k093888n915769p844841
39956b06502o610375m873136l669458j574015Q48426J346399R76379K951372N753385
39947e057525L798446l086896p315493m056675J610682K479114n97863j551273
39939a3777483J240329L775153L289724J255647j41514o20654o42373k52989O49246
$$ y = [-8947238, -2289344, 1514166, 2601441, 1641557, -2525194, -9895596, -15874825, -14689649, -6045951, 4523501, 11684841, 13917811, 11856886, 6993049, 2659089, 2589250, 6723504, 10797750, 11376789, 9184886, 6544156, 4022596, 1114205, -1755604, -3468575, -3139520, 22131, 6218237, 13793760, 20145120, 24328376, 26941595, 27490317, 24698474, 19874446, 16587156, 15647996, 13554108, 7638339, -206502, -6816877, -11690013, -15359471, -16933486, -16085060, -14738661, -13762282, -10810910, -5057525, -1259079, -4345975, -11661468, -15718143, -14107461, -11628347, -12226210, -13777483, -12537154, -8762001, -5472277, -4216630, -4358144, -4978798, -5621171, -5874160, -5224914]
39930e224914K203729M078127M329206P97370m943054p592536m408128Q81776
39922i878424L159180K505842K255573K650640J102842j985852k634759M85510
39914b339448L298337J850247k181687l891883j438712K359117M004619K817027
39906D477617M07003j437989j417395J225920N372978P314508L944005k664908
39898A7221739o421882m437109n12724O98587R955O43203J744161K46095k462239
39889F729786k055485P69708O17079l215711m629043n47635L859088L523763P76183
39880E827733m35707j720083n631570q800135o608141j252807J838685K908714
39872a3873311N894311R523034Q330729K298936k101146j586210q5698j209805
$$ y = [-5224914, -3021185, 1056942, 5386148, 6183518, 1240464, -6352072, -10760200, -9878424, -6719244, -4213402, -1957829, 692811, 1795653, -190199, -2824958, -2339448, 958889, 2809136, 627449, -3264434, -4703146, -2344029, 1660590, 4477617, 4884620, 3446631, 2029236, 3255156, 8628134, 15942642, 19886647, 17221739, 10799857, 6362748, 5850024, 6548611, 6558566, 7201769, 8945930, 9192025, 6729786, 4674301, 5444009, 6061088, 2845377, -1783666, -2331301, 1527787, 5051550, 5827733, 5392026, 3671943, -1959627, -10759762, -17367903, -18620710, -16782025, -13873311, -7979000, 1544034, 9874763, 12173699, 10072553, 8486343, 8400645, 7190840]
39864G190840k681001j214563J595359J709898j556674m793070m477801o69973
39856d896985K715111J939209j467243j900544K222641N065228J665579m093489
39848A249507n185531j917270Q2953N6886K213565O247982O229606K57219o207539
39839C027378q435776p202518m112522P27464M698214L849062L34236R96315O000994
39830a17153P305493J870347k803148j336920P48489k166097n237674k349678
39822d086341J916943O6790m629034l850239P40390P76105k760299j58122R545380
39813b438427J4548869P573112l537421p862632n441035l067027k822309j827507
39805d874377O37573K236128K018179J170699M67022J08359P78910K282587K470575
$$ y = [7190840, 4509839, 3295276, 4890635, 6600533, 5043859, 250789, -4227012, -4896985, -2181874, -242665, -1709908, -3610452, -1387811, 3677417, 5342996, 1249507, -3936024, -5853294, -5770341, -5713455, -3499890, 2748092, 8977698, 9234917, 3027378, -5408398, -12610916, -16723438, -15995974, -11297760, -7448698, -7114462, -6118147, -117153, 7188340, 9058687, 6255539, 4918619, 5667108, 3501011, -1736663, -4086341, -2169398, -2102608, -6731642, -10581881, -9841491, -9065386, -11825685, -11983807, -2438427, 12110442, 19683554, 16146133, 8283501, 2842466, -224561, -3046870, -4874377, -4236804, -2000676, 17503, 1188202, 1655224, 1763583, 2542493, 4825080, 7295655]
39796G295655j62712l840025n288344l439093k03415J748376J436259M59265J187445
39787h06589L264738L334837P7267k614879r04828K461303J808810k241401l175522
39778A203736J228580N372636M571532J393932n8554q71336l712442o614039n768800
39769c254755k226927p07021k737387n215082n266279k874145J048384N694214
39761a5538998R023765Q259372K943410l748182p362492n568546R8503N181217
39753f711951N934999K928296K00302M07559K274557L382843L365510L111830
39745A4893945K834377K498609K424292K023892j67215l768719o031631n608389
39737I099161m310742l251069m83140M447238O860752K538369m924176p539943
$$ y = [7295655, 7132943, 3292918, -1995426, -5434519, -5637934, -3889558, -2453299, -1994034, -806589, 2458149, 5792986, 5870253, 3255374, 2350546, 4811849, 6620659, 4379258, 1203736, 2432316, 7804952, 12376484, 13770416, 13711862, 12840526, 9128084, 2514045, -3254755, -5481682, -6188703, -8926090, -14141172, -19407451, -22281596, -21233212, -15538998, -6515233, 1744139, 4687549, 939367, -6423125, -11991671, -11893168, -6711951, -776952, 2151344, 2351646, 2759205, 5033762, 8416605, 11782115, 14893945, 17728322, 20226931, 22651223, 24675115, 24507900, 20739181, 14707550, 9099161, 4788419, 1537350, 1054210, 5501448, 12362200, 14900569, 9976393, 2436450]
39729B436450l250314K050060L128008J256662P4932k0644o95827j817818j734908
39720A426601j01662J703950K373869J693510L44724p31485j366220k416771l940296
39711a013780l833463m02628M158984N745320L936406K245803K005556J55657
39703A2997855m571676p491004m346934J001685R58570m545759p124776j578939
39695a4700978O834052R705049N900920P51762k148100l472065m013204l242303
39687d384867k162293k774785l568197k41578O789329J0134315M668634m158915
39679D301643o241545L53945P396447P296875J396623l625530l913007j115993
39671E849458P20913o98211l675072m109277p78053J920943m52179m882487l760100
$$ y = [2436450, -813864, 1236196, 4364204, 5620866, 5695798, 5675154, 4979327, 3161509, 1426601, 1324939, 3028889, 5402758, 7096268, 7440992, 6709507, 5343287, 2926516, -1013780, -4847243, -5249871, -1090887, 4654433, 8590839, 10836642, 12842198, 12997855, 8426179, 935175, -3411759, -2410074, -1451504, -5997263, -13122039, -14700978, -7866926, 1838123, 7739043, 8490805, 6342705, 2870640, -1142564, -4384867, -6547160, -9321945, -12890142, -13131720, -6342391, 3791924, 8460558, 4301643, -1939902, -1585957, 5810490, 13107365, 14503988, 10878458, 6965451, 5849458, 6570371, 5872160, 2197088, -1912189, -2690242, -769299, -1221478, -6103965, -9864065]
39662i864065M015487J0190227Q036049J075406l174422l875476n566376q819981
39654g983151q945678m010402J801635M507167N299951O648561P098941L712147
39646H129171k001914m615387j943002J295779n61525n775714o572123o4257O166932
39637e942040L534699n102125q638058k957572M273906N916644M652763N393558
39629A131775N749596J498965l828782l774889o0451N75925j255620J238994P457703
39620H733216Q000523l07309q079913o868017m28305L062411K266986k30509m735199
39611A413884j0438306j0826588k370615O579144N414146l007432o455045j702955
39603b1393767K268617L15732j111996L506873Q474548O072751j000646m239682
$$ y = [-9864065, -5848578, 4341649, 12377698, 13453104, 10278682, 6403206, 836830, -7983151, -16928829, -20939231, -19137596, -14630429, -9330478, -2681917, 4417024, 8129171, 6127257, 1511870, -431132, 864647, 303122, -5472592, -12044715, -12108972, -5942040, -2407341, -7509466, -16147524, -19105096, -14831190, -8914546, -4261783, 1131775, 6881371, 8380336, 4551554, 776665, 716214, 1292139, 36519, 1275513, 8733216, 16733739, 16426430, 8346517, 1478500, 1050195, 4112606, 6379592, 6149083, 1413884, -9024422, -19851010, -22221625, -15642481, -10228335, -13235767, -19690812, -21393767, -19125150, -18809418, -19921414, -16414541, -7939993, -1867242, -2867888, -7107570]
39595g107570j914568O92268R99016J439217K881138K861342J162886Q69260J996572
39586C879561j47574o916858j1439183o747190L874491J0091164P392832J612785
39578A600028k64804J133671Q01109k372756m812031m152691j735372O29517K702204
39569f471125M030865L444640J506641N51352P69341q92395n755276r867478q431140
39560b1114575k300726K935617L688077J560364K22462J598949N125682Q447287
39552A63137Q491959L884256k976639p624712p922991n793095m252901l741947
39544a9772933k045859K411920P657640R223740M944030j817262n401192m170477
39536h970393j339235M29136J644497K173747m52350n547389o426265J370928
$$ y = [-7107570, -9022138, -8329870, -7330854, -5891637, -3010499, -149157, 1013729, 1882989, 3879561, 3731987, -3184871, -14624054, -21371244, -17496753, -7405589, -12757, 1600028, 1335224, 2468895, 3270004, 897248, -3914783, -8067474, -9802846, -9173329, -6471125, -2440260, 1004380, 2511021, 3062373, 3831714, 2939319, -2815957, -12683435, -21114575, -23415301, -20479684, -16791607, -15231243, -15008781, -13409832, -8284150, 163137, 8655096, 12539352, 9562713, 1938001, -5984990, -11778085, -16030986, -19772933, -21818792, -19406872, -11749232, -2525492, 2418538, 601276, -4799916, -8970393, -10309628, -9880492, -8235995, -6062248, -6514598, -12061987, -18488252, -17117324]
39528a7117324J1452232J2507478K496264q702383j1222240m762038M235697R597978
39520a514336Q386918K071625l267494k338410K202219K820102j296451k144151
39512D920022M410198J0776006Q264506k9065m505841l577304m260252r311277
39504F686993j2446055q347226o15911L819989L788237L548556N711936P741981
39496I888500N209847k725098j1120238j3173246p388362L68646L766071L272563
39488a1901317L596094N528967M932589r0031n601080o968062m296402j145853
39480a5945095l14315j940323l479533j184217N528852J1062722Q865998M17414
39472C011503n516871m251307q46637j414780l790820j966350L703256P058680
$$ y = [-17117324, -5665092, 6842386, 9338650, 636267, -10585973, -15348011, -11112314, -1514336, 6872582, 8944207, 5676713, 3338303, 5540522, 8360624, 7064173, 4920022, 9330220, 20106226, 28370732, 28341667, 23835826, 20258522, 15998270, 6686993, -5759062, -14106288, -14722199, -10902210, -7113973, -3565417, 2146519, 9888500, 15098347, 12373249, 1253011, -11920235, -19308597, -18939951, -15173880, -11901317, -8305223, -2776256, 2156333, 2066302, -3534778, -10502840, -14799242, -15945095, -16259410, -18199733, -21679266, -22863483, -17334631, -6271909, 2594089, 3011503, -2505368, -6756675, -7603312, -9018092, -12808912, -14775262, -11072006, -4013326]
39464d013326N668786L642202M220305M840606J864421l365728o100324m169897
39456B587045j18786K117944J240125p73876j458557q31338r00541k186243k359874
39447b684101L24352L685219M043509J451128j87740J276509K982590R92629m003989
39438G880106p009904m624473J025655M988026N029824L106019J740684J111405
39430A3247342O17738J043140K702473K909523j300583q136328j2105351j0501745
39422a1523791n623225k61273M843822Q025718O284415O79994k573871l74260
39414e22471K130697m66109m634608l087555L478955P166197M593853N66856n87259
39405H638556m33645j341813k186295j921966k314805l981233l929448k15011
$$ y = [-4013326, 1655460, 5297662, 9517967, 14358573, 16222994, 12857266, 6756942, 2587045, 2468259, 4586203, 5826328, 5052452, 3593895, 2762557, 1862016, -324227, -2684101, -2359749, 1325470, 5368979, 6820107, 6632367, 7908876, 10891466, 11884095, 7880106, 870202, -3754271, -2728616, 2259410, 7289234, 10395253, 12135937, 13247342, 13865080, 14908220, 17610693, 20520216, 19219633, 11083305, -1022046, -11523791, -17147016, -17408289, -12564467, -4538749, 1745666, 2425660, -148211, -522471, 1608226, 1142117, -3492491, -6580046, -3101091, 4065106, 8658959, 9225815, 8638556, 8204911, 6863098, 4676803, 2754837, 440032, -3541201, -7470649, -7685660]
39397g685660M313548N679532L379333o30127m465413o180136m473566j129965
39389a1192454O26383J055916K812500M455782J376529n080805o938476j528492
39381a4413117L769098L741152L776133Q675058J1510320M351455o344314p932962
39373G132823j373735J139321l024504l556895L434441P856315L090531k585857
39365A2112440n40853L684330R56679n259380n354445k85527O98467l956334o439594
39356d384217l240504O16143K011655M099631P581634P036168M70813n149549
39348I041774l547705J515256K592256j47134p14233K092392L017194n81960m151968
39339I115872k705783J971807L962581Q21200m372176p376702o385318j790925
$$ y = [-7685660, -3372112, 2307420, 5686753, 5056626, 591213, -5588923, -10062489, -11192454, -10566071, -9510155, -6697655, -2241873, -865344, -5946149, -12884625, -14413117, -10644019, -6902867, -3126734, 5548324, 17058644, 21410099, 15065785, 7132823, 5759088, 6898409, 3873905, 317010, 3751451, 11607766, 14698297, 12112440, 11571587, 15255917, 16212596, 10953216, 5598771, 5313244, 6011711, 2055377, -4384217, -7624721, -7008578, -4996923, -897292, 6684342, 13720510, 14191323, 9041774, 5494069, 7009325, 9601581, 9454447, 8740214, 10832606, 13849800, 13267840, 9115872, 6410089, 8381896, 12344477, 13165677, 8793501, 1416799, -4968519, -6759444]
39331f759444M367467P959395N049784k978496q863547p155236j083376J709625
39323g753828o77667k784577l30632M372480O880892O041608K918357j444618
39315G222015m630963l520885M52251J108596l411323o049894q93902O323421
39307c400684N249980l787810r664760n579957L240795Q219117P045921K568581
39299C891183j912057l459154n07199M230913N794489L669485K201019L077331
39291A6986010K832092o0803j558889J027357L896208K688380j209925m552611
39283B0047819p580396j0540725r653856k814981M285239M510521n46889l176320
39275e469588n40613L390439N515080O316362N265957N07215n758627p620802
$$ y = [-6759444, -2391977, 5567418, 10617202, 7638706, -1224841, -8380077, -9463453, -7753828, -8431495, -11216072, -11546704, -7174224, -293332, 5748276, 8666633, 7222015, 2591052, -929833, -477582, 631014, -2780309, -8830203, -9724105, -3400684, 1849296, -1938514, -11603274, -17183231, -13942436, -5723319, 1322602, 3891183, 1979126, -1480028, -1987227, 2243686, 8038175, 11707660, 13908679, 16986010, 19818102, 19757299, 18198410, 19225767, 23121975, 25810355, 24600430, 20047819, 12467423, 1926698, -7727158, -10542139, -6256900, -1746379, -2293268, -5469588, -6010201, -2619762, 2895318, 9211680, 14477637, 14984852, 9226225, 1605423]
39267A605423l106761L111544O032713N170384K259363j284326l383689k215039
39259H189612L95696M74003k036739k923970o12430J234707j86695k781702m013587
39250b261105m981139p040254q196184o233218k512837K82123J596027J881252
39242b7465335J036563K53295K021883N698573O730571L382850L77580J968368
39234e995652N122970M402338N33622j391257j60856Q86862L22148k9110j11527
39225C579538k510272p237915j0183849q410691l755668J31286J757865J998161
39217b4631545K617269M961082Q051086Q341918L909288j811297l755971k206904
39209d525074j990873m448591m816425M84148P730830J0026353N453035j468397
$$ y = [1605423, -1501338, 1610206, 7642919, 12813303, 15072666, 13788340, 10404651, 8189612, 8585308, 9059311, 7022572, 4098602, 3486172, 4720879, 4534184, 1752482, -2261105, -7242244, -14282498, -22478682, -28711900, -31224737, -30942614, -29346587, -27465335, -26428772, -26175477, -24153594, -18455021, -11724450, -8341600, -7964020, -5995652, -872682, 3529656, 4063278, 2672021, 2511165, 3398027, 3720175, 3691065, 3579538, 1069266, -6168649, -16352498, -24763189, -28518857, -28387571, -26629706, -24631545, -22014276, -17053194, -9002108, -660190, 3249098, 1437801, -2318170, -4525074, -6515947, -10964538, -15780963, -15296815, -7565985, 2460368, 7913403, 6445006]
39201F445006n297320m530627j450125J091779K089185K047553J308044n2637
39193A650858j091618j009342j413604m339452p245208m679231K614805N873427
39185i639365M09315n981451l911333K941928L594817k658701n721091j464371
39177b2430252L035278L322973M414145Q874671R648644K287485n610865o091948
39169b549869l405650m971553p474209l571020L451111M539698O00138N3894K700914
39160a0626546J05874p459185q837992k94263P261282N337573N28263K116337
39152a1868657O672412M956699k299001n949782k597293K134198L503051K914255
39144b534118K629936J541904j645924m794171m248016N80870N340594M069448
$$ y = [6445006, 1147686, -3382941, -4833066, -3741287, -1652102, 395451, 1703495, 1650858, 559240, -450102, -1863706, -6203158, -13448366, -18127597, -15512792, -9639365, -9230050, -15211501, -19122834, -16180906, -12586089, -15244790, -20965881, -22430252, -19394974, -16072001, -11657856, -2783185, 6865459, 9152944, 3542079, -2549869, -5955519, -10927072, -18401281, -21972301, -18521190, -13981492, -13381354, -13327460, -10626546, -10520672, -17979857, -26817849, -27112112, -19850830, -14513257, -13984994, -11868657, -5196245, -239546, -2538547, -8488329, -11085622, -8951424, -5448373, -2534118, 95818, 1637722, -8202, -4802373, -9050389, -8469519, -3128925, 940523]
39136I40523m044382j1741118j0789792k336200M078406L003134n88747o3405
39128b1541581L305218M165746K081131Q92773J681251J906061K75538j973448
39120i207311l491784l039853O43576N678361O724696K183122j735021L21603
39112a922611L787822J262084m271699k976709N531893J0031117M476397l029336
$$ y = [940523, -3103859, -14844977, -25634769, -27970969, -23892563, -20889429, -21478176, -21541581, -18236363, -14070617, -11989486, -11096713, -9415462, -7509401, -7233863, -9207311, -12699095, -15738948, -15095372, -9417011, -2692315, -509193, -2244214, -1922611, 1865211, 3127295, -1144404, -4121113, 1410780, 11441897, 15918294, 12888958]
$$ [...]
##END NTUPLES=NMR SPECTRUM
##END=
