##TITLE=31Pdec_DE-140_2d
, 24 sc
 3.4.2026
##JCAMPDX= 6.0         $$ Bruker NMR JCAMP-DX V2.0
##DATA TYPE= NMR SPECTRUM
##DATA CLASS= NTUPLES
##ORIGIN= UXNMR, Bruker Analytische Messtechnik GmbH
##OWNER= root
$$ XWIN-NMR		Version 3.5
$$ Fri Apr  3 14:29:11 2026 Russian Standard Time (UT+4h)  she@DPX200
##.OBSERVE FREQUENCY= 81.013821
##.OBSERVE NUCLEUS= ^31P
##.ACQUISITION MODE= SIMULTANEOUS
##.ACQUISITION SCHEME= undefined
##.AVERAGES= 40
##.DIGITISER RES= 17
##SPECTROMETER/DATA SYSTEM= spect
##.PULSE SEQUENCE= zgpg30
##.SOLVENT NAME= MeOD
##.SHIFT REFERENCE= (INTERNAL, MeOD, 0, 197.392)
##AUDIT TRAIL= $$ (NUMBER, WHEN, WHO, WHERE, WHAT)
$$ ##TITLE= Audit trail, XWIN-NMR		Version 3.5
$$ ##JCAMPDX= 5.01
$$ ##ORIGIN= Bruker BioSpin GmbH
$$ ##OWNER= she
$$ F:/spectra/data/she/nmr/P31/2/pdata/1/auditp.txt
$$ ##AUDIT TRAIL=  $$ (NUMBER, WHEN, WHO, WHERE, WHAT)
(   1,<2026-04-03 14:27:43.73 +0400>,<she>,<DPX200>,
      <created by zg, POWCHK disabled, PULCHK disabled
       configuration hash MD5:
       00 E9 B6 7A A2 85 ED C7 34 08 36 98 17 FE 4E 26
       data hash MD5: 32K
       50 7C 62 67 42 36 23 6A 87 42 1A 22 B5 6F 39 0F>)
(   2,<2026-04-03 14:28:12.32 +0400>,<she>,<DPX200>,
      <Start of raw data processing
       efp BC_mod = 2 LB = 1.5 FT_mod = 6 PKNL = 1 PHC0 = 1361.787 PHC1 = 131.7007 SI = 64K 
       data hash MD5: 64K
       56 89 21 D1 93 5E 05 58 5E 46 4E 95 36 1B 4C 2E>)
(   3,<2026-04-03 14:28:33.09 +0400>,<she>,<DPX200>,
      <pk PHC0 = 7.503835 PHC1 = -14.8 
       data hash MD5: 64K
       E1 3E 0B 38 BF AE 0B 81 9F AD 65 B0 A4 F6 09 D7>)
(   4,<2026-04-03 14:28:47.82 +0400>,<she>,<DPX200>,
      <abs ABSG = 5 
       data hash MD5: 64K
       8B C7 33 31 DF 10 BC 43 AE D4 73 D6 7B 0D 78 1C>)
$$ ##END=
$$ 
$$ hash MD5
$$ 72 E0 5D B9 CF AF 6C 90 03 57 9A 12 5E 6C B4 53
##$RELAX= 
##$RELAX= 
##$RELAX= 
##$RELAX= 
##$RELAX= 
##$RELAX= 
##$RELAX= 
##$RELAX= 
$$ Bruker specific parameters
$$ --------------------------
##$DU= <F:/spectra>
##$EXPNO= 2
##$NAME= <P31>
##$PROCNO= 1
##$TYPE= <nmr>
##$USER= <she>
##$AMP= (0..31)
100 100 100 100 100 100 100 100 100 100 100 100 100 100 100 100 100 100 
100 100 100 100 100 100 100 100 100 100 100 100 100 100 
##$AQSEQ= 0
##$AQ_mod= 1
##$AUNM= <au_zg>
##$AUTOPOS= <>
##$BF1= 81.014009
##$BF2= 200.13
##$BF3= 200.13
##$BF4= 200.13
##$BF5= 200.13
##$BF6= 200.13
##$BF7= 200.13
##$BF8= 200.13
##$BYTORDA= 1
##$CFDGTYP= 0
##$CFRGTYP= 5
##$CHEMSTR= <none>
##$CNST= (0..31)
1 1 145 1 1 1 1 1 1 1 1 1 1 1 1 1 1 1 1 1 1 1 1 1 1 1 1 1 1 1 1 1 
##$CPDPRG= <waltz16>
##$CPDPRG1= <>
##$CPDPRG2= <waltz16>
##$CPDPRG3= <>
##$CPDPRG4= <mlev>
##$CPDPRG5= <mlev>
##$CPDPRG6= <mlev>
##$CPDPRG7= <mlev>
##$CPDPRG8= <mlev>
##$CPDPRGB= <>
##$CPDPRGT= <>
##$D= (0..31)
0 1 0 0 0 0 0 0 0 0.06 0 0.03 2e-05 3e-06 0 0 0.0002 0 0 0 0 0 0 0 0 0 
0 0 0 0 0 0 
##$DATE= 1775212063
##$DBL= (0..7)
120 120 120 11 120 120 24 19 
##$DBP= (0..7)
150 150 150 150 150 150 150 150 
##$DBP07= 0
##$DBPNAM0= <>
##$DBPNAM1= <>
##$DBPNAM2= <>
$$ [...]
##$SUBNAM3= <"">
##$SUBNAM4= <"">
##$SUBNAM5= <"">
##$SUBNAM6= <"">
##$SUBNAM7= <"">
##$SUBNAM8= <"">
##$SUBNAM9= <"">
##$SW= 400.765351723535
##$SWIBOX= (0..15)
0 1 3 0 0 0 0 0 0 0 0 0 0 0 0 0 
##$SW_h= 32467.5324675325
##$TD= 32768
##$TD0= 1
##$TE= 0
##$TE2= 300
##$TE3= 300
##$TEG= 300
##$TL= (0..7)
0 120 53 12 22 120 120 120 
##$TP= (0..7)
150 150 150 150 150 150 150 150 
##$TP07= 0
##$TPNAME0= <>
##$TPNAME1= <>
##$TPNAME2= <>
##$TPNAME3= <>
##$TPNAME4= <>
##$TPNAME5= <>
##$TPNAME6= <>
##$TPNAME7= <>
##$TPOAL= (0..7)
0.5 0.5 0.5 0.5 0.5 0.5 0.5 0.5 
##$TPOFFS= (0..7)
0 0 0 0 0 0 0 0 
##$TUNHIN= 0
##$TUNHOUT= 0
##$TUNXOUT= 0
##$USERA1= <user>
##$USERA2= <user>
##$USERA3= <user>
##$USERA4= <user>
##$USERA5= <user>
##$V9= 5
##$VALIST= <valist>
##$VCLIST= <CCCCCCCCCCCCCCC>
##$VD= 0
##$VDLIST= <DDDDDDDDDDDDDDD>
##$VPLIST= <PPPPPPPPPPPPPPP>
##$VTLIST= <TTTTTTTTTTTTTTT>
##$WBST= 1024
##$WBSW= 4
##$XGAIN= (0..3)
0 0 0 0 
##$XL= 0
##$YL= 0
##$YMAX_a= 33590
##$YMIN_a= -44105
##$ZGOPTNS= <>
##$ZL1= 120
##$ZL2= 120
##$ZL3= 120
##$ZL4= 120
##$ABSF1= 197.3918
##$ABSF2= -203.3724
##$ABSG= 5
##$ABSL= 3
##$ALPHA= 0
##$AQORDER= 0
##$ASSFAC= 0
##$ASSFACI= 0
##$ASSFACX= 0
##$ASSWID= 0
##$AUNMP= <proc_1d>
##$AZFE= 0.1
##$AZFW= 0.5
##$BCFW= 0
##$BC_mod= 2
##$BYTORDP= 0
##$COROFFS= 0
##$CY= -3
##$DATMOD= 1
##$DC= 0
##$DFILT= <>
##$DTYPP= 0
##$F1P= 0
##$F2P= 0
##$FCOR= 1
##$FTSIZE= 65536
##$FT_mod= 6
##$GAMMA= 0
##$GB= 0
##$INTBC= 1
##$INTSCL= 9.790993e-09
##$ISEN= 30
##$LB= 1.5
##$LEV0= 0
##$LPBIN= 0
##$MAXI= 10000
##$MC2= 0
##$MEAN= 0
##$ME_mod= 0
##$MI= 50
##$NCOEF= 0
##$NC_proc= -7
##$NLEV= 6
##$NOISF1= 182.463
##$NOISF2= 159.3651
##$NSP= 0
##$NTH_PI= 0
##$NZP= 0
##$OFFSET= 197.3918
##$PC= 4
##$PHC0= 1369.291
##$PHC1= 116.9007
##$PH_mod= 1
##$PKNL= yes
##$PPARMOD= 0
##$PSCAL= 0
##$PSIGN= 0
##$REVERSE= no
##$SF= 81.014063255964
##$SI= 65536
##$SIGF1= 159.3651
##$SIGF2= -187.1042
##$SINO= 113.3802
##$SIOLD= 16384
##$SREGLST= <1H.CDCl3>
##$SSB= 0
##$STSI= 65536
##$STSR= 0
##$SW_p= 32467.5324675325
##$SYMM= 0
##$S_DEV= 0
##$TDeff= 32768
##$TDoff= 0
##$TI= <>
##$TILT= no
##$TM1= 0
##$TM2= 0
##$TOPLEV= 0
##$USERP1= <user>
##$USERP2= <user>
##$USERP3= <user>
##$USERP4= <user>
##$USERP5= <user>
##$WDW= 1
##$XDIM= 65536
##$YMAX_p= 309778469
##$YMIN_p= -107602437
$$ End of Bruker specific parameters
$$ ---------------------------------
##NTUPLES= NMR SPECTRUM
##VAR_NAME=  FREQUENCY,     SPECTRUM/REAL,   SPECTRUM/IMAG
##SYMBOL=    X,             R,               I
##VAR_TYPE=  INDEPENDENT,   DEPENDENT,       DEPENDENT
##VAR_FORM=  AFFN,          ASDF,            ASDF
##VAR_DIM=   65536,         65536,           65536
##UNITS=     HZ,            ARBITRARY UNITS, ARBITRARY UNITS
##FACTOR=    0.49542278885378, 1,            1
##FIRST=     15991.5117654749, 0,            0
##LAST=      -16476.0207020576, 0,           0
##MIN=       -16476.0207020576, -107602437,  0
##MAX=       15991.5117654749, 309778469,    0
$$ Real data points
##PAGE= N=1
##DATA TABLE= (X++(R..R)), XYDATA
$$ [...]
45572H53043m2192n24715p68842m31356n1483k42770p09636p25277k08616L83736
45562b468108R02697J421662J573252R30858p0648n99938p37560j190784j730890
45553a969459j311111J1654Q03217M60409J40438O39840R31767P1444q75888m41390
45543a539079P96942J149115M34704j39321j88571l89474p81393o44414m9149
45534a350640J34313j39821j075O85779J051538P48872L26641k8672o48327j153477
45524c74869o66088M80075Q45735R2339n13332k42808J41476J83692O71071J800634
45514B417925K123989O81466j154647j469524m80444M4085n96340j360402j124328
45505i18220K7420J065032R92269j75355j155950p19365N81286R49104j34776
$$ plain form
45572 853043 810851 286136 -482706 -914062 -965545 -1208315 -1917951 -2643228 -2851844 -2468108
45562 -2468108 -1565411 -143749 1429503 2360361 2289713 1689775 952215 -238569 -1969459
45553 -1969459 -3280570 -3268916 -2465699 -2005290 -1864852 -1225012 -293245 -221801 -1097689 -1539079
45543 -1539079 -742137 406978 841682 702361 513790 124316 -657077 -1301491 -1350640
45534 -1350640 -1216327 -1356148 -1357223 -671444 380094 1128966 1455607 1426935 778608 -374869
45524 -374869 -1040957 -560882 284853 377192 -136140 -378948 -237472 -53780 617291 2417925
45514 2417925 4541914 5223380 4068733 2599209 2118765 2162850 1566510 206108 -918220
45505 -918220 -890800 174232 1166501 991146 -164804 -884169 -302883 646221 511445
45496E11445j195100j074456m92342m00887k66316O68275J607141J281163K5468
45487F64391p37932n55346j01201K55383O87526J009164P74347J35803l51070
45478A781065n51407o12814m56432j61429k24068o26428m70178N12600J090389
45469B81298M01714l85507J19839J042409N21529j182272k029432j364268n45283
45460c139973l94840j97082M15897O43673K06863J3828L81710K82306p26182j337048
45450c850848l77703J307400J972351J179696j341m16614J82878J061061J075628
45441B132508r8716j310556j312205n92791n62284j083198o25262Q76832J435537
45432a140135J48289j103901m76770J059538J489791Q91781P82606J261630R82393
$$ plain form
45496 511445 -683655 -1758111 -2250453 -2651340 -2917656 -2249381 -642240 638923 664391
45487 664391 -73541 -628887 -730088 -474705 212821 1221985 1996332 2132135 1781065
45478 1781065 1229658 616844 160412 -1017 -225085 -851513 -1321691 -809091 281298
45469 281298 683012 297505 417344 1459753 1981282 799010 -1230422 -2594690 -3139973
45460 -3139973 -3534813 -3731895 -3315998 -2672325 -2465462 -2451634 -2069924 -1787618 -2513800 -3850848
45450 -3850848 -4228551 -2921151 -948800 230896 229555 -187059 -4181 1056880 2132508
45441 2132508 2033792 723236 -588969 -1181760 -1744044 -2827242 -3452504 -2575672 -1140135
45432 -1140135 -991846 -2095747 -2572517 -1512979 -23188 868593 1651199 2912829 3895222
45423C895222l25988j278779r45505q471N02675M45728J80518j34302m62654o63726
45413A204718o03972k71614J31730R5543p22837j676126j523717j27388J102239
45404b391424J104113N27760L20201J00114p24163j274900m54753Q16524O94923
45395a281605n19568o20051R93136K260581J660183M13528K77679Q05108M15429
45386D404420q94250j636828j169446m38600m20862r42770j219901q27442K5108
45377c120571P24893P18850N8306n89213o76647l01585J83428O71810J094315
45368a236414J163198P95099M17280L38718J58933n87672j444936j401846k44242
45359b041882J063609J497054J038771M33406J64824n3739p58826j809278k216301
$$ plain form
45423 3895222 3569234 2290455 1344950 1336479 1839154 2284882 2465400 2331098 1868444 1204718
45413 1204718 600746 329132 460862 556405 -166432 -1842558 -3366275 -3493663 -2391424
45404 -2391424 -1287311 -759551 -439350 -339236 -1063399 -2338299 -2793052 -1976528 -1281605
45395 -1281605 -1801173 -2421224 -1428088 832493 2492676 2906204 3183883 3988991 4404420
45386 4404420 3510170 1873342 703896 265296 -155566 -1098336 -2318237 -3145679 -3120571
45377 -3120571 -2395678 -1676828 -1618522 -2207735 -2884382 -3185967 -3002539 -2330729 -1236414
45368 -1236414 -73216 721883 1139163 1477881 1636814 1049142 -395794 -1797640 -2041882
45359 -2041882 -978273 518781 1557552 1990958 2155782 2102043 1343217 -466061 -2682362
45350b682362j211285N85046J570958R43846l82809r39358l29752O86084J278078
45341d81554J150859M01968n56912j064299p75630j27356K02983J64486K04053
45332h81402M74562P28314Q15069O73019M5234j012040j512919m72530J425914
45323B83221K185789R49204q75760j527144j001579m37740k21943J22889N93126
45314G0063N36443j15774n13004r9158O17381Q69886N90359J59209k92748q25418
45304I97239j218415j072573l70627L81764O61375M50129J95766K84366O10804
45295I19828P37555M27972j58313p84212j320529j503501r59727J55597R27512
45286a557818O59332j05296j53007Q26910J815721J704584M73771r88250j799033
$$ plain form
45350 -2682362 -3893647 -3308601 -1737643 -793797 -1176606 -2115964 -2445716 -1759632 -481554
45341 -481554 669305 1071273 514361 -549938 -1325568 -1452924 -1249941 -1085455 -881402
45332 -881402 -406840 321474 1136543 1809562 1854796 842756 -670163 -1142693 283221
45323 283221 2469010 3418214 2542454 1015310 13731 -424009 -645952 -523063 70063
45314 70063 606506 490732 -22272 -121430 495951 1365837 1956196 2115405 1822657 997239
45304 997239 -221176 -1293749 -1664376 -1282612 -621237 -171108 24658 309024 919828
45295 919828 1657383 2085355 1927042 1142830 -177699 -1681200 -2640927 -2485330 -1557818
45286 -1557818 -898486 -1003782 -1156789 -329879 1485842 3190426 3664197 2675947 876914
45277H76914j651445q51956j3005M69526O70780P48747N66917R2031j50190L05968
45267A064287R46534P62549l54068j499262k056086k167196j801994n33749J248446
45258d390539K031696R61446q35825j585146r26038J60570Q84386J171926J097315
45249a430209P36674L72528J21410l37952j032123j214259m37520M59107M67326
45240b295018M855J67128P76170O49403k70407o34663J48220R20938N61617m35430
45230d07187r09057o12691p7886L44421N52900L98055k201j24693K21306M93040
45220a23993K44496j75854k87488k77865n04480o97510m06020J02928J74388j52312
45210b103710j28537N68635J257569J043858p6967j122286j135506k42249M86215
$$ plain form
45277 876914 -774531 -1626487 -1639492 -1169966 -499186 249561 816478 908509 758319 1064287
45267 1064287 2010821 2773370 2419302 920040 -1136046 -3303242 -5105236 -5638985 -4390539
45258 -4390539 -2358843 -1397397 -2233222 -3818368 -4744406 -4583836 -3699450 -2527524 -1430209
45249 -1430209 -693535 -321007 -199597 -537549 -1569672 -2783931 -3221451 -2762344 -2295018
45240 -2295018 -2290163 -2123035 -1346865 -697462 -967869 -1602532 -1454312 -533374 28243 -407187
45230 -407187 -1316244 -1928935 -2006821 -1662400 -1109500 -711445 -713646 -838339 -617033 -123993
45220 -123993 120503 -55351 -342839 -620704 -1125184 -1822694 -2228714 -2125786 -1951398 -2103710
45210 -2103710 -2232247 -1663612 -406043 637815 560848 -561438 -1696944 -1939193 -1452978
45201a452978L63640l9443K08873R68817J280066R08004O03637O44635K64372
45192C749623r01118j844967j538868m51716K58125M23884O37449Q11978K81670
45183A426060p43435j084566k56782P55949Q30631P7672n80212o13235j48868
45174c36786N39767J216918J518007J118761J53722p98026j227158j076301o25272
45165D83632j70463J20769J92278J01310R317L8761J37106J74096J03380j23460
45155A066726o43090j340165j575783q49866K53549N47488j05243m89466J67983
45146b967867J065888J202252Q54288O47793J79163r74396j725774q00429R17532
45137a601550J373738M53404m4305M54585N62918k65323o88106r9302J12650q36475
$$ plain form
45201 -1452978 -1089338 -1128781 -919908 48909 1328975 2236979 2840616 3485251 3749623
45192 3749623 2848505 1003538 -535330 -987046 -728921 -305037 332412 1144390 1426060
45183 1426060 682625 -401941 -658723 97226 927857 1005529 425317 -187918 -336786
45174 -336786 202981 1419899 2937906 4056667 4210389 3412363 2185205 1108904 483632
45165 483632 313169 433938 626216 727526 736843 775604 912710 1086806 1190186 1066726
45155 1066726 423636 -916529 -2492312 -3342178 -3088629 -2541141 -2646384 -3135850 -2967867
45146 -2967867 -1901979 -699727 154561 802354 981517 7121 -1718653 -2519082 -1601550
45137 -1601550 -227812 225592 181287 635872 1198790 933467 245361 146059 258709 -577766
45127e77766j546831r46669j86700k73923j2194J515045K476062J014187j201817
45118B59394j192382O92818J529646N49352j79352L08831M98682n20447j439957
45109E06585j081717n2293P77277J401907J586096O39951r58539j604689r50958
45100B63620m17014o82391o54741K66508R25592M45179l28187m84725l94122l56989
45090a417270K27173J188486J014881o50929j818586j063542J60857l9304r32201
45081c330435o71961N16941J018202O85854O28360P69126J6107j351068j688231
45072c407105n46316O12085N60278k76767q03205m79871N41257J538157J566748
45063f94739N57367k93784j33656J99677l95604j302651j185446k93070Q9901
$$ plain form
45127 -577766 -2124597 -3071266 -3257966 -3531889 -3544083 -2029038 447024 1461211 259394
45118 259394 -932988 -240170 1289476 1838828 1659476 1968307 2466989 1946542 506585
45109 506585 -575132 -627425 149852 1551759 3137855 3777806 2819267 1214578 263620
45100 263620 -153394 -835785 -1490526 -1224018 -298426 146753 -181434 -666159 -1060281 -1417270
45090 -1417270 -1190097 -1611 1013270 362341 -1456245 -2519787 -2358930 -2398234 -3330435
45081 -3330435 -4002396 -3485455 -2467253 -1781399 -1153039 -383913 -367806 -1718874 -3407105
45072 -3407105 -3953421 -3341336 -2781058 -3057825 -3861030 -4340901 -3799644 -2261487 -694739
45063 -694739 -137372 -431156 -564812 -365135 -760739 -2063390 -3248836 -3541906 -3452005
45054c452005M3417P60103J987493J957419K92457j062616o04270P12634J109350
45045A743982K48987j001056j868803j888540q56720O05784J311970R69524N21209
45036b13663N47792M19364l34922r94411q82695n71711p57322q18672J97283J683046
45026a725911J920100L78166j483466j908638o84057Q85897J440547Q52283J58417
45017a66662J80942M14510j91565j439719j816367n80750J042911J512010J008351
45008c6339Q08546J158607J055104P6474q20149p36678j27264j890m23226n57734
44998C95451j9862N49432L91945l67123r40305q49198l36618Q5965J49818j25875
44988a066370n50803p98962o16831j54986J56745J83580K15301L85152L99142
$$ plain form
45054 -3452005 -3408588 -2648485 -660992 1296427 1588884 526268 -78002 634632 1743982
45045 1743982 1992969 991913 -876890 -2765430 -3622150 -3016366 -1704396 -734872 -213663
45036 -213663 334129 753493 418571 -575840 -1458535 -2030246 -2787568 -3606240 -3408957 -1725911
45026 -1725911 194189 572355 -911111 -2819749 -3503806 -2617909 -1177362 -325079 -166662
45017 -166662 14280 428790 237225 -1202494 -3018861 -3599611 -2556700 -1044690 -36339
45008 -36339 772207 1930814 2985918 3062392 2242243 1505565 1378301 1376411 953185 395451
44998 395451 375589 925021 1316966 949843 9538 -839660 -1176278 -1090313 -940495 -1066370
44988 -1066370 -1617173 -2416135 -3032966 -3187952 -3031207 -2847627 -2632326 -2247174 -1848032
44979a848032J20922m8444J87393M21516J38826m32509o85890n78289n03782l92470
44969c620759K73265J468923K332332K098038R22047l67715j051200j009323o85036
44960C60572n48818n32417k59070J23021k6950o82086q54310r7279N65130J71073
44950a781134n37162l01022M62898K77086q48748j216815J6972J639104K136665
44941a52156J386320J83668p53207r37414l56642J48726k00634p68823l48214
44932a798376O84602P76441o9073n9642J254573J870478N40847j054728j009443
44923A135679j52958k83108j041547r16917j73703k11252p34662k18378J072918
44914a523928J156877l57596j465658q60486L22390O85256N72985Q05566R98615
$$ plain form
44979 -1848032 -1727110 -1775554 -1588161 -1166645 -1027819 -1460328 -2146218 -2724507 -3228289 -3620759
44969 -3620759 -3347494 -1878571 453761 2551799 3473846 3106131 2054931 1045608 360572
44960 360572 -188246 -720663 -979733 -856712 -883662 -1565748 -2420058 -2517337 -1952207 -1781134
44950 -1781134 -2318296 -2619318 -2156420 -1879334 -2728082 -3944897 -3927925 -2288821 -152156
44941 -152156 1234164 1417832 664625 -272789 -629431 -480705 -681339 -1450162 -1798376
44932 -1798376 -1113774 -337333 -406406 -466048 788525 2659003 3199850 2145122 1135679
44923 1135679 982721 699613 -341934 -1258851 -1432554 -1643806 -2378468 -2596846 -1523928
44914 -1523928 -367051 -724647 -2190305 -3050791 -2728401 -2043145 -1470160 -664594 334021
44905C34021M60528l29551l99629K30529P35860O72412K29233k71980n45978m18459
44895F96986j44828j98290m62899k56544N33358J060504O91799j38981p40273
44886A040832j109945j451837j397087n22787O99927J226642O24185n24622j288056
44877b702748j160564l76859K95185K95418o1404o154N21321P05486R8546o12187
44867c003960n40631K16871Q54074Q78863L58339m29563j009858p58067L82236
44858c051696J442731J343541J74284r72705j319075r74374l05280N44905J337765
44849a779904J559469R76089R7215k69171J28759P64344R54087N73874P3850j79810
44839B898802l64237q06998j321886j362092q25697j99360K27514O90162J172869
$$ plain form
44905 334021 794549 464998 65369 295898 1031758 1704170 1933403 1661423 1115445 696986
44895 696986 552158 353868 -109031 -365575 167783 1228287 1920086 1781105 1040832
44886 1040832 -69113 -1520950 -2918037 -3440824 -2740897 -1514255 -890070 -1414692 -2702748
44877 -2702748 -3863312 -4240171 -3944986 -3649568 -3710972 -3717126 -3195805 -2490319 -2391773 -3003960
44867 -3003960 -3544591 -3327720 -2473646 -1594783 -1236444 -1666007 -2675865 -3433932 -3051696
44858 -3051696 -1608965 -265424 -91140 -1063845 -2382920 -3357294 -3662574 -3117669 -1779904
44849 -1779904 -220435 755654 852869 583698 712457 1476801 2430888 3004762 3078612 2898802
44839 2898802 2534565 1727567 405681 -956411 -1782108 -1981468 -1753954 -1063792 109077
44830A09077R93514j51271j229869r23054N10677J396897Q25389k51082m91494
44821G88784R4619N47661M68045K43514P2869k80197p12916o44131J0063M09765
44811I98076j42660j183556j717297j528110j184011r17472l47487N26471Q94809
44802d601237K63862n53176l51066P77248J488189J023538K06871J69536P14053
44793h62182P23734m9957n45594J5391Q89803Q12889k19302r85442p38581k5712
44783i84953L50724L63716L16133R2952m30069p12263j18209J027669J695538
44774A601238J379638M54109n29273j176272j045395k984J181700J451067P62367
44765D076195k5566n21987j009207j268777n95777O35796R03884k22451j194951
$$ plain form
44830 109077 1102591 951320 -278549 -1201603 -690926 705971 1531360 1280278 788784
44821 788784 883403 1431064 1899109 2142623 2215492 1935295 1222379 578248 588311 998076
44811 998076 855416 -328140 -2045437 -3573547 -4757558 -5675030 -6022517 -5496046 -4601237
44802 -4601237 -4337375 -4890551 -5241617 -4464369 -2976180 -1952642 -1745771 -1576235 -862182
44793 -862182 -138448 -188405 -733999 -718608 171195 984084 764782 -220660 -959241 -984953
44783 -984953 -634229 -270513 45620 138572 -291497 -1003760 -1121969 -94300 1601238
44774 1601238 2980876 3434985 2905712 1729440 684045 681061 1862761 3313828 4076195
44765 4076195 4050629 3528642 2519435 1250658 654881 1290677 2194561 1972110 777159
44756G77159q34896j59114n11081j172649o15038Q09345J424595R35815N23210
44747A177346M76450j24846j220605j378094j78194Q57612N45043l41855o34525
44738h21668n26519p08493r33304n86988J61149P59077J109490J235044Q89877
44729E77665K24958j9451K79187J75478p61012j433733q16866L72065P42417J51953
44719e07339o00452j171923j499263j063917J96405R76796K52996p69785k04538
44710d391020J454212J925878P26646j27106N77202J496109J217135M59077M12040
44701C750173N54592j80822j267551j411174p46742m49392o23914l42893L85816
44692c31907M59074l18917p30770j70903L20509r9652m91552L73407J792837J882965
$$ plain form
44756 777159 -57737 -216851 -727932 -1900581 -2515619 -1706274 -281679 654136 1177346
44747 1177346 1653796 1528950 308345 -1069749 -1247943 -390331 154712 -187143 -821668
44738 -821668 -1348187 -2056680 -2989984 -3576972 -3415823 -2656746 -1547256 -312212 577665
44729 577665 802623 783172 1062359 1237837 476825 -956908 -1773774 -1401709 -659292 -507339
44719 -507339 -1107791 -2279714 -3778977 -4842894 -4646489 -3669693 -3416697 -4186482 -4391020
44710 -4391020 -2936808 -1010930 -284284 -411390 165812 1661921 2879056 3338133 3750173
44701 3750173 4304765 4123943 2856392 1445218 698476 249084 -374830 -717723 -331907
44692 -331907 127167 -191750 -922520 -1093423 -772914 -872566 -1364118 -990711 802126 2685091
44682B685091K74856j338869j541774q70610n95150p64810m04268P45815J654336
44673a55383J316286L9010r14172p11997K72793J004221Q99452K91756j95996
44664A845970m79682q88013j348017j322152p56810l87140n48261l48025J037010
44655c195120K661154K657603Q30857q73294r34605j33361p6506q13941j056621
44646i33834k71886O17130N91782l03095j293087j709723j324441l44977O89696
44637d282435J235328J084998M11340l12796m29708L59507J350881J360474L01757
44628A079346m58513L9066Q68887N77589n83832j086709n27798j39079o82048
44619i13091j212196o09429O67565J226772O10669k39935k10114P55878J592378
$$ plain form
44682 2685091 2959947 1621078 79304 -791306 -1386456 -2151266 -2555534 -1809719 -155383
44673 -155383 1160903 1199913 285741 -426256 -153463 850758 1750210 2041966 1845970
44664 1845970 1366288 478275 -869742 -2191894 -2948704 -3335844 -3884105 -4232130 -3195120
44655 -3195120 -533966 2123637 2954494 2081200 1146595 1013234 936728 122787 -933834
44646 -933834 -1205720 -588590 3192 -299903 -1592990 -3302713 -4627154 -4972131 -4282435
44637 -4282435 -3047107 -1962109 -1550769 -1863565 -2293273 -1933766 -582885 777589 1079346
44628 1079346 620833 659899 1528786 2106375 1522543 435834 -91964 -231043 -913091
44619 -913091 -2125287 -2734716 -2067151 -840379 -229710 -469645 -679759 76119 1668497
44610A668497J171330m25539j817359j857391r90751m45599l67235J84023J355212
44601a524812J896684R67823n12953j104433o54422o9797J00320l887j95491l69702
44591a470670k39328L33761Q90423Q36104K26161l42737m43185r6370L49536L32751
44581C76446m65535j437846j425005k42713Q36066P21206r8625n37596m73090
44572b746692l14915J83963J319677K195493J661965K56840m03902j10455k02760
44563A839214j053030j310931l13001N93898K47678l86557Q1033J038987Q44620
44554A581911n16894j452631j150443m15654j17851j03199J39767P12371J404817
44545H2194J854200J603760O63578j56724j91360J10441J3735j26856M87084J354994
$$ plain form
44610 1668497 2839827 2414288 596929 -1260462 -2251213 -2696812 -3064047 -2880024 -1524812
44601 -1524812 371872 1339695 826742 -277691 -932113 -1001910 -901590 -905477 -1100968 -1470670
44591 -1470670 -1709998 -1376237 -485814 350290 576451 233714 -209471 -305841 43695 376446
44581 376446 -89089 -1526935 -2951940 -3194653 -2358587 -1637381 -1736006 -2273602 -2746692
44572 -2746692 -3061607 -2877644 -1557967 637526 2299491 2556331 2152429 2041974 1839214
44563 1839214 786184 -524747 -837748 -243850 3828 -382729 -301696 737291 1581911
44554 1581911 1065017 -387614 -1538057 -1953711 -2071562 -2174761 -2034994 -1322623 82194
44545 82194 1936394 3540154 4203732 4047008 3855648 3966089 3979824 3852968 4340052 5695046
44535E695046J036535o63098k261275k584871j853469n78555J031434K114163
44527A935910J375710q04845k124430j403719l40304p39697j520854n26820J775962
44518b373087K840106J855618O06091L90448L68760m12255j315430j397976r03882
44509c41607m79775p0080M89268P66613M85903J54520K21512M05371M45728N99065
44499B676518P71781K17284j111620j962686j484022n34848k62452l79911j02400
44490b172356J79521k72355p77536j05142J232344J429803K05574o39405N3743
44481h65809J124737R66319j70184p79405k43189O37219Q89988L57465m59468
44472A457673r95337j017133o86903k96581K7501K82290M24408M81288O38392
$$ plain form
44535 5695046 6731581 6068483 3807208 1222337 -631132 -1209687 -178253 1935910
44527 1935910 3311620 2506775 382345 -1021374 -1361678 -2101375 -3622229 -4149049 -2373087
44518 -2373087 467019 2322637 2928728 3319176 3687936 3275681 1960251 562275 -341607
44509 -341607 -821382 -891462 -402194 364419 850322 1004842 1226354 1631725 2077453 2676518
44499 2676518 3448299 3665583 2553963 591277 -892745 -1427593 -1690045 -2069956 -2172356
44490 -2172356 -1992835 -2265190 -3042726 -3147868 -1915524 -485721 -280147 -919552 -865809
44481 -865809 258928 1225247 1055063 275658 32469 669688 1559676 1917141 1457673
44472 1457673 462336 -554797 -1241700 -1538281 -1510780 -1228490 -804082 -322794 315598
44463C15598R24214J034165Q03776N63420O07378O50053L10639k29026o11059
44454D369158r04294j156831q96435J2366N43685k67879j618661j779102n13714
44445b211707P08330R09667N59155J90265l74183j000386r46640j96839K71541
44436b090797J61211L66050J104110J140603o2166r75294k18082J169415J315367
44427A910417L00614m56323p25613j315630j888060j150053O93838J741014J130683
44418B40887K28542L79942J011530Q80677j7882q13674j106709r64056l05501
44409d66244P08851J227684O56191k89717m43691J02803J50502p34150j502094
44400e89865j129939j8658P20370Q03580Q09809R33675O05711m54947j532444
$$ plain form
44463 315598 1239812 2273977 3077753 3641173 4248551 4898604 5209243 4980217 4369158
44454 4369158 3464864 2308033 1411598 1423964 1967649 1699770 81109 -1697993 -2211707
44445 -2211707 -1503377 -593710 -34555 155710 -218473 -1218859 -2165499 -2362338 -2090797
44436 -2090797 -1929586 -1563536 -459426 681177 619011 -356283 -574365 595050 1910417
44427 1910417 2211031 1754708 1029095 -286535 -2174595 -3324648 -2630810 -889796 240887
44418 240887 469429 849371 1860901 2741578 2723696 1910022 803313 -160743 -466244
44409 -466244 242607 1470291 2126482 1836765 1393074 1495877 1646379 912229 -589865
44400 -589865 -1719804 -1738462 -1018092 -214512 595297 1528972 2134683 1679736 147292
44391A47292j715565r85722p5175M32598M53035J98409R9508N77343J342136J316576
44381A790435j8610j575170j865744r70961k13400q6754J16486N79828M89479
44372a754411k26584k99450Q31118J788022J264043O9321j89489M93413R47023
44363B923006R01750J009711J197823O29657p22914j827361j993452j458786o28609
44354C0825K27653O32406L15623j29691l0289J45354m95983j551858j670514n89312
44344c115786N36753R38783J006137J072328Q25516K87470O4504J71201j62470
44335A624436j023150j364714o11222L90440O15545O3365p67385j516765j586055
44326d175505l59292J494540K139048Q70925p34595q78680K23177J073930R37046
$$ plain form
44391 147292 -1568273 -2553995 -2629170 -2196572 -1743537 -1545128 -1445620 -868277 473859 1790435
44381 1790435 1771825 196655 -1669089 -2640050 -2853450 -2940204 -2823718 -2243890 -1754411
44372 -1754411 -1980995 -2280445 -1449327 338695 1602738 1672059 1482570 1975983 2923006
44363 2923006 3824756 4834467 6032290 6661947 5939033 4111672 2118220 659434 30825
44354 30825 258478 890884 1206507 1076816 1046527 1191881 695898 -855960 -2526474 -3115786
44344 -3115786 -2579033 -1640250 -634113 438215 1263731 1551201 1615705 1786906 1624436
44335 1624436 601286 -763428 -1374650 -984210 -368665 -305300 -1072685 -2589450 -4175505
44326 -4175505 -4534797 -3040257 -901209 -30284 -764879 -1643559 -1420382 -346452 590594
44317E90594J75881n90054o93321L69205J924089K198567N39274j304834j403341
44308A806060l32916r6794r55419j167027J61554J703528J848066P21976l35177
44299C353851m70819M0401L34632j93364j247585j788854j193467j21494K44165
44290a042534l38736r89184q12961L09901J801556K697064K181388M71367j080045
44281C197816j373253p52490k26727m6875P0608j31712j055213k019805j771476
44272d109127k94536J056530J378308J051991O11644J3659o10247o74500j68680
44263a744958R2099j46884K0866J110695K049732J539743l5011j097400q91836
44254H97046p2500M76891N09887J58740l96253q54944r19344o17393j91778K85639
$$ plain form
44317 590594 766475 176421 -516900 -147695 1776394 3974961 4514235 3209401 1806060
44308 1806060 1473144 1376350 420931 -746096 -584542 1118986 2967052 3689028 3353851
44299 3353851 2883032 2923433 3258065 3064701 1817116 28262 -1165205 -1286699 -1042534
44290 -1042534 -1381270 -2370454 -3183415 -2873514 -1071958 1625106 3806494 4277861 3197816
44281 3197816 1824563 1072073 845346 798471 869079 737367 -317846 -2337651 -4109127
44272 -4109127 -4403663 -3347133 -1968825 -916834 -305190 -291531 -901778 -1576278 -1744958
44263 -1744958 -1652859 -1799743 -1778877 -668182 1381550 2921293 2886282 1788882 897046
44254 897046 824546 1301437 1811324 1970064 1573811 718867 -200477 -817870 -1009648 -724009
44244g24009Q34670J185328R11912J1176r62055j402140j105218k78168O26312
44235i02192J099307R04101L09653j93214m57045p52027j202405j413157r22322
44226c529301Q5199Q45646Q63266L96217m6103l39629n55181m97343l9264K89854
44216b526639j26770p99820m68528J011157K076412J434538j90699j151395r99520
44207a741264m78009J100N75580R53884O03426r4750j62511L98645N77727L9087
44197F72915m62504n71939q02738j104653n36269Q72093J489931M63943o49223
44188f28444o4087J523157K033514J003612k44773q76057j145581j001610k0689
44179E79042J103857Q51308q09722j955253j259265L08892J074754P14951r6076
$$ plain form
44244 -724009 110661 1295989 2207901 2219077 1257022 -145118 -1250336 -1528504 -902192
44235 -902192 197115 1101216 1410869 1217655 760610 8583 -1193822 -2606979 -3529301
44226 -3529301 -3444102 -2598456 -1735190 -1338973 -1385076 -1724705 -2279886 -2777229 -2816493 -2526639
44216 -2526639 -2653409 -3453229 -3921757 -2910600 -834188 600350 409651 -741744 -1741264
44207 -1741264 -2219273 -2218173 -1642593 -688709 -85283 -180033 -342544 56101 633828 672915
44197 672915 210411 -361528 -1164266 -2268919 -2805188 -1933095 -443164 20779 -628444
44188 -628444 -692531 830626 2864140 3867752 3622979 2746922 1601341 599731 579042
44179 579042 1682899 2534207 1724485 -230768 -1490033 -1181141 -106387 608564 512488
44170E12488r04559j332028p68812N96371J292851M02449q19848n83178P15509
44161h88757J070976M655p04875J78984J507623J610024O89276J23644J97370
44152C788920r1836j197547k183905j925769m52927J098292J498526M25289j171986
44143b12943j811100r48719M54072J160894J062164Q19709O20952K06235j70706
44134A180558L7585N05187K99378m73872n81482K92928P58706j57652j326239
44125E35097j183949j10250L78167J42224L75617J235451J327908n4674j676116
44116I69475k009131j055178J32176Q21961Q64722L89714q8725P6887P32560Q97505
44106A731966K06315l87889k5102P16499P48761Q7471m61094p04760j018851j211175
$$ plain form
44170 512488 -392071 -1724099 -2492911 -1896540 -603689 -201240 -1021088 -1604266 -888757
44161 -888757 182219 186874 -518001 -339017 1168606 2778630 3467906 3591550 3788920
44152 3788920 3697084 2499537 315632 -1610137 -2063064 -964772 533754 959043 -212943
44143 -212943 -2024043 -2972762 -2518690 -1357796 -295632 524077 1145029 1351264 1180558
44134 1180558 1218143 1723330 2022708 1548836 967354 1260282 2018988 1861336 535097
44125 535097 -648852 -759102 -380935 -238711 136906 1372357 2700265 2645591 969475
44116 969475 -1039656 -2094834 -1962658 -1140697 -275975 113739 25014 101901 834461 1731966
44106 1731966 1938281 1550392 1525290 2241789 2990550 3078021 2616927 1912167 893316 -317859
44096c17859o81005K82164N44806k41579j058345r88726m09647j66758k80167
44087c317116j89122J80522L86127L50061N53746J229186J863048J766733Q87459
44078C710644j61377p33621o48616j88260J85358J53822j99022m44502l28528
44069A345898j98464n53975j117217r07958L75770J577836J364780k7752j132491
44060G26427j178887p68135n99345n45341k96886L6185M30551J162395J973368
44051I40332J940078Q73943m8489R1223N73658L05650m00462n95018m90107r29284
44041B261524j553154j238217j80957K65554r9267n0706P14104R27206J10269
44032A156356m06835J08519K93777q82022j910664r51297J037432J648429P33727
$$ plain form
44096 -317859 -998864 -716700 -171894 -413473 -1471818 -2460544 -2870191 -3036949 -3317116
44087 -3317116 -3506238 -3325716 -2939589 -2589528 -2035782 -806596 1056452 2823185 3710644
44078 3710644 3549267 2815646 2167030 1978770 2164128 2317950 2118928 1674426 1345898
44069 1345898 1147434 593459 -523758 -1431716 -1055946 521890 1886670 1858918 726427
44060 726427 -452460 -1220595 -1819940 -2365281 -2662167 -2625982 -2195431 -1033036 940332
44051 940332 2880410 3754353 3705864 3797087 4370745 4676395 4275933 3680915 3190808 2261524
44041 2261524 708370 -529847 -710804 -445250 -544517 -595223 118881 1046087 1156356
44032 1156356 749521 858040 1151817 269795 -1640869 -2592166 -1554734 93695 827422
44023H27422L55107J285187J961337J214788j39831j078455j784400k397236k090836
44014a846917o08813O42175L47691q55251j463342j153306n34853K90926J509222
44005c672468K485709K340503J403833Q28701Q78468P73374J51159n06406r32981
43996C749892j406868j861074j731035r48805j78298J50691K03324O5390l23971
43987b280754n09798P3248Q93380Q06371R217K0616J184203J835139Q94930l32983
43977B593569l24729J86564l22814j395620j416725m89280j93817p28897o37553
43968b729302M13437Q94959J20792m61412K18340R28752K05680j113004j137419
43959b659177K28172J387374J458811R91000N28775k3405n32680m32590K79595
$$ plain form
44023 827422 1182529 2467716 4429053 5643841 5504010 4425555 2641155 243919 -1846917
44014 -1846917 -2455730 -1813555 -1465864 -2321115 -3784457 -4937763 -5472616 -5181690 -3672468
44005 -3672468 -1186759 1153744 2557577 3386278 4264746 5038120 5189279 4682873 3749892
43996 3749892 2343024 481950 -1249085 -2197890 -2376188 -2225497 -2022173 -1956783 -2280754
43987 -2280754 -2790552 -2717304 -1823924 -1017553 -1008336 -987720 196483 2031622 2926552 2593569
43977 2593569 2268840 2455404 2132590 736970 -679755 -1169035 -1362852 -2091749 -2729302
43968 -2729302 -2315865 -1420906 -1300114 -1761526 -1543186 -614434 -408754 -1521758 -2659177
43959 -2659177 -2431005 -1043631 415180 1406180 1934955 1911550 1378870 946280 1225875
43950A225875P81938N00547k58713r66298j458435j615206j152248j90420M72437
43941b660523K27699m30392l98034O10419J587405J447579M19013k58627K6397
43932E70936N51072M63510J5880p2188O4385k44856q13385o99888K04719Q55999
43922H96184O52512K52338L01541L99864l065o04629q63738q06586n63123L3454
43912c05248P29521P42252J34095J40557J149068J653889N89537n92506j9769
43903D221396J473337J544671O5717p89521o7651P90106O26745J00796j35312
43894G830284o13275j410452j287592K63214J711742J556451L48199o05055j199908
43885F593608j792959j792242p19870K64633k54193j602008j827708n78077N50601
$$ plain form
43950 1225875 2007813 2508360 2249647 1283349 -175086 -1790292 -2942540 -3132960 -2660523
43941 -2660523 -2432824 -2863216 -3261250 -2650831 -1063426 384153 803166 544539 570936
43932 570936 1122008 1585518 1601398 1529210 1593595 1348739 535354 -164534 40185 896184
43922 896184 1548696 1801034 2102575 2502439 2499374 1894745 1031007 224421 -338702 -305248
43912 -305248 424273 1166525 1300620 1441177 2590245 4244134 4833671 4241165 4221396
43903 4221396 5694733 7239404 7305121 6515600 6447949 7238055 7864800 7965596 7830284
43894 7830284 7217009 5806557 4518965 4782179 6493921 8050372 8398571 7793516 6593608
43885 6593608 4800649 3008407 2288537 2553170 2298977 696969 -1130739 -1708816 -1158215
43876a158215N22520J07171K94340Q19885Q60743L07002k20582j50260M94941
43867A877545R95768M70734j014501k109020j627772j39101P03303K84019m42396
43858a001421n53405k65232j40575j24659O9383K73852J94499K9152J87171O02976
43848g28259Q07679N96289K38348K6096p2353k08982l24589k26162O9534L09235
43838D86836L82824M62546N82443M12647j54214n14769r5447O10429N79360j77424
43828B575231n59708r1609M02116L13904K95118R18383J323922M26282j185894
43819D417745j864678j074299K46939J210213J609359J227348n6220j320508j150619
43810C245280M26072J722798J642766J028226J048880J310747O81331o59550j303756
$$ plain form
43876 -1158215 -635695 -528524 -234184 585701 1446444 1753446 1532864 1382604 1877545
43867 1877545 2873313 3344047 2329546 220526 -1407246 -1546347 -843044 -559025 -1001421
43858 -1001421 -1554826 -1820058 -1960633 -2085292 -2015909 -1742057 -1547558 -1518406 -1331235 -728259
43848 -728259 79420 675709 914057 940153 867800 658818 334229 108067 177601 486836
43838 486836 869660 1332206 1914649 2327296 2173082 1658313 1562866 2173295 2752655 2575231
43828 2575231 2015523 1923914 2326030 2639934 2935052 3853435 5177357 5603639 4417745
43819 4417745 2553067 1478768 1725707 2935920 4545279 5772627 5716407 4395899 3245280
43810 3245280 3671352 5394150 7036916 8065142 9114022 10424769 11106100 10446550 9142794
43801I142794o92528K1419l89645j472633j685166n09392P88131P85312k88253
43792E700039j011820p21351r8433J66966J96154N0327p19368j802335j601850
43783A58329O12806K850204K460466k31317k160417j516917K49283Q99832K20665
43774C542934n41816p34329o32434n35653n39198o95538p05734k1942J160084
43765B96374J721353J093504J72368n092K37445m3705p95689j150660q26325l04370
43755C95203J61114P18453J180411J037472L14308k98841l10615P5325L58400
43746C631230K19177l20668q12691o33607K14396P70575J40191j294264k243194
43737c28855j973513q53240M12677J386478J701845J012353m52143j647010j500195
$$ plain form
43801 9142794 8450266 8471685 8082040 6609407 4924241 4414849 5202980 5988292 5700039
43792 5700039 4688219 3966868 3868435 4035401 4231555 4281882 3562514 1760179 158329
43783 158329 771135 3621339 6081805 5850488 3690071 2173154 2422437 3322269 3542934
43774 3542934 3001118 2266789 1634355 1098702 559504 -136034 -841768 -863710 296374
43765 296374 2017727 3111231 3283599 3278507 3515952 3472247 2676558 1525898 699573 395203
43755 395203 556317 1274770 2455181 3492653 3806961 3508120 3197505 3272830 3631230
43746 3631230 3850407 3529739 2717048 2083441 2297837 3068412 3208603 1914339 -328855
43737 -328855 -2302368 -3155608 -2742931 -1356453 345392 1357745 905602 -741408 -2241603
43728b241603k2810J505212J662774L49280j049292j232331m56969J14489K27356
43719a143894O54591J489802J673354P76085n7577R4590L56413m61632j749074
43710A632658j970872j000589o429N12430R02969R10492n7337j212252q92746
43701a181676P97391J690499N93137j030677j295141l07906O92481J240157J430625
43692B628890R54986k26339j039955n32332N62652P35422k15886j149497j263340
43683D54601p00748J98724J085255J233301J90311j182714j396753k29328R66206
43674F18855J037670L16031j36987J03462N41753M62146k78192r95842q66444
43665H02452m6290L62005j21179m91020K45599J371650J426984M44597j91272
$$ plain form
43728 -2241603 -2264413 -759201 903573 1252853 203561 -1028770 -1485739 -1371250 -1143894
43719 -1143894 -489303 1000499 2673853 3449938 3392361 3486951 3843364 3381732 1632658
43710 1632658 -338214 -1338803 -1345232 -832802 70167 980659 923322 -288930 -1181676
43701 -1181676 -384285 1306214 1899351 868674 -426467 -734373 -41892 1198265 2628890
43692 2628890 3583876 3357537 2317582 1785250 2347902 3083324 2867438 1717941 454601
43683 454601 -246147 -47423 1037832 2271133 2461444 1278730 -118023 -347351 618855
43674 618855 1656525 1972556 1835569 1939031 2480784 2942930 2664738 1668896 802452
43665 802452 756162 1118167 996988 505968 751567 2123217 3550201 3994798 3803526
43656C803526j069K1207o55535j127694o55564R3239K58968J45572L67514N53189
43646B803353M5779p27916p74313r4263L54118J33739j75633J5563N78097J031567
43636C190091J044474N20097l11600q89607q62057n63265n04614n50713j83382
43627H89424N15603Q25089L92837l38453q50041j097688j125459p15889J61996
43618a342581R41609R73534L34093k17424r5549M74873P22403J95401o75476j005021
43608C05862m87152K49853N21219M92717P48742J169507R38212k02378j342138
43599B394444j443614n80977K94182N54037L85933K10076J29683Q3746J39847
43590B167357L32591M20810J82204p2238K99589J327635K035750J450209j21131
$$ plain form
43656 3803526 3802457 3823664 3168129 2040435 1384871 1478110 1737078 1882650 2250164 2803353
43646 2803353 2849132 2121216 1346903 1252640 1606758 1740497 1564864 1580427 2158524 3190091
43636 3190091 4234565 4754662 4443062 3553455 2691398 2128133 1623519 1072806 889424
43627 889424 1405027 2230116 2622953 2284500 1434459 336771 -788688 -1504577 -1342581
43618 -1342581 -400972 572562 906655 689231 593682 1068555 1790958 1986359 1310883 305862
43608 305862 -181290 68563 589782 1082499 1831241 3000748 3938960 3736582 2394444
43599 2394444 950830 369853 664035 1218072 1604005 1814081 1943764 2027510 2167357
43590 2167357 2499948 2920758 3102962 3030724 3330313 4657948 6693698 8143907 8022776
43581H022776j326792j327541o17255j74416l39542p81464j040844p71971K1637
43572A664588O26667J56508j020925j190111M76151K308119K057112O593j361827
43563C722875p76717L94249N22379j07703l96471l22416m51348m94663J86844
43554B277029J095095J007770j64068j087643p72442K45945P66613L54125l86284
43545C336140o14906j42222L88408K68923l14597n11292j37481n5709p05453j044832
43535D66979O4235J920749K622473J499947k09380j142011j146416o65310N4641
43526C465907O42754M73376m52406j163432q88457l7625N23852O10712N01665
43517C676346J48026n64524j082946o26824O40847J647800J762401J456945J371638
$$ plain form
43581 8022776 6695984 5368443 4751188 4576772 4237230 3455766 2414922 1642951 1664588
43572 1664588 2291255 2447763 1426838 236727 712878 3020997 5078109 5084702 3722875
43563 3722875 2946158 3340407 3862786 3755083 3358612 3036196 2584848 2090185 2277029
43554 2277029 3372124 4379894 4215826 3128183 2355741 2601686 3368299 3722424 3336140
43545 3336140 2721234 2579012 2967420 3236343 2921746 2410454 2272973 2217264 1511811 466979
43535 466979 531214 2451963 5074436 6574383 6365003 5222992 4076576 3411266 3465907
43526 3465907 4108661 4582037 4129631 2966199 2077742 2040117 2563969 3174681 3676346
43517 3676346 3824372 3259848 2176902 1550078 2190925 3838725 5601126 7058071 8429709
43508H429709J326185P57589k33962r06533q88261n98930n18240n54375m71545
43499F341637m68887p57721q90853l06489N40568N10268n47222j365939r77520
43490B077842J4553N41004O24403Q94781J197372Q45312n2346o40511n79791k64207
43480D658412Q5111M95466N14454m10888j723917k074019j082748K31260R80012
43471A673143J268888J331880J044641O87566R41684J584094J411673J02904j069982
43462H976491j109875n88537k17911M41305J620587K073747Q24846q54990j082155
43453A0083508k55325l16039j502550j988806q88751M32028O51061L41761N84193
43444G141080J070200P74469k57637q95174m50063M82984P15608k15964j363627
$$ plain form
43508 8429709 9755894 10513483 10279521 9372988 8484727 7885797 7367557 6813182 6341637
43499 6341637 5872750 5115029 4224176 3917687 4458255 4968523 4421301 3055362 2077842
43490 2077842 2092395 2633399 3257802 4152583 5349955 6195267 6142921 5502410 4922619 4658412
43480 4658412 4743523 5238989 5753443 5342555 3618638 1544619 461871 693131 1673143
43471 1673143 2942031 4273911 5318552 6006118 6947802 8531896 9943569 10046473 8976491
43462 8976491 7866616 7278079 7060168 7501473 9122060 11195807 12020653 11165663 10083508
43453 10083508 9828183 9512144 8009594 6020788 5132037 5564065 6215126 6556887 7141080
43444 7141080 8211280 8985749 8728112 7832938 7382875 7865859 8581467 8365503 7001876
43435G001876j204608M69457J907096J405511m04763j399514q85513k27756l70353
43426F291433m12130N20766J474075J103196o6698l95364L04647N38616m69154
43417H889387j558162j340423j00988P77548O79754J81430j76839o29255j387179
43408E335273j779464r53224O94156J596017Q83155m11846n90409O22922J884850
43399G281430J962343R66449j64913p63120p86239n35457k89331o0738K97906
43390G908330O41674N01382j47893n27476j00843M35867R7406p76973r88889m15735
43380F626850j11720l38802o7833R63772J288666n6575j624153j386469L76822
43371E670558J653546J657454J454288J689916J479696J17036j505512k040947
$$ plain form
43435 7001876 5797268 6266725 8173821 9579332 9174569 7775055 6889542 6661786 6291433
43426 6291433 5879303 6400069 7874144 8977340 8910642 8515278 8819925 9358541 8889387
43417 8889387 7331225 5990802 5889814 6667362 7347116 7528546 7351707 6722452 5335273
43408 5335273 3555809 2602585 3296741 4892758 5775913 5364067 4773658 5396580 7281430
43399 7281430 9243773 10210222 10045309 9282189 8495950 7960493 7671162 7610424 7908330
43390 7908330 8550004 9051386 8903493 8376017 8275174 8711041 8808447 8031474 7042585 6626850
43380 6626850 6515130 6176328 6108495 7072267 8360933 8304358 6680205 5293736 5670558
43371 5670558 7324104 8981558 10435846 12125762 13605458 13722494 12216982 10176035
43363A0176035j357258k78593O40899J284935J446264R87721K79504k39198p34870
43354A2205439j511665k045509j374403M03379J844699J775103N69552n99266
43346A1267329j149830j132703n49697L92579P55869j71226j411037j095619R45834
43337G851499K682833K586402J565423J244784J520197J234116L84157n5052l3463
43328A8980896l49357q06152k77473J173785K007455J523963Q18699P70857P36821
43319B4579494J85762M0651J069036K234021K168466J314544J008820J189867
43311C3790661P27096l99323j000924p17919n42652j054245j531942j316077r26985
43302B7027690j179799j927196k288990j752460p13803j61166q03673k149185
$$ plain form
43363 10176035 8818777 8540184 9181083 10466018 11912282 12900003 13179507 12940309 12205439
43354 12205439 10693774 8648265 7273862 7677241 9521940 11297043 11866595 11267329
43346 11267329 10117499 8984796 8435099 8827678 9583547 9412321 8001284 6905665 7851499
43337 7851499 10534332 13120734 14686157 15930941 17451138 18685254 19069411 19014359 18980896
43328 18980896 18631539 17825387 17547914 18721699 20729154 22253117 23071816 23842673 24579494
43319 24579494 24765256 24805907 25874943 28108964 30277430 31591974 32600794 33790661
43311 33790661 34517757 34118434 33117510 32399591 31856939 30802694 29270752 27954675 27027690
43302 27027690 25847891 23920695 21631705 19879245 19165442 19004276 18200603 16051418
43294A6051418k660384j458032L23976P44175m17251j365717q02567L47468M41732
43285A1204818m63449q09780P7889R46937L79969j183286k036825j557021q99848
43276E659404j019963j095092L919J429350J239099m80457j297872L5086J569185
43267F042659J083219m91429o12858Q02304J289230k14733j703099j166068N64395
43258E593620J289712M92957n00936p24242n59261o62443r47762q80202k31708
43249B869735O76808J261082J147078N17983R648J53697Q47887J340531Q30074
43240I654523o86889k159533k423126j489840m70305r3141N2980N09845R87677
43231C882191R90312O23537N4826r76165k144937k008753N8178K141994J851940
$$ plain form
43294 16051418 13391034 11933002 12256978 13001153 12583902 11218185 10415618 10763086 11204818
43285 11204818 10741369 9931589 10009478 10956415 11336384 10153098 8116273 6559252 5659404
43276 5659404 4639441 3544349 3548268 4977618 6216717 5736260 4438388 4473474 6042659
43267 6042659 7125878 6634449 6021591 6823895 8113125 7898392 6195293 5029225 5593620
43258 5593620 6883332 7376289 6875353 6151111 5591850 4929407 3981645 3101443 2869735
43249 2869735 3546543 4807625 5954703 6472686 6482334 6636031 7483918 8824449 9654523
43240 9654523 8967634 6808101 4384975 2895135 2424830 2331689 2384669 2894514 3882191
43231 3882191 4872503 5496040 5550866 4574701 2429764 421011 479189 2621183 4473123
43222D473123k13566j084243L92538K069629J787833J45511j056456j383849j352620
43213C777900q05717N69965J871391J810221O73344O3967O72145J448907J209385
43204A1291508J38200p40074j029282j297175j949566k263900j154511J039293
43196D034493K368238J559867j99724q26991j30412L82105J40055J20179O77989
43187H125799P56509n9160n53128L1980O02976J59455m49957k13994M9383p97446
43177G652417j883359j567806k29177L13517k56940n16376R0982M92830J32489
43168D228577m1208O20794J243947Q71584k5205l64257o320K95012O4196l55732
43158F531388l00745L70884R17525M83405n85157q50134K44209J328995R97667
$$ plain form
43222 4473123 4259557 3175314 3567852 5637481 7425314 7570825 6514369 5130520 3777900
43213 3777900 2972183 3542148 5413539 7223760 7897104 7961071 8633216 10082123 11291508
43204 11291508 11429708 10689634 9660352 8363177 6413611 4149711 2995200 4034493
43196 4034493 6402731 7962598 7762874 6935883 6805471 7187576 7327631 7447810 8125799
43187 8125799 8882308 8823148 8270020 8302000 8904976 9064431 8614474 8400480 8449863 7652417
43177 7652417 5769058 4201252 3972075 4285592 4028652 3512276 3603258 4096088 4228577
43168 4228577 4187369 4808163 6052110 6923694 6898489 6534232 6527912 6822924 6887120 6531388
43158 6531388 6230643 6601527 7519052 8002457 7417300 6567166 6811375 8140370 9138037
43149I138037q4459l34639J25430k19328j548909k219166j311542Q0260P10652
43140D336336P77745Q85844Q00904K24156k71768j01807L09716K47054j84158
43131G024022m02347k45602R9011N23389Q54504Q44772O77871P97558R32308K19867
43121A1325353j252180k096419j484573l04012L41575O55123J099779R81922l69918
43112H896650j801070j528752J39029J091787N05207j75120J51163M41381m83968
43103G236307j519002o53935J729120K856906J274756j016077j216386N16367
43095I208056J541706O11133n84651k61836Q14374Q89137J51776J63581R14356
43086A3447632O83194r01927j793371m81362J666176K361714J457039N26579K43771
$$ plain form
43149 9138037 9053578 8718939 8844369 8625041 7076132 4856966 3545424 3625684 4336336
43140 4336336 5114081 5999925 6800829 7024985 6753217 6651410 6961126 7208180 7024022
43131 7024022 6621675 6376073 6475084 6998473 7852977 8697749 9375620 10173178 11105486 11325353
43121 11325353 10073173 7976754 6492181 6188169 6529744 7184867 8284646 9266568 8896650
43112 8896650 7095580 5566828 5705857 6797644 7302851 7127731 7278894 7720275 7236307
43103 7236307 5717305 5063370 6792490 9649396 10924152 9908075 8691689 9208056
43095 9208056 10749762 11360895 10776244 10514408 11328782 12217919 12369695 12533276 13447632
43086 13447632 14130826 13228899 11435528 10954166 12620342 14982056 16439095 16965674 17209445
43077A7209445j54425j092586j875270j813386j037843l3677P86672R85517M07216
43068A3381663l02816k34588N79692J137803P78286p3509o09772n57054k36254
43059A3863451j43288n71316j278005j522898q32190L09471R43331P25193P3137
43050A1566886o04610j173894j321671o50564N18151J120122N67978m50028q22782
43041H749588l42623K74531N00482O05933J053285J646920J654708P81585l06355
43032A4618054o96757k84642K72160N34538O56851P35426M95273l9473k38854
43023A6052576K18017O85533M97977J21797N26206J621297K161035J243090o80170
43014B2447358k289601k472121j104034P18918J453178O40463n99362j086028
$$ plain form
43077 17209445 17055020 15962434 14087164 12273778 11235935 11202258 11988930 12974447 13381663
43068 13381663 13078847 12844259 13423951 14561754 15340040 15266531 14656759 14099705 13863451
43059 13863451 13720163 13148847 11870842 10347944 9515754 9825225 10768556 11493749 11566886
43050 11566886 10962276 9788382 8466711 7816147 8334298 9454420 10022398 9572370 8749588
43041 8749588 8406965 8681496 9181978 9787911 10841196 12488116 14142824 14924409 14618054
43032 14618054 13921297 13636655 13908815 14443353 15100204 15835630 16330903 16291430 16052576
43023 16052576 16270593 16956126 17454103 17575900 18102106 19723403 21884438 23127528 22447358
43014 22447358 20157757 17685636 16581602 17300520 18753698 19394161 18794799 17708771
43006A7708771j021762j150570j199150m49546N96021P33830J48859K49367J189698
42997A6805518J430214M08270k82514M41312J092949k7658j771300j614944M89706
42988A6971553K021470J587034N49933M65702Q04749K89403q43080j213811k93407
42979B0339546J034839J631013J130166N5544o19865l17441L80761K48382r06410
42970B2976535j677505q28666R28253J849010J514360J132989J471557J741747
42962B9108280J113757K79098M55486J390726J596946N74522l66430J1326J085191
42953C5248902J326347N29403K9292P00773J758065J994125J441566J030126J004615
42944D5063214O50029l13366r37494k23533J362881K286662J840337J004684J115778
$$ plain form
43006 17708771 16687009 15536439 14337289 13887743 14483764 15217594 15366453 15615820 16805518
42997 16805518 18235732 18644002 18361488 18802800 19895749 19868091 18096791 16481847 16971553
42988 16971553 18993023 20580057 21129990 21595692 22400441 22689844 21846764 20632953 20339546
42979 20339546 21374385 23005398 24135564 24191108 23571243 23253802 23634563 23882945 22976535
42970 22976535 21299030 20470364 21398617 23247627 24761987 25894976 27366533 29108280
42962 29108280 30222037 30501135 30956621 32347347 33944293 34518815 34152385 34163711 35248902
42953 35248902 36575249 37104652 37133944 37834717 39592782 41586907 43028473 44058599 45063214
42944 45063214 45713243 45399877 44462383 44238850 45601731 47888393 49728730 50733414 51849192
42935E1849192K152124K929807K827690K565362K994792L796483M064102L798720
42927G6978272L857208M379254M336048L194826K128613K591969M221066N321210
42919A07008466N263622N097208N569394N924640N437582M972766N777937P416281
42911A52467896Q312254Q103245Q011890Q761761R543834R572122R385431R717125
42903B23875558J0080195R629682Q783796Q708363R449775R810112R086912P776056
42895B97200449O333166M402001J842853m36122j537680j904865k736516m379940
42887B98783346o117907p416175q526144r677097j0409713j0200926r377295q880918
42879B28177171r186066r831326j0086580r766889r198041q613832p931465p096539
$$ plain form
42935 51849192 54001316 56931123 59758813 62324175 65318967 69115450 73179552 76978272
42927 76978272 80835480 85214734 89550782 92745608 94874221 97466190 101687256 107008466
42919 107008466 112272088 117369296 122938690 128863330 134300912 139273678 145051615 152467896
42911 152467896 160780150 168883395 176895285 185657046 195200880 204773002 214158433 223875558
42903 223875558 233955753 243585435 252369231 261077594 270527369 280337481 289424393 297200449
42895 297200449 303533615 307935616 309778469 309342347 307804667 305899802 303163286 298783346
42887 298783346 292665439 285249264 276723120 267046023 256636310 246435384 237058089 228177171
42879 228177171 218991105 209159779 199073199 189306310 180108269 171494437 163562972 156466433
42871A56466433o316638n836042n712630n899974o247497o292155n480108l953340
42863A10728049k766783k823634l782693m498167m377855l786122l235615k798751
42855H2658429k363995j963772j753517j967776k723703l477642l114365j361331
42847F3932328K60038P782j694916k728258k191006j350726j280450j209668k15346
42838E3529778Q90575P87739k17924p83654o04191m16970l67518J07224Q60577
42829E3785636Q83810k32333j677418k402580k006895p82874L83796M71559m86152
42820D7936549j107791n17220J52836n53125j848099j632896K63684J800729J825854
42811D6320521J358854J250663P15988p16195j675887q75611Q10098J691905J603806
$$ plain form
42871 156466433 150149795 144313753 138601123 132701149 126453652 120161497 114681389 110728049
42863 110728049 107961266 105137632 101354939 96856772 92478917 88692795 85457180 82658429
42855 82658429 80294434 78330662 76577145 74609369 71885666 68408024 65293659 63932328
42847 63932328 64192366 64200148 62505232 59776974 57585968 56235242 54954792 53745124 53529778
42838 53529778 54420353 55208092 54990168 54206514 53602323 53185353 52817835 52925059 53785636
42829 53785636 54669446 54437113 52759695 50357115 48350220 47567346 47951142 48422701 47936549
42820 47936549 46828758 46311538 46464374 45911249 44063150 42430254 42693938 44494667 46320521
42811 46320521 47679375 48930038 49646026 48929831 47253944 46378333 47188431 48880336 50484142
42802E0484142J419464J199406M61281l31822k06416O45787J057436O83945L76273
42793E5789496O97571J116113Q69670r1365j142010j505797q62637J87748O08085
42784E5666874K35630K9979N42042R72098N36385j08712Q4832Q19205J049370
42775E9827703P39546O16066O20881J77759k43802M75182K064879K860844K173807
42766F9312865J192518J073019J511179J787228J932865K131091K054759J570975
42758H2566499J217079J338461J601785J868944K550381L511804L743274K881840
42750A01280067J977969J868015J902072J366337J027291J824041K971816L115396
42742A17333004K758650L569610N429792O274512N296790M338896N103146O605145
$$ plain form
42802 50484142 51903606 53103012 53564293 53232471 53026055 53671842 54729278 55413223 55789496
42793 55789496 56487067 57603180 58472850 58381485 57239475 55733678 54871041 55058789 55666874
42784 55666874 55902504 55932483 56474525 57446623 57983008 57874296 57959128 58778333 59827703
42775 59827703 60567249 61183315 61804196 61981955 61738153 62213335 64278214 67139058 69312865
42766 69312865 70505383 71578402 73089581 74876809 76809674 78940765 80995524 82566499
42758 82566499 83783578 85122039 86723824 88592768 91143149 94654953 98398227 101280067
42750 101280067 103258036 105126051 107028123 108394460 109421751 111245792 114217608 117333004
42742 117333004 120091654 123661264 129091056 135365568 140662358 145001254 150104400 156709545
42734A56709545O862650O022031O024526P507117Q756868Q122272O205750M953290
42726B11164049N351840O779740Q100113Q537877P756623O060045M623737M589138
42718B62963162N511680N528104L700946J428076N58235P26276m8204k301295
42710B78066980m329023m895188n105669o467780q332864q871180p958542p343674
42702B24763060p955536q666753q228729p119050o625440o987091p403843p383949
42694A64392669p148388o891734o478736n950718n695173n870183o034826n596407
42686A14726504m471759l204503k525670k750158l406196l536593k711212j749980
42678I0370433j946639l324596m207099l148619r61965R9996p65107j896907j574065
$$ plain form
42734 156709545 163572195 169594226 175618752 183125869 191882737 200005009 206210759 211164049
42726 211164049 216515889 223295629 231395742 239933619 247690242 253750287 258374024 262963162
42718 262963162 268474842 274002946 277703892 279131968 279690203 280416479 280368275 278066980
42710 278066980 273737957 268842769 263737100 257269320 248936456 240065276 232106734 224763060
42702 224763060 216807524 208140771 199912042 192792992 186167552 179180461 171776618 164392669
42694 164392669 157244281 150352547 143873811 137923093 132227920 126357737 120322911 114726504
42686 114726504 110254745 107050242 104524572 101774414 98368218 94831625 92120413 90370433
42678 90370433 88423794 85099198 80892099 77743480 76781515 76881511 76116404 74219497 72645432
42669G2645432l88543j11710q78295j080763n4347P78911Q0715j456178k339310
42660F7195912k395839k414395k454538k005786j447228j750470k664697k699826
42652D9363133j321746J57032M95922J65702K46162O66830N83143j47440r20656
42643D9288082j426391j771951j821835j322634n50899k3100L17532Q21829J183166
42634D4693799P12522l89399j008320o32422k2922K8199j72778J10021Q40261
42625D4158961J304006J064630L33436l46469m28524K96922J332312J780679J372469
42616E0868422Q14066P57849Q90486N46202j99802o53728l95574N20631J880594
42607E5029146L152026L411821K311159Q88302N01799J100640J533294J438224
$$ plain form
42669 72645432 72256889 72145179 71266884 70186121 70131774 70910685 70991400 69535222 67195912
42660 67195912 64800073 62385678 59931140 57925354 56478126 54727656 52062959 49363133
42652 49363133 48041387 48198419 48694341 48860043 49106205 49773035 50356178 50208738 49288082
42643 49288082 47861691 46089740 44267905 42945271 42394372 42371272 42688804 43510633 44693799
42634 44693799 45406321 45016922 44008602 43376180 43353258 43381457 43208679 43318700 44158961
42625 44158961 45462967 46527597 46861033 46514564 46086040 46382962 47715274 49495953 50868422
42616 50868422 51682488 52440337 53330823 53877025 53677223 53023495 52627921 53148552 55029146
42607 55029146 58181172 61592993 63904152 64792454 65294253 66394893 67928187 69366411
42599F9366411J590127K249548K566177K145015J878035K364146K660990J729686
42591H6550135K20102m36084m2182N38629R90475J517413J621038N90182q51147
42582I0698561j144006m02427n05777k052026l080953k025503k74631o5026j048454
42573H0099758j104363N0583M49413p75611j890206j279151J34365M93081k40984
42564G5936885o32922j37087L56565M5905r53120k183073l178817l304844k318371
42555F3631121j106178q18810j221615j047011j42400Q4791j101357k430431k468093
42546E3380017j684384j472964j954457k176664j975817k085357k519650k356988
42538C7153736j350892m49668l30081n55145o31790q09537j235610j298012n41985
$$ plain form
42599 69366411 70956538 73206086 75772263 77917278 79795313 82159459 84820449 86550135
42591 86550135 86770237 86334153 86291971 86830600 87821075 89338488 90959526 91549708 90698561
42582 90698561 89554555 89152128 88646351 86594325 83513372 81487869 81213238 81148212 80099758
42573 80099758 78995395 79045978 79495391 78719780 76829574 75550423 75684788 76177869 75936885
42564 75936885 75303963 75166876 75523441 75569346 74616226 72433153 69254336 65949492 63631121
42555 63631121 62524943 61706133 60484518 59437507 59295107 59379898 58278541 55848110 53380017
42546 53380017 51695633 50222669 48268212 46091548 44115731 42030374 39510724 37153736
42538 37153736 35802844 35353176 35023095 34467950 33836160 33026623 31791013 30493001 29951016
42529B9951016N07380J087457J071939N48465o25673k090864k642972j640665
42521B6166083j87893J18061p75895j574297j527320j077020p68353n61019l23374
42512A9488973j84090k07677k65432k70128j30794L40272J021275J318443R59939
42503B2070781N05383L96345R8192q51382j539754p64228Q95046J589960Q04451
42494B3204794n7069O9228N45705M73269J37395K08145N42618O55499O33978Q04488
42484B7218050J020008Q66035J66624r90196k195327k623526j806695n53798p2517
42475B1028658j31623N43295J848399K026152M97496q54586m27134P28683Q13981
42466B6073321R7132o4519J53297l92119j306249j045437L24847R34347m5779
$$ plain form
42529 29951016 30458396 31545853 32617792 33166257 32540584 30449720 27806748 26166083
42521 26166083 25978190 26096251 25320356 23746059 22218739 21141719 20373366 19812347 19488973
42512 19488973 19304883 19097206 18831774 18561646 18430852 18771124 19792399 21110842 22070781
42503 22070781 22576164 22972509 23070701 22219319 20679565 19915337 20810383 22400343 23204794
42494 23204794 23147725 23216953 23762658 24235927 24373322 24581467 25124085 25779584 26413562 27218050
42484 27218050 28238058 29104093 29270717 28280521 26085194 23461668 21654973 21101175 21028658
42475 21028658 20897035 21440330 23288729 25314881 25812377 24957791 24530657 25259340 26073321
42466 26073321 26170453 26105934 26259231 25867112 24560863 23515426 23840273 24774620 24728841
42457B4728841j238409j246557m14520K08316L24180J34833k92795p69049r02954
42448B0531886p23286o55499o65277k80114L50573L91820l77857j123046j137727
42439A6311473o34270r2532L04435L59497p7015m96452j61992O19427P31670J5552
42429A6879793m27169q8754J44943l12724o38318r4268O34461P07535N88258R60502
42419A8354259J209085M73867n65785o08272O3615K8770p83899q38731M71338
42410A7804247J636331J124347m77695j329099o84995M59508Q09686K08338m28817
42401A9121851l34403J51147M0050q58686j427996o05471J117825K201275J861668
42392B1267260O94982l96778j098867j362054r39973K86619J837033K814319K546464
$$ plain form
42457 24728841 23490432 22243875 21829355 22037671 22361851 22496684 22203889 21434840 20531886
42448 20531886 19808600 19153101 18487824 18207710 18558283 18950103 18572246 17449200 16311473
42439 16311473 15677203 15584671 15889106 16248603 16171588 15675136 15513144 16132571 16864241 16879793
42429 16879793 16452624 16363870 16508813 16196089 15557771 15463503 16097964 16805499 17393757 18354259
42419 18354259 19563344 20037211 19471426 18863154 18926769 18955539 18171640 17332909 17804247
42410 17804247 19440578 20564925 20087230 18758131 18073136 18532644 19342330 19550668 19121851
42401 19121851 18787448 18938595 18978645 18119959 16691963 16086492 17204317 19405592 21267260
42392 21267260 21962242 21565464 20466597 19104543 18164570 18451189 20288222 23102541 25649005
42383B5649005J153877l03216m89462R05059K613891L015642J841525K21490p88593
42374C3819218j093400j088925j090007j318610j745869j816401j046979p256
42366B4611771J72071m95153o71010K64563J082256N30998o29626p10573L47228
42357B4502525R68423L81632m25547m93723k58142m21442n63861J00131J228891
42348B5018887J671097J021143J335n95236o27643l51597j06233k27302o70123
42339B5134328p66797J8495J148953J537841J013171M68545M62604N78366M62700
42330C0058206N34054J070909J409710Q04899m81390j627720k256406k345510
42322B7166752j763132o85343Q4112P6809q3450K40416N33756J63971j34110O73082
$$ plain form
42383 25649005 26802882 26499666 26010204 26915263 29529154 32544796 34386321 34607811 33819218
42374 33819218 32725818 31636893 30546886 29228276 27482407 25666006 24619027 24611771
42366 24611771 24783842 24288689 23617679 23882242 24964498 25495496 24865870 24155297 24502525
42357 24502525 25470948 25852580 25427033 24933310 24675168 24253726 23689865 23789996 25018887
42348 25018887 26689984 27711127 27712462 27117226 26489583 26137986 26031753 25804451 25134328
42339 25134328 24367531 24386026 25534979 27072820 28085991 28554536 29017140 29595506 30058206
42330 30058206 30592260 31663169 33072879 33877778 33396388 31768668 29512262 27166752
42322 27166752 25403620 24718277 24802389 24879198 24795748 25036164 25569920 25733891 25599781 26272863
42312B6272863J857890J763757N45932P8801R04904J401413O61393N7617P19292
42303C4263862J403555O02636p57648p42896N11974J269186J118910J284635K145476
42294D1099690K513603J715949O87525M25147O81333P71403N87777K59517k78442
42285D8463502q59028r90728o27453l81581o69025j278057j951607k626210k908826
42276C6170987k217266p97849K45926L79193K97179O81312J107212Q66310K15347
42267C6948351j2635L09400M60362o8287q70465j016947K0044J712742K725164
42258D0207729K135451M73060q22680r76266m34901R1239M23702N99037N25622
42249D2221993L11175L00402M50466L06080p7913N0004R07630J530388J072320
$$ plain form
42312 26272863 28130753 29894510 30440442 30519243 31424147 32825560 33486953 33544570 34263862
42303 34263862 35667417 36270053 35512405 34769509 35281483 36550669 37669579 38954214 41099690
42294 41099690 43613293 45329242 46016767 46441914 47123247 47894650 48482427 48741944 48463502
42285 48463502 47604474 46613746 45986293 45604712 44935687 43657630 41706023 39079813 36170987
42276 36170987 33953721 33155872 33401798 33780991 34078170 34759482 35866694 36733004 36948351
42267 36948351 36935716 37245116 37705478 37637191 36766726 35749779 35769823 37482565 40207729
42258 40207729 42343180 42816240 41993560 41017294 40582393 40673632 41097334 41696371 42221993
42249 42221993 42533168 42833570 43284036 43590116 43512203 43562207 44469837 46000225 47072545
42240D7072545J52000O0903J003960J956854K102885J679608J405937J617414
42232E7052106K037592K109503J578479Q54159N57722O60197N53628J12312m254
42223F5511444N47436J130021J091994O83646L58451r8798r00670j407552j014415
42214F5901557l68413n27194j271588j531959j267059j465686k196344k186509
42206E5086805q84568L67064Q0424j355844k300939j936221r22544l65387p90773
42197D6978017j874768k633008k113484m10560J162630J316170P5779j430634
42189D1070142k233644k234647j888350j612443j513276j438428j234828r66249
42181B7948277p86454o60219m40888j67227K1894J75649L11648L7450r50896j982680
$$ plain form
42240 47072545 47224545 47285448 48289408 50246262 52349147 54028755 55434692 57052106
42232 57052106 59089698 61199201 62777680 63631839 64189561 64849758 65403386 65515698 65511444
42223 65511444 66058880 67188901 68280895 68964541 69322992 69224194 68323524 66915972 65901557
42214 65901557 65533144 65005950 63734362 62202403 60935344 59469658 57273314 55086805
42206 55086805 54202237 54569301 54649725 53293881 50992942 49056721 48134177 47768790 46978017
42197 46978017 45103249 42470241 40356757 39946197 41108827 42424997 42500776 41070142
42189 41070142 38836498 36601851 34713501 33101058 31587782 30149354 28914526 27948277
42181 27948277 27161823 26501604 26060716 25893489 25915383 26091032 26402680 26440130 25489234 23506554
42171B3506554j868779n47123N44354K60582p97151j264506q05492j26710K58334
42162A9160063L10559j59277j314105k492233k571449j379387r040N25040L33529
42153A2403700J29706K51883N18164O08246L05789l18861q24944q35013n78770
42144A1659900n60393p07124m78305J07586L35842k2783j70255N75928J735146
42135A2475542K326290K041408J199203Q7776r75893j435534j108332o14356m74296
42126A3521808k63767M68990R97975L46700r17559j259393n23629j64378q32023
42117A1374724j346103p84821n8086k55450p06144j57343J009570J361120O87390
42108A1124857O3767j03468m00686p23023j6348J766084K977039K411590R41767
$$ plain form
42171 23506554 21637775 21090652 21635006 21895588 21098437 19833931 19028439 18901729 19160063
42162 19160063 19470622 19311345 17997240 15505007 12933558 11554171 11545131 12070171 12403700
42153 12403700 12533406 12785289 13303453 13911699 14217488 13898627 13073683 12238670 11659900
42144 11659900 11099507 10392383 9914078 10021664 10357506 10334723 10164468 10740396 12475542
42135 12475542 14801832 16843240 18042443 18130219 17154326 15718792 14610460 13996104 13521808
42126 13521808 13258041 13727031 14725006 15071706 14154147 12894754 12371125 12206747 11374724
42117 11374724 10028621 9243800 9185714 8930264 8224120 8066777 9076347 10437467 11124857
42108 11124857 11188624 11085156 10684470 9961447 9945099 11711183 14688222 17099812 18041579
42099A8041579M1047l17513j088651k165408k346757j177104L28647J001891P69627
42090A3087358L56175L46219P98825J325580J292126L14279j148111j948888j355676
42081A3067887P1947J003517Q14418K78502N16389J434279J783796R46591n4851
42072A9862475o322O05140L20389p79313p65782J310885L587949L588325J468661
42063B9192407l46293m43294J86378K15614j3600O44812K206492L517368L808549
42054C8968433L436984L106092L011283K940241K781856K626887K529468K435696
42046F1836940K331266K217160J831265O53233j454383l673460m760952m343700
42038E4637369l342149k880577l111829l395737l266391k797586k274805j948065
$$ plain form
42099 18041579 18082626 17765113 16676462 14511054 12164297 10987193 11315840 12317731 13087358
42090 13087358 13443533 13789752 14588577 15914157 17206283 17520562 16372451 14423563 13067887
42081 13067887 13139834 14143351 14957769 15236271 15752660 17186939 18970735 19917326 19862475
42072 19862475 19856153 20461293 20781682 20002369 19236587 20547472 24135421 27723746 29192407
42063 29192407 28846114 28402820 28589198 28804812 28791212 29436024 31642516 35159884 38968433
42054 38968433 42405417 45511509 48522792 51463033 54244889 56871776 59401244 61836940
42046 61836940 64168206 66385366 68216631 68869864 67415481 63742021 58981069 54637369
42038 54637369 51295220 48414643 45302814 41907077 38640686 35843100 33568295 31620230
42030C1620230j919763j903030j358266k89166M33392P8249r50446j735871k056608
42021B1918721k151219j705138k88573J283889J407302j48670j733235j989105
42013A6593972j412513j093257j027060o43662j29855j12585n62999r62022j091380
42004I558639q90193j84233O05449L78924q59536j142646Q33478L035178K322164
41995A3657224q76666k703113j193347J129854J231769k42973p43909M5601L97630
41986A0702070j05059r8866P86725J116447J31395r00594o53108L82662Q83640
41977A2245312M99668j57772n62176o15288m85262n03269o97955l77792R62251
41968A0307717K320174K060538L92087n41173K88785J247552O47538o32025p41533
$$ plain form
42030 31620230 29700467 27797437 26439171 26150005 26583397 26661646 25711200 23975329 21918721
42021 21918721 19767502 18062364 17773791 19057680 20464982 20316312 18583077 16593972
42013 16593972 15181459 14088202 13061142 12417480 12287625 12175040 11612041 10650019 9558639
42004 9558639 8668446 8484213 9089662 9468586 8609050 7466404 8299882 11335060 13657224
41995 13657224 12780558 10077445 8884098 10013952 11245721 11002748 10258839 10304440 10702070
41986 10702070 10597011 10498145 11284870 12401317 12532712 11632118 10979010 11361672 12245312
41977 12245312 12744980 12587208 12025032 11409744 10924482 10421213 9723258 9345466 10307717
41968 10307717 12627891 14688429 15080516 14539343 14828128 16075680 16723218 16091193 15349660
41959A5349660J28166K86799o23767j379497j452689j545783j828027j541792
41951G393070o53166j35689j73416K32963J285784J679291O96964m80033n46869
41942I298899J52165O41688Q48077R76428N50627n87877j330891q03408Q223l42102
41932I411829j376812j360817j243J154158R81458M045p47541q41835k81762O18777
41922G560257J036636L52675q10403j213971o74144r6649Q1161K71693N36267
41913G043522L70115o6389J04450Q44538Q85968k72815j328558j016798Q1620
41904F645653N73425K14625k19032l61216m88023p18918q78770q88552o49877
41895C229315P5493J090702J575417J106710L24855p7823l77788j011062j436162
$$ plain form
41959 15349660 15477826 15764625 15140858 13761361 12308672 10762889 8934862 7393070
41951 7393070 6739904 6604215 6430799 6663762 7949546 9628837 10325801 9845768 9298899
41942 9298899 9451064 10092752 10940829 11917257 12467884 11880007 10549116 9745708 9753931 9411829
41932 9411829 8035017 6674200 6672957 7827115 8808573 8812618 8065077 7223242 6941480 7560257
41922 7560257 8596893 8949568 8139165 6925194 6251050 6154401 6235562 6507255 7043522
41913 7043522 7413637 7347248 7451698 8296236 9182204 8909389 7580831 6564033 6645653
41904 6645653 7219078 7433703 7214671 6853455 6365432 5646514 4767744 3879192 3229315
41895 3229315 3304808 4395510 5970927 7077637 7402492 7324669 6946881 5935819 4499657
41886D499657r01200J43012N93610L55341K20405K77922j86589j094802j248915
41877B658441p1652J428742K005845J583433P62155j69116r83264j064089j74731
41868E975764P73717O67664l15158j010103r18502o31707n50952j94697P47524
41859D543550J485186J058520j96734r74286p12090j53371j6481N6031O43940
41850E734265J262912Q49291n85145j664295j294618J4442Q91621P59854K67868
41841F236195K41396O56407P38822j05719j533530k426900j905402k21636J430717
41832C110350K004878J417416M00247k12415j05261K96562J98158p03460j731035
41823D675440j894090j014629J57282Q88439J056940Q15979K56389m10149q23883
$$ plain form
41886 4499657 3598457 3741469 4335079 4690420 4910825 5188747 5002158 3907356 2658441
41877 2658441 2586789 4015531 6021376 7604809 8366964 8197848 7214584 6150495 5975764
41868 5975764 6749481 7417145 7101987 6091884 5173382 4541675 3990723 3796026 4543550
41859 4543550 6028736 7087256 6890522 5916236 5204146 5050775 5034294 5090325 5734265
41850 5734265 6997177 7846468 7261323 5597028 4302410 4316852 5208473 5968327 6236195
41841 6236195 6477591 7133998 7872820 7767101 6233571 3806671 1901269 1679633 3110350
41832 3110350 5115228 6532644 6932891 6720476 6615215 6911777 7109935 6406475 4675440
41823 4675440 2781350 1766721 1924003 2812442 3869382 4685361 4941750 4531601 3707718
41814C707718q54364o35378j82807M92358Q76162L32250p86260j241729n45658
41805A162292L35852M71557L08328O96260J294658J050992q3308r96984r18375
41796C321272j84538N05680Q24718P16903K60605j85713k03008J69881M81361
41787E707161M43264J32499l07027p74405j045764q35358q1281R05874J465744
41778E610707R02645o72783j853741j217180O20908J354154L8792j432589j001897
41769B349016O11321J240805N96228J75106L10939k89833j789329k333105q79427
41760h279R95478J419773Q45428Q26910J314421R42060m82429j478849r99966
41751C374547K33984R03373P47992N24839P13887Q28161J59864j026809j531168
$$ plain form
41814 3707718 2853354 2217976 2035169 2527527 3403689 3735939 2949679 1707950 1162292
41805 1162292 1498144 1969701 2278029 2974289 4268947 5319939 5236631 4239647 3321272
41796 3321272 3136734 3642414 4467132 5184035 5444640 5258927 5055919 5225800 5707161
41787 5707161 6150425 6282924 5975897 5201492 4155728 3320370 3239089 4144963 5610707
41778 5610707 6513352 5840569 3986828 2769648 3390556 4744710 4783502 3350913 2349016
41769 2349016 2960337 4201142 4797370 4972476 5283415 4993582 3204253 871148 -8279
41760 -8279 987199 2406972 3252400 4079310 5393731 6335791 5853362 4374513 3374547
41751 3374547 3608531 4511904 5259896 5784735 6498622 7326783 7486647 6459838 4928670
41742D928670p08722N31357Q38182J88511l29259k95294l50363o78585m21846
41733C702651P74218J757700J337934r241q38821o16204m2183J17516k46991p61009
41723E175570q17905N3749J503387K347414J803052M64143m05953k12842P18535
41714A0629150J700052J968370J003477p39126j887535j669220r28759q78949
41706I197460j315835j036356K63123J549149J881868J374146O38947P2180j53019
41697A2471663l5954J10454n3619l85420m73702l36438l85379o79154p50927k85522
41687I196002M85953J175099J611971J711291J336930N11256m26228j026706j086856
41678A3488712q24594o99224r27192j200164j087989o18424j02773M46792J133890
$$ plain form
41742 4928670 4219948 4751305 5589487 5777998 5448739 5153445 4803082 4124497 3702651
41733 3702651 4476869 6234569 7572503 7563262 6724441 6108237 6066054 6183570 5936579 5175570
41723 5175570 4357665 4411414 5914801 8262215 10065267 10529410 10123457 9910615 10629150
41714 10629150 12329202 14297572 15301049 14561923 12674388 11005168 10076409 9197460
41706 9197460 7881625 6845269 7108392 8657541 10539409 11913555 12552502 12624682 12471663
41697 12471663 12435709 12546163 12492544 12107124 11633422 11296984 10911605 10232451 9481524 9196002
41687 9196002 9681955 10857054 12469025 14180316 15517246 16028502 15602274 14575568 13488712
41678 13488712 12664118 11964894 11037702 9837538 8749549 8131125 8028352 8475144 9609034
41669I609034J549270J180513M68686M06989Q83910O67155n03166j222266o76105
41660A2364020j53882r96707k270329k150494p42222K98633L76645L27199N20348
41651G573211M88036L37657O71847J039949L39774j023166j303142j92346M92078
41642H423898l55572j423479j145832Q455O25151M42140J20879m3284l2005L56383
41632F976734Q32851M45744q22694j298702K19000K377610K833718J345848j66494
41623A2743615l27919L70110Q85623R52506Q83532J006997J513861K225465K529313
41614B2783103K125669J625047J737018K184369K261971K172112K749363L937213
41606D1575865M664238M464308M223147M832833N819371N906048M598680K711631
$$ plain form
41669 9609034 11158304 12338817 12807503 13214492 14098402 14765557 14262391 13040125 12364020
41660 12364020 12210138 11213431 8943102 6792608 6050386 6349019 6725664 7052863 7573211
41651 7573211 8061247 8398904 9070751 10110700 10450474 9427308 8124166 7931820 8423898
41642 8423898 8068326 6644847 5499015 5507470 6132621 6574761 6695640 6652356 6620351 6976734
41632 6976734 7809585 8255329 7432635 6133933 6352933 8730543 11564261 12910109 12743615
41623 12743615 12415696 12785806 13671429 14623935 15507467 16514464 18028325 20253790 22783103
41614 22783103 24908772 26533819 28270837 30455206 32717177 34889289 37638652 41575865
41606 41575865 46240103 50704411 54927558 59760391 65579762 71485810 76084490 78796121
41598G8796121J352389O49635l12008k165545m097802m611307l550759k559998
41590F3500726l006876m218421m615493m000445l609907m138167m831937m656366
41582C0423114l499570k049893j115330j117008j680595j795721r72428l1997
41574A8160572j0737n65129m95987K80961N64867j10254n84967J49017J302430
41565A8690773J303932j23447j700106k120687j293483k36185n9994q71817j608692
41556A1980294j307090m27354k16791p81747q23631L81442J829647K267477J840135
41547A4742382J389554R71524J84914o43751q41846o20719p50147j230059j469487
41538A1732365j603219k244819k867929j995117M57130K448074K345294J044844
$$ plain form
41598 78796121 80148510 80798145 80486137 78320592 74222790 69611483 66060724 63500726
41590 63500726 60493850 56275429 51659936 47659491 44049584 39911417 35079480 30423114
41582 30423114 26923544 24873651 23758321 22641313 20960718 19164997 18192569 18160572
41574 18160572 18149835 17584706 17088719 17369680 17934547 17824293 17239326 17388343 18690773
41565 18690773 19994705 19871258 18171152 16050465 14756982 14520797 14460803 13588986 11980294
41556 11980294 10673204 10245850 10029059 9247312 8423681 8805123 10634770 12902247 14742382
41547 14742382 16131936 17103460 17288374 16644623 15802777 15182058 14431911 13201852 11732365
41538 11732365 10129146 7884327 5016398 3021281 3478411 5926485 8271779 9316623
41530I316623M50679P92616Q57329K71935q1475J60939K56240j03798r8118O42121
41520A2465091R55772k41329k028643k418290r66950O83000R50522N3262p16625
41511H735810p16631m07813m13071o57224n78475l7068K99980j69550q62042m96644
41501D697272J003813J964300J082477o29491j171737l38828K57261j97538p11381
41492E956148m25746J9770j91501o99900q59538q43382q74285m39395N90137J072780
41482C305088J76116j002408q83676J81542N47730j34220o45268l13356K60720
41473A492268N78524P57594O07320k10378r52425l97410J032430J483084M61935
41464D852942l97472p2056K47246n85276j576973j299195k61815J54447N5375
$$ plain form
41530 9316623 9767302 10559918 11417247 11689182 11607707 11768646 12024886 11921088 11822970 12465091
41520 12465091 13420863 13179534 11150891 8732601 7765651 8448651 9399173 9452435 8735810
41511 8735810 8019179 7611366 7198295 6541071 5962596 5925528 6225508 6055958 5193916 4697272
41501 4697272 5701085 7665385 8747862 8118371 6946634 6607806 6865067 6667529 5956148
41492 5956148 5530402 5550172 5358671 4658771 3799233 2955851 2081566 1642171 2232308 3305088
41482 3305088 3481204 2478796 1595120 1776662 2324392 2190172 1544904 1231548 1492268
41473 1492268 2070792 2828386 3435706 3225328 2272903 1875493 2907923 4391007 4852942
41464 4852942 4455470 4383414 4630660 4045384 2468411 1169216 907401 1061848 1117223
41455A117223M54686J075209O88012o13418j273925n14063P37125J325542J087990
41446D084381M31719k21466m08738J4198L94749L2116o40002n85397J86318O22621
41436C910499L39894J31620N03704Q70879O67452K21857k2219k33914n41203m81151
41426E367418K10691R34623J025699O61001L52825Q3660l95482q88470j070441
41417F281524j089758j177525j030635l39429L70044L05808k66393j98084Q49108
41408C704660J736007J355531J76667m17961J045N41121N11882M21615R19874
41399H950441J431657Q33167o91808j581735r82705R9947L46348q1845k02844
41390H120623O6347P7973p7041L29059J112178J120969M7621r49453r44790m54694
$$ plain form
41455 1117223 1571909 2647118 3335130 2721712 1447787 933724 1670849 2996391 4084381
41446 4084381 4516100 4294634 3885896 3900094 4294843 4326959 3686957 3101560 3287878 3910499
41436 3910499 4250393 4382013 4885717 5756596 6424048 6645905 6623686 6389772 5848569 5367418
41426 5367418 5578109 6512732 7538431 8199432 8552257 8635917 8240435 7351965 6281524
41417 6281524 5191766 4014241 2983606 2644177 3014221 3320029 3053636 2855552 3704660
41408 3704660 5440667 6796198 6972865 6554904 6555949 7097070 7608952 8030567 8950441
41399 8950441 10382098 11215265 10523457 8941722 7959017 8058964 8405312 8323467 8120623
41390 8120623 8186970 8264943 8187902 8516961 9629139 10750108 10797729 9848276 8903486 8448792
41380H448792l00431k90945J17446O77796Q14766O27340N12390K73077m60342
41371A0419889j263317j301571n19499L43875P77838Q05603M43102l21030j013690
41362H371200r23095k2705R07070J211665R85311P16829P22764R66378J105315
41353A4040732P54622r945n65179m83928j26178p5696k70726k38874L2988R8972
41343A3156788j80370m82721o12549p11839q83086j048881j156286j160164r37286
41334E983606n45248k97977k41752M297M59683M80054j06444l40806M06911J105730
41324F908054N45349n01019l14788R17907J281322K17852o58734l31853J28731
41315H192821k26971n04356J98270R06653L99746n48675l69751P13035J093261
$$ plain form
41380 8448792 8148361 7857416 7974862 8652658 9467424 10094764 10607154 10880231 10419889
41371 10419889 9156572 7855001 7335502 7679377 8457215 9262818 9705920 9384890 8371200
41362 8371200 7448105 7425400 8332470 9544135 10529446 11246275 11969039 12935417 14040732
41353 14040732 14795354 14785409 14220230 13736302 13610124 13534428 13263702 13024828 13057816 13156788
41343 13156788 12976418 12493697 11881148 11169309 10286223 9237342 8081056 6920892 5983606
41334 5983606 5438358 5140381 4898629 4902926 5362609 5842663 5736219 5395413 5802324 6908054
41324 6908054 7453403 6952384 6637596 7555503 8836825 9054677 8395943 8064090 8192821
41315 8192821 7965850 7461494 7659764 8566417 8966163 8417488 8047737 8760772 9854033
41306I854033L06561m86278l52175M22072J099028J213342P08076J53287L78767
41297A3296713J131549R10098q46038k402784j977400l76972L61942J30570M09943
41288A0637621J315795J438354O18504L93171J214353J573176O82743j52031J08847
41279A7830533N29030J23598l14982J75342Q29305N13699k37041k16030L66660
41270A9600114L97177k71106r40055j407360j779400j592492n77498K58519j86000
41261A3501899j273167j453711n79560J06284K3582k53978m34906q37053j188259
41252G611131o60310N82557J281024R56985N89298Q80254J094924L98363o76873
41243A2057353j053665p38853o53016j089823j190598j46785J476109K024869
$$ plain form
41306 9854033 10160594 9674316 9322141 9744213 10843241 12056583 12764659 12917946 13296713
41297 13296713 14428262 15338360 14492322 12089538 10112138 9735166 10097108 10227678 10637621
41288 10637621 11953416 13391770 14010274 14403445 15617798 17190974 17873717 17721686 17830533
41279 17830533 18359563 18483161 18168179 18343521 19172826 19686525 19449484 19233454 19600114
41270 19600114 19997291 19726185 18786130 17378770 15599370 14006878 13429380 13687899 13501899
41261 13501899 12228732 10775021 10195461 10301745 10325327 10071349 9636443 8799390 7611131
41252 7611131 6950821 7533378 8814402 9771387 10360685 11240939 12335863 12734226 12057353
41243 12057353 11003688 10264835 9611819 8521996 7331398 7184613 8660722 10685591
41235A0685591O04545j535213k108872n33104J232919J201946j24013p93769k49227
41226H380803L51794L33180L18459O48057N88282k49686r95522q30684k39344
41217H305339j46002n56588q10082n98193p6531N60806J065731J107925O89046
41208I541451K08038j20703m04802m90704J1563Q47772J099181M85080j22133
41199A1054743l4129J93379k38467r62769r07697J64225J320011J544114P00163
41190A2833573m56712r42731m23571M15052O43804K09462k02885l13108m49395
41181A1313489n73518j15896Q89025J489284J165615O50986Q22242J500651J911120
41172A9052998J691367R82720J50963k41293J20796O81312O74537M47510R13441
$$ plain form
41235 10685591 11290136 9754923 7646051 7112947 8345866 9547812 9423799 8630030 8380803
41226 8380803 8732597 9065777 9384236 10032293 10620575 10370889 9375367 8544683 8305339
41217 8305339 8159337 7602749 6792667 6194474 6117943 6678749 7744480 8852405 9541451
41208 9541451 9749489 9628786 9223984 8733280 8744843 9592615 10691796 11176876 11054743
41199 11054743 11020614 11213993 10975526 10012757 9105060 9269285 10589296 12133410 12833573
41190 12833573 12376861 11434130 11010559 11425611 12069415 12278877 12075992 11762884 11313489
41181 11313489 10739971 10624075 11513100 13002384 14167999 14818985 15641227 17141878 19052998
41172 19052998 20744365 21727085 21878048 21636755 21757551 22438863 23113400 23560910 24474351
41163B4474351J604597R31648j159930k645239k361521j584059j511741j179411
41155A6568695M74010K270863K531256J655987R27946J71887j161764j993983
41147B1444897j252503k76123q08020j725651r14587N70902p4892k275285k460195
41138A2228543P1356J837397P92272p60832n78651K3881n46906q31461P18125
41129A2953724K216892J182968j103770j502799R8830J110356N50441j52502k25033
41120A5129107m35586r59784r67254m80533l89329n00463L02749J821829K502237
41111A6022973J826527Q38611J24991p79919j745620j798484r46336l80932m03236
41102A2758575k2761Q50854Q37553m31298j210260k53574J132465J131753K05479
$$ plain form
41163 24474351 26078948 27010596 25850666 23205427 20843906 19259847 17748106 16568695
41155 16568695 17042705 19313568 21844824 23500811 24428757 24600644 23438880 21444897
41147 21444897 20192394 19916271 19108251 17382600 16468013 17038915 16964023 14688738 12228543
41138 12228543 12299899 14137296 14929568 14168736 13590085 13613966 13067060 12235599 12953724
41129 12953724 15170616 16353584 15249814 13747015 13845845 14956201 15506642 15354140 15129107
41120 15129107 14693521 13733737 12766483 12285950 11896621 11396158 11698907 13520736 16022973
41111 16022973 17849500 18688111 18813102 18033183 16287563 14489079 13542743 13161811 12758575
41102 12758575 12735814 13586668 14424221 13992923 12782663 12529089 13661554 14793307 14998786
41093A4998786J76022J328112K054285J158304p19600k022543j891625q53069
41085A4228672k40902p54782j512595j067794N51242J654364J055363m64260j372194
41076A2077114j262651q95101j005765j667230k306670j972476k46293J766279
41068D487207K220671P98605p39095q70141j54493P5989j86599o5509M34684N25109
41058F526428J42974K9806L84639O11667M66089L93804N29298K70018p75753k011759
41048F567211k365737j314693O20057K136831K120369P79966l87393k55138N57776
41039H459249N43751p04493k071177k386605j606971m90935K64283M30193K75055
41030B712350L07490O72098Q50703L17307o38734j162602q02668J42711J075284
$$ plain form
41093 14998786 15174808 16502920 18557205 19715509 18995909 16973366 15081741 14228672
41085 14228672 13987770 13232988 11720393 10652599 11203841 12858205 13913568 13449308 12077114
41076 12077114 10814463 9919362 8913597 7246367 4939697 2967221 2720928 4487207
41068 4487207 6707878 7506483 6767388 5897247 5742754 5818743 5632144 5566635 6001319 6526428
41058 6526428 6669402 6699208 7083847 7695514 8161603 8555407 9084705 9354723 8578970 6567211
41048 6567211 4201474 2886781 3506838 5643669 7764038 8544004 8156611 7901473 8459249
41039 8459249 9003000 8298507 6227330 3840725 2233754 1742819 2007102 2437295 2712350
41030 2712350 3019840 3691938 4542641 4859948 4221214 3058612 2255944 2398655 3473939
41021C473939J519566J331805Q69336O50315N19599k80621j715208k436266j550306
41012B382159j14366L84358L43839J166526K479728K347171M89286q70478k54415
41003H353808Q76400N06012q96766j386426n48377K87734L28041J35701K53364
40994G909491L72097M8853o61678j355933j441595m41140J149618J811997P94041
40985H185751n61523n06256N49159P10253l66739r72795j77764P37702N25025
40976H122813o3973J47235N77096m4431j250299j311732O7999J204173Q28653
40967H277534l16828p95000l36968K70068M35126J96218j82923m18642k08037
40958F920548M67144J088767J018373J94423p82877j258894j100320p17484o17964
$$ plain form
41021 3473939 4993505 6325310 7194646 7844961 8364560 8083939 6368731 3932465 2382159
41012 2382159 2267793 2652151 2995990 4162516 6642244 8989415 9478701 8608223 8353808
41003 8353808 9230208 9736220 8839454 7453028 6904651 7192385 7520426 7656127 7909491
40994 7909491 8281588 8330441 7668763 6312830 4871235 4430095 5579713 7391710 8185751
40985 8185751 7624228 7117972 7667131 8377384 8010645 7037850 6860086 7597788 8122813
40976 8122813 8058840 8206075 8783171 8738740 7488441 6176709 6244708 7448881 8277534
40967 8277534 7960706 7165706 6828738 7098806 7533932 7730150 7547227 7128585 6920548
40958 6920548 7387692 8476459 9494832 9689255 8906378 7647484 6547164 5829680 5211716
40949E211716q92868j090132o79109L17145J280244J657078J504645J238423J001369
40940I548511N71807r2213n40306l31693K65217M39599j54635q63076q45276k52494
40930G745441p0938p12908j354865j086252k53478J9278n29926r31746m23232
40921B401374M52963O34643m5898p74513q20882j76167P10387J310111J215444
40912D907462N16960k657L71577J208086J226047k7051j384036j443686k86624
40903E086078Q13420J050137P06255K83731j26086m76390n32520l02515r8319
40894F403791J06465P44651J731805K173212J554361O11006L14176N17201M43745
40885A4600413P2598P226K13122N2102l98067k70232N26140Q43904M8315p94178
$$ plain form
40949 5211716 4318848 3228716 2549607 2866752 4146996 5804074 7308719 8547142 9548511
40940 9548511 10120318 10028105 9487799 9156106 9421323 9860922 9706287 8843211 7997935 7745441
40930 7745441 7674503 6961595 5606730 4520478 4267000 4286278 3756352 2824606 2401374
40921 2401374 2854337 3488980 3443082 2668569 1847687 1671520 2381907 3692018 4907462
40912 4907462 5424422 5421765 5793342 7001428 8227475 8200424 6816388 5372702 5086078
40903 5086078 5899498 6949635 7655890 7939621 7813535 7337145 6804625 6502110 6403791
40894 6403791 6510256 7254907 8986712 11159924 12714285 13325291 13639467 14156668 14600413
40885 14600413 14673011 14680237 14893359 14945461 14547394 14277162 14803302 15647206 15695521 14901343
40875A4901343m33884N66244N28413q75568k003016j368395L92918J259563K44723
40866A3212341j485642k106405j364880o73091q94830r96289K34583J870946J796188
40857I592921j24516j595354j156790j50829l10412r90706n34822P34956J013894
40848F478342J2382o95802l55047j9562m18262o93237j04250N48096K74189m67931
40838D558918n75522P1005P39189R51222O47862j19430r05512r33135j92000K22507
40828D465104l01981p41389L5236J239149J075845n40753j639523q14657R91809
40819C768840J870022J249202J37802m45671n25071o55491q86830o32315L97127
40810D277615J450885J365264l6183j588169k002455j089810L71266J511624J845197
$$ plain form
40875 14901343 14467459 15033703 15562116 14686548 12683532 11315137 11708055 12967618 13212341
40866 13212341 11726699 9620294 8255414 7582323 6687493 5691204 5925787 7796733 9592921
40857 9592921 9468405 7873051 6716261 6565432 6255020 5264314 4729492 5464448 6478342
40848 6478342 6490724 5794922 5439875 5420313 5002051 4308814 4204564 4752660 5026849 4558918
40838 4558918 3983396 4054401 4793590 5744812 6392674 6273244 5367732 4434597 4242597 4465104
40828 4465104 4163123 3421734 3456970 4696119 5771964 5231211 3591688 2777031 3768840
40819 3768840 5638862 6888064 7025866 6580195 6055124 5399633 4512803 3880488 4277615
40810 4277615 5728500 7093764 7057581 5469412 3466957 2377147 2748413 4260037 6105234
40801F105234J347313M89469r3729k73243m57430p85587q00142k03038O30084
40792E958931J246127J615507J648604R60791k88535j063971p28803j8991N4712
40783I384372l68119n63890n34866o44720n24033L62987J410692J450601M54048
40774A0427072n78128j197579j633380j580024n16027P27772N38771r03463j412018
40765C872996O6493J775378J726040M61247j93664N5558J27742k17313j81830
40756G492647K59359J26281p10841r76851K9991J072900N59457j181869k236296
40747D434778j494879K01168J368941J472882Q32924k41090j377373j681207n27610
40738B988534J125740J401678o6233j444542j134075J57724P54033M09180K4072
$$ plain form
40801 6105234 7452547 7942016 7848287 7575044 7117614 6332027 5531885 5328847 5958931
40792 5958931 7205058 8820565 10469169 11429960 11141425 10077454 9348651 9329660 9384372
40783 9384372 9016253 8452363 7917497 7272777 6748744 7111731 8522423 9973024 10427072
40774 10427072 9848944 8651365 7017985 5437961 4921934 5649706 6188477 5285014 3872996
40765 3872996 3939489 5714867 7440907 7902154 7708490 7764048 7891790 7674477 7492647
40756 7492647 7752006 7878287 7167446 6190595 6220586 7293486 7852943 6671074 4434778
40747 4434778 2939899 3141067 4510008 5982890 6815814 6574724 5197351 3516144 2988534
40738 2988534 4114274 5515952 5449719 4005177 2871102 3028826 3782859 4192039 4216111
40729D216111k25833p79682j142155l17454J200799J687624P43826r3123K32942
40720E523055R01050Q80232M22226N6662m57305j207157j446325q45716k50792
40711C575930k25910p4162O43215R24689j9848j117584r27572J71078P87056O50893
40701D387785M05057Q0538n46557p62394J39785J216131R75109k38445q08920
40692D848089n45720q02556j846406k163931q96348Q09071J578091J462008J106059
40683C548357O09462J8457j70516J73045L85099R9852m7182N15479J264510J313656
40673G710219O25232j10639m03220l26285k83764o78652j518191k258483k335458
40664D20759j726893o61506P67411K084446K212758Q59935m72433k91217N49017
$$ plain form
40729 4216111 3990278 3210596 2068441 1750987 2951786 4639410 5383236 5290113 5523055
40720 5523055 6424105 7304337 7726563 7783225 7325920 6118763 4672438 3826722 3575930
40711 3575930 3350020 3275858 3919073 4843762 4823914 3706330 2778758 2949836 3736892 4387785
40701 4387785 4792842 4873380 4326823 3564429 3704214 4920345 5895454 5657009 4848089
40692 4848089 4302369 3499813 1653407 -510524 -1406872 -597801 980290 2442298 3548357
40683 3548357 4157819 4176276 4005760 4178805 4563904 4663756 4616574 5132053 6396563 7710219
40673 7710219 8335451 8224812 7821592 7495307 7211543 6532891 5014700 2756217 420759
40664 420759 -1306134 -1967640 -1200229 884217 3096975 3956910 3484477 3193260 3742277
40655C742277R1191j400697j601589O4035J169507p8901k039855k049989q4504
40646b188525J717087K065899J350587K37292q74380j390623r28713k464O62554
40637F48714J084827J454839J346489O03969K42773J066804J968549J188190r98985
40628H606169k414243j800043j30161R87390R22879q4818j350141j783081p30272
40619B223679Q53757J201023R1918p35732q1632J013076R46202n9844m71900J93491
40609E174038Q28195N24911k31549n52146m80874o55160j053831r11798N8425
40600B700211J081266J344234J051446Q28675N23511m32049j583628j576779q6537
40591C850350J478148J860645J524951J419543J179288l2483j523979j658495
$$ plain form
40655 3742277 3833468 2432771 831182 895217 2064724 1985823 -54032 -2104021 -2188525
40646 -2188525 -471438 1594461 2945048 3182340 2307960 917337 -11376 -13840 648714
40637 648714 1733541 3188380 4534869 5138838 5381611 6448415 8416964 9605154 8606169
40628 8606169 6191926 4391883 4261722 5249112 6171991 6087173 4737032 2953951 2223679
40619 2223679 3077436 4278459 4370377 3634645 3553013 4566089 5512291 5452447 4980547 5174038
40609 5174038 6002233 6527144 6295595 5743449 5262575 4607415 3553584 2641786 2700211
40600 2700211 3781477 5125711 6177157 7005832 7529343 7097294 5513666 3936887 3850350
40591 3850350 5328498 7189143 8714094 10133637 11312925 11280442 9756463 8097968
40583H097968m14051L23388n20589j668322j468801k11922O14691N30559K74744
40574E557665K62812J38468j29086J17799J082014J871099J601440N95091j46904
40565A0950398k77011k07742j32210J96753O54441O23843P2384q7049O27965J255914
40555A3677686O93222n10056q31435l9698N00600j17885j257672k026270k382973
40546G705519k376377j511835K02450J549874J500014O25223J61847K95014L66071
40537H517800J76975k0622l65616j064088j551188j111322j29209L47761J22599
40528D923090j20447j11604j94491l16867N632O30228P67166J97673m02550m81304
40518D896526j34694L57565O63300K41264r04865j530807m84996J384972K104453
$$ plain form
40583 8097968 7683917 8007305 7486716 5818394 4349593 4137671 4752362 5282921 5557665
40574 5557665 5820477 5958945 5829859 5947658 7029672 8900771 10502211 11097302 10950398
40565 10950398 10673387 10465645 10333435 10530188 11184629 11808472 11880856 11793807 12421772 13677686
40555 13677686 14370908 13860852 13029417 12989719 13490319 13372434 12114762 10088492 7705519
40546 7705519 5329142 3817307 4019757 5569631 7069645 7694868 7856715 8151729 8517800
40537 8517800 8694775 8674153 8308537 7244449 5693261 4581939 4452730 4800491 4923090
40528 4923090 4802643 4691039 4496548 4179681 4185313 4815541 5582707 5780380 5377830 4896526
40518 4896526 4761832 5119397 5782697 6023961 5119096 3588289 3103293 4488265 6592718
40509F592718J315776M84834K61415l41960j565655j882700n75667O26378J58505
40500E073644p69390j92829J243874J305228j53046j005575k90429N45975L05611
40491F063063j64485K33770R29651P70308j24546q18801j102636j422810j745481
40482B618033j544129p07817L73431J444526K338080K486401J395455l17614j219455
40473F866911p18780K27563M47770k0189l85998m55738o93513j138657j180220
40464B949149n80097P6583L32938N72274J217206J792432J561808P64077L41780
40455I028150N21461N40844n7643o83768o35964j26521J64365J10544R9812J85943
40445I147223p9559q61846j546819j365022l83741M69673N25146K42124N61011
$$ plain form
40509 6592718 7908494 8393328 8654743 8312783 6747128 4864428 4288761 4915139 5073644
40500 5073644 4304254 4111425 5355299 6660527 6507481 5501906 5211477 5757452 6063063
40491 6063063 5898578 6132348 7061999 7832307 7707761 6888960 5786324 4363514 2618033
40482 2618033 1073904 366087 739518 2184044 4522124 7008525 8403980 8086366 6866911
40473 6866911 6148131 6375694 6823464 6803275 6417277 5961539 5268026 4129369 2949149
40464 2949149 2369052 2445635 2778573 3350847 4568053 6360485 7922293 8686370 9028150
40455 9028150 9549611 10090455 10032812 9349044 8713080 8586559 8750924 8861468 8961280 9147223
40445 9147223 9067664 8205818 6658999 5293977 4910236 5379909 5905055 6147179 6708190
40436F708190J471169J836701Q86547p16369j748012j824935j330226m90564N75512
40427E368013J244479R07717M7108k55751M6889q6426r90324j609882j136610
40418C535213k72121r2587m79161n62644j51101J84318J04326k11068n54627p90063
40408G10485o19875J06115Q96916R66966J41785q91388j254635o55494L95073
40399b04052J034776Q77099L96202K52552L84500K63521r8685j84890m1029l29584
40389B350410j004881r75651K63059J557618J529504M45526k61713Q2204Q27881
40380D813957J096328O39349k60986j082102j296001q01523q0841L39456L88928
40371C756565K64163J29576J63504L99834M18697j23401o10030j32427P94590
$$ plain form
40436 6708190 8179359 10016060 10902607 10186238 8438226 6613291 5283065 4792501 5368013
40427 5368013 6612492 7520209 7567317 7311566 7358455 7272029 6281705 4671823 3535213
40418 3535213 3263092 3170505 2691344 2128700 1977599 2161917 2266243 2055175 1500548 710485
40408 710485 90610 196725 1093641 2060607 2202392 1311004 56369 -599125 -204052
40399 -204052 830724 1707823 2104025 2356577 2741077 3004598 2905913 2721023 2679994 2350410
40389 2350410 1345529 369878 632937 2190555 3720059 4165585 3903872 3986076 4813957
40380 4813957 5910285 6549634 6288648 5206546 3910545 3109022 3028181 3367637 3756565
40371 3756565 4020728 4150304 4313808 4713642 5132339 5008938 4398908 4266481 5061071
40362E061071N83396q34253j418949r0485J295757P01969p98869o84908R80514
40353D795243J691426M34174r87585r10290O3972N96516M90852K02014j21333
40344F254989l07311l6724L16368j47908j281651j673015o56223O10441Q07974
40335C886940J33493m58103o85647p59123o21016k38970L044q5892j22559R9373
40325A151540K34940K31515N84843J176531R83029k28936j069374m89041M80125
40316C055172K92686p02464j015704n39890m94203j048698r14032L31085J193414
40307A57366L90017j189805j672528o19483P29131J237250R71663N74822L20687
40298H99120P0149k65245n74595p40111p24523m82264L492N41940P94271O27663
$$ plain form
40362 5061071 5644467 4810214 3391265 3300780 4596537 5298506 4499637 3814729 4795243
40353 4795243 6486669 6920843 5933258 5022968 5086940 5683456 6174308 6376322 6254989
40344 6254989 5947678 5910954 6227322 6079414 4797763 3124748 2468525 3078966 3886940
40335 3886940 4020433 3562330 2876683 2117560 1496544 1257574 1260618 1174726 1052167 1151540
40325 1151540 1386480 1617995 2202838 3379369 4362398 4133462 3064088 2575047 3055172
40316 3055172 3347858 2645394 1629690 1089800 595597 -453101 -1367133 -1036048 157366
40307 157366 547383 -642422 -2314950 -2934433 -2205302 -968052 3611 578433 899120
40298 899120 969269 704024 129429 -610682 -1335205 -1817469 -1813977 -1272037 -477766 149897
40288A49897K30621k28081p71453j251274j211624n37324J14803J24807j12795
40279c492423K57149J157632J557643Q89298k74428j056648j056580k23255J196874
40270a044738K376100K400797J357561K33871m04224q05772j037839p23074p5185
40261B277497R355o02647r25466n12536j86038m02696l22422N00883R82441L74840
40251A193211j88927L23018P37924l06384j445002l90029J974998K362504Q9455
$$ plain form
40288 149897 380518 152437 -619016 -1870290 -3081914 -3619238 -3504435 -3379628 -3492423
40279 -3492423 -3235274 -2077642 -519999 369299 94871 -961777 -2018357 -2241612 -1044738
40270 -1044738 1331362 3732159 5089720 5323591 4919367 4113595 3075756 2352682 2277497
40261 2277497 2286852 1684205 758739 246203 60165 -342531 -664953 -164070 818371 1193211
40251 1193211 1004284 1327302 2065226 1758842 313840 -76189 1898809 4261313 4350768
$$ [...]
##END NTUPLES=NMR SPECTRUM
##END=
