##TITLE=31Pdec_DE-140_1d_1h30m
, 64 sc
 2.4.2026
##JCAMPDX= 6.0         $$ Bruker NMR JCAMP-DX V2.0
##DATA TYPE= NMR SPECTRUM
##DATA CLASS= NTUPLES
##ORIGIN= UXNMR, Bruker Analytische Messtechnik GmbH
##OWNER= root
$$ XWIN-NMR		Version 3.5
$$ Thu Apr  2 15:07:35 2026 Russian Standard Time (UT+4h)  she@DPX200
##.OBSERVE FREQUENCY= 81.013821
##.OBSERVE NUCLEUS= ^31P
##.ACQUISITION MODE= SIMULTANEOUS
##.ACQUISITION SCHEME= undefined
##.AVERAGES= 64
##.DIGITISER RES= 17
##SPECTROMETER/DATA SYSTEM= spect
##.PULSE SEQUENCE= zgpg30
##.SOLVENT NAME= MeOD
##.SHIFT REFERENCE= (INTERNAL, MeOD, 0, 197.392)
##AUDIT TRAIL= $$ (NUMBER, WHEN, WHO, WHERE, WHAT)
$$ ##TITLE= Audit trail, XWIN-NMR		Version 3.5
$$ ##JCAMPDX= 5.01
$$ ##ORIGIN= Bruker BioSpin GmbH
$$ ##OWNER= she
$$ F:/spectra/data/she/nmr/P31/2/pdata/1/auditp.txt
$$ ##AUDIT TRAIL=  $$ (NUMBER, WHEN, WHO, WHERE, WHAT)
(   1,<2026-04-02 15:06:32.00 +0400>,<she>,<DPX200>,
      <continue with go, POWCHK disabled, PULCHK disabled
       configuration hash MD5:
       00 E9 B6 7A A2 85 ED C7 34 08 36 98 17 FE 4E 26
       data hash MD5: 32K
       3B D4 03 26 58 0F 4F 6B 01 D6 A5 D8 D3 8D CD B5>)
(   2,<2026-04-02 15:06:33.90 +0400>,<she>,<DPX200>,
      <Start of raw data processing
       efp BC_mod = 2 LB = 1.5 FT_mod = 6 PKNL = 1 PHC0 = 1339.99 PHC1 = 186.3007 SI = 64K 
       data hash MD5: 64K
       0B 15 34 20 30 69 9D 0D 8E 28 72 11 90 85 FF 2A>)
(   3,<2026-04-02 15:06:48.60 +0400>,<she>,<DPX200>,
      <pk PHC0 = 21.79728 PHC1 = -54.6 
       data hash MD5: 64K
       E0 82 A7 A7 23 88 26 5B 1C A9 50 5B CB 51 4F 8A>)
(   4,<2026-04-02 15:06:57.84 +0400>,<she>,<DPX200>,
      <abs ABSG = 5 
       data hash MD5: 64K
       E2 62 C1 04 69 1D DA 1A 2E E0 26 5D F0 BF 52 E7>)
$$ ##END=
$$ 
$$ hash MD5
$$ 6B 52 2A F0 39 11 6D 50 6D 4E A9 3E 03 07 A5 2D
##$RELAX= 
##$RELAX= 
##$RELAX= 
##$RELAX= 
##$RELAX= 
##$RELAX= 
##$RELAX= 
##$RELAX= 
$$ Bruker specific parameters
$$ --------------------------
##$DU= <F:/spectra>
##$EXPNO= 2
##$NAME= <P31>
##$PROCNO= 1
##$TYPE= <nmr>
##$USER= <she>
##$AMP= (0..31)
100 100 100 100 100 100 100 100 100 100 100 100 100 100 100 100 100 100 
100 100 100 100 100 100 100 100 100 100 100 100 100 100 
##$AQSEQ= 0
##$AQ_mod= 1
##$AUNM= <au_zg>
##$AUTOPOS= <>
##$BF1= 81.014009
##$BF2= 200.13
##$BF3= 200.13
##$BF4= 200.13
##$BF5= 200.13
##$BF6= 200.13
##$BF7= 200.13
##$BF8= 200.13
##$BYTORDA= 1
##$CFDGTYP= 0
##$CFRGTYP= 5
##$CHEMSTR= <none>
##$CNST= (0..31)
1 1 145 1 1 1 1 1 1 1 1 1 1 1 1 1 1 1 1 1 1 1 1 1 1 1 1 1 1 1 1 1 
##$CPDPRG= <waltz16>
##$CPDPRG1= <>
##$CPDPRG2= <waltz16>
##$CPDPRG3= <>
##$CPDPRG4= <mlev>
##$CPDPRG5= <mlev>
##$CPDPRG6= <mlev>
##$CPDPRG7= <mlev>
##$CPDPRG8= <mlev>
##$CPDPRGB= <>
##$CPDPRGT= <>
##$D= (0..31)
0 1 0 0 0 0 0 0 0 0.06 0 0.03 2e-05 3e-06 0 0 0.0002 0 0 0 0 0 0 0 0 0 
0 0 0 0 0 0 
##$DATE= 1775127845
##$DBL= (0..7)
120 120 120 11 120 120 24 19 
##$DBP= (0..7)
150 150 150 150 150 150 150 150 
##$DBP07= 0
##$DBPNAM0= <>
##$DBPNAM1= <>
$$ [...]
##$SUBNAM3= <"">
##$SUBNAM4= <"">
##$SUBNAM5= <"">
##$SUBNAM6= <"">
##$SUBNAM7= <"">
##$SUBNAM8= <"">
##$SUBNAM9= <"">
##$SW= 400.765351723535
##$SWIBOX= (0..15)
0 1 3 0 0 0 0 0 0 0 0 0 0 0 0 0 
##$SW_h= 32467.5324675325
##$TD= 32768
##$TD0= 1
##$TE= 0
##$TE2= 300
##$TE3= 300
##$TEG= 300
##$TL= (0..7)
0 120 53 12 22 120 120 120 
##$TP= (0..7)
150 150 150 150 150 150 150 150 
##$TP07= 0
##$TPNAME0= <>
##$TPNAME1= <>
##$TPNAME2= <>
##$TPNAME3= <>
##$TPNAME4= <>
##$TPNAME5= <>
##$TPNAME6= <>
##$TPNAME7= <>
##$TPOAL= (0..7)
0.5 0.5 0.5 0.5 0.5 0.5 0.5 0.5 
##$TPOFFS= (0..7)
0 0 0 0 0 0 0 0 
##$TUNHIN= 0
##$TUNHOUT= 0
##$TUNXOUT= 0
##$USERA1= <user>
##$USERA2= <user>
##$USERA3= <user>
##$USERA4= <user>
##$USERA5= <user>
##$V9= 5
##$VALIST= <valist>
##$VCLIST= <CCCCCCCCCCCCCCC>
##$VD= 0
##$VDLIST= <DDDDDDDDDDDDDDD>
##$VPLIST= <PPPPPPPPPPPPPPP>
##$VTLIST= <TTTTTTTTTTTTTTT>
##$WBST= 1024
##$WBSW= 4
##$XGAIN= (0..3)
0 0 0 0 
##$XL= 0
##$YL= 0
##$YMAX_a= 24874
##$YMIN_a= -32226
##$ZGOPTNS= <>
##$ZL1= 120
##$ZL2= 120
##$ZL3= 120
##$ZL4= 120
##$ABSF1= 197.3918
##$ABSF2= -203.3724
##$ABSG= 5
##$ABSL= 3
##$ALPHA= 0
##$AQORDER= 0
##$ASSFAC= 0
##$ASSFACI= 0
##$ASSFACX= 0
##$ASSWID= 0
##$AUNMP= <proc_1d>
##$AZFE= 0.1
##$AZFW= 0.5
##$BCFW= 0
##$BC_mod= 2
##$BYTORDP= 0
##$COROFFS= 0
##$CY= -3
##$DATMOD= 1
##$DC= 0
##$DFILT= <>
##$DTYPP= 0
##$F1P= 0
##$F2P= 0
##$FCOR= 1
##$FTSIZE= 65536
##$FT_mod= 6
##$GAMMA= 0
##$GB= 0
##$INTBC= 1
##$INTSCL= 9.790993e-09
##$ISEN= 30
##$LB= 1.5
##$LEV0= 0
##$LPBIN= 0
##$MAXI= 10000
##$MC2= 0
##$MEAN= 0
##$ME_mod= 0
##$MI= 50
##$NCOEF= 0
##$NC_proc= -7
##$NLEV= 6
##$NOISF1= 182.463
##$NOISF2= 159.3651
##$NSP= 0
##$NTH_PI= 0
##$NZP= 0
##$OFFSET= 197.3918
##$PC= 4
##$PHC0= 1361.787
##$PHC1= 131.7007
##$PH_mod= 1
##$PKNL= yes
##$PPARMOD= 0
##$PSCAL= 0
##$PSIGN= 0
##$REVERSE= no
##$SF= 81.014063255964
##$SI= 65536
##$SIGF1= 159.3651
##$SIGF2= -187.1042
##$SINO= 113.3802
##$SIOLD= 16384
##$SREGLST= <1H.CDCl3>
##$SSB= 0
##$STSI= 65536
##$STSR= 0
##$SW_p= 32467.5324675325
##$SYMM= 0
##$S_DEV= 0
##$TDeff= 32768
##$TDoff= 0
##$TI= <>
##$TILT= no
##$TM1= 0
##$TM2= 0
##$TOPLEV= 0
##$USERP1= <user>
##$USERP2= <user>
##$USERP3= <user>
##$USERP4= <user>
##$USERP5= <user>
##$WDW= 1
##$XDIM= 65536
##$YMAX_p= 265304556
##$YMIN_p= -95175475
$$ End of Bruker specific parameters
$$ ---------------------------------
##NTUPLES= NMR SPECTRUM
##VAR_NAME=  FREQUENCY,     SPECTRUM/REAL,   SPECTRUM/IMAG
##SYMBOL=    X,             R,               I
##VAR_TYPE=  INDEPENDENT,   DEPENDENT,       DEPENDENT
##VAR_FORM=  AFFN,          ASDF,            ASDF
##VAR_DIM=   65536,         65536,           65536
##UNITS=     HZ,            ARBITRARY UNITS, ARBITRARY UNITS
##FACTOR=    0.49542278885378, 1,            1
##FIRST=     15991.5117654749, 0,            0
##LAST=      -16476.0207020576, 0,           0
##MIN=       -16476.0207020576, -95175475,   0
##MAX=       15991.5117654749, 265304556,    0
$$ Real data points
##PAGE= N=1
##DATA TABLE= (X++(R..R)), XYDATA
$$ [...]
45541b549811n25349L39555J570276J905551R36743l88873q96831n44510k94623
45532d47872o80195j010343l86695Q48637J390210P14841j92321j90891N63472
45523F08843J045963P64708J07950l89314m72067o2210O33335J041470Q36496
45514D115174M72935M91044N35935j01365j103559j299461l39847P75357J097349
45505D643562O97594o7195j154555k127604j960873m71183R35919R76883K09308
45496A681856o2142J26379k00200r55071j026131k45394L02592J92925L08864
45487A23678J037786J325593M27301o82301p96551l66292n83043j297984j326254
45478b138067m95478O9469k46449p30196n85164Q8466Q93831J700723K136177
$$ plain form
45541 -2549811 -3075160 -2735605 -1165329 740222 1676965 1288092 391261 -153249 -447872
45532 -447872 -1128067 -2138410 -2525105 -1676468 -286258 428583 236262 45371 608843
45523 608843 1654806 2419514 2527464 2138150 1666083 1603873 2237208 3278678 4115174
45514 4115174 4588109 5079153 5615088 5513723 4410164 3110703 2770856 3546213 4643562
45505 4643562 5341156 5273961 4119406 1991802 30929 -440254 495665 1472548 1681856
45496 1681856 1619714 1746093 1545893 590822 -435309 -680703 -378111 -185186 123678
45487 123678 1161464 2487057 2914358 2232057 1435506 1069214 486171 -811813 -2138067
45478 -2138067 -2633545 -2564076 -2810525 -3540721 -4125885 -4037419 -3143588 -1442865 693312
45469F93312J490621j34703j362590j130157k10907j23633q34618p98696N32372
45460a878999J520279N02613j687170k608885j443689l8225k86269j568918j799636
45451i288899l96382J089392J299881P52132O59974J081054J166107P07796L93997
45442b534948N93239P79417L94927l26915p28525n60656j60299K9436p4788j65831
45432b754943N6220M64456O43302N03508M33283O13254N98257N4522m39280k8568
45422A44011J093834J726507J103301l19702j609572k228982j993209q97102N60665
45413b420249J401244J042086q6731j083230j404380r33490K61468J729280K530145
45404A036143J938783K57967j382725k006222j433034k03873Q51583J138875O90403
$$ plain form
45469 693312 2183933 2049230 686640 -443517 -654424 -778057 -1612675 -2411371 -1878999
45460 -1878999 -358720 143893 -1543277 -4152162 -5595851 -5634076 -5920345 -7489263 -9288899
45451 -9288899 -9685281 -8595889 -7296008 -6543876 -5883902 -4802848 -3636741 -2928945 -2534948
45442 -2534948 -1941709 -1162292 -767365 -1094280 -1822805 -2383461 -2543760 -2514324 -2589112 -2754943
45432 -2754943 -2698723 -2234267 -1590965 -1087457 -654174 -40920 557337 611859 172579 144011
45422 144011 1237845 2964352 4067653 3747951 2138379 -90603 -2083812 -2980914 -2420249
45413 -2420249 -1019005 23081 -63650 -1146880 -2551260 -3484750 -3223282 -1494002 1036143
45404 1036143 2974926 3232893 1850168 -156054 -1589088 -1792961 -941378 197497 887900
45395H87900K1517m32243n43347k36316M92596J172051J064555J26503p51666
45386A801550q72857n87302n15438m52626K14388J323549J963399J600050N54516
45377E029229n53357j245241j172660l22745P12198J178780R08271K52246n33864
45368D252857j320118j747873j554309j139215j054562r93425j66505J223415
45360b499735J857185J044987k16983m96174L49904J257107J337760O38098k17640
45351C054509o75946o61351n82307p97301j029020o49387L69571J224889J179530
45342A433187L13108p35026j342430j153271k97413N13926O75254N34747Q40575
45333G82657J308848Q19052o19437j369735m82426O34730J35640j466540j938765
$$ plain form
45395 887900 909417 477174 -66173 -302489 190107 1362158 2426713 2553216 1801550
45386 1801550 928693 341391 -174047 -626673 -412285 911264 2874663 4474713 5029229
45377 5029229 4475872 3230631 2057971 1735226 2447424 3626204 4534475 4786721 4252857
45368 4252857 2932739 1184866 -369443 -1508658 -2563220 -3556645 -3723150 -2499735
45360 -2499735 -642550 402437 185454 -310720 39184 1296291 2634051 3272149 3054509
45351 3054509 2378563 1717212 1134905 337604 -691416 -1340803 -971232 253657 1433187
45342 1433187 1746295 1011269 -331161 -1484432 -1781845 -1267919 -592665 -57918 782657
45333 782657 2091505 2910557 2291120 921385 438959 1073689 1209329 -257211 -2195976
45324b195976m49829J434691J955693J074937j04005p49271o94448k33693L1711
45315F9810k84576p12658l66248P81580J666244J403138K37209r55006j522432
45306C17061j227745k47314P22892R45233N13315K13161L26838K65574l23593
45297A505422q87712r02668p17037p70773o26435L11603J491038J615328L60569
45288A379335j076996j324546k32034J186874J800576J212293r2208j204479j471204
45279A77611q57471J99520J131222J541194J483284J396285J409201Q66295q02404
45270F544737k768991l306900j947912k23445L24801j9590j01268K00012J94532
45261a104024o7612J46998Q05144J003559M35284j31585n8008M07059P73953Q69100
$$ plain form
45324 -2195976 -2645805 -1211114 744579 1819516 1715511 966240 271792 38099 69810
45315 69810 -214766 -927424 -1293672 -512092 1154152 2557290 2794499 1839493 317061
45306 317061 -910684 -1157998 -435106 510127 1023442 1236603 1563441 1829015 1505422
45297 1505422 617710 -284958 -1001995 -1772768 -2399203 -2087600 -596562 1018766 1379335
45288 1379335 302339 -1022207 -1254241 -67367 1733209 2945502 2853294 1648815 177611
45279 177611 -679860 -480340 650882 2192076 3675360 5071645 6480846 7347141 6544737
45270 6544737 3775746 468846 -1479066 -1702511 -1377710 -1397300 -1498568 -1298556 -1104024
45261 -1104024 -1171636 -1024638 -219494 784065 1219349 1087764 1029756 1436815 2210768 3079868
45251C079868N66757k13511j065171j398666j235380r29366l01700Q29153J495674
45242H27658N81136r55039q36594R70743J662955j93863k045757r89507J723646
45233G45378K495542O60904r98307p47409Q1653M1191k33688R6574L08241k64345
45223B185734o44265Q6538R06184M26186p01142p48232L94541J226621R49081
45214D081246J63442n05682r30171p17877M74496J711050J414383l20023j455715
45205C915149p28790O34797Q21128l6116m40337N2096M39632J65173L062N92064
45195E417858J124259M01569j251259k118425j242874L39974R41670K33689o95572
45186C150889r22520n27022K2298M24429L63581l34345j070814r07093l7151J98396
$$ plain form
45251 3079868 3646625 3433114 2367943 969277 -266103 -1195469 -1497169 -668016 827658
45242 827658 1408794 453755 -382839 587904 2250859 2056996 11239 -978268 745378
45233 745378 3240920 3901824 2903517 2156108 2237761 2278952 2045264 2141838 2450079 2185734
45223 2185734 1541469 1628007 2534191 2960377 2259235 1511003 1905544 3132165 4081246
45214 4081246 4244688 3739006 2808835 2090958 2565454 4276504 5690887 5370864 3915149
45205 3915149 3186359 3821156 4642284 4606168 4165831 4217927 4657559 4822732 4825794 5417858
45195 5417858 6542117 6943686 5692427 3574002 2331128 2671102 3612772 3846461 3150889
45186 3150889 2228369 1701347 1723645 2148074 2511655 2177310 1106496 199403 162252 360648
45176C60648n90849r13935L30823J758337J318472m73179j104223K59295J695789
45167B641178J515160M07502k19018l55064o56403r39062p98897p56768j347054
45158e08426j773010r54583N30695J068370M13035j6826N84572J239098Q42326
45149A425251j08493k86661N67777J359904J082381p4172j137647j482941j267983
45140G7416q68088k94032N31751J206752J153514N01698L1322O9652J12485j76026
45130B346444l47151n1263J99979j30375o03492m58353J70386M93430J81587m72007
45120A329185j084556j176071k35271J299031J820157N48513q91332m66945J131772
45111B274483J322053m12335j604903n33463J214066J202066m36078j652000j457305
$$ plain form
45176 360648 -230201 -1144136 -813313 945024 2263496 1790317 686094 945389 2641178
45167 2641178 4156338 4563840 4344822 3989758 3333355 2394293 1595396 838628 -508426
45158 -508426 -2281436 -3236019 -2705324 -1636954 -1223919 -1240745 -656173 582925 1425251
45149 1425251 1316758 1030097 1597874 2957778 4040159 3965987 2828340 1345399 77416
45140 77416 -790672 -1084704 -552953 653799 1807313 2309011 2340333 2409985 2522470 2346444
45130 2346444 1999293 1948030 2148009 2017634 1414142 955789 1126175 1619605 1801192 1329185
45120 1329185 244629 -931442 -1166713 132318 1952475 2500988 1609656 1142711 2274483
45111 2274483 3596536 3184201 1579298 1045835 2259901 3461967 3025889 1373889 -83416
45102h3416n82388J69626O40426P12766L70469J96232O27144R17845O1172j413540
45092A616336j902072j040346j74149j96418l01649M10265J302535J223295L18850
45083A256647l81956p09114j360549k259775k274394j013217K61739L69755M22
45074f110442N97533J936607K278400J033331k24626p4708P15054N77847m06942
45065C22054q78956m06344K44911P78042J593565K247294J458485p49178k472698
45056B137175k346646j212322m63902o4710N91386J047213N43417l91652o58256
45047h18297l45258k93030l63439K72455J392311J896563J651608J523202J490536
45038F406651M89906j418593k453080j553671l6321K51571o41079j284531r61855
$$ plain form
45102 -83416 -665804 -496178 144248 857014 1227483 1423715 2050859 2968704 3029876 1616336
45092 1616336 -285736 -1326082 -1500231 -1696649 -1998298 -1588033 -285498 937797 1256647
45083 1256647 874691 165577 -1194972 -3454747 -5729141 -6742358 -6480619 -6110864 -6110442
45074 -6110442 -5512909 -3576302 -1297902 -264571 -489197 -563905 151149 728996 322054
45065 322054 -556902 -963246 -718335 59707 1653272 3900566 5359051 4609873 2137175
45056 2137175 -209471 -1421793 -1885695 -1950405 -1359019 -311806 231611 -160041 -818297
45047 -818297 -1163555 -1456585 -1820024 -1547569 -155258 1741305 3392913 4916115 6406651
45038 6406651 6896557 5477964 3024884 1471213 1434892 1686463 1045384 -239147 -1201002
45029a201002q2146Q98625J757456J976745J061169n58553j758446j989060j715229
45020a610441j517724j350640r09089k57458K90454O94431J162957J571799J354423
45011e71288L63113m63557l7339J234829J672064O01206o19736p04805m69982
45002A004505j278367k284363j354276J354495L030409K060467J37952n83926
44994B086896m79077r47711j572633r72425M29590P96750k09368r77704n34477
44985b380159K54531M39618L00471L05108J61431l33203o21152l41282k3872q3219
44975b321728J0341P17704J368202J102308L27051J44943N94934N77388l76827
44966B144316j277387j077950j83051J76450k58542m73869J71729Q38814M24484
$$ plain form
45029 -1201002 -1283148 -384523 1372933 3349678 4410847 3852294 2093848 104788 -1610441
45020 -1610441 -3128165 -4478805 -5387894 -5645352 -5354898 -4660467 -3497510 -1925711 -571288
45011 -571288 -208175 -671732 -709071 525758 2197822 2799028 2179292 1474487 1004505
45002 1004505 -273862 -2558225 -3912501 -2558006 472403 2532870 2670822 2086896
44994 2086896 1607819 660108 -912525 -1884950 -1455360 -658610 -867978 -1845682 -2380159
44985 -2380159 -2125628 -1686010 -1385539 -1080431 -919000 -1252203 -1873355 -2214637 -2238509 -2321728
44975 -2321728 -2311387 -1593683 -225481 876827 1203878 1348821 1943755 2521143 2144316
44966 2144316 866929 -211021 -394072 -217622 -476164 -950033 -778304 60510 484994
44957D84994o54838r64954k43631J88154l77053p55961J97748J505236J416492
44948G96187J88115k66240O58237J445220Q75063m31076j401132j828192j577090
44939a540908j39681J903124K513098Q14388j113143q01328J115690J871294M84785
44930E107319j314247j943849j696460j282127n63165M77697J022881O11774o8694
44921C51129l66256n71422r00979p39335J43701P28345K99767r8562P83395K117720
44911A747503J959089J97380j192459r96822k16211j37676m15660l2725Q45344
44902A757763J124177M16662n54984j031136r55284o89150n38829n77203n73763
44893a621747j54607O70284J263946R85919r368q92226j033537n41532p480Q0189
$$ plain form
44957 484994 -169844 -1134798 -1378429 -1190275 -1567328 -2323289 -2125541 -620305 796187
44948 796187 984302 718062 1376299 2821519 3696582 3265506 1864374 36182 -1540908
44939 -1540908 -1680589 222535 2735633 3550021 2436878 1635550 2751240 4622534 5107319
44930 5107319 3793072 1849223 152763 -1129364 -1692529 -1214832 -191951 419823 351129
44921 351129 -15127 -586549 -1487528 -2226863 -2083162 -1354817 -1055050 -1153612 -370217 1747503
44911 1747503 3706592 3903972 2711513 1714691 1498480 1360804 945144 912419 1757763
44902 1757763 2881940 3298602 2743618 1712482 757198 68048 -470781 -1047984 -1621747
44893 -1621747 -1776354 -1106070 157876 1143795 1134427 242201 -791336 -1332868 -1340348 -1260159
44883a260159k41361m26919l1190N91021N44486l75589j137675o84540O04313
44874b417613J326418Q17223k14277q41952r36944p49266k12442P42036J596687
44865h90130J628957P94117k14781p58719p83103o01690m51932k98424P1159P03010
44855h01536J157463P92277l75042j351798j170629j07873O01529L19431k49570
44846a185748j19283O26113J016510N18612l71137q99162r13337o75269k27788
44837b230489N06367J129610R57253M9691n35230o2086P17486M69204q22290j741578
44827a562062j353594l05828L78635O88040J058327J205154O10767k38300k94548
44818A86591M49410R24973O15494P9636l23368r09811j378971m97793J837324
$$ plain form
44883 -1260159 -1501520 -1928439 -1959629 -1368608 -824122 -1199711 -2337386 -3021926 -2417613
44874 -2417613 -1091195 -273972 -488249 -1330201 -2267145 -3016411 -3228853 -2486817 -890130
44865 -890130 738827 1532944 1318163 559444 -223659 -825349 -1277281 -1575705 -1504546 -801536
44855 -801536 355927 1148204 773162 -578636 -1749265 -1857138 -1255609 -936178 -1185748
44846 -1185748 -1305031 -678918 337592 856204 485067 -414095 -1327432 -2002701 -2230489
44837 -2230489 -1724122 -594512 362741 412432 -122798 -184884 532602 1001806 179516 -1562062
44827 -1562062 -2915656 -3221484 -2842849 -2154809 -1096482 108672 719439 481139 186591
44818 186591 636001 1560974 2176468 2256104 1932736 1022925 -356046 -853839 983485
44809I83485L424854K229370o07263j950273p43785Q05786M61165j215581k117681
44800A270077j494894m37742p1358l74277o57039m30353K34832P74362O35623
44791e50769j0201l33925O4611N37603L09075l91768p04933l28221L14940Q44703
44781b48885J154738J032499L04833o40948j143229j086212q35786m46148L18826
44772a590312J177773J395958Q36204J80753r2422j94627l14688k99519l04120
44763G95000p66538j315005p97858Q95428K097539J417551l31818j325016j068083
44754c98800l80135K19866O82218N54449m17842j118909k56573J306695J302987
44745A493956n56822j904000j147116L04319M20182n35817j047370r42512j035092
$$ plain form
44809 983485 4408339 6637709 6030446 4080173 3336388 4142174 4603339 3387758 1270077
44800 1270077 -224817 -662559 -733917 -1108194 -1765233 -2195586 -1960754 -1186392 -550769
44791 -550769 -560970 -894895 -830284 -292681 16394 -375374 -1080307 -1408528 -1093588 -248885
44781 -248885 905853 1938352 2243185 1602237 459008 -627204 -1462990 -1909138 -1590312
44772 -1590312 -412539 983419 1819623 2000376 1907954 1713327 1398639 1099120 795000
44763 795000 28462 -1286543 -2084401 -1188973 908566 2326117 1994299 669283 -398800
44754 -398800 -778935 -559069 123149 677598 259756 -859153 -1115726 190969 1493956
44745 1493956 937134 -966866 -2113982 -1809663 -1389481 -1925298 -2972668 -3915180 -4950272
44736d950272j058768o7551J421835J749873P37751J14797Q06336J484054P15568
44727I53623q05761j352114n72684L98281P06968M99815J32000k66483m04659
44718g11014R0813R82564J441350R96969K4606q36637j272514j189244n99194
44709a072301J09226L20314J1235m1484O34660J343428J131069K37483k12885
44700B460745J34652M64767J93490j97475j52322J3147j86093m60405k80454J70837
44690B160889L74415L70045M74849N10176J63538k38631k12127j1979j19412k85769
44680C185994j96476n35014j870554k895433j725801R88494K359983J180398n24607
44671c3016o88673J28413N00860N59300R50413J057174K32103n13847r4760N12390
$$ plain form
44736 -4950272 -6009040 -6076591 -4654756 -2904883 -2167132 -2052335 -1245999 238055 953623
44727 953623 147862 -1204252 -1776936 -1378655 -671687 -171872 -39872 -306355 -711014
44718 -711014 -620201 362363 1803713 2800682 2825288 1988651 716137 -473107 -1072301
44709 -1072301 -963075 -642761 -631526 -673010 -38350 1305078 2436147 2673630 2460745
44700 2460745 2595397 3060164 3253654 3056179 2903857 2917004 2730911 2270506 1990052 2160889
44690 2160889 2535304 2905349 3380198 3890374 4053912 3815281 3603154 3591175 3471763 3185994
44680 3185994 2989518 2454504 583950 -2311483 -4037284 -3048790 -688807 491591 -33016
44671 -33016 -721689 -593276 -92416 466884 1417297 2474471 2706574 2192727 2097967 2610357
44661B610357j34382j200835q14401O69960J180946L31846k85335j26173l49204
44652A882779j150015j076494K73229J259373Q51996J34333J41403K28157k60398
44643B284363n87676j42821L59024L82921N39386Q54202L3687k016586k937300
44634a230800j185156J155777J142962p84066j792364q97610L35077P36594O56496
44625a863090L65602l10858p53300q0887J006740R55401l6733k83037L82380K42370
44615c75412j106814j631266o7166J844299J851691L32374o82165m47418J46322
44606a35555L69083K47108k02903r95541j608005j430264o71960j8653M10613
44597d036077R64437J496608J369427M98015l06769k89844L77077R29213R67630
$$ plain form
44661 2610357 2475975 1275140 460739 1130699 2311645 2643491 2358156 2231983 1882779
44652 1882779 732764 -343730 -70501 1188872 2040868 2175201 2316604 2544761 2284363
44643 2284363 1696687 1553866 1912890 2295811 2835197 3689399 3723086 1706500 -1230800
44634 -1230800 -2415956 -1260179 -117217 -901283 -2693647 -3591257 -3256180 -2519586 -1863090
44625 -1863090 -1497488 -1808346 -2561646 -2642533 -1635793 -680392 -717125 -1000162 -617782 -375412
44615 -375412 -1482226 -3113492 -3180658 -1336359 515332 847706 165541 -281877 -135555
44606 -135555 233528 480636 277733 -717808 -2325813 -3756077 -4428037 -4446690 -4036077
44597 -4036077 -3071640 -1575032 -205605 292410 -14359 -304203 72874 1002087 1969717
44588A969717P82294P12308M97749l31575j460434j802912q68476M47044R89239
44579I34954P27258L03927j75626q47045j084281k14799R15982O57572r57815
44570B60127j983581j300883r2848J74692j77775o0465M95533P66012P96854J070829
44560e1505J240041N29260p98019j543258j178894m64906l46573q60679j248695
44551d723228q03737L72647J324186J239152N54382M55456J125586J392036N50169
44542A486649m72457n22765J53139O38924Q06148Q72986L16212j282738k773843
44533g77745k441979m35106J261858J435345Q99813Q50802J220042J236783O64671
44524C914484j73790r86593j605937j899841j892462j646975r89360J83453J355008
$$ plain form
44588 1969717 2752011 3464319 3962068 3630493 2170059 367147 -501329 -54285 934954
44579 934954 1662212 1966139 1790513 943468 -140813 -355612 560370 1217942 260127
44570 260127 -1723454 -3024337 -3117185 -2942493 -3120268 -3180733 -2685200 -1919188 -1122334 -51505
44560 -51505 1188536 1717796 919777 -623481 -1802375 -2267281 -2613854 -3474533 -4723228
44551 -4723228 -5526965 -5154318 -3830132 -2590980 -2036598 -1581142 -455556 936480 1486649
44542 1486649 1014192 491427 644566 1283490 2089638 2962624 3278836 1996098 -777745
44533 -777745 -3219724 -3654830 -2392972 -957627 -57814 792988 2013030 3249813 3914484
44524 3914484 3740694 2754101 1148164 -751677 -2644139 -4291114 -5280474 -5097021 -3742013
44515c742013J753584J296630O02262J07813j78936j56474L19013Q38982P45383
44506A586244J28948k89452l40948n53728r89982r68079k49937M88087P45373
44497d43474P62200N89630k61725j588065k058606r86364M14249O66567J51047
44488b754541K91262J169064J435234M99804n83536p05590p9121M05522L72618
44479E0716K6600l68795n97344m64245m1725L10139L87062L48302L50628L02195
44469C03533J43383M2948J18034K59190M20534P35145J070157Q46874k07073j337795
44459B394930j427456m60387K71231k22222j288630j502665o15572J75628K2970
44450b652173l71887Q4623J165317J632576R75312q2417p75333j067639j047559
$$ plain form
44515 -3742013 -1988429 -691799 -89537 18276 -160660 -317134 1879 840861 1586244
44506 1586244 1715192 1425740 1084792 531064 -458918 -1426997 -1676934 -1188847 -443474
44497 -443474 318726 908356 646631 -941434 -3000040 -3986404 -3572155 -2905588 -2754541
44488 -2754541 -2463279 -1294215 141019 640823 57287 -648303 -727424 -321902 50716
44479 50716 77316 -291479 -888823 -1353068 -1394793 -1084654 -697592 -349290 1338 303533
44469 303533 446916 489864 607898 867088 1287622 2022767 3092924 3939798 3732725 2394930
44459 2394930 967474 507087 778318 556096 -732534 -2235199 -2850771 -2675143 -2652173
44450 -2652173 -3024060 -2939437 -1774120 -141544 833768 751351 -23982 -1091621 -2139180
44441b139180n04526M02496Q54323M27110j57094o1131M02548L96475M4494K18982
44431a15503R27563J053259K2197j230668j525288r41189l84798k06638o5182
44422b466247J45463J47944O2555M44628J222223J354234J79274j343776j527408
44413a781110k8048J665029J993103J013898j9767l06910j50202j20538k16071
44404B049384j15782J05691j4447n74656r46227n17169L17360M39025m73193j237620
44394i67634o18877Q49125J426224N69346l16415L1991R60354J070684L11219
44385C316017k84471m09824o70723j113072r62700p5472N77150L35275k46772
44376D65408m44317l85204m04388k03804N64753J462498J760851J369332O57998
$$ plain form
44441 -2139180 -2643706 -2241210 -1386887 -959777 -1116871 -1178002 -775454 -378979 -334485 -115503
44431 -115503 812060 1865319 1887516 656848 -868440 -1809629 -2194427 -2401065 -2466247
44422 -2466247 -2320784 -2172840 -2110285 -1665657 -443434 910800 1090074 -253702 -1781110
44413 -1781110 -1809158 -144129 1848974 2862872 2843105 2536195 2385993 2265455 2049384
44404 2049384 1933602 2039293 2024846 1450190 503963 -13206 304154 743179 269986 -967634
44394 -967634 -1586511 -737386 688838 1258184 941769 973760 1934114 3004798 3316017
44385 3316017 3031546 2621722 1950999 837927 -124773 -200245 376905 712180 465408
44376 465408 21091 -364113 -768501 -972305 -407552 1054946 2815797 4185129 4843127
44367D843127k12519j148689j705968j508861q71886m38579l88486m36908l43326
44358b212095R643O97508J437237J558894Q33291j3571j75202J81500L33626J30997
44348B781828M114P8827K5367k78765n71975o95255p69758r16982j136383j282491
44338b761473r08206M05552K129092K800801J683731j13489r93908q28903n83123
44329H30074n37900k13201K39519J10662l20985J30999J504562K166532J090796
44320E001058n72436j164381p74541o91291j235474j397233n29184O18870Q58253
44311A13641L9788p79848n93965L24182P39510J05226o39734m70321Q8542k20563
44301a293542j211261j295973P1840J406274J285500K36683l38744j21963K38618
$$ plain form
44367 4843127 4630608 3481919 1775951 267090 -604796 -1043375 -1431861 -1868769 -2212095
44358 -2212095 -2202452 -1504944 -67707 1491187 2324478 2310907 2135705 2317205 2650831 2781828
44348 2781828 2785942 2864769 2890136 2611371 2039396 1344141 574383 -342599 -1478982 -2761473
44338 -2761473 -3669679 -3264127 -1135035 1665766 3349497 3236008 2242100 1413197 830074
44329 830074 292174 78973 318492 429154 108169 239168 1743730 3910262 5001058
44320 5001058 4428622 3264241 2489700 1798409 562935 -834298 -1363482 -744612 113641
44311 113641 153429 -626419 -1220384 -896202 -156692 -51466 -691200 -1161521 -1072979 -1293542
44301 -1293542 -2504803 -3800776 -3728936 -2322662 -1037162 -800479 -1139223 -1261186 -1022568
44292a022568L99795M13885J38653m04053n44988J53873R40462Q17564J18391
44283A011014L3861P09537R44455m7627j489157j985789j061399M98754J498341
44274A11990J419170Q26302N80448O47376K40524o91430j047848k51144O53248
44265B488636N94981K73763R23983J929153J474100n35546k054869j770725p11031
44256B612445k86655k43128L44400J163402J092700P540j023087j214233q73644
44247A579740o84087p66472o41756P2308J019338J297112N18804n19061p08318
44238A167608k1599N91056N75081K36664j29788n92111q95723m92764L73036O55393
44228A466853P9373l26126J10010O28999M80634K86452P63158J074148J7151j727288
$$ plain form
44292 -1022568 -622773 -208888 -70235 -474288 -1019276 -865403 75059 892623 1011014
44283 1011014 1044875 1754412 2698867 2651240 1162083 -823706 -1885105 -1386351 111990
44274 111990 1531160 2357462 2937910 3585286 3825810 3134380 2086532 1835388 2488636
44265 2488636 3083617 3357380 4281363 6210516 7684616 7149070 5094201 3323476 2612445
44256 2612445 2325790 2082662 2427062 3590464 4683164 4690704 3667617 2453384 1579740
44247 1579740 895653 129181 -512575 -440267 579071 1876183 2394987 1875926 1167608
44238 1167608 1146009 1737065 2312146 2548810 2419022 1826911 931188 438424 811460 1466853
44228 1466853 1546226 1220100 1330110 1959109 2439743 2726195 3489353 4563501 4580652 2853364
44218B853364k216093r52497O00068J282148J461925J636762J315968R3347j283573
44209D791419j856981j736407j581134j396463p43274K19200P80514O41105J03896
44200g78125o05190j451387j961118j304170N20693K118315K006750L85209j003427
44191b072450q81496K24995R34277P67262L58104K12658J00115k03894l55998
44182i16427n9565L12454K33833j94161m59015l37607N8670O00529J005492P70314
44172A014517r6652n97114J56067J497591J819926P15283m79479o20305k43230
44163C166604m09414q94318o47496K89973O18592j92589q31328P3146J749312
44154B922482K026290K43276j735950j933638p39860l1812m21459o95936M4184
$$ plain form
44218 2853364 637271 -315226 284842 1566990 3028915 4665677 5981645 6074992 4791419
44209 4791419 2934438 1198031 -383103 -1779566 -2522840 -2303640 -1523126 -882021 -778125
44200 -778125 -1383315 -2834702 -4795820 -6099990 -5579297 -3460982 -1454232 -1069023 -2072450
44191 -2072450 -2953946 -2728951 -1794674 -1027412 -669308 -456650 -356535 -560429 -916427
44182 -916427 -975992 -663538 -429705 -623866 -1082881 -1420488 -1361818 -761289 244203 1014517
44172 1014517 917865 320751 476818 1974409 3794335 4509618 4030139 3409834 3166604
44163 3166604 2757190 1862872 1215376 1505349 2123941 1931352 1100024 1173170 2922482
44154 2922482 4948772 5192048 3456098 1522460 782600 750788 329329 -366607 -322423
44145c22423J044205J178666M98032k13817n82945n70269r434Q65211J055071
44136B942297Q828j237435j216322m1351Q27682O45285O5578j85989j54827l0070
44126A623676K25830L61229n0608o89791o47470J65273P25576M08504j61767k41774
44116A718678j6892M9594L2583N0053k38518q94010j158288m50557O46844J147658
44106H87145R28342N39785K30152j03491l62884l63994k54729k59847k78750j70142
44096G91587o1188R747K42717M62622L5730j028124j607915q67927M85100J147509
44086c90142Q69916L27885j20812o03585j022327j048037n95110K64770J371708
44077i45734J977052J093443q48871j785905o40972R42475J007106K77628O69643
$$ plain form
44145 -322423 721782 1900448 2398480 2184663 1601718 1031449 1022015 1887226 2942297
44136 2942297 2951125 1713690 497368 456017 1283699 1928984 1994562 1808573 1653746 1623676
44126 1623676 1849506 2210735 2160127 1470336 822866 988139 1713715 2122219 1960452 1718678
44116 1718678 1701786 1751380 1783963 1834016 1595498 701488 -456800 -907357 -260513 887145
44106 887145 1815487 2355272 2585424 2481933 2119049 1755055 1500326 1240479 961729 791587
44096 791587 730399 740146 982863 1445485 1481215 453091 -1154824 -2022751 -1537651 -390142
44086 -390142 479774 807659 686847 83262 -939065 -1987102 -2582212 -2317442 -945734
44077 -945734 1031318 2124761 1275890 -510015 -1150987 -208512 798594 1076222 1745865
44068A745865J693096J049017j308888k558261j142526R84401J391818L30025
44060B184547n36679p40744p14436k88124P40878J438830P64876p62886j724795
44051C61467j622007r25263R2925J330975K091745J607848K28994q65416j058403
44042A242865o96160l06104p0042J02614M43591J017084J340180Q95372J68254
44033D137654J94909P81021N28704p16062j091566L59659J627344M96773j842950
44024D475486k289664l17397J452712J119242l64670j301523j407725j120498
44016B45963m74181L90333Q57741P96958Q80871J362522J540866R49627M9252
44007F599952p16727j449597j927462j463726k76358K61099m16477j014662k91279
$$ plain form
44068 1745865 3438961 4487978 3179090 620829 -521697 462704 1854522 2184547
44060 2184547 1647868 907124 192688 -95436 645442 2084272 2849148 2086262 361467
44051 361467 -1260540 -2185803 -2092878 -761903 1329842 2937690 3166684 2301268 1242865
44042 1242865 546705 240601 170559 273173 716764 1733848 3074028 3969400 4137654
44033 4137654 4332563 5113584 5642288 4926226 3834660 4194319 5821663 6318436 4475486
44024 4475486 2185822 1868425 3321137 4440379 4075709 2774186 1366461 245963
44016 245963 -228218 162115 1019856 1816814 2697685 4060207 5601073 6550700 6599952
44007 6599952 5883225 4433628 2506166 1042440 766082 1027181 610704 -403958 -695237
43998f95237J023340J375226O24484j04807k37581j96440l59519o24694q36716
43989c1944q27328k74206P34827J329373Q50787r0625l90158m108J79959j41421
43979A335156k88525J98118Q18597Q68925L51853j61411k31701Q0322L63890L26752
43969C661976J69430L01049O20266N30809o6325l60280K60546J148797J123037
43960G389305l4107j446933k266787k257442j496503k90466O21519N06296n22039
43951B02843j510467j583618o02118Q75523J890505J651181L79411o47137n01323
43942A54800K16752L05103k80158n73087l28007l58605r14556r66728J88752J548283
43932a007451J571695K41420r58688r38847q0386O32780Q84915J088188J505900
$$ plain form
43998 -695237 328103 1703329 2327813 2223006 1985425 1788985 1429466 804772 -31944
43989 -31944 -859272 -1133478 -398651 930722 1781509 1690884 1300726 1296618 1476577 1335156
43979 1335156 1046631 1244749 2063346 2932271 3284124 3122713 2891012 2971334 3335224 3661976
43969 3661976 3831406 4132455 4752721 5283530 5217205 4856925 5117471 6266268 7389305
43960 7389305 7355198 5908265 3641478 1384036 -112467 -402933 218586 724882 202843
43951 202843 -1307624 -2891242 -3493360 -2617837 -727332 923849 1303260 656123 154800
43942 154800 371552 676655 396497 -176590 -504597 -863202 -1777758 -2744486 -2555734 -1007451
43932 -1007451 564244 805664 -153024 -1091871 -1172257 -539477 345438 1433626 2939526
43923B939526J766723J362153M01770m27362o71063n53513m67362m09404k64825
43914C676643k71467o35683r10283m28907O55479J387418J166850L96669r8462
43905D938257J35875R38700J575905J137026m35294j778142j414160K96703J445952
43896F840822J034658R5024q5726K75665K98541L9423R3813K60128j04511p19099
43886H028738o71995n1422l8259j099438k149180j990735q06498K90085N84233
43877B095529J75141m30045o72718k83681L33469M00925k34167q00256o36963
43868e2766o0872K57701L11390N19904Q24686P68737L40244N875q4189k21371
43858B609339m08822k41840K81816N49139K63795p6247o3074p5109m83252p55859
$$ plain form
43923 2939526 4706249 6068402 6470172 6042810 5371747 4818234 4350872 3941468 3676643
43914 3676643 3405176 2769493 1859210 1430303 2085782 3473200 4640050 5036719 4938257
43905 4938257 5074132 6012832 7588737 8725763 8290469 6512327 5098167 5394870 6840822
43896 6840822 7875480 7970504 7884778 8160443 8458984 8498407 8592220 8852348 8747837 8028738
43886 8028738 7356743 7305321 7267062 6167624 4018444 2027709 1221211 1511296 2095529
43877 2095529 2270670 1840625 1167907 884226 1217695 1618620 1384453 584197 -52766
43868 -52766 -113638 144063 455453 975357 1800043 2568780 2909024 2914899 2830710 2609339
43858 2609339 2200517 1958677 2240493 2789632 3053427 2977180 2914106 2838997 2355745 1599886
43848A599886j75428R12873J428992R64406P7138o58967j051000q54658M6842
43839B290084R55685Q96307P5884k63030J85273J74456j028411k141197j563664
43830d18613K64864J507585J430351R38078Q23441P59849J70694q60828j740229
43821B875192j818917q38465M77265P19780m29240j272360j84038J860816K439509
43812C829542J103493k31648l77787k37739n56909n18471L45425Q71774L48509
43803D576189N6148R94117J751820P71117p00775m52249R11570Q90763o37251
43794H161449j096527N62037K200127J915576N72843k94383q20121j510001j600443
43785H090557n75869K21172n05541j634417j192936M99492J289912L51859j021962
$$ plain form
43848 1599886 1424458 2337331 3766323 4730729 4807867 4148900 3097900 2243242 2290084
43839 2290084 3245769 4142076 4217960 3954930 4140203 4314659 3286248 1145051 -418613
43830 -418613 -153749 1353836 2784187 3722265 4545706 5305555 5476249 4615421 2875192
43821 2875192 1056275 217810 695075 1414855 985615 -286745 -470783 1390033 3829542
43812 3829542 4933035 4701387 4323600 4085861 3528952 3010481 3355906 4227680 4576189
43803 4576189 4632337 5626454 7378274 8149391 7448616 6996367 7907937 8798700 8161449
43794 8161449 7064922 7626959 9827086 11742662 12315505 12021122 11201001 9691000 8090557
43785 8090557 7514688 7735860 7230319 5595902 4402966 4902458 6192370 6544229 5522267
43776E522267j563939j172670k4342J625002K623821J710706m74583j760898j300541
43767E184823n01799n56609p29110p1045P15667N06566k85828m57444M5336L42598
43757D193155K11475P0438k02315j013999j852797j736641p99153j00366J06710
43748a123493M94887R83976N85259o37231j106591p5500J070119R85362M82349
43739A659137R57455J778542J165351p88420j967766j257429N1249M13562Q8864
43730B100545J68637O87201Q24174L80101q854O2037K88753K71508P3156M8082
43720D895340L55988P07840N84263j70019j023711j297950r62265n21794k22769
43711B344923N4021J52000l04708j001292r41580J29578J061417P50432l16268
$$ plain form
43776 5522267 3958328 2785658 2761316 4386318 7010139 8720845 8246262 6485364 5184823
43767 5184823 4683024 4126415 3397305 3326260 4041927 4548493 4262665 3805221 3850557 4193155
43757 4193155 4404630 4475068 4272753 3258754 1405957 -330684 -1129837 -1230203 -1123493
43748 -1123493 -628606 355370 940629 303398 -803193 -878693 191426 1176788 1659137
43739 1659137 2616592 4395134 5560485 4772065 2804299 1546870 1598119 2011681 2100545
43730 2100545 2269182 2956383 3780557 4160658 4151804 4213841 4502594 4774102 4847258 4895340
43720 4895340 5251328 5959168 6543431 6373412 5349701 4051751 3089486 2567692 2344923
43711 2344923 2398944 2550944 2246236 1244944 303364 432942 1494359 2244791 1928523
43702A928523p78442k82477K30165k505n94473o45690J81867J371631K037750
43693C446349J670322N96379l60499p64665q62658r28016q18777m53572j52251
43684A372612o3401J78614O79836P78253M8875p17922m50992O44454J384311J196798
43674E051438N05248k17105p57816p03439K13609J272571J309586K33573r03174
43665F004491j359946j266619q03035j4151N11299J20574n46415j45344J065197
43656C566051J169617m25681j702338r46275O13011P58703l14463n74042N26482
43647B671065J413736J031064J84234j25425q8641j55728j7813O31732J223969
43638F768193J071400M32457M3458o0474n04402j405720j881988j058764O33541
$$ plain form
43702 1928523 1150081 867604 1097769 1095264 500791 -144899 36968 1408599 3446349
43693 3446349 5116671 5713050 5352551 4587886 3725228 2797212 1978435 1524863 1372612
43684 1372612 1309211 1487825 2167661 2945914 2994789 2276867 1825875 2470329 3854640 5051438
43674 5051438 5556686 5339581 4581765 3878326 4091935 5364506 6674092 6907665 6004491
43665 6004491 4644545 3377926 2574891 2560740 3072039 3192613 2646198 2500854 3566051
43656 3566051 4735668 4309987 2607649 1661374 2274385 3033088 2718625 2144583 2671065
43647 2671065 4084801 5115865 5300099 5174674 5086033 4930305 4912492 5544224 6768193
43638 6768193 7839593 8272050 8315508 8255034 7750632 6344912 4462924 3404160 4037701
43629D037701J606274Q24871q79841j749478j271633o13510o66590p00553K41605
43620H28846J486131J534118L47122n05085l2448J000426J357820Q17736j6491
43611F818175o00771p03983l66513J984p6914m92627o05116j32685M60848O12496
43601D914894K73889j99011l44520J84166J156759J586006O98014q93112j721836
43592E655249j265318m12034j4417J07040L85532O38940N33525K35642N0566o2399
43582E852326j86678k02455k17735o30421j333686j492457o29916O07112J262055
43573C028145J140964O43609J05333k03481N272N79111Q72701O09700K73779K52363
43563G307496K45567l0303k79619k67501k49834k66063P2415N12302K7873j387443
$$ plain form
43629 4037701 5643975 6468846 5589005 3839527 2567894 1954384 1287794 587241 828846
43620 828846 2314977 3849095 4196217 3691132 3658684 4659110 6016930 6834666 6818175
43611 6818175 6217404 5513421 5146908 5148892 5071978 4579351 3974235 3841550 4302398 4914894
43601 4914894 5188783 4989772 4645252 4829418 5986177 7572183 8270197 7377085 5655249
43592 5655249 4389931 3977897 3963480 4070520 4456052 5094992 5628517 5864159 5914725 5852326
43582 5852326 5665648 5463193 5245458 4615037 3281351 1788894 1158978 1766090 3028145
43573 3028145 4169109 4812718 4918051 4714570 4719842 5298953 6171654 6781354 7055133 7307496
43563 7307496 7553063 7522760 7243141 6975640 6725806 6459743 6532158 7044460 7072333 5684890
43553E684890k045351q80589P29844R33999R2684k51599q0371m17138q65702j61706
43543B738961J035379O10897j377008k197030m86605J629516J787624O18861P0855
43534D431450K83445J24028l98719l05836M25740Q54335O02167J6094p28961j412022
43524C891721j236976P5801J176327N62682j167637k024372j321064j44297O79182
43515D91367J375814J862385J337328j73077j267744r50299O4170N24984K93718
43506C558646J44972N49803J223237J457474O46179j002134k189988j718867q8505
43497B580817R45857N91931j91361l89051k31640k37115j49172K59163L27064
43488C506493m22413j101981n79890P19098J389510J130816R56136J340658J463051
$$ plain form
43553 5684890 3639539 2758950 3488794 4422793 4515477 4263878 4183507 3766369 2900667 2738961
43543 2738961 3774340 4385237 3008229 811199 324594 1954110 3741734 4360595 4431450
43534 4431450 4714895 4838923 4440204 4134368 4560108 5414443 6016610 6032704 5303743 3891721
43524 3891721 2654745 2730546 3906873 4469555 3301918 1277546 -43518 -187815 491367
43515 491367 1867181 3729566 5066894 4893817 3626073 2675774 2739944 3264928 3558646
43506 3558646 3703618 4253421 5476658 6934132 7580311 6578177 4388189 2669322 2580817
43497 2580817 3526674 4118605 3927244 3538193 3306553 3069438 2920266 3179429 3506493
43488 3506493 3084080 1982099 1402209 2121307 3510817 4641633 5597769 6938427 8401478
43479H401478O40455n65802j274264j521293j837292k056230j397592K16103J540310
43470B145873J166890p42581k270480j646589P49803K731919K728450J340439
43462F203724K22312M8620K41631K79148L37061O09738Q03577O12162J75604k25612
43452I307965n39132p33346n82839k3654M74166K68562o75772j558493j421146
43443D516311j03511J481644K131647J489265L31069k89532j1059P57904J405802
43434A1709540J540649J119889M84841J37385K71401O91153J266935K007498K444855
43425B1674146J668337l21482j873424j353331O73452K039241J752791R94596
43417B5254326J082877J709259J867421J437561Q54391J1377j308191k368486
$$ plain form
43479 8401478 9041933 8476131 7201867 5680574 3843282 1787052 389460 605563 2145873
43470 2145873 3312763 2570182 299702 -1346887 -597084 2134835 4863285 6203724
43462 6203724 6426036 6474656 6716287 6995435 7332496 7942234 8745811 9357973 9533577 9307965
43452 9307965 8768833 8035487 7452648 7428994 7903160 8171722 7495950 5937457 4516311
43443 4516311 4412800 5894444 8026091 9515356 9846425 9556893 9545834 10303738 11709540
43434 11709540 13250189 14370078 14854919 14992304 15263705 15954858 17221793 19229291 21674146
43425 21674146 23342483 23021001 21147577 19794246 20467698 22506939 24259730 25254326
43417 25254326 26337203 28046462 29913883 31351444 32205835 32217212 30909021 28540535
43409B8540535k115332p95979J84723J54590j10728J60150N92308N56537L52262
43400B7519066O29616J119490R07186j24869r95167r45623l85163j80148n23993
43391B7020395r62324j200956j370734j610470j832359j900683j725719j226011
43383A5191139n17418n8942k16652p30291j037377j046618j042570r20105l29943
43374I291223L23298O4247j027736j453255l68558R51786Q61911k57005p68773
43365G617138l69087j84175m88483k19652R30584J748981J474167Q96582O56971
43356A2063026P5779j186538j871976j064312o6618m87442j451843q64839J098270
43347F243507K096186J234231K85989P30309J620421J458407N44366R1308J40102
$$ plain form
43409 28540535 26425203 25629224 25813947 25968537 25857809 26017959 26610267 27166804 27519066
43400 27519066 28148682 29268172 30175358 30050489 29055322 28109699 27724536 27544388 27020395
43391 27020395 26058071 24857115 23486381 21875911 20043552 18142869 16417150 15191139
43383 15191139 14673721 14614779 14398127 13667836 12630459 11583841 10541271 9621166 9291223
43374 9291223 9614521 9678768 8651032 7197777 6829219 7781005 8642916 8385911 7617138
43365 7617138 7248051 7063876 6575393 6355741 7286325 9035306 10509473 11406055 12063026
43356 12063026 12138805 10952267 9080291 8015979 7949361 7461919 6010076 5145237 6243507
43347 6243507 8339693 9573924 9859913 10590222 12210643 13669050 14213416 14304724 14444826
43338A4444826j76093r15850j230552p71284j43900J1972l71674j071595j778867
43329G996983j972747j174776M30845J896753K238549J298971o8444p59244n25951
43320I360939j81751m34709q42378n46617K12861L14472m33875q28446r0529Q84590
43310G414557Q58496k4691p54305r90474j033660p96164j9140P26897M99251m93257
43300E387510r28063j78524Q67551J138390O58448L7932n30292j093233j293048
43291D066671o84110M57350J261429J265769Q93954Q10363J043084R52233N7114
43282A0123857j251568j996293j631822n88109L03008O81643P52540P58708P17328
43273G869292N56626J92541m19036j008792r72772n0181J134965J708724J606909
$$ plain form
43338 14444826 14268733 13352883 12122331 11351047 11207147 11219119 10847445 9775850 7996983
43329 7996983 6024236 4849460 5280305 7177058 9415607 10714578 10646134 9886890 9360939
43320 9360939 9179188 8744479 7902101 7355484 7568345 7882817 7448942 6620496 6529967 7414557
43310 7414557 8273053 8248362 7494057 6503583 5469923 4673759 4654619 5381516 5880767 5387510
43300 5387510 4459447 4280923 5148474 6286864 6945312 6983244 6452952 5359719 4066671
43291 4066671 3382561 3839911 5101340 6367109 7261063 8071426 9114510 10066743 10123857
43282 10123857 8872289 6875996 5244174 4656065 4959073 5640716 6393256 7151964 7869292
43273 7869292 8425918 8618459 8199423 7190631 6217859 6167678 7302643 9011367 10618276
43264A0618276J424674J299156P17085l99968j229146j149534p05992q24353j422374
43255H327824j514918o40226M46884P03147K9762p20414q26656m80244l49452
43246D975707n54061m57493L69657J341235J432848M25203q65940j544863j380389
43237C741904o52365J80761N76739K61180k90227k39875M97014J066867Q96249
43228F038247M60721L61073K86587l21566j016746p48561N22426J515135J190615
43219H287931k7507r27210r21148m14282q7451k11409n53343o73240l18247L29800
43209D483894P92662P29750K18584l76142p26217p25197m53702o4849K39773J71806
43199D290362m66162j357160j638699p38231P90652J762777J743172J348037J052243
$$ plain form
43264 10618276 12042950 13342106 14059191 13659223 12430077 11280543 10574551 9750198 8327824
43255 8327824 6812906 6172680 6619564 7322711 7352473 6632059 5805403 5325159 4975707
43246 4975707 4421646 3964153 4333810 5675045 7107893 7533096 6667156 5122293 3741904
43237 3741904 3089539 3270300 3847039 4108219 3817992 3578117 4075131 5141998 6038247
43228 6038247 6498968 6860041 7146628 6825062 5808316 5059755 5582181 7097316 8287931
43219 8287931 8260424 7333214 6412066 5997784 5910333 5698924 5145581 4472341 4154094 4483894
43209 4483894 5276556 6006306 6224890 5848748 5122531 4397334 3943632 3878783 4118556 4290362
43199 4290362 3824200 2467040 828341 90110 880762 2643539 4386711 5734748 6786991
43190F786991N26677l84116q99644l80234M80749O03001K19358M12506J170389
43181H535677J285104L31274o16356o81825l61188l58533l96356m2423K63942
43172G959316L9222j72771L20581R92906P87617k01425r02401q93360p03702n80294
43162F645689j26316O94230J236155J118435O46604J11910m89792q85286o00092
43153H351537J18488L63845q6901l74895O7519O15025M56469k76798r43903j212249
43143G078137r05058J36452J368168J564324L60880r83880j275187j020322j246324
43134E077190j460095l55205J770344K972754K225909O19742l79480o31779p60913
43125I078467r63635j082617j114590j009351n23844K26432O00344K69448k46165
$$ plain form
43190 6786991 7313668 6929552 6029908 5649674 6130423 6733424 6952782 7365288 8535677
43181 8535677 9820781 10152055 9535699 8853874 8492686 8134153 7737797 7695374 7959316
43172 7959316 7998538 7825767 8146348 9139254 9926871 9725446 8823045 7929685 7225983 6645689
43162 6645689 6519373 7213603 8449758 9568193 10214797 10326707 9836915 8951629 8351537
43153 8351537 8470025 8833870 8746969 8372074 8439593 9054618 9511087 9234289 8290386 7078137
43143 7078137 6173079 6309531 7677699 9242023 9602903 8619023 7343836 6323514 5077190
43134 5077190 3617095 3261890 5032234 8004988 10230897 10850639 10471159 9839380 9078467
43125 9078467 8114832 7032215 5917625 4908274 4384430 4610862 5211206 5480654 5234489
43116E234489k72752J99492O68289O57863l5404j078523j518001p33312M15075
43107C537216M03164p00532j028657L82663J976018J865010N36793j28728K20641
43098G063588K46921n54316r88357j84679J002140J301174O67110j08364o07478
43089G837739q41512o66463O5423J000832J508624J318303O07060l51255j242182
43080I236569j542891p77193Q26237K126006J937445L73487r47467n84108Q80156
43071A1528241J421647K19174j228670j251281l03717J1878m76838m28805O99109
43062A0190738J804190J866498J194964N02938p7476n00346m08245R0277J74675
43053A4838213m50185r12603m88940K61699M78453L42765N26517R43318J034526
$$ plain form
43116 5234489 4961737 5161229 5829518 6487381 6451977 5373454 3855453 3122141 3537216
43107 3537216 3940380 3239848 2211191 2593854 4569872 6434882 6971675 6842947 7063588
43098 7063588 7310509 6756193 5767836 5583157 6585297 7886471 8553581 8445217 7837739
43089 7837739 6996227 6329764 6395187 7396019 8904643 10222946 10830006 10478751 9236569
43080 9236569 7693678 6916485 7742722 9868728 11806173 12179660 11232193 10648085 11528241
43071 11528241 12949888 13169062 11940392 10689111 10385394 10397272 9920434 9491629 10190738
43062 10190738 11994928 13861426 15056390 15559328 15481852 14981506 14573261 14663538 14838213
43053 14838213 14388028 13475425 12986485 13248184 13726637 14069402 14595919 15539237 16573763
43044A6573763Q19157O92922N40939l8427r05042j586623k010060k244113j908968
43035I933548p52012N17909R42623O22649L71811L41439M7988m46979n78784m37166
43025A0563026o42229r96072n61798O45820J349119Q62504O0738q8740K00748
43016A1393116M37860Q50643J497088J424379l979j642238j788190n03098N96771
43007A2262352O73939M52172N94378O57563J59532m10806m08471j27840k68089
42998A3584730p32741p61501j03318O32473Q24328M94193K1144l18467l45349
42989A3295492M6421O01318P37602K59739k36236j41836K15336N6724n22577n96660
42979A3715323L4358L47906k33704o74096R3802J171335Q09904p46193j299354
$$ plain form
43044 16573763 17392920 18085842 18626781 18588354 17683312 16096689 14086629 11842516 9933548
43035 9933548 9181536 9699445 10642068 11264717 11636528 11977967 12025955 11578976 11000192 10563026
43025 10563026 9920797 8924725 8362927 9008747 10357866 11220370 11281108 11192368 11393116
43016 11393116 11830976 12681619 14178707 15603086 15599107 13956869 12168679 11665581 12262352
43007 12262352 12936291 13388463 13982841 14640404 14799936 14389130 13980659 13852819 13584730
42998 13584730 12851989 12090488 11987170 12619643 13443971 13938164 13959308 13640841 13295492
42989 13295492 13341913 13943231 14680833 14940572 14704336 14562500 14777836 14834560 14311983 13715323
42979 13715323 13749681 14097587 13863883 13189787 13283589 14454924 15264828 14518635 13219281
42970A3219281P1109J541937J230241j30949n97725j2055J86926l58794l95255
42961A4754716N87861J244858M28637r31978j090777J67033J498676J827572J145271
42952A9631869j87899j757672k657382j920715P3446J488924J058985l29198q29437
42943A4570921M3608J214921J857202K170318K241474J499500L4311o73881M76942
42934B3435316K379710K922450J660372J3397r52641j443904j586406q52302N58531
42925B6134523J288725P32888R5952M23734P92156p0682j343115j122096O16137
42916B7548222J953500J833368J095199N43029j33948r46958r27831J37604Q34062
42907C1936247K34103m08083L99816J780669J672654J04272o93411M53259K096451
$$ plain form
42970 13219281 13290390 14832327 16062568 15931619 15333894 15321839 15508765 15149971 14754716
42961 14754716 15342577 16587435 17016072 16084094 14993317 15160350 16659026 18486598 19631869
42952 19631869 19443970 17686298 15028916 13108201 13181647 14670571 15729556 15400358 14570921
42943 14570921 14614529 15829450 17686652 19856970 22098444 23597944 23632255 22958374 23435316
42934 23435316 25815026 28737476 30397848 30411245 29458604 28014700 26428294 25575992 26134523
42925 26134523 27423248 28156136 28252088 28675822 29467978 29397296 28054181 26932085 27548222
42916 27548222 29501722 31335090 32430289 32973318 32839370 31892412 30964581 31102185 31936247
42907 31936247 32170350 31762267 32162083 33942752 35615406 35719678 35026267 35479526 37575977
42898C7575977K432563J608082Q27155L31897m56193j385125j486324m43035Q36600
42889C9841597J371367J172020Q57145P26489O54248O24182Q67988J421511J872276
42880D9408823J766871J187079P32103Q70198J430160J873418J997408K105206
42872F1371266K377338K392104J677836O50893M38074J490560K831599L213017
42864G6442687K758748K745065L737420M772519M792672M168685M046751M618504
42856A08083051M985965M675336M318305M540473M998361N083930N008924N469032
42848A47163377O486543P284308P328199O966334O895689P360301Q046029Q514585
42840B06045365Q544427Q165776P549738O908488O438574O213099N978030N146247
$$ plain form
42898 37575977 40008540 41616622 42443777 42775674 42319481 40934356 39448032 39004997 39841597
42889 39841597 41212964 42384984 43242129 43968618 44622866 45247048 46115036 47536547 49408823
42880 49408823 51175694 52362773 53094876 53965074 55395234 57268652 59266060 61371266
42872 61371266 63748604 66140708 67818544 68469437 68907511 70398071 73229670 76442687
42864 76442687 79201435 81946500 85683920 90456439 95249111 99417796 103464547 108083051
42856 108083051 113069016 117744352 122062657 126603130 131601491 136685421 141694345 147163377
42848 147163377 153649920 160934228 168262427 175228761 182124450 189484751 197530780 206045365
42840 206045365 214589792 222755568 230305306 237213794 243652368 249865467 255843497 260989744
42832B60989744L327304R87508p28707j113192o60782m84346j139927k299864
42824B58877738l393636m175488m719099n236173n934768o758374p269432p121454
42816B14269314o654616o629488p261014p896034p847359p223685o670463o535967
42808A57550688o603836o530134o270570o070124o129453o237860n790956m464947
42800A09452808k928423k424907l312616m402109m269172k996580j981650k086801
42792H5050550k719714k926393k632846k293751j918696j254668o84378j040928
42784F9579176k354131l484808l391832k295866j170676m67452R4369O49110P49103
42775E7906993o109j288807k253111k290239j468885l84584L11033L60946K5846
$$ plain form
42832 260989744 264317048 265304556 264575849 263462657 262801875 262317529 261177602 258877738
42824 258877738 255484102 251308614 246589515 241353342 235418574 228660200 221390768 214269314
42816 214269314 207614698 200985210 193724196 185828162 177980803 170757118 164086655 157550688
42808 157550688 150946852 144416718 138146148 132076024 125946571 119708711 113917755 109452808
42800 109452808 106524385 104099478 100786862 96384753 92115581 89119001 87137351 85050550
42792 85050550 82330836 79404443 76771597 74477846 72559150 71304482 70620104 69579176
42784 69579176 67225045 63740237 60348405 58052539 56881863 56414411 56508780 57157890 57906993
42775 57906993 57900884 56612077 54358966 52068727 50599842 50215258 50526291 50887237 50913083
42766E0913083k61360l72916n32178q98901j276661j302797q19802j9329O70992
42757D6100131Q49613M84717M8258R3718N94684R16560O04284q082k14950J60194
42747D9629127N62625M13598j81163n10765k020J113324J892809J576925M18809
42738E4913269n67201p41458m31867k34655j39649J71090M09890k02870j731136
42729E1445413l003079k754525j084422N91624R70415o300j352878k028135j635302
42720D1142811m50377Q89875J708841J621232Q44598J24208O1512M64661O30998
42711D7038359L42349J87099O20933J105358P41701l77715j091672n99391N30755
42702D8497776J086427O31731j34744k97322L05294J052440J318637J124020R00852
$$ plain form
42766 50913083 50651723 50278807 49746629 48847728 47571067 46268270 45448468 45429139 46100131
42757 46100131 46949744 47434461 47482719 47576437 48171121 49087681 49691965 49683883 49468933 49629127
42747 49629127 50191752 50605350 50424187 49913422 49911402 51024726 52917535 54494460 54913269
42738 54913269 54346068 53604610 53172743 52938088 52798439 52969529 53379419 53176549 51445413
42729 51445413 48442334 45687809 44603387 45195011 46165426 46159126 44806248 42778113 41142811
42720 41142811 40692434 41582309 43291150 44912382 45756980 45881188 45942700 46407361 47038359
42711 47038359 47380708 47567807 48188740 49294098 50035799 49658084 48566412 47967021 48497776
42702 48497776 49584203 50215934 50081190 49783868 50089162 51141602 52460239 53584259 54485111
42693E4485111P16173J54488p89980j214630l64916J090491J739333J396374J376853
42684E8589297K445361L532898L291771K133319J634522K321829L168555L201700
42676H0319252K542875J715188R05269K89672K93666J004472J849222K277097
42668I1196713K320966K174140J779288J287326J359151K359209L619247M176967
42660A10273007L996875L792475L868603L953075M102959M815199N967239O547557
42652A47316989O016515N227447N216535N604602N232759M191296L993207N378877
42644A88178227P031682P268770O250953N475733N509675N452370M633611L583606
42636B33384627K923688K419252J809853J577010J928889J852091M20540j495377
$$ plain form
42693 54485111 55201284 55355772 54565792 53351162 52986246 54076737 55816070 57212444 58589297
42684 58589297 61034658 64567556 67859327 69992646 71627168 73948997 77117552 80319252
42676 80319252 82862127 84577315 85482584 85772256 86065922 87070394 88919616 91196713
42668 91196713 93517679 95691819 97471107 98758433 100117584 102476793 106096040 110273007
42660 110273007 114269882 118062357 121930960 125884035 129986994 134802193 140769432 147316989
42652 147316989 153333504 158560951 163777486 169382088 174614847 178806143 182799350 188178227
42644 188178227 195209909 202478679 208729632 214205365 219715040 225167410 229801021 233384627
42636 233384627 236308315 238727567 240537420 242114430 244043319 245895410 246315950 244820573
42628B44820573k273659k070667k688010m698458o381777o293969n432513n614816
42620B09366704o757388p271473o618760n933408o161750o920646p428654p476881
42612A54797744p126351o356907n450891m988048n023065m901671m312091l880390
42604A12758330m177987m680806m407138l309623k376662k396593l094989l539052
42596H4775480l113639k083819j340525j523632k333992k890081k769584k326869
42588F6393339j909713j353746o16516l21522r90118k062828k441888j901556
42580E4795452j244726j051630j007026o63444k12808j26357m64189q81166j002964
42571D8141142n88749K68567Q69060L64311j072098k022997j414602R644N61496
$$ plain form
42628 244820573 242546914 240476247 237788237 233089779 226708002 220414033 214981520 209366704
42620 209366704 202609316 195337843 188719083 182785675 176623925 169703279 162274625 154797744
42612 154797744 147671393 141314486 135863595 130875547 125852482 120950811 116638720 112758330
42604 112758330 108580343 103899537 99492399 96182776 93806114 91409521 88314532 84775480
42596 84775480 81661841 79578022 78237497 76713865 74379873 71489792 68720208 66393339
42588 66393339 64483626 63129880 62513364 62191842 61201724 59138896 56697008 54795452
42580 54795452 53550726 52499096 51492070 50828626 50615818 50489461 50025272 49144106 48141142
42571 48141142 47552393 47820960 48690020 49054331 47982233 45959236 44544634 44554278 45115774
42562D5115774k03243j031209p99558R9621O20619N41497L79563L30552J56619
42553D5210235k0300L25558J189950J731538J272309J87543n87310o77673n25555
42544D8106295o50851j001945j106823p32200k93217m73127j305232j840996j158885
42535C9543019L36817J197014O88547l20351o12002j79691O5300l02531q89406
42526C9526716j324821j618485j703492j392857q89654o58038o77539n06232j77742
42517C0577856k21254n74091m11106M66712R90234L13185q17561j113671n96445
42508B8613859l29441o43698p88134l09617L15248O12600P09401O99854L11563
42499B9191635l50318n25215J35696Q43909O79494j40657o93965o98477o34992
$$ plain form
42562 45115774 44912531 43881322 43081764 43181385 43802004 44343501 44723064 45053616 45210235
42553 45210235 45189935 45515493 46705443 48436981 49709290 49896833 49309523 48631850 48106295
42544 48106295 47455444 46453499 45346676 44614476 44321259 43848132 42542900 40701904 39543019
42535 39543019 39879836 41076850 41765397 41445046 40833044 40653353 40718653 40416122 39526716
42526 39526716 38201895 36583410 34879918 33487061 32597407 31939369 31261830 30755598 30577856
42517 30577856 30356602 29782511 29371405 29838117 30828351 31141536 30323975 29210304 28613859
42508 28613859 28284418 27640720 26852586 26542969 26858217 27470817 28180218 28880072 29191635
42499 29191635 28841317 28316102 28451798 29295707 29975201 29834544 29140579 28442102 27807110
42490B7807110o56324k22287R31857K065563K121759R36087n62069j310147j078499
42481C0033050m60287n2923J53377M82799Q83081R33020O10457N63669J203643
42472C4349886J853804J445100L0648j061118q24273K54531J030402J156032J013760
42463C9248772N72788o41486k279234k887212j597944M79140J354510L94650j243978
42454C3400006k230552k311306j941889j509712j230080j209814j262661j071728
42446B0632264p21526n92008o06365k47172M38091O15556j14637j022122j337114
42437A7044967j304690j453930j554157j201929q04857r17786j113564o83400
42429H010654l3338o0513m51214j37927O23724L72986j029458j746814o24563
$$ plain form
42490 27807110 27150786 26928499 27860356 29925919 32047678 32983765 32421696 31111549 30033050
42481 30033050 29572763 29519840 29673217 30156016 31039097 31972117 32582574 33146243 34349886
42472 34349886 36203690 37648790 37679438 36618320 35794047 36048578 37078980 38235012 39248772
42463 39248772 39821560 39180074 36900840 34013628 32415684 32894824 34249334 34643984 33400006
42454 33400006 31169454 28858148 26916259 25406547 24176467 22966653 21703992 20632264
42446 20632264 19910738 19318730 18712365 18465193 18903284 19518840 19404203 18382081 17044967
42437 17044967 15740277 14286347 12732190 11530261 10725404 9807618 8694054 8010654
42429 8010654 7977316 7916803 7465589 7327662 7951386 8324372 7294914 5548100 4923537
42420D923537J034177J438824P83415M46605P00744P07220K54975M9365L91391
42411A0730253P43712O69366L27969M053j58843o993L92612M77170j93676j113831
42401A1871792j257829l34778Q79843J430407J026317J66372k42359L12751J185579
42392A5038095J082115k09723j220053o11312J022808K045094J896403J292780
42384B0336207Q04254M83151N83871J249020J549321K99802j950240l132830k306296
42375A7916260q40507l96767q81885j172640r18926o93065q88587j250261j263239
42366I610383o41082K77476N59947l16145j493612j589685n55464L47394N24216
42357F723428O63988J006275N66950r97285k184375j617086j37820M87964J13955
$$ plain form
42420 4923537 5957714 7396538 8179953 8626558 9327302 10034522 10289497 10338862 10730253
42411 10730253 11473965 12143331 12471300 12475353 12316510 12309517 12702129 13179299 12985623 11871792
42401 11871792 10613963 10279185 11159028 12589435 13615752 13782124 13539765 13852516 15038095
42392 15038095 16120210 15910487 14690434 14079122 15101930 17147024 19043427 20336207
42384 20336207 21140461 21623612 22207483 23456503 25005824 25305626 23355386 20222556 17916260
42375 17916260 17075753 16678986 15797101 14624461 13705535 13012470 12123883 10873622 9610383
42366 9610383 8969301 9246777 9806724 9490579 7996967 6407282 5851818 6199212 6723428
42357 6723428 7387416 8393691 8960641 7963356 5778981 4161895 4024075 4512039 4625994
42348D625994n2434L81942P08162O59584O78338P39954L55499k34895k30581K75595
42338G907158L31150k28863n00475j55781j9176n17861q31835k76927N49607P68960
42328G025957M46851P1029l18998o61052l67366P31734J616415J304557L40446
42319A0189573l1739K28393J18898n06306n63366M52886J468248J261052Q0192
42310A2697831q60336r56353n94664l08490k29587k59776k52655o0286K17149
42301I392833J53240m04057q07100k65164R87935J820205J623374R49954M90795
42292A3942015J79060j83927j86400M36714Q69608J85259r87191j050521J80934
42283A3385551J012669K95977r11344j011947j91922J75707j41907K5239J168225
$$ plain form
42348 4625994 4573560 4955502 5663664 6323248 7001586 7741540 8097039 7862144 7631563 7907158
42338 7907158 8238308 8009445 7508970 7353189 7334013 6816152 5984317 5707390 6256997 7025957
42328 7025957 7472808 7543837 7224839 6563787 6196421 6928155 8544570 9849127 10189573
42319 10189573 10157834 10386227 10505125 9998819 9435453 9888339 11356587 12617639 12697831
42310 12697831 11837495 10881142 10286478 9977988 9748401 9488625 9235970 9175684 9392833
42301 9392833 9546073 9142016 8334916 8069752 9057687 10877892 12501266 13451220 13942015
42292 13942015 14121075 13937148 13750748 14187462 15057070 15242329 14255138 13204617 13385551
42283 13385551 14398220 14694197 13782853 12770906 12578984 12754691 12612784 12638023 13806248
42274A3806248K074860J441364l26123j658714j811329j557583j784652j997315
42266H186756r24097J363102K817250J691835j067608k856314k644761j750742
42258D815421j256907n19669Q61934J469620J88378j449481j189209M77280J072340
42249D469707o808q56578m40597o2578o85382j087342l5071J500410J845923J027130
42239E668814J80031l53431q42389r52076k48537O49115Q05460M33708M05000
42230E745695P38173P97004N83140N72756N77469L8371p42200q95611l92498L0471
42220G052770K38651P48465J401321J260725N4435j364274k186855k255381j427532
42211C522325L85152K206858K350670N15951j468429j798755q12134j44036m37308
$$ plain form
42274 13806248 15881108 17322472 16996349 15337635 13526306 11968723 10184071 8186756
42266 8186756 7262659 8625761 11443011 13134846 12067238 9210924 6566163 4815421
42258 4815421 3558514 3038845 3900779 5370399 5558777 4109296 2920087 3397367 4469707
42249 4469707 4462899 3606321 3165724 3103146 2417764 1330422 1295351 2795761 4641684 5668814
42239 5668814 5848845 5495414 4653025 3700949 3452412 4101527 4906987 5340695 5745695
42230 5745695 6483868 7280872 7864012 8436768 9014237 9052608 8310408 7414797 7022299 7052770
42220 7052770 7291421 8039886 9441207 10701932 10756367 9392093 7205238 4949857 3522325
42211 3522325 3907477 6114335 8465005 8980956 7512527 5713772 4901638 4757602 4320294
42202D320294q41532m79642M71689J214739J285074Q86831M76043J77719k22499
42193G288716o75203p02279k57039k49401j364077k651459k418698n47443J259428
42184c17455J778880J557932J431681J120764K49366m04320J4196Q47141P76403
42175G054588j69962q01578p17039o77368r79068q45537J16045J017286R59843
42166D957210L64997K11216M83351K73880p32579j667340j553024m92753N04699
42157B349657O84213K62661P452L15575Q59802J056579O71778m4871n97966n66038
42147D998842L7704O01361M31488l56653q24102m07803K63532K91763q1001K09806
42137E164937J348634K139555J559802J09003r36639j094082q21362m43593K18676
$$ plain form
42202 4320294 3478762 2999120 3470809 4685548 5970622 6857453 7333496 7511215 7288716
42193 7288716 6613513 5911234 5654195 5404794 4040717 1389258 -1029440 -1576883 -317455
42184 -317455 1461425 3019357 4451038 5571802 5821168 5416848 5431044 6278185 7054588
42175 7054588 6884626 6083048 5366009 4688641 3709573 2864036 2980081 3997367 4957210
42166 4957210 5322207 5533423 6016774 6290654 5558075 3890735 2337711 1844958 2349657
42157 2349657 3033870 3296531 3303983 3619558 4479360 5535939 6207717 6162846 5564880 4998842
42147 4998842 5036546 5637907 6069395 5712742 4888640 4480837 4744369 5036132 4955131 5164937
42137 5164937 6513571 8653126 10212928 10321931 9385292 8291210 7469848 7026255 7244931
42128G244931J118327J647735J376914O47222P0951k08943l86191m15858n8572
42119A1036516N85710J009957Q17733P1180q32530j406715j328758p45455j75254
42110I032384K02352Q38875J858274K232658R58038j037112j483035L09696K383599
42101A5295729K728891J715112Q66194M38355j61983m49005N57472K080440K111563
42092B5182768N22484m10935O23264J974862J638990K92513Q1799J366151K402116
42083C3674012J895769M18345o76282o88640O8142O11718J37693r38133j226644
42074C3275980k53132O14198M0362j216338j417282n11188j44688j097039k231758
42065B7059115k306777j549775r36150q62571j024643r27317k45044P11947Q90935
$$ plain form
42128 7244931 8363258 10010993 11387907 12035129 12106080 11897137 11510946 11095088 11036516
42119 11036516 11622226 12632183 13449916 13521096 12688566 11281851 9953093 9207638 9032384
42110 9032384 9234736 10073611 11931885 14164543 15122581 14085469 12602434 12912130 15295729
42101 15295729 18024620 19739732 20605926 21044281 20882298 20433293 20990765 23071205 25182768
42092 25182768 25705252 25294317 25917581 27892443 29531433 29823946 29905745 31271896 33674012
42083 33674012 35569781 35988126 35311844 34623204 34691346 35303064 35440757 34502624 33275980
42074 33275980 33022848 33637046 33677408 32461070 31043788 30532600 30387912 29290873 27059115
42065 27059115 24752338 23202563 22266413 21403842 20379199 19451882 19206838 19918785 20809720
42056B0809720l20349j856286j983530o23630N41506N08425J14173K24227K07164
42047A7621420p46222j904650j908223p77550J94907K42940j91201l82417q6844
42038A2062160M98699Q72447M81292n97772j471310j451276r07499n12673j14079
42029H859989P94214J825940J985052J179948M66505N35040P68109K29254r63086
42020A5680965j745335j386073l24494K85881j69322j021155j061393q0069P98829
42011A0977834N92775k89783q17777p94538o98380m87174K78113J166748J009323
42002A0937141k97739j234640o38500O02462P47831m70078j743438k129699j991720
41993C781620j894761j596869o69810N46712J294428J382424J204069R24820K92839
$$ plain form
42056 20809720 20489371 18633085 16649555 16025925 16567431 17075856 17190029 17414256 17621420
42047 17621420 16875198 14970548 13062325 12284775 12479682 12722622 12531421 12149004 12062160
42038 12062160 12560859 13433306 13914598 13316826 11845516 10394240 9486741 8974068 8859989
42029 8859989 9654203 11480143 13465195 14645143 15111648 15646688 16414797 16644051 15680965
42020 15680965 13935630 12549557 12225063 12510944 12341622 11320467 10259074 10179005 10977834
42011 10977834 11570609 11280826 10463049 9668511 8970131 8482957 8761070 9927818 10937141
42002 10937141 10639402 9404762 8766262 9368724 10116555 9646477 7903039 5773340 3781620
41993 3781620 1886859 289990 -379820 166892 1461320 2843744 4047813 4972633 5265472
41984E265472o74390j381464j284996m63714O32272J596331J997047J419834Q1296
41975G187688r86896j010105m99394n29701j142589j267795k78381J174736K070408
41966D717971K024552J185742n1587q79584n00235P01160J194541K46747q92249
41957G747058o46521O39446J205366K71935j236439k240707k547592k169664q43495
41948A79387J141987K521685K306610J046524J36014J00046K51291r710l12540
41939G361294j02020K36519j99144j309782j755831p39342O64097Q48405q7307
41930D916889o46997l38525k53258r00007j121031j45483P68545K45524p71508
41921A754149l42012J344507K139180J106781l46607p56520l28883Q2274K53152
$$ plain form
41984 5265472 4591082 3209618 1924622 1460908 2093180 3689511 5686558 7106392 7187688
41975 7187688 6200792 5190687 4691293 4161592 3019003 1751208 1472827 2647563 4717971
41966 4717971 6742523 7928265 7876678 6997094 6496859 7198019 8392560 8639307 7747058
41957 7747058 7100537 7739983 8945349 9217284 7980845 5740138 3192546 1022882 179387
41948 179387 1321374 3843059 6149669 7196193 7332207 7432253 7683544 7673834 7361294
41939 7361294 7259274 7495793 7296649 5986867 4231036 3491694 4155791 5004196 4916889
41930 4916889 4269892 3931367 3678109 2778102 1657071 1511588 2280133 2525657 1754149
41921 1754149 1412137 2756644 4895824 6002605 5655998 4899478 4570595 4652869 4906021
41912D906021K26639j15428n11715l86478Q6847O2462m31101k64163Q82708J645430
41902F101222Q58341p52759j650296j352376l89701P03376J465795J396066O55059
41893G034727J59290K08564j10654j301585k218911j582581O3789J105279R48354
41884D306272K35092m30235q07274n99630J50827P04693O42277N92265R28664
41875E722951O90620p74037k036959j339577N25740J190378K39854m84550j10119
41866C624301J51104m15619p12680r0218J97467q18732j887337j372052K53109
41857a070657J314818J365037J159877R76814N08705n123K4048L76096K24336
41848D873951n97076j452909j864136j767565j073745J39934J183176J372917
$$ plain form
41912 4906021 5132660 5017232 4505517 4119039 4205886 4268348 3837247 3573084 4455792 6101222
41902 6101222 6959563 6206804 4556508 3204132 2814431 3517807 4983602 6379668 7034727
41893 7034727 7194017 7402581 7291927 5990342 3771431 2188850 2252639 3357918 4306272
41884 4306272 4541364 4111129 3303855 2704225 2855052 3559745 4202022 4794287 5722951
41875 5722951 6413571 5639534 3602575 2262998 2788738 3979116 4218970 3734420 3624301
41866 3624301 3775405 3359786 2647106 2556888 2754355 1935623 48286 -1323766 -1070657
41857 -1070657 244161 1609198 2769075 3745889 4254594 4249471 4273519 4649615 4873951
41848 4873951 4276875 2823966 959830 -807735 -1881480 -1741546 -558370 814547
41840H14547R79107P72199Q14172N51817k6365k69240M8107L65386K28075j78384
41830D099421n40755p79879o96388P1132J355695K202780J747680K00746j263293
41821F397139j535544n07373Q39657J303033O00875m11863p80182m54740l0832
41812E420170J45480J17697j68303q22885j495074j515971p27734K70886Q51183
41803B075449R39715P50370L47802k57614q28447r73301m54628N97084J640401
41794C836831J958869J246378M7075o35978l30000M26494O83825P5892q42675
41785F466711j187528o17477L88425J111029J333159J355587J393476J295986
41777A1539368Q96766K73361m50656j168250j518671j070087p1884N14575K13814
$$ plain form
41840 814547 1793654 2565853 3380025 3931842 3905477 3636237 3684344 4049730 4277805 4099421
41830 4099421 3558666 2778787 2082399 2153531 3509226 5712006 7459686 7660432 6397139
41821 6397139 4861595 4354222 5193879 6496912 7097787 6685924 5905742 5451002 5420170
41812 5420170 5565650 5683347 5515044 4692159 3197085 1681114 953380 1224266 2075449
41803 2075449 3015164 3765534 4113336 3855722 3027275 2053974 1599346 2196430 3836831
41794 3836831 5795700 7042078 7089153 6453175 6123175 6549669 7233494 7309386 6466711
41785 6466711 5279183 4661706 5050131 6161160 7494319 8849906 10243382 11539368
41777 11539368 12436134 12709495 12258839 11090589 9571918 8501831 8429947 8944522 9158336
41768I158336k20014J29682R55505J192273O04816J0043m0136J32463K16653N00129
41758A2639750J130614J523044J143107M26994K43875O43748P66100J9507j129440
41749A7407299j714393j335539m87078K2413k08040r53981j634566j714880j044319
41740H336916l6870N54409L12817l76420p69547o32732l33654j25923J05767K74022
41730G308785n4397q37172j215232n92709M17198Q03635N25502K97632L07729
41721F960971N7623n68251r62200o94289o9101M06979N55677L91917o840l63387
41711E709099l91512j86364k0796J33729L70332L72489q7813m22629J8296O15532
41701F110363J54823j065396j270115J18635J312201O49706r59253j390908k46911
$$ plain form
41768 9158336 8938322 9068004 10023509 11215782 11820598 11830641 11790505 11922968 12139621 12639750
41758 12639750 13770364 15293408 16436515 16863509 17107384 17751132 18517232 18536739 17407299
41749 17407299 15692906 14357367 13870289 13892702 13684662 12730681 11096115 9381235 8336916
41740 8336916 8300046 8854455 9167272 8790852 8021305 7388573 7054919 6928996 7034763 7308785
41730 7308785 7254388 6417216 5201984 4609275 5026473 5830108 6355610 6653242 6960971
41721 6960971 7018594 6450343 5488143 4793854 4724753 5131732 5687409 6079326 6072486 5709099
41711 5709099 5317587 5131223 5110427 5244156 5614488 5986977 5899164 5476535 5494831 6110363
41701 6110363 6265186 5199790 3929675 4048310 5360511 6010217 5050964 3660056 3413145
41692C413145R93485J236114P14273j30601j246931k248997k312332j250364J26487
41683g05721J090988J732196K271345K338442J464167p9687j379803j702380j058265
41674C971282j16476L94134L75467L91453Q01948J119770O99966j42931m14166
41665G080447J35666O13185K83781l90787m95648J3363L16173j13655q78028j240459
41655E324038j000610n87697l90485k39081K47807Q88918R31680N5219r83939
41646D245850j164737m55618K51778L45646P6576l0547K30416P77836J277128
41637E554328J087620j40028j644490k080630j188404j79385j3908j37124L32084
41628A590063R63114P12458j95002m37234L35513R00324L36618o01918o80232
$$ plain form
41692 3413145 4406630 5642744 6357017 6226416 4979485 2730488 418156 -832208 -705721
41683 -705721 385267 2117463 4388808 6727250 8191417 8111730 6731927 5029547 3971282
41674 3971282 3854806 4248940 4624407 5015860 5817808 6937578 7637544 7494613 7080447
41665 7080447 7216113 7829298 8113079 7722292 7226644 7240007 7556180 7442525 6564497 5324038
41655 5324038 4323428 3735731 3345246 3106165 3353972 4242890 5174570 5229789 4245850
41646 4245850 3081113 2625495 2877273 3222919 3299495 3268948 3499364 4277200 5554328
41637 5554328 6641948 6501920 4857430 2776800 1588396 1409011 1395103 1257979 1590063
41628 1590063 2553177 3265635 3070633 2633399 2968912 3869236 4205854 3603936 2923704
41619B923704O9015O16081M31734j16538n61997p40586n32226O3455N79750M36021
41609C168413k71861q22453p46186j89869N46501J240426J493858R53601k1589
41600E350841n83917n43363n80451r65346r15903P5389J020762N71782r91075
41591B438719j963623j361721O1260J015853J052562N40948Q866j99649j25658
41582A467557k27236p45854j068403l96786R43357J720794J468247R61790P30889
41573D854355K24043q78573j632627j185723l30725l73191r44827m69602J211140
41564D74270K217998J192345p20628j371777l85663O14403L59016m93972m71218
41555A414774O91984J797605J774825Q23620k32648j062750j680547j657014m78196
$$ plain form
41619 2923704 2992719 3608800 4040534 3923996 3361999 2621413 2089187 2152642 2732392 3168413
41609 3168413 2896552 2074099 1327913 1138044 1684545 2924971 4418829 5372430 5350841
41600 5350841 4766924 4223561 3643110 2677764 1761861 1837250 2858012 3429794 2438719
41591 2438719 475096 -886625 -825365 190488 1243050 1783998 1792864 1593215 1467557
41582 1467557 1240321 494467 -573936 -970722 -27365 1693429 3161676 4123466 4854355
41573 4854355 5078398 4199825 2567198 1381475 1050750 677559 -267268 -736870 474270
41564 474270 2692268 3884613 3163985 1792208 1406545 2020948 2379964 1885992 1414774
41555 1414774 2106758 3904363 5679188 6502808 6270160 5207410 3526863 1869849 1391653
41546A391653J279692K101553J255760l24932j252325j105422k91618O96774J296581
41537E047716R09330k85758j111827p45056K13127P04432O41302N67118N55282
41528F495666M11445L40676L53376k86160j714279k308530o20995J958338K495561
41519G125098M80512j567086j797073j181717j177895j357656p73101p576j36066
41510c92560p31297n82274K97136Q67224P55915M20505N7847l84572m87527J13725
41500f5878P70619N65680k32313o09016m57794n54549r88673r07703K3549J035986
41490a420092J393183J193064Q07365L68188N3262J33048M95357P13510O56306
41481D393191M45457o3178r61435j578012j077192J84596R08865O01530N8175
$$ plain form
41546 1391653 2671345 4772898 6028658 5703726 4451401 3345979 3054361 3751135 5047716
41537 5047716 5957046 5671288 4559461 3814405 4027532 4731964 5373266 5940384 6495666
41528 6495666 6907111 7247787 7601163 7315003 5600724 3292194 2671199 4629537 7125098
41519 7125098 7605610 6038524 4241451 3059734 1881839 524183 -248918 -256494 -392560
41510 -392560 -1123857 -1706131 -1408995 -541771 214144 634649 692496 307924 -179603 -65878
41500 -65878 704741 1270421 1038108 429092 -28702 -583251 -1571924 -2479627 -2456078 -1420092
41490 -1420092 -26909 1166155 1973520 2341708 2394970 2528018 3023375 3736885 4393191
41481 4393191 4838648 4775470 3814035 2236023 1158831 1343427 2252292 2853822 2911997
41472B911997n6364K8118J55530P23740J586812J653751M49027r07601j257752
41463E287258j081979j489221k222451k009924n82884R62295J768439J983854
41455B615387J813293J004884k85318j131119j005757n89491o83032q88707k91529
41446E58611Q22916J024078k18040j461857j013307P69817J855239J203929M9838
41437C591224K5103Q69270R95450p3042j060066q84402j25239N2045l96358n91260
41427B402725j62032L91414O01466N36708L97629K38643J75615L43532N39152
41418E464852L72805j01585l49994j10621K20948J48920l27582q40207j016320
41409C461216n85382L99194J187508P49237r03660k238492j762304J32358J613050
$$ plain form
41472 2911997 2855633 2883751 3039281 3763021 5349833 7003584 7452611 6545010 5287258
41463 5287258 4205279 2716058 493607 -1516317 -2099201 -1136906 631533 2615387
41455 2615387 4428680 5433564 5148246 4017127 3011370 2421879 1738847 850140 558611
41446 558611 1381527 2405605 2187565 725708 -287599 482218 2337457 3541386 3591224
41437 3591224 3616327 4485597 5481047 5408005 4347939 3463537 3338298 3390343 2993985 2402725
41427 2402725 2240693 2632107 3233573 3770281 4167910 4406553 4582168 4925700 5464852
41418 5464852 5837657 5736072 5386078 5275457 5496405 5645325 5317743 4477536 3461216
41409 3461216 2875834 3275028 4462536 5211773 4308113 2069621 307317 439675 2052725
41400B052725J621037Q15088K10376j42456o00112r05955o33833j87356l43987
41391A885527r13030q24121K66522J310116J214466K32858m99054m12945L956
41382B264295j7583o36792j231480r95130J60358J332890J567170R72110M06937
41373C822775J81471j01423l59687J47526J299133J631621M14373p90600p4263
41364F170926J923758K707414J338462n31683j270201j215659j302433j208343
41356F612241j19193J499440K205365J441663J70902l41868J99467J041793J207934
41347A3917744M83635k59154j2855R82208J362891M67337o10873l92700J056592
41338A6994825K314857K433923J781661J098929N00805k63446j010987j078919
$$ plain form
41400 2052725 3673762 4488850 4699226 4556770 3956658 3050703 2416870 2229514 1885527
41391 1885527 972497 148376 414898 1725014 2939480 3172338 2673284 2260339 2264295
41382 2264295 2246712 1609920 378440 -616690 -456332 876558 2443728 3415838 3822775
41373 3822775 4004246 3902823 3543136 3690662 4989795 6621416 7035789 6245189 6170926
41364 6170926 8094684 10802098 12140560 11608877 10338676 9123017 7820584 6612241
41356 6612241 6493048 7992488 10197853 11639516 11810418 11468550 11668017 12709810 13917744
41347 13917744 14401379 14142225 14129370 15111578 16474469 16941806 16330933 15938233 16994825
41338 16994825 19309682 21743605 23525266 24624195 25125000 24861554 23850567 22771648
41330B2771648j62731J003158J163375l5217j456550j807530j300297j202226
41322A8973630j831250k103021j376317n63501o58351j183850j155468q00576
41314I301296j047563j763339j842932r53120J4106L12455J28805j46051m87382
41305C516275q42589r54622p97438n59158j72941M19048O31898j68243j391431
41296c19201j607320m31665R80472J582032J489529J069715K42399o64353o08344
41287A733264O47239J707688J311262R4539m99281k80168k8878J25150N33661
41278E344476O91806k43197j662294j912499p73059O1898m43881j081748l29844
41269c48342J282694J951219J071027k31092p59685m56026L5922K57757K31050
$$ plain form
41330 22771648 22608917 23612075 24775450 24740233 23283683 21476153 20175856 18973630
41322 18973630 17142380 15039359 13663042 13099541 12441190 11257340 10101872 9301296
41314 9301296 8253733 6490394 4647462 3694342 3708448 4020903 4149708 4003657 3516275
41305 3516275 2673686 1719064 921626 362468 189527 608575 1240473 1072230 -319201
41296 -319201 -1926521 -2358186 -1377714 204318 1693847 2763562 3005961 2341608 1733264
41287 1733264 2380503 4088191 5399453 5493992 4994711 4714543 4685665 4810815 5344476
41278 5344476 6036282 5793085 4130791 2218292 1445233 1507131 1063250 -18498 -348342
41269 -348342 934352 2885571 3956598 3725506 2965821 2509795 2545717 2803474 3034524
41260C034524K40597M10368M34217l9878p21714q74475l65134J24829K27771M03798
41250B874903P91571N22697q10244j828527r46607J120804K015508R17210n11242
41241D146073p14209k01867j23956k85199J47397Q47250O77365m50036j270603
41232B772215p98351N59893J633829J676595Q69348K7900k14716j25871n06168
41223E894674j431803j926324j300119j96434L08272P4828l12097n30902n14317
41214F5778r4933M39766J82252q78238j046070P78150K758073K241508j20659
41205D325627r49523Q47363K382524J221334j068926j647433n80803M4420k76938
41196D297645l18845K39674N28123M92100Q54285J141076M1200j993392k697977
$$ plain form
41260 3034524 3275121 3685489 4119706 4079828 3358114 2483639 2118505 2243334 2471105 2874903
41250 2874903 3666474 4189171 3378927 1550400 603793 1724597 3740105 4657315 4146073
41241 4146073 3431864 3229997 3106041 2820842 2968239 3815489 4492854 4042818 2772215
41232 2772215 1973864 2533757 4167586 5844181 6713529 6741429 6526713 6400842 5894674
41223 5894674 4462871 2536547 1236428 1039994 1348266 1423094 1110997 580095 65778
41214 65778 -29155 410611 592863 -285375 -1331445 -553295 2204778 4446286 4325627
41205 4325627 3376104 4223467 6605991 7827325 6758399 5110966 4530163 4574583 4297645
41196 4297645 3978800 4218474 4746597 5238697 6092982 7234058 7275258 5281866 2583889
41187B583889j194577O77591J070635M42315J25748J35212k43259p79335o75471
41178B142748k7428L32438J65351N2046M52307J200539J754201J523783L38458
41169G934443j012351j234588n6817J204270J172746J4127j078873j454168j312513
41160D176276r16938l79933j6600p3258j76961K11291Q26123Q05240m4987q57132
41150C553121q11203j29634L38561J97846j45551p6253N33277J220981J395813
41141F076958Q26780k42704j244022j485496n72511J005418J977146J518390K42504
41132H102463n99228p12742p62828r23253n88658K10166L83899m92077j158057
41123C459685m55825P27194O41711o80074j416290n46155Q86591J391534Q00839
$$ plain form
41187 2583889 1389312 2066903 3137538 3579853 3705601 3840813 3597554 2818219 2142748
41178 2142748 2115320 2447758 2613109 2665155 3117462 4318001 6072202 7595985 7934443
41169 7934443 6922092 5687504 5630687 6834957 8007703 8021830 6942957 5488789 4176276
41160 4176276 3259338 2879405 2862805 2789547 2612586 2823877 3650000 4455240 4410253 3553121
41150 3553121 2741918 2612284 2950845 3148691 3003140 2926887 3460164 4681145 6076958
41141 6076958 6903738 6661034 5417012 3931516 3359005 4364423 6341569 7859959 8102463
41132 8102463 7503235 6790493 6027665 5104412 4515754 4725920 5109819 4617742 3459685
41123 3459685 3003860 3731054 4372765 3692691 2276401 1730246 2616837 4008371 4809210
41114D809210q6562p60538j195625j272063p26566L18824J157114J016567j53098
41105C107263j423432j638372n90053P51355J324507R77556K11425n44590r68280
41096A207379p13230M2224K97612o76348k130554k561297j576646k23253N38829
41087e795284P96469R59058R70294O90058M47303P07635J459766K169674K140243
41078D545216R71703r15760k298740k254097j222882l79186m2236M46072J236036
41069H6126J438024N23524o49077q89133j50652O69037R26992O57478K07033k3813
41059B795539J82024M66875J62321o83877j119247o26687j151j64106o99100n21296
41049b08705L86847R71057O75397l1880o79300j242901j416842o05894Q45179
$$ plain form
41114 4809210 4722648 3962110 2766485 1494422 767856 1086680 2243794 3260361 3107263
41105 3107263 1683831 45459 -544594 206761 1531268 2508824 2720249 2175659 1207379
41096 1207379 494149 536373 833985 157637 -1972917 -4534214 -6110860 -6334113 -5795284
41087 -5795284 -4998815 -4039757 -3069463 -2379405 -1932102 -1224467 235299 2404973 4545216
41078 4545216 5516919 4601159 2302419 48322 -1174560 -1553746 -1595982 -1149910 86126
41069 86126 1524150 2047674 1398597 509464 358812 1027849 1954841 2612319 2819352 2795539
41059 2795539 2977563 3444438 3606759 2922882 1803635 1176948 1175797 1011691 312591 -208705
41049 -208705 178142 1149199 1824596 1792716 1113416 -129485 -1546327 -2152221 -1307042
41040a307042J465216N18770p23083n59940P98757J579698R22195j79670n75445
41031A939456m33153m21366l76998K11003R01326O52732n08951j208575m99630
41022B55844Q06884J135149L9807j380169j704242m70677J491336K669634K086773
41013D930339K58120j300331j736761j601463j651078j644383j040890k61159
41005d047606j55455m87526j40267J095573K057489J842531R25095K18311r8748
40996A209397k73416k80295j04013j36475o04960j021260q23816k31512J18259
40987b148091R8962J18236M30972R00251J245266J144725L78036p06273j168680
40978B93404m59600P56760J261105O67154k64693o18411k56292K02170Q2655o16405
$$ plain form
41040 -1307042 158174 676944 -46139 -606079 192678 1772376 2694571 2514901 1939456
41031 1939456 1506303 1084937 707939 918942 1820268 2473000 1964049 755474 255844
41022 255844 1062728 2197877 2237684 857515 -846727 -1317404 173932 2843566 4930339
41013 4930339 5188459 3888128 2151367 549904 -1101174 -2745557 -3786447 -4047606
41005 -4047606 -4203061 -4690587 -4830854 -3735281 -1677792 164739 1089834 1308145 1209397
40996 1209397 935981 655686 551673 415198 -189762 -1211022 -2034838 -2266350 -2148091
40987 -2148091 -2049129 -1930893 -1499921 -599670 645596 1790321 2168357 1462084 293404
40978 293404 -166196 590564 1851669 2518823 2254130 1635719 1379427 1581597 1664252 1047847
40968A047847j125225p58918J27226N36227K78729K52417Q72424J134573J35651
40959B500951j189783j148496J46343P21093m51028j881399j602964J12865J188041
40950a604377N71354n10492m25693O32828J075342J98589r41095j124082n27817
40941b655443o9049Q2905L56960O13339L81664J32748Q70374K188929K259028
40932D161455M72031j308298j229190J229L99804l98241j104655j017826o26136
40923f49827k56239K58616O19120L15389j10733L72426J301439J011732o15882
40914B246041j502515m18433R70346N78337q13429o64648J422226K904279J770621
40905F492825p76273k069670j425186n30505o52757r08027J4631J471606J592018
$$ plain form
40968 1047847 -77378 -836296 -709070 -172843 105886 358303 1230727 2365300 2500951
40959 2500951 1311168 162672 309015 1030108 579080 -1302319 -2905283 -2792418 -1604377
40950 -1604377 -1033023 -1543515 -1969208 -1336380 -261038 -62449 -1003544 -2127626 -2655443
40941 -2655443 -2724492 -2641587 -2284627 -1671288 -1289624 -1156876 -286502 1902427 4161455
40932 4161455 4633486 3325188 2095998 2097227 2497031 2098790 994135 -23691 -649827
40923 -649827 -906066 -647450 -28330 287059 176326 548752 1850191 2861923 2246041
40914 2246041 743526 325093 1295439 1873776 1060347 395699 1817925 4722204 6492825
40905 6492825 5716552 3646882 2221696 1691191 1038434 130407 145038 1616644 3208662
40896C208662Q8338j239198j157935n80781n95289m74159P57045J963664J272623
40887C242970p27346j477409k15262J011430O21044l86498n53728k14779k32823
40878A067599j45281P15759J437985P11622q79428j490066o41301L17370L18163
40869A412422j98031l67448j80538k75451r57965j651528j261664O12077K750467
40860a17659L294549J955111L80271j46429k77128j046040j908930j664586n27376
40851e8217K17713J87833J08275L01514L21599J6735k24002k46520j69053J50174
40841F06051O95368P23449k13962j084843o02462O73831J019601J53549n45641
40832A424941m49571m46233r58671j080027l87137J07048k37359m49962L47445
$$ plain form
40896 3208662 3297000 2057802 899867 319086 -276203 -750362 6683 1970347 3242970
40887 3242970 2515624 1038215 822953 1834383 2455427 2068929 1515201 1300422 1067599
40878 1067599 922318 1638077 3076062 3787684 2908256 1418190 776889 1094259 1412422
40869 1412422 1214391 846943 666405 390954 -567011 -2218539 -3480203 -2868126 -117659
40860 -117659 3176890 5132001 5512272 5365843 5088715 4042675 2133745 469159 -58217
40851 -58217 159496 347329 455604 757118 1078717 1095452 871450 624930 455877 606051
40841 606051 1301419 2024868 1810906 726063 123601 797432 1817033 1970582 1424941
40832 1424941 975370 529137 -429534 -1509561 -1896698 -1789650 -2027009 -2476971 -2129526
40823b129526J293969J109559P3944n53620l41231K07239O86703Q73270L78011
40814A598318p23563j413597q82037K80090R46525J006330J052922J032530M13499
40805C311017n45826r34659o13686l77219m99177j75704J082126K275272J874219
40796E396363k63627k468273k887619j381715L98339Q69124J75646l37414k9243
40787e28419L95254J85858l67246n49767k41149J87819M53793L76857j35709o59789
40777h82498m10201O33900J375329J006376J78416M1848O54322J133747R38970
40768D670209K07053p44793j438102j205245m2584R02967O32240l00016o54732
40759B026997l51356k48297m15453p6304P14785Q28290j16935r79068p50323N2656
$$ plain form
40823 -2129526 -835557 274002 347946 -205674 -546905 -339666 347037 1220307 1598318
40814 1598318 874755 -538842 -1420879 -1140789 -194264 812066 1864988 2897518 3311017
40805 3311017 2765191 1830532 1216846 839627 340450 164746 1246872 3522144 5396363
40796 5396363 5132736 2664463 -223156 -1604871 -1206532 -337408 -161762 -499176 -528419
40787 -528419 -133165 52693 -314553 -864320 -1105469 -917650 -463857 -87000 -222709 -882498
40777 -882498 -1292699 -658799 716530 1722906 1901322 1943170 2597492 3731239 4670209
40768 4670209 4877262 4132469 2694367 1489122 1446538 2349505 2981745 2681729 2026997
40759 2026997 1675641 1427344 1011891 935587 1650372 2478662 2361727 1382659 632336 684992
40749F84992L40947l2362m21275m32194j61542J57894K07101l13598j124438j267347
40739b361822j05283J727399K772503K158255M49053q69959q10475J31385O34872
40730C725928L02561J26263P30018J009632l04658k285834k637521q98471Q54790
40721F22708R61916K13065P0326L40683l6352r01236j129591n37987j39970n26596
40711a063034j050551p82890L77403J624536J898677P99832q14937j518036r49725
40702a478725k10318j74789k33509M82407J445421J505042P63058K94241K86150
40693B678978m3644o95311o72103R7256K08400r93606j972504j043663R98287
40684a437910J746528L98763j254927j280936M7933R55572N60494k47739k49928
$$ plain form
40749 684992 1025939 993577 572302 140108 -21434 136460 343561 29963 -1094475 -2361822
40739 -2361822 -2467105 -739706 2032797 4191052 4640105 3770146 2959671 3091056 3725928
40730 3725928 4028489 4154752 4884770 5894402 5589744 3303910 666389 -232082 622708
40721 622708 1584624 1797689 1868015 2208698 2172346 1271110 141519 -396468 -536438 -1063034
40711 -1063034 -2113585 -2896475 -2519072 -894536 1004141 1803973 989036 -529000 -1478725
40702 -1478725 -1689043 -1863832 -2097341 -1614934 -169513 1335529 2098587 2392828 2678978
40693 2678978 2635334 1940023 1267920 1365176 1573576 579970 -1392534 -2436197 -1437910
40684 -1437910 308618 707381 -547546 -1828482 -1780549 -824977 -264483 -512222 -762150
40675g62150M88861Q65966L26186l85000k45109O84509J350876J004135l2931
40666C295343q79041j000182n43118p4842o3343l88379l92813L01049J123612
40657A378286J149608L51473k84334n5366N81760P40641K26343n00408j071743
40648B516260j350716j061230L3548J508213K375798K060693R64517j14312q18084
40639F114687j248970j441671j235522o36688L4878M40790M48389N3271o00300
40630A928864j037667p26720J51921N89725q8159j203955j504103q12323j19204
40621b821621J4253J79173Q51906J354771Q74203j50092n97051k20041L09394
40612b05105O10427Q13903P34875j9288j001313j117726k12022N69965M44894
$$ plain form
40675 -762150 -273289 592677 918863 533863 288754 973263 2324139 3328274 3295343
40666 3295343 2416302 1416120 873002 798160 734817 346438 -46375 254674 1378286
40657 1378286 2527894 2879367 2595033 2539667 3121427 3862068 4088411 3588003 2516260
40648 2516260 1165544 104314 137862 1646075 4021873 6082566 7047083 6932771 6114687
40639 6114687 4865717 3424046 2188524 1551836 1586714 2027504 2475893 2529164 1928864
40630 1928864 891197 164477 316398 906123 817964 -385991 -1890094 -2702417 -2821621
40621 -2821621 -2807368 -2628195 -1776289 -421518 452685 302593 -294458 -514499 -205105
40612 -205105 405322 1219225 1954100 1934812 933499 -184227 -396249 173716 618610
40603F18610J2438Q947O6883l73487p79487l48119M13874K48244q52426j451974
40593b436497o58525P73525J683366J888135J777248J323428L08199q60159j344763
40584B453957q75257m3444M21054L21506n7577l32501k60724J49314O10225P42366
40574C128919M14810j09834m23980l64166j05983J32413L60125O30345O73713
40565D336362Q4607r41696j421880o00864R64895J842367J291087n3112j141029
40556D360737j591268j525770r28128J74834J166448J233093M00684l82365l96536
40547B511729O2617K97755J83808J06820J81439O0909m30980r08122r02950n05037
40537F57988k02850j43071P8525O81964J073023M71648q22810j441519o46683
$$ plain form
40603 618610 631048 639995 706878 333391 -446096 -794215 -380341 -132097 -984523 -2436497
40593 -2436497 -3095022 -2321497 -638131 1250004 3027252 4350680 4658879 3798720 2453957
40584 2453957 1578700 1535256 1956310 2277816 2220239 1887738 1627014 1776328 2386553 3128919
40574 3128919 3543729 3433895 3009915 2645749 2539766 2672179 3032304 3662649 4336362
40565 4336362 4420969 3479273 2057393 1456529 2421424 4263791 5554878 5501766 4360737
40556 4360737 2769469 1243699 315571 490405 1656853 2889946 3290630 2908265 2511729
40547 2511729 2574346 2872101 3055909 3162729 3344168 3405077 2974097 2065975 1163025 657988
40537 657988 455138 312067 390592 1072556 2145579 2617227 1794417 352898 -293785
40528b93785M89810L56487r85669j811753j079041K46749P43174N04338O28470
40519a201220J300317J537926P47448n14515j468829j890407j711074p39465P42603
40510c197216J786419J721341Q39655k09047j115007j599494j165615J02866J070000
40501a766098P81130j63892l79836L63026R44424O47561J07277J87571P16291
40492A437454Q47803K00787q13765j498483j391244n48847M34570R15035Q79861
40483D63171R06225J324635J743252J590749Q25890j37492r58651j527012j741196
40474B489571j463812p82402j71604j87446q22560j246878n83189Q99494J820203
40465d8623J300037J20627l00940K64220Q09613O34914L1873n32562r56014j065571
$$ plain form
40528 -293785 196025 552512 -433157 -2244910 -3323951 -3077202 -2334028 -1829690 -1201220
40519 -1201220 99097 1637023 2384471 1869956 401127 -1489280 -3200354 -3939819 -3197216
40510 -3197216 -1410797 310544 1150199 941152 -173855 -1773349 -2938964 -2836098 -1766098
40501 -1766098 -984968 -1148860 -1528696 -1165670 -221246 426315 533592 721163 1437454
40492 1437454 2285257 2486044 1672279 173796 -1217448 -1766295 -1331725 -416690 463171
40483 463171 1369396 2694031 4437283 6028032 6853922 6716430 5757779 4230767 2489571
40474 2489571 1025759 243357 71753 -115693 -938253 -2185131 -2768320 -1868826 -48623
40465 -48623 1251414 1372041 1071101 1335321 2144934 2779848 2811721 2279159 1323145 257574
40455B57574n90776J19823K65230j17006M0883J149097J987194J275308m41788
40446C945539j430218r04076L22682J064321Q73650Q0178o23051p03857l30360
40437B294808j81667m40503m93463m4198K32697j30485l75126K54090R61931M89313
40427B567397o82947q54291K26183R42872M21930j66146K51010P09048k74497
40418C140559k190475k976647j608941Q82379K829397L405994K732844J389513
40410G604623Q1192o93244q82557o99927l47808q6150k33489p47484j101496r65817
40400A927843o90107o46369m58780M18144J525917J620438K51262j482715k089802
40391C75831j242857J11885R46829J108104J117630J306551J381324R12878O2338
$$ plain form
40455 257574 -333202 -213379 51851 -65155 -24272 1124825 3112019 4387327 3945539
40446 3945539 2515321 1611245 1933927 2998248 3871898 3952076 3329025 2625168 2294808
40437 2294808 2113141 1672638 1179175 1134977 1367674 1237189 862063 1116153 2078084 2567397
40427 2567397 1884450 1030159 1256342 2199214 2621144 2454998 2706008 3415056 3140559
40418 3140559 950084 -2026563 -3635504 -2753125 76272 3482266 6215110 7604623
40410 7604623 7685815 6992571 6110014 5410087 5062279 4976129 4742640 3995156 2893660 1927843
40400 1927843 1237736 591367 132587 550731 2076648 3697086 3948348 2465633 375831
40391 375831 -867026 -755141 191688 1299792 2417422 3723973 5105297 6018175 6080513
40382F080513n11942n10956l77954n81172q36610m71753N48418J388353J233733
40373E960630J82449q55956j053578m32195K15647J90713l73146p75221o66299
40364B393044l61522k16321j51102R780J83658L00383M59737M76693j41865j205902
40354A746583j473559k17574J268274R70729j036701k372228j344409R52734K235076
40345G28925J788477P12007P0451r6977j79131m00181q29869j227704r00422N18172
40335A83748K101469K263697O23372j424321k285818j724529n65886M36217Q97337
40326E05286N60831m46174j313336j186785j39530R19550J263149Q95391J94010
40317A252392n05989r15018p96579j83426N56675R50068P23321O3798l78433j22997
$$ plain form
40382 6080513 5568571 5057615 4679661 4098489 3261879 2790126 3338544 4726897 5960630
40373 5960630 6143079 5287123 4233545 3801350 4016997 4207710 3834564 3059343 2393044
40364 2393044 2031522 1815201 1664099 1673879 1857537 2157920 2617657 3094350 2952485 1746583
40354 1746583 273024 55450 1323724 2294453 1257752 -1114476 -2458885 -1506151 728925
40345 728925 2517402 3229409 3299860 3202883 3023752 2623571 1793702 565998 -334424 183748
40335 183748 2285217 4548914 5172286 3747965 1462147 -262382 -828268 -392051 505286
40326 505286 1066117 619943 -693393 -1880178 -2019708 -1100158 162991 1058382 1252392
40317 1252392 746403 -168615 -965194 -1148620 -591945 358123 1081444 1145242 766809 643812
40307F43812L40521m9333j320043j967706q97741P47248R55450k33338p24904
40298b506034M72282J703116J121397o40487j511122q26626K41173O59370N75029
40289g11902M36475K68193Q4060J68775N94152R61393Q47981K11586o39201j178198
40279A043314r33877j6453Q04361R08868M61187q0824o14789j076760j051790
40270e56763l89616L17327O12032R12121J495199J526323L66800q43478n58251
40261B881694O47207Q10513k73510p44399J72228Q84273J57593q64299o48876
40252C022424L08188N27690j62570q09300r29150o70301j51215K72204j05797
40243A302173j162480j578436p11875J93546j23105r74693j048594n75858m79970
$$ plain form
40307 643812 984333 935000 -385043 -2352749 -3250490 -2503242 -1547792 -1781130 -2506034
40298 -2506034 -2033752 -330636 790761 150274 -1360848 -2187474 -1946301 -1286931 -711902
40289 -711902 -275427 -7234 76826 245601 839753 1801146 2649127 2860713 2221512 1043314
40279 1043314 109437 92984 897345 1806213 2267400 2186576 1571787 495027 -556763
40270 -556763 -946379 -629052 -17020 895101 2390300 3916623 4283423 3439945 2881694
40261 2881694 3528901 4339414 4065904 3321505 3493733 4378006 4535599 3671300 3022424
40252 3022424 3330612 3858302 3695732 2886432 1957282 1286981 1135766 1407970 1302173
40243 1302173 139693 -1438743 -2150618 -1957072 -2080177 -3054870 -4103464 -4679322 -5159292
40234e159292l78727N63538J565228J231435J82543L60405J818917K533439J598750
40225D316236L17145l51400j097530k175850k233398n81850J113127R89443l86533
40216i0610j044943l76823N27201P33820M15304J63025K23981L75183K25874j35802
40206A016210P7732J204205K005747R95436j107755j942004r01982l0512o50335
40197F66742j199888k51J660269J386855n89788j886224j507047o25350j20927
40188b215609L98583R91868Q88613Q4154l17622O0113K20032l85107q06949j74283
40178a256207Q93706J307759R73277M37381n0124l24305K9800R19275J317340
40169D247902N05025p66054j227205p84975l47106k66034K1054P98629J464877
$$ plain form
40234 -5159292 -5538019 -4974481 -3409253 -2177818 -1995275 -1634870 184047 2717486 4316236
40225 4316236 4633381 4281981 3184451 1008601 -1224797 -1806647 -693520 295923 -90610
40216 -90610 -1135553 -1512376 -985175 -251355 163949 326974 550955 926138 1152012 1016210
40206 1016210 1093942 2298147 4303894 5299330 4191575 2249571 1347589 1317077 666742
40197 666742 -533146 -533397 1126872 2513727 1923939 37715 -1469332 -2094682 -2215609
40188 -2215609 -1817026 -825158 63455 147609 -170013 -109900 110132 -274975 -1081924 -1256207
40178 -1256207 -362501 945258 1918535 2355916 2305792 1981487 2011287 2930562 4247902
40169 4247902 4752927 3986873 2759668 1974693 1627587 1361553 1382607 2181236 3646113
40160C646113J422630R08913N17993L23065n4814o77203j057714q30579l63663
40151C834741l78560r62650j306126o81612N34504J223803Q56317O724n50826
$$ plain form
40160 3646113 5068743 5977656 6495649 6818714 6763900 6086697 5028983 4198404 3834741
40151 3834741 3456181 2493531 1187405 505793 1040297 2264100 3120417 3127141 2576315
$$ [...]
##END NTUPLES=NMR SPECTRUM
##END=
