##TITLE=31Pdec_DE-140W_TFA
 DMSO+CCl4,64 sc
 7.4.2026
##JCAMPDX= 6.0         $$ Bruker NMR JCAMP-DX V2.0
##DATA TYPE= NMR SPECTRUM
##DATA CLASS= NTUPLES
##ORIGIN= UXNMR, Bruker Analytische Messtechnik GmbH
##OWNER= root
$$ XWIN-NMR		Version 3.5
$$ Tue Apr  7 15:24:17 2026 Russian Standard Time (UT+4h)  she@DPX200
##.OBSERVE FREQUENCY= 81.013821
##.OBSERVE NUCLEUS= ^31P
##.ACQUISITION MODE= SIMULTANEOUS
##.ACQUISITION SCHEME= undefined
##.AVERAGES= 64
##.DIGITISER RES= 17
##SPECTROMETER/DATA SYSTEM= spect
##.PULSE SEQUENCE= zgpg30
##.SOLVENT NAME= DMSO
##.SHIFT REFERENCE= (INTERNAL, DMSO, 0, 197.392)
##AUDIT TRAIL= $$ (NUMBER, WHEN, WHO, WHERE, WHAT)
$$ ##TITLE= Audit trail, XWIN-NMR		Version 3.5
$$ ##JCAMPDX= 5.01
$$ ##ORIGIN= Bruker BioSpin GmbH
$$ ##OWNER= she
$$ F:/spectra/data/she/nmr/P31/2/pdata/1/auditp.txt
$$ ##AUDIT TRAIL=  $$ (NUMBER, WHEN, WHO, WHERE, WHAT)
(   1,<2026-04-07 15:23:20.17 +0400>,<she>,<DPX200>,
      <continue with go, POWCHK disabled, PULCHK disabled
       configuration hash MD5:
       00 E9 B6 7A A2 85 ED C7 34 08 36 98 17 FE 4E 26
       data hash MD5: 32K
       F2 25 A4 D8 39 BE E9 99 B4 AC 5E D5 CB 75 D7 0E>)
(   2,<2026-04-07 15:23:22.18 +0400>,<she>,<DPX200>,
      <Start of raw data processing
       efp BC_mod = 2 LB = 1.5 FT_mod = 6 PKNL = 1 PHC0 = 1120.907 PHC1 = 712.1007 SI = 64K 
       data hash MD5: 64K
       E4 2B 48 FC 43 65 9C 98 88 16 8C 06 38 41 5B 9D>)
(   3,<2026-04-07 15:23:39.43 +0400>,<she>,<DPX200>,
      <pk PHC0 = -60.46166 PHC1 = 137.6 
       data hash MD5: 64K
       F5 16 33 8D C1 94 69 4B CE DB 5D 33 A3 43 32 B7>)
(   4,<2026-04-07 15:23:42.78 +0400>,<she>,<DPX200>,
      <abs ABSG = 5 
       data hash MD5: 64K
       EA 5B 04 E4 44 ED 62 D9 53 14 72 D1 68 DC 71 CB>)
$$ ##END=
$$ 
$$ hash MD5
$$ 3B 8F 03 FF 5F E0 50 FF 33 8F 2D DC FF 13 EA 12
##$RELAX= 
##$RELAX= 
##$RELAX= 
##$RELAX= 
##$RELAX= 
##$RELAX= 
##$RELAX= 
##$RELAX= 
$$ Bruker specific parameters
$$ --------------------------
##$DU= <F:/spectra>
##$EXPNO= 2
##$NAME= <P31>
##$PROCNO= 1
##$TYPE= <nmr>
##$USER= <she>
##$AMP= (0..31)
100 100 100 100 100 100 100 100 100 100 100 100 100 100 100 100 100 100 
100 100 100 100 100 100 100 100 100 100 100 100 100 100 
##$AQSEQ= 0
##$AQ_mod= 1
##$AUNM= <au_zg>
##$AUTOPOS= <>
##$BF1= 81.014009
##$BF2= 200.13
##$BF3= 200.13
##$BF4= 200.13
##$BF5= 200.13
##$BF6= 200.13
##$BF7= 200.13
##$BF8= 200.13
##$BYTORDA= 1
##$CFDGTYP= 0
##$CFRGTYP= 5
##$CHEMSTR= <none>
##$CNST= (0..31)
1 1 145 1 1 1 1 1 1 1 1 1 1 1 1 1 1 1 1 1 1 1 1 1 1 1 1 1 1 1 1 1 
##$CPDPRG= <waltz16>
##$CPDPRG1= <>
##$CPDPRG2= <waltz16>
##$CPDPRG3= <>
##$CPDPRG4= <mlev>
##$CPDPRG5= <mlev>
##$CPDPRG6= <mlev>
##$CPDPRG7= <mlev>
##$CPDPRG8= <mlev>
##$CPDPRGB= <>
##$CPDPRGT= <>
##$D= (0..31)
0 1 0 0 0 0 0 0 0 0.06 0 0.03 2e-05 3e-06 0 0 0.0002 0 0 0 0 0 0 0 0 0 
0 0 0 0 0 0 
##$DATE= 1775560907
##$DBL= (0..7)
120 120 120 11 120 120 24 19 
##$DBP= (0..7)
150 150 150 150 150 150 150 150 
##$DBP07= 0
##$DBPNAM0= <>
##$DBPNAM1= <>
$$ [...]
##$SUBNAM3= <"">
##$SUBNAM4= <"">
##$SUBNAM5= <"">
##$SUBNAM6= <"">
##$SUBNAM7= <"">
##$SUBNAM8= <"">
##$SUBNAM9= <"">
##$SW= 400.765351723535
##$SWIBOX= (0..15)
0 1 3 0 0 0 0 0 0 0 0 0 0 0 0 0 
##$SW_h= 32467.5324675325
##$TD= 32768
##$TD0= 1
##$TE= 0
##$TE2= 300
##$TE3= 300
##$TEG= 300
##$TL= (0..7)
0 120 53 12 22 120 120 120 
##$TP= (0..7)
150 150 150 150 150 150 150 150 
##$TP07= 0
##$TPNAME0= <>
##$TPNAME1= <>
##$TPNAME2= <>
##$TPNAME3= <>
##$TPNAME4= <>
##$TPNAME5= <>
##$TPNAME6= <>
##$TPNAME7= <>
##$TPOAL= (0..7)
0.5 0.5 0.5 0.5 0.5 0.5 0.5 0.5 
##$TPOFFS= (0..7)
0 0 0 0 0 0 0 0 
##$TUNHIN= 0
##$TUNHOUT= 0
##$TUNXOUT= 0
##$USERA1= <user>
##$USERA2= <user>
##$USERA3= <user>
##$USERA4= <user>
##$USERA5= <user>
##$V9= 5
##$VALIST= <valist>
##$VCLIST= <CCCCCCCCCCCCCCC>
##$VD= 0
##$VDLIST= <DDDDDDDDDDDDDDD>
##$VPLIST= <PPPPPPPPPPPPPPP>
##$VTLIST= <TTTTTTTTTTTTTTT>
##$WBST= 1024
##$WBSW= 4
##$XGAIN= (0..3)
0 0 0 0 
##$XL= 0
##$YL= 0
##$YMAX_a= 21356
##$YMIN_a= -11926
##$ZGOPTNS= <>
##$ZL1= 120
##$ZL2= 120
##$ZL3= 120
##$ZL4= 120
##$ABSF1= 197.3918
##$ABSF2= -203.3724
##$ABSG= 5
##$ABSL= 3
##$ALPHA= 0
##$AQORDER= 0
##$ASSFAC= 0
##$ASSFACI= 0
##$ASSFACX= 0
##$ASSWID= 0
##$AUNMP= <proc_1d>
##$AZFE= 0.1
##$AZFW= 0.5
##$BCFW= 0
##$BC_mod= 2
##$BYTORDP= 0
##$COROFFS= 0
##$CY= -3
##$DATMOD= 1
##$DC= 0
##$DFILT= <>
##$DTYPP= 0
##$F1P= 0
##$F2P= 0
##$FCOR= 1
##$FTSIZE= 65536
##$FT_mod= 6
##$GAMMA= 0
##$GB= 0
##$INTBC= 1
##$INTSCL= 9.790993e-09
##$ISEN= 30
##$LB= 1.5
##$LEV0= 0
##$LPBIN= 0
##$MAXI= 10000
##$MC2= 0
##$MEAN= 0
##$ME_mod= 0
##$MI= 50
##$NCOEF= 0
##$NC_proc= -8
##$NLEV= 6
##$NOISF1= 182.463
##$NOISF2= 159.3651
##$NSP= 0
##$NTH_PI= 0
##$NZP= 0
##$OFFSET= 197.3918
##$PC= 4
##$PHC0= 1060.445
##$PHC1= 849.7007
##$PH_mod= 1
##$PKNL= yes
##$PPARMOD= 0
##$PSCAL= 0
##$PSIGN= 0
##$REVERSE= no
##$SF= 81.014063255964
##$SI= 65536
##$SIGF1= 159.3651
##$SIGF2= -187.1042
##$SINO= 113.3802
##$SIOLD= 16384
##$SREGLST= <1H.CDCl3>
##$SSB= 0
##$STSI= 65536
##$STSR= 0
##$SW_p= 32467.5324675325
##$SYMM= 0
##$S_DEV= 0
##$TDeff= 32768
##$TDoff= 0
##$TI= <>
##$TILT= no
##$TM1= 0
##$TM2= 0
##$TOPLEV= 0
##$USERP1= <user>
##$USERP2= <user>
##$USERP3= <user>
##$USERP4= <user>
##$USERP5= <user>
##$WDW= 1
##$XDIM= 65536
##$YMAX_p= 470026177
##$YMIN_p= -35518333
$$ End of Bruker specific parameters
$$ ---------------------------------
##NTUPLES= NMR SPECTRUM
##VAR_NAME=  FREQUENCY,     SPECTRUM/REAL,   SPECTRUM/IMAG
##SYMBOL=    X,             R,               I
##VAR_TYPE=  INDEPENDENT,   DEPENDENT,       DEPENDENT
##VAR_FORM=  AFFN,          ASDF,            ASDF
##VAR_DIM=   65536,         65536,           65536
##UNITS=     HZ,            ARBITRARY UNITS, ARBITRARY UNITS
##FACTOR=    0.49542278885378, 1,            1
##FIRST=     15991.5117654749, 0,            0
##LAST=      -16476.0207020576, 0,           0
##MIN=       -16476.0207020576, -35518333,   0
##MAX=       15991.5117654749, 470026177,    0
$$ Real data points
##PAGE= N=1
##DATA TABLE= (X++(R..R)), XYDATA
$$ [...]
$$ plain form
40081 -1796808 2021802 5148576 5721750 4737814 3527814 2032483 -394800 -4075750
40073 -4075750 -8906313 -13905512 -17010462 -16532187 -12840616 -7913363 -3629445 -1052883
40065 -1052883 -304811 -42925 1734869 4833494 5986611 2853420 -2064354 -3964611
40057 -3964611 -1716120 1392694 2805949 3565957 5174698 6425298 5235596 1943028
40049 1943028 -1009323 -1684472 283186 4088239 7756745 8547389 4958411 -1587795
40041 -1587795 -7736559 -10790568 -10293424 -7912106 -6127243 -6147458 -6688743 -5660111 -3156477
40032 -3156477 -1372321 -1258097 -1206888 27282 1226508 1148555 1066160 2458165 3620149
40023 3620149 1572734 -3181927 -6805309 -7211730 -6255891 -6173989 -6450224 -5520677 -3462858
$$ packed form
40081a796808L818610L126774N73174r83936j210000j495331k427283l680950
40073d075750m830563m999199l104950M78275L691571M927253M283918K576562
40065a052883P48072K61886J777794L098625J153117l133191m917774j900257
40057c964611K248491L108814J413255P60008J608741J250600j189702l292568
40049A943028k952351o75149J967658L805053L668506P90644l588978o546206
40041a587795o148764l054009M97144K381318J784863k0215n41285J028632K503634
40032c156477J784156J14224N1209J234170J199226p7953q2395J392005J161984
40023C620149k047415m754661l623382m06421R55839Q1902k76235R29547K057819
$$ plain form
40014 -3462858 -1295968 842478 2943472 3521136 750843 -4816874 -9968631 -11534995
40006 -11534995 -9005322 -4781256 -2231300 -2923108 -5238090 -6195465 -4884522 -3164458
39998 -3164458 -2626001 -2362559 -836061 1509903 3240489 4451318 6164878 7879221
39990 7879221 8237373 8036695 9698214 12928649 13791745 10070289 5383985 5181983 9583844
39981 9583844 13004783 10930399 4656213 -1266421 -4098272 -4165820 -2732798 -615739
39973 -615739 1449961 2707140 3127885 3519073 4424434 5233841 4754017 2678543 273654
39964 273654 -712349 45751 1026970 832710 194927 961199 2946562 3203365 -395812
39955 -395812 -5647904 -7812325 -5118362 -971424 235292 -1567054 -2412264 507457
$$ packed form
40014c462858K166890K138446K100994N77664k770293n567717n151757j566364
40006a1534995K529673M224066K549956o91808k314982r57375J310943J720064
39998c164458N38457K63442J526498K345964J730586J210829J713560J714343
39990G879221L58152k00678J661519L230435Q63096l721456m686304k02002M401861
39981I583844L420939k074384o274186n922634k831851o7548J433022K117059
39973f15739K065700J257179M20745L91188R05361Q09407m79824k075474k404889
39964B73654r86003P58100R81219j94260o37783P66272J985363K56803l599177
39955c95812n252092k164421K693963M146938J206716j802346q45210K919721
$$ plain form
39947 507457 5606111 9299423 10094986 8990373 6768516 2948161 -2280541 -6865858
39939 -6865858 -8845292 -8570171 -7818518 -7358893 -6740560 -6122849 -6632534 -8451950 -9779390
39930 -9779390 -8528889 -4616710 -196630 1998784 590466 -3380883 -7144706 -8681171
39922 -8681171 -8601844 -8777755 -9299410 -8254696 -4805247 -808001 1503766 2050745 2104096
39913 2104096 2300375 2629258 3034355 2623475 -289107 -5509304 -9585676 -9328635 -5824880
39904 -5824880 -2663442 -1061758 484331 2349001 2984314 2169961 1606713 1442255 -348471
39895 -348471 -3662562 -4809517 -1783380 1813682 1105710 -3738254 -8408803 -10027259
39887 -10027259 -8753947 -5249091 -205699 3924826 4234590 1035942 -2222076 -3154967
$$ packed form
39947E07457N098654L693312P95563j104613k221857l820355n228702m585317
39939f865858j979434K75121P51653M59625O18333O17711n09685j819416j327440
39930i779390J250501L912179M420080K195414j408318l971349l763823j536465
39922h681171P9327j75911n21655J044714L449449L997246K311767N46979N3351
39913B104096J96279L28883M05097m10880k912582n220197m076372K57041L503755
39904e824880L161438J601684J546089J864670O35313q14353n63248j64458j790726
39895c48471l314091j146955L026137L597062p07972m843964m670549j618456
39887a0027259J273312L504856N043392M130525L09764l198648l258018r32891
$$ plain form
39879 -3154967 -2388743 -1108270 834804 3555122 5936798 6866278 6351119 4881768 2940337
39870 2940337 1311716 438442 -529683 -2393842 -3809948 -2641226 671512 3605711
39862 3605711 5580168 8482849 12437783 14343992 12307940 8599644 6076826 4376757
39854 4376757 2260960 1248891 3522817 7770398 10597123 11302383 12023016 13523293
39846 13523293 14050274 12609565 10557657 9251430 8256256 6501022 3548686 -484601
39838 -484601 -4602880 -6618475 -5202981 -2341207 -1585019 -3538905 -5211187 -4281713 -1751391
39829 -1751391 404668 1932702 3348356 4109264 3312346 1211887 -1010410 -2220395
39821 -2220395 -1682364 362761 2160144 2000952 732669 1034902 3734443 6754216 8288185
$$ packed form
39879c154967P66224J280473J943074K720318K381676R29480n15159j469351j941431
39870B940337j628621q73274r68125j864159j416106J168722L312738K934199
39862C605711J974457K902681L954934J906209k036052l708296k522818j700069
39854D376757k115797j012069K273926M247581K826725P05260P20633J500277
39846A3523293N26981j440709k051908j306227r95174j755234k952336m033287
39838d84601m118279k015595J415494K861774P56188j953886j672282R29474K530322
39829a751391K156059J528034J415654P60908p96918k100459k222297j209985
39821b220395N38031K045125J797383j59192j268283L02233K699541L019773J533969
$$ plain form
39812 8288185 8738023 8564540 6840776 3697154 1874017 3461704 6627413 7754188
39804 7754188 5586311 1445776 -3029526 -6230422 -6464724 -4282866 -3526618 -6982581
39796 -6982581 -11960516 -13367568 -10381558 -6555710 -3854197 -881030 2411912 2781890
39788 2781890 -1378624 -6571921 -8354741 -6659869 -4443783 -3004009 -1510330 28588
39780 28588 322573 -836259 -2033700 -2232934 -1671701 -707840 656728 1795457 1361183
39771 1361183 -1151175 -4456269 -6613390 -6788863 -5689830 -4596248 -4266199 -4711769 -5678730
39762 -5678730 -6834955 -7388129 -6309909 -3704779 -1372035 -901313 -1603303 -1683372 -1160227
39753 -1160227 -1763024 -3723854 -4762182 -3188422 -226066 2031143 3461080 5193632
$$ packed form
39812H288185M49838j73483j723764l143622j823137J587687L165709J126775
39804G754188k167877m140535m475302l200896k34302K181858P56248l455963
39796f982581m977935j407052K986010L825848K701513K973167L292942L69978
39788B781890m160514n193297j782820J694872K216086J439774J493679J538918
39780B8588K93985j158832j197441j99234N61233R63861J364568J138729m34274
39771A361183k512358l305094k157121j75473J099033J093582L30049m45570r66961
39762e678730j156225n53174J078220K605130K332744M70722p01990q0069N23145
39753a160227o02797j960830j038328J573760K962356K257209J429937J732552
$$ plain form
39745 5193632 7241135 8517147 8480338 7319348 5194493 2722367 1578609 3070813
39737 3070813 6376216 9350877 10670553 10232255 8384383 6190434 5507972 6926207
39729 6926207 8272696 7211123 4841327 4409954 6655067 9046593 9884986 10230971 10758733
39720 10758733 9683098 5965056 2342647 2328245 5276814 7228558 6384341 5196168
39712 5196168 6667478 10795234 15491448 19096851 20649524 19185026 14752474 9652967
39704 9652967 6838534 6820137 7476029 7237465 7071917 8532785 11084071 12650891 12105912
39695 12105912 9915116 6966432 4396649 4158759 7559434 12778070 15869424 15230491
39687 15230491 13401472 13320858 14508234 14487034 12374714 9013632 4818781 33063 -3505846
$$ packed form
39745E193632K047503J276012l6809j160990k124855k472126j143758J492204
39737C070813L305403K974661J319676m38298j847872k193949o82462J418235
39729F926207J346489j061573k369796m31373K245113K391526Q38393L45985N27762
39720A0758733j075635l718042l622409j4402K948569J951744q44217j188173
39712E196168J471310M127756M696214L605403J552673j464498m432552n099507
39704I652967k814433j8397O55892k38564j65548J460868K551286J566820n44979
39695A2105912k190796k948684k569783k37890L400675N218636L091354o38933
39687A5230491j829019q0614J187376k1200k112320l361082m194851m785718l538909
$$ plain form
39678 -3505846 -3571728 -683660 2301163 4134349 6481629 10535338 14494653 15859842
39670 15859842 14787105 13572499 13493754 13477359 11794583 8409899 5586090 6044565 10090778
39661 10090778 14876197 17276533 17029312 15898938 14519971 12263665 10182242 11297308
39653 11297308 16585240 22646922 25205278 23886350 22055097 22706139 25841227 29275806
39645 29275806 30717329 29266774 25836597 22188658 19392588 17509870 16436109 15962958
39637 15962958 15218557 13638883 12539058 13769105 16518991 17879624 17409326 18389457
39629 18389457 22855231 27967984 29714505 28063559 25677182 23346935 20045841 16373308
39621 16373308 14368948 14118753 13649256 12228486 10977524 10240420 9302408 8885182 10718618
$$ packed form
39678c505846o5882K888068K984823J833186K347280M053709L959315J365189
39670A5859842j072737j214606p8745j6395j682776l384684k823809M58475M046213
39661A0090778M785419K400336k47221j130374j378967k256306k081423J115066
39653A1297308N287932O061682K558356j318928j831253O51042L135088L434579
39645B9275806J441523j450555l430177l647939k796070j882718j073761m73151
39637A5962958p44401j579674j099825J230047K749886J360633m70298R80131
39629A8389457M465774N112753J746521j650946k386377k330247l301094l672533
39621A6373308k004360k50195m69497j420770j250962p37104r38012m17226J833436
$$ plain form
39612 10718618 13903820 14840757 12133116 8923052 8784353 11546817 14761770 17096933
39604 17096933 18319575 17772668 15249996 12427784 11391293 12151368 12952738 12438108 10376268
39595 10376268 7081129 3465224 1111465 1034104 2580877 4197582 4691369 3337453
39587 3337453 5778 -3870031 -5759186 -4864665 -3447617 -3777360 -4720996 -3392698 168563
39578 168563 2183144 -337106 -5613431 -8591883 -6014518 326388 5139987 4417955
39570 4417955 -1063937 -6978109 -9968641 -10330600 -10291476 -10914933 -11408326 -10480768 -7477758
39561 -7477758 -2987569 810506 1326622 -1827238 -6202892 -9493664 -12003074 -14665450
39553 -14665450 -15888953 -12950948 -6464920 -1012157 -428059 -3936968 -7686222 -8897274
$$ packed form
39612A0718618L185202R36937k707641l210064j38699K762464L214953K335163
39604A7096933J222642n46907k522672k822212j036491P60075Q01370n14630k061840
39595A0376268l295139l615905k353759p7361J546773J616705M93787j353916
39587C337453l331675l875809j889155Q94521J417048l29743r43636J328298L561261
39578A68563K014581k520250n276325k978452K577365O340906M813599p22032
39570D417955n481892n914172k990532l61959L9124o23457m93393R27558L003010
39561g477758M490189L798075N16116l153860m375654l290772k509410k662376
39553a4665450j223503K938005O486028N452763N84098l508909l749254j211052
$$ plain form
39545 -8897274 -7847876 -6878845 -8253307 -12237597 -16618262 -18569770 -17253147 -14063952
39537 -14063952 -10598086 -7675372 -6375873 -8026034 -12000548 -15135895 -15110044 -13414001
39529 -13414001 -12904838 -13010337 -10151124 -3595882 1948825 1919594 -1587097 -2003111 3211434
39520 3211434 9413810 11040937 7968988 3560438 -824010 -5749734 -9707788 -9763688
39512 -9763688 -6545014 -4364819 -4940225 -4839775 -1445849 2213774 2048036 -565711 -1227304
39503 -1227304 190437 -430069 -4407503 -7993709 -8097974 -6150913 -4586168 -3074225
39495 -3074225 -645676 1267967 795084 -1122504 -2095106 -1773471 -1589478 -1837365 -1393139
39486 -1393139 -76129 823983 568403 -149135 -747752 -1867769 -4213329 -6980770 -8244666
$$ packed form
39545h897274J049398R69031j374462l984290m380665j951508J316623L189195
39537a4063952L465866K922714J299499j650161l974514l135347K5851J696043
39529a3414001N09163j05499K859213O555242N544707k9231l506691m16014N214545
39520C211434O202376J627127l071949m408550m384448m925724l958054n5900
39512i763688L218674K180195n75406J00450L393926L659623j65738k613747o61593
39503a227304J417741o20506l977434l586206j04265J947061J564745J511943
39495c074225K428549J913643m72883j917588r72602L21635J83993k47887M44226
39486a393139J317010R00112k55580p17538n98617j120017k345560k767441j263896
$$ plain form
39477 -8244666 -7055932 -4860365 -4254749 -6048026 -8344316 -9405768 -10404354 -13424186
39469 -13424186 -17313475 -18376237 -15776178 -13263464 -13825505 -15204536 -13275347 -8069911
39461 -8069911 -3551135 -2432278 -4056057 -6809304 -9694716 -11464323 -10934147 -8780826
39453 -8780826 -6940802 -5804555 -4082469 -1830530 -1121615 -2598604 -3586031 -1403459
39445 -1403459 2832743 5434057 4346416 760541 -2747336 -4269306 -3199172 -279182
39437 -279182 2737661 4255736 3971590 2721984 1466669 676573 365976 350311 628587
39428 628587 1562944 3270120 4809863 4650183 2268199 -1164932 -3935756 -5271797 -5695324
39419 -5695324 -6450238 -8485002 -11219340 -12377133 -10125697 -5638365 -2428610 -2584980
$$ packed form
39477h244666J188734K195567O05616j793277k296290j061452r98586l019832
39469a3424186l889289j062762K600059K512714n62041j379031J929189N205436
39461h069911M518776J118857j623779k753247k885412j769607N30176K153321
39453h780826J840024J136247J722086K251939P08915j476989r87427K182572
39445a403459M236202K601314j087641l585875l507877j521970J070134K919990
39437b79182L016843J518075k84146j249606j255315p90096l10597j5665K78276
39428F28587R34357J707176J539743j59680k381984l433131k770824j336041m23527
39419e695324p54914k034764k734338j157793K251436M487332L209755j56370
$$ plain form
39411 -2584980 -4532689 -5063228 -2806104 756616 2887398 1796882 -1762114 -4621658
39403 -4621658 -3994259 -683047 1691362 1191935 -334650 -520250 309595 1048740 2886863
39394 2886863 7381899 12421709 13623287 10012529 5165662 1954336 -651131 -4009326
39386 -4009326 -6183824 -4729024 -1132960 758540 -72260 -1201286 -1022158 -548558 -561869
39377 -561869 -5968 1439445 1723516 -645002 -3809704 -4882582 -3807512 -2700638 -2356990
39368 -2356990 -2011309 -2050263 -3970776 -7246956 -9004143 -7744265 -4954494 -2055339 1348974
39359 1348974 4474317 3855354 -1892936 -8103364 -8923643 -5026936 -2232825 -2877544 -3289865
39350 -3289865 -595137 2853261 4048359 4103929 5217544 6121153 4329862 645597 -2396511
$$ packed form
39411b584980j947709n30539K257124L562720K130782j090516l558996k859544
39403d621658O27399L311212K374409m99427j526585j85600Q29845P39145J838123
39394B886863M495036N039810J201578l610758m846867l211326k605467l358195
39386d009326k174498J454800L596064J891500q30800j129026J79128M73600j3311
39377e61869N55901J445413K84071k368518l164702j072878J075070J106874L43648
39368b356990L45681l8954j920513l276180j757187J259878K789771K899155L404313
39359A348974L125343o18963n748290o210428q20279L896707K794111o44719m12321
39350c289865K694728L448398J195098N5570J113615R03609j791291l684265l042108
$$ plain form
39341 -2396511 -4820620 -7951874 -10160439 -8278351 -2915631 1881064 4415426 6520347
39333 6520347 8405212 7121281 2131525 -1952306 -1417603 950174 -17239 -4333604
39325 -4333604 -7369428 -6848770 -5467500 -6316082 -8811766 -10246676 -9447453 -7724040 -6985330
39316 -6985330 -7542937 -7690380 -5739941 -2453806 -247084 409541 1860127 5310625 8237630
39307 8237630 8082071 6608697 7258677 9280493 8475214 3803143 -822492 -2411804 -2747379
39298 -2747379 -4328624 -5776230 -4266347 -377006 2663508 3369073 2814353 1958129 1028497
39289 1028497 1126797 3417301 6367329 6473622 2659501 -2109652 -4528642 -4412701 -3467014
39280 -3467014 -2557740 -1814082 -1928455 -3317546 -4741751 -4625004 -3310075 -2234753 -1293565
$$ packed form
39341b396511k424109l131254k208565J882088N362720M796695K534362K104921
39333F520347J884865j283931m989756m083831N34703K367777r67413m316365
39325d333604l035824N20658J381270q48582k495684j434910P99223J723413P38710
39316f985330n57607j47443J950439L286135K206722O56625J450586L450498K927005
39307H237630j55559j473374O49980K021816q05279m672071m625635j589312l35575
39298b747379j581245j447606J509883L889341L040514P05565n54720q56224r29632
39289A028497R8300K290504K950028J06293l814121m769153k418990J15941R45687
39280c467014R09274P43658j14373j389091j424205J16747J314929J075322R41188
$$ plain form
39271 -1293565 738010 3006854 2440985 -1866720 -6301878 -6951251 -4814065 -4109079 -5951413
39262 -5951413 -6945766 -4873764 -2633602 -4107930 -8075740 -9484102 -6377084 -2402012
39254 -2402012 -1584168 -3266460 -4030189 -2711953 -927759 579175 3131706 6996623
39246 6996623 9596005 8724334 6135614 5566238 7550784 8676684 6614400 3513810
39238 3513810 2689001 3718042 3445362 1101941 -534305 587026 3157904 5224468
39230 5224468 6882038 8424005 8184965 5023697 1442748 978257 3004838 3357590 312237
39221 312237 -3182420 -4095069 -3217432 -2934723 -3518713 -3730394 -3431143 -3304385 -2848062
39212 -2848062 -732650 2996026 6469919 7748031 6324284 3297160 473014 -1504893
$$ packed form
39271a293565K031575K268844n65869m307705m435158o49373K137186P04986j842334
39262e951413r94353K072002K240162j474328l967810j408362L107018L975072
39254b402012Q17844j682292p63729J318236J784194J506934K552531L864917
39246F996623K599382q71671k588720n69376J984546J125900k062284l100590
39238C513810q24809J029041k72680k343421j636246J121331K570878K066564
39230E224468J657570J541967k39040l161268l580949m64491K026581L52752l045353
39221C12237l494657r12649Q77637K82709n83990k11681K99251J26758M56323
39212b848062K115412L728676L473893J278112j423747l027124k824146j977907
$$ plain form
39204 -1504893 -4410074 -10320040 -17628804 -21326974 -18942136 -14257814 -12656388 -14164146
39196 -14164146 -14076092 -9731040 -3373584 1791551 5038292 6591117 5692884 2315189
39188 2315189 -979514 -1132228 1980752 5582501 7091269 6246378 4528331 3311599
39180 3311599 2599650 1342175 -970671 -3442319 -5062609 -6233433 -7851358 -9415124
39172 -9415124 -9673105 -8841534 -8179227 -7369242 -4698507 -348068 3029611 4057252 4413370
39163 4413370 5375681 5293501 2912984 829696 2217538 5445809 5681148 1640393 -2710185
39154 -2710185 -3706462 -2141123 -848972 -937416 -2062733 -4234776 -7196363 -9254871 -8724122
39145 -8724122 -6025603 -3027661 -884701 293757 404455 -445131 -1032451 62513 2413252
$$ packed form
39204a504893k905181n909966p308764l698170K384838M684322J601426j507758
39196a4164146Q8054M345052O357456N165135L246741J552825q98233l377695
39188B315189l294703j52714L112980L601749J508768q44891j718047j216732
39180C311599p11949j257475k312846k471648j620290j170824j617925j563766
39172i415124k57981Q31571O62307Q09985K670735M350439L377679J027641L56118
39163D413370R62311q2180k380517k083288J387842L228271K35339m040755m350578
39154b710185r96277J565339J292151q8444j125317k172043k961587k058508N30749
39145h724122K698519K997942K142960J178458J10698q49586n87320J094964K350739
$$ plain form
39136 2413252 3834008 2886627 426756 -1622259 -2174418 -1350531 68781 875476 -67422
39127 -67422 -2517337 -4407148 -3819751 -1441074 -22352 -1147851 -3606131 -5543180 -7035899
39118 -7035899 -9193988 -11419146 -11453385 -8457061 -4442883 -1813998 -686460 239534 1104918
39109 1104918 730836 -1218981 -3377050 -4319735 -4042184 -3242039 -1903650 508293 3548239
39100 3548239 5291965 3970392 74626 -3731750 -5183901 -4494988 -3324621 -2235735
39092 -2235735 -419584 2115954 3730408 3335967 2126642 1920968 2590379 2369563 208507
39083 208507 -3266714 -6601217 -8213094 -6875093 -2908732 1384536 3708088 3824241
39075 3824241 2521325 -457201 -5312138 -9596852 -9696856 -5629755 -1811521 -1737793 -4082882
$$ packed form
39136B413252J420756r47381k459871k049015n52159Q23887J419312Q06695r42898
39127f7422k449915j889811N87397K378677J418722j125499k458280j937049j492719
39118g035899k158089k225158l4239K996324M014178K628885J127538R25994Q65384
39109A104918l74082j949817k158069r42685K77551Q00145J338389K411943L039946
39100C548239J743726j321573l895766l806376j452151O88913J170367J088886
39092b235735J816151K535538J614454l94441j209325k05674O69411k20816k161056
39083B08507l475221l334503j611877J338001L966361M293268K323552J16153
39075C824241j302916k978526m854937m284714j00004M067101L818234P3728k345089
$$ plain form
39066 -4082882 -5674174 -6171364 -7345300 -9159446 -9573939 -8040777 -6570744 -6779451 -7838672
39057 -7838672 -8090086 -7101079 -5286973 -2909562 -583519 276952 -1088115 -3309252 -4079835
39048 -4079835 -2764027 -853872 211334 690526 1633347 3168482 4411885 4611105 3619247
39039 3619247 1565098 -949574 -2388476 -1366275 1107917 1612587 -2087711 -7832425
39031 -7832425 -10858373 -8921427 -4451582 -1330694 -777554 -1166694 -854698 130792 926550
39022 926550 1121929 828396 119304 -1085185 -2773184 -4871004 -7488524 -10698268 -13809487
39013 -13809487 -15309327 -14255914 -11623871 -9357004 -7985212 -6386076 -4323383 -3529657
39005 -3529657 -4912666 -6222062 -4737045 -1434688 152862 -912954 -1738756 14326
$$ packed form
39066d082882j591292m97190j173936j814146m14493J533162J470033k08707j059221
39057g838672k51414R89007J814106K377411K326043Q60471j365067k221137p70583
39048d079835J315808J910155J065206M79192R42821J535135J243403J99220r91858
39039C619247k054149k514672j438902J022201K474192N04670l700298n744714
39031g832425l025948J936946M469845L120888N53140l89140L11996R85490P95758
39022I26550J95379k93533p09092j204489j687999k097820k617520l209744l111219
39013a3809487j499840J053413K632043K266867J371792J599136K062693P93726
39005c529657j383009j309396J485017L302357J587550j065816q25802J753082
$$ plain form
38997 14326 3264033 6075759 8374905 10308699 10258220 6973571 2254472 -882219 -1734272
38988 -1734272 -1469760 -200676 2873323 6758059 8715310 7478019 4563998 1943149
38980 1943149 -61358 -2024799 -3755991 -4003842 -1489103 3563390 8660476 10866339
38972 10866339 10206443 9828848 11429228 12305534 9277504 3948262 840663 1176323 2211299
38963 2211299 2597755 4241599 7786462 10184419 8931201 5819792 4173811 4595772
38955 4595772 5614085 6459740 6825369 5512267 1756586 -3025444 -6518358 -7528696
38947 -7528696 -5759609 -1620282 2286197 2099236 -2471987 -6624934 -6572787 -4756595 -5462702
38938 -5462702 -7663370 -6992386 -3367382 -1030035 -1093345 89075 3768928 5659783 2795376
$$ packed form
38997A4326L249707K811726K299146J933794n0479l284649m719099l136691q52053
38988a734272K64512J269084L073999L884736J957251j237291k914021k620849
38980A943149k004507j963441j731192k47851K514739N052493N097086K205863
38972A0866339o59896l77595J600380Q76306l028030n329242l107599L35660J034976
38963B211299L86456J643844L544863K397957j253218l111409j645981M21961
38955D595772J018313Q45655L65629j313102l755681m782030l492914j010338
38947g528696J769087M139327L906479j86961m571223m152947N2147J816192p06107
38938e462702k200668O70984L625004K337347o3310J182420L679853J890855k864407
$$ plain form
38929 2795376 -1143610 -1150336 1941308 3731179 3122557 2505477 2681446 2199638 1332257
38920 1332257 2372634 5279777 6624778 4254506 322185 -1858482 -1903578 -1658290 -1966696
38911 -1966696 -2023892 -1281791 -378400 -64641 -106944 382764 1698306 2842098 2477090
38902 2477090 806529 -136810 1149290 3504234 4491017 3704879 3305112 4959979 7536073
38893 7536073 8520576 6888472 3848852 1302780 163774 -129308 -804664 -2220927 -3162324
38884 -3162324 -2284923 -252575 555892 -1127785 -3796356 -4886549 -3458873 -669945
38876 -669945 1594652 1885560 -94807 -2823412 -3544300 -792212 3695111 6500756 5947561
38867 5947561 3242404 444369 -1565003 -2916734 -3737875 -4016863 -3847591 -3147824 -1549256
$$ packed form
38929B795376l938986o726L091644J789871o08622o17080J75969m81808q67381
38920A332257J040377K907143J345001k370272l932321k180667m5096K45288l08406
38911a966696n7196P42101R03391L13759m2303M89708J315542J143792l65008
38902B477090j670561r43339J286100K354944R86783p86138l99767J654867K576094
38893G536073R84503j632104l039620k546072j139006k93082o75356j416263r41397
38884c162324Q77401K032348Q08467j683677k668571j090193J427676K788928
38876f69945K264597K90908j980367k728605p20888K752088M487323K805645n53195
38867E947561k705157k798035k009372j351731q21141k78988J69272O99767J598568
$$ plain form
38858 -1549256 807602 2659445 2528839 329918 -2422924 -4174688 -4699191 -4635972 -4085928
38849 -4085928 -2468748 -26070 1282724 -644084 -5535463 -10566325 -12951327 -12113716
38841 -12113716 -9125718 -5079693 -883403 2164571 2997883 1888600 -122804 -2738976
38833 -2738976 -6117553 -9170449 -9877471 -7969352 -5795306 -5418234 -6066646 -5822445 -4731810
38824 -4731810 -4344275 -4732508 -4212161 -2283377 -761161 -1046004 -1907926 -1278191 892632
38815 892632 2903966 3557020 2751158 603569 -2312428 -4220286 -3535127 -1197365 146139
38806 146139 -221276 -37701 2421952 5463224 6112577 3910805 783191 -2008567 -4636985
38797 -4636985 -6693495 -6739955 -4534191 -1907848 -453076 322148 1561797 3038335 3780419
$$ packed form
38858a549256K356858J851843j30606k198921k752842j751764n24503O3219N50044
38849d085928J617180K442678J308794j926808m891379n030862k385002Q37611
38841a2113716K987998M046025M196290L047974Q33312j109283k011404k616172
38833b738976l378577l052896p07022J908119K174046L77072o48412K44201J090635
38824d731810L87535l88233N20347J928784J522216k84843q61922O29735K170823
38815H92632K011334O53054q05862k147589k915997j907858O85159K337762J343504
38806A46139l67415J83575K459653L041272O49353k201772l127614k791758k628418
38797d636985k056510m6460K205764K626343J454772P75224J239649J476538P42084
$$ plain form
38788 3780419 3764242 3622137 3277551 2210264 746833 -157657 -313981 -443502 -993285
38779 -993285 -1638059 -1783984 -842875 1499510 4285742 5158048 2678346 -1510528 -4361467
38770 -4361467 -5046892 -5167596 -5476003 -4697352 -2239902 217029 1168760 1464455 2476583
38761 2476583 3704450 4037028 4031787 4750901 5259514 3671233 304533 -2516179 -3803703
38752 -3803703 -4856724 -6656016 -8602416 -10528511 -13663354 -18111945 -21062226 -19443260
38744 -19443260 -13662963 -7109013 -2293996 1036234 3977527 6148238 6140895 3702124
38736 3702124 515387 -1466594 -2022204 -2467788 -3673115 -5153658 -6342947 -7548194
38728 -7548194 -8652268 -7921986 -3869228 1922959 5513252 4391804 -678516 -7464082
$$ packed form
38788C780419j6177j42105l44586j067287j463431r04490j56324j29521n49783
38779i93285o44774j45925R41109K342385K786232Q72306k479702m188874k850939
38770d361467o85425j20704l08407P78651K457450K456931R51731K95695J012128
38761B476583J227867L32578n241P19114N08613j588281l366700k820712j287524
38752c803703j053021j799292j946400j926095l134843m448591k950281J618966
38744a9443260N780297O553950M815017L330230K941293K170711p343k438771
38736C702124l186737j981981n55610m45584j205327j480543j189289j205247
38728g548194j104074P30282M052758N792187L590293j121448n070320o785566
$$ plain form
38720 -7464082 -14059884 -18563491 -19151717 -15943363 -11585581 -8687624 -7381457 -6134004
38712 -6134004 -3863509 -459072 3383580 5660076 3887943 -1759076 -7140986 -7949059
38704 -7949059 -4386537 -437661 1031674 711655 788852 2380836 5067425 7281761 6983607
38695 6983607 3437036 -1462103 -4867754 -5929191 -5784465 -5117288 -3753979 -2578430
38687 -2578430 -3338347 -5808685 -7343599 -6331514 -4212415 -2929861 -2279113 -1240496
38679 -1240496 -219872 -214528 -1118736 -2582868 -5235370 -9124242 -12133525 -12174675 -10152112
38670 -10152112 -8549432 -7802720 -6557203 -5001530 -4948699 -6312854 -6500678 -4439921 -2695208
38661 -2695208 -3930823 -7148520 -9225300 -8834546 -7144986 -5741601 -5586691 -7162726
$$ packed form
38720g464082o595802m503607n88226L208354M357782K897957J306167J247453
38712f134004K270495L404437L842652K276496j772133n647019n381910q08073
38704g949059L562522L948876J469335l20019P7197J591984K686589K214336k98154
38695F983607l546571m899139l405651j061437J44726O67177J363309J175549
38687b578430p59917k470338j534914J012085K119099J282554O50748J038617
38679a240496J020624N344r04208j464132k652502l888872l009283m1150K022563
38670a0152112J602680P46712J245517J555673N2831j364155j87824K060757J744713
38661b695208j235615l217697k076780L90754J689560J403385J54910j576035
$$ plain form
38653 -7162726 -9780194 -11189593 -9631037 -6165075 -3515165 -2703924 -2283520 -873256
38645 -873256 1139410 2790349 3941275 4707694 4561936 3007623 679145 -1000395 -1180908
38636 -1180908 -329539 273025 -156848 -815694 133111 3290048 6748811 8170290 7758573
38627 7758573 7547427 7747896 6120687 2089542 -731219 1589569 8033039 13672496
38619 13672496 15493818 14642750 12812470 9295212 3089497 -4012461 -8412496 -8076697
38611 -8076697 -3771662 2103947 6624806 7323978 4086408 1047 -1259517 854031
38603 854031 3805747 5629900 7011137 9348990 12301610 14221366 14022144 11662952
38595 11662952 7615182 2902199 -983596 -3374497 -5253242 -7664114 -9672510 -9342287
$$ packed form
38653g162726k617468j409399J558556L465962K649910Q11241M20404J410264
38645h73256K012666J650939J150926P66419j45758j554313k328478j679540j80513
38636a180908Q51369O02564m29873o58846R48805L156937L458763J421479m11717
38627G758573k11146K00469j627209m031145k820761K320788O443470N639457
38619A3672496J821322q51068j830280l517258o205715p101958m400035L35799
38611h076697M305035N875609M520859O99172l237570m085361j260564K113548
38603H54031K951716J824153J381237K337853K952620J919756j99222k359192
38595A1662952m047770m712983l885795k390901j878745k410872k008396L30223
$$ plain form
38587 -9342287 -6746997 -4380148 -3944229 -4197234 -3162015 -1336270 -937372 -2302607 -2988176
38578 -2988176 -1082043 2064655 3601087 2795593 1435461 897285 497796 -634232 -1506881
38569 -1506881 -646435 1005677 528168 -2983057 -6432299 -6283204 -3282981 -1639023 -3452299
38560 -3452299 -6116587 -6176285 -3739947 -1243700 492705 2141528 2595649 -466883 -5807916
38551 -5807916 -7917757 -3628854 2864656 4778993 1284047 -2148618 -1523267 1347266
38543 1347266 3113941 3761308 4850363 5641837 4309025 1735069 660410 1179335 383355
38534 383355 -2604139 -4231505 -1243470 4221345 7042913 5784904 3933380 4202222
38526 4202222 4713707 2634922 -793859 -1880859 -103613 1309662 704258 520330 2977941
$$ packed form
38587i342287K595290K366849M35919k53005J035219J825745L98898j365235o85569
38578b988176J906133L146698J536432q05494j360132n38176l99489j132028q72649
38569a506881Q60446J652112m77509l511225l449242J49095L000223J643958j813276
38560c452299k664288n9698K436338K496247J736405J648823M54121l062532n341033
38551e807916k109841M288903O493510J914337l494946l432665O25351K870533
38543A347266J766675O47367J089055P91474j332812k573956j074659N18925p95980
38534C83355k987494j627366K988035N464815K821568j258009j851524K68842
38526D202222N11485k078785l428781j087000J777246J413275o05404j83928K457611
$$ plain form
38517 2977941 6169647 6942225 5472685 3923950 2193127 -1229962 -4906310 -5236069
38509 -5236069 -2156377 26918 -1069941 -2687535 -2294333 -2442951 -6585416 -12606889
38501 -12606889 -14903723 -11860800 -7223447 -4332255 -2889141 -1868946 -1829427 -2774388
38493 -2774388 -2604097 233777 4194411 6321132 5329233 2046610 -1781635 -4045110
38485 -4045110 -3141842 136091 2501667 1417351 -2006087 -4379544 -3816721 -1407886
38477 -1407886 625974 1215172 935969 963655 1749036 2584113 2443869 1038598 -1221953
38468 -1221953 -3851858 -6258792 -7633647 -7841267 -7914134 -8448001 -8153943 -5806329 -3136984
38459 -3136984 -3198492 -5469464 -5388918 -194476 6980970 10622074 8708257 3265855 -3205074
$$ packed form
38517B977941L191706P72578j469540j548735j730823l423089l676348l29759
38509e236069L079692K183295j096859j617594L93202j48618m142465o021473
38501a2606889k296834L042923M637353K891192J443114J020195L9519r44961
38493b774388J70291K837874L960634K126721r91899l282623l828245k263475
38485d045110R03268L277933K365576j084316l423438k373457N62823K408835
38477a407886K033860N89198k79203K7686P85381Q35077j40244j405271k260551
38468a221953k629905k406934j374855k07620p2867n33867K94058K347614K669345
38459c136984o1508k270972Q0546N194442P175446L641104j913817n442402o470929
$$ plain form
38450 -3205074 -9309245 -13662039 -14953824 -13489805 -11116652 -9375177 -8598502 -8379900
38442 -8379900 -7768271 -5528134 -1561515 2321650 4314198 4727241 4763587 3958514 1017562
38433 1017562 -2962365 -4631313 -2672561 -88006 -815153 -5080736 -9336118 -10218153
38425 -10218153 -7517498 -3518148 -428693 1236836 2265312 3382836 4585507 5544843
38417 5544843 6006595 5627517 4105591 1858762 -97229 -1435858 -2941497 -4999559
38409 -4999559 -6476287 -6021211 -3839571 -1260366 721793 1438234 54556 -3235047
38401 -3235047 -6042289 -5739221 -2697781 27155 519096 55653 975196 3851476 7342298
38392 7342298 9685844 9690448 7173465 3208481 -424813 -2353907 -2026608 465234 4044958
$$ packed form
38450c205074o104171m352794j291785J464019K373153J741475P76675K18602
38442h379900O11629K240137L966619L883165J992548M13043L6346q05073k940952
38433A017562l979927j668948J958752K584555p27147m265583m255382q82035
38425a0218153K700655L999350L089455J665529J028476J117524J202671R59336
38417E544843M61752l79078j521926k246829j955991j338629j505639k058062
38409d999559j476728M55076K181640K579205J982159P16441j383678l289603
38401c235047k807242L03068L041440K724936M91941m63443R19543K876280L490822
38392G342298K343546M604k516983l964984l633294j929094L27299K491842L579724
$$ plain form
38383 4044958 6569232 6562766 5153166 4902933 6441226 7676746 6876800 5075542 4394219
38374 4394219 4940566 4589713 1616390 -3181682 -7052105 -7894246 -6362274 -4951865 -4658360
38365 -4658360 -3575826 -51250 3829217 4222472 830663 -2377533 -2429306 -884839 -854998
38356 -854998 -2733118 -4749134 -5948047 -6292223 -5006661 -1437746 2758318 4614081
38348 4614081 3335425 1092850 51858 129380 104403 -435836 -963757 -906731 -69154
38339 -69154 1247200 2262127 2522250 2848478 4583278 7535721 9672639 9589957 8445982
38330 8445982 8320168 9081861 8218993 3958572 -2517024 -8300300 -11101560 -9855345 -4583068
38321 -4583068 2618518 7416425 6687035 2576958 868236 4187487 8770479 9458445
$$ packed form
38383D044958K524274o466j409600k50233J538293J235520p99946j801258o81323
38374D394219N46347l50853k973323m798072l870423q42141J531972J410409K93505
38365d658360J082534L524576L880467L93255l391809l208196n1773J544467K9841
38356h54998j878120k016016j198913l44176J285562L568915M196064J855763
38348D614081j278656k242575j040992P7522k4977n40239n27921N7026Q37577
38339f9154J316354J014927K60123L26228J734800K952443K136918q2682j143975
38330H445982j25814P61693q62868m260421o475596n783276k801260J246215N272277
38321d583068P201586M797907p29390m110077j708722L319251M582992O87966
$$ plain form
38313 9458445 6029405 2385772 952112 808139 836109 1570024 3285204 4711309 4737305
38304 4737305 3780195 2688618 1687439 930326 684902 591431 193717 308819 1979826
38295 1979826 3901339 3278179 -111928 -3246267 -4259799 -4816054 -6512958 -7687922
38287 -7687922 -6238915 -3437976 -2048348 -2089715 -1347486 837557 3012282 4237743 4763205
38278 4763205 4562474 3642368 3405065 5152302 7397818 7306126 5022517 3982180 6240374
38269 6240374 9792091 11496697 10685285 8647188 6145630 3018293 -457989 -3043270
38261 -3043270 -3431338 -1509645 1037745 1804241 220609 -1309614 -82983 3223319
38253 3223319 5016427 3211941 -198227 -1664666 -169820 1989024 2028998 -286662
$$ packed form
38313I458445l429040l643633j433660j43973K7970P33915J715180J426105K5996
38304D737305r57110j091577j001179p57113k45424r3471l97714J15102J671007
38295A979826J921513o23160l390107l134339j013532n56255j696904j174964
38287g687922J449007K800939J389628m1367P42229K185043K174725J225461N25462
38278D763205k00731r20106k37303J747237K245516r1692k283609j040337K258194
38269F240374L551717J704606q11412k038097k501558l127337l476282k585281
38261c043270l88068J921693K547390P66496j583632j530223J226631L306302
38253C223319J793108j804486l410168j466439J494846K158844L9974k315660
$$ plain form
38245 -286662 -2435038 -1952120 603129 2149372 824412 -1801392 -3034013 -2447340 -1673149
38236 -1673149 -1796358 -2702690 -4424768 -7163288 -9939321 -10857782 -9048814 -5443157 -1822125
38227 -1822125 144689 -181275 -1229596 -181033 3129026 4655912 1021817 -5228254
38219 -5228254 -8467006 -7355899 -5516412 -4871347 -2906680 1887876 6109622 5938746
38211 5938746 2632857 297445 63333 -334773 -2240144 -4305789 -4860719 -3903130 -2683746
38202 -2683746 -2625579 -4306796 -6390450 -6213686 -2705379 1811968 3840975 2226688 -1326121
38193 -1326121 -4317976 -5014465 -2994609 378085 2493086 1638918 -1589575 -5354008
38185 -5354008 -8068321 -8469133 -5928695 -1927964 272615 -991653 -3854518 -5736268
$$ packed form
38245b86662k148376M82918K555249J546243j324960k625804j232621N86673P74191
38236a673149j23209r06332j722078k738520k776033r18461J808968L605657L621032
38227a822125J966814l25964j048321J048563L310059J526886l634095o250071
38219e228254l238752J111107J839487O45065J964667M794556M221746j70876
38211E938746l305889k335412k34112l98106j905371k065645n54930R57589J219384
38202b683746N8167j681217k083654J76764L508307M517347K029007j614287l552809
38193a326121k991855o96489K019856L372694K115001q54168l228493l764433
38185e354008k714313m00812K540438M000731K200579j264268k862865j881750
$$ plain form
38177 -5736268 -6668744 -7923980 -8647776 -6515868 -1551155 2938081 3629597 87790 -5545908
38168 -5545908 -10449938 -12749685 -12441221 -10860417 -8817012 -5944495 -2436599 62803
38160 62803 726562 1249810 3195564 4770693 2948889 -1579800 -4426811 -2923971 875297
38151 875297 3401547 3681886 3110680 2789814 2628619 2342708 2131927 2406042 3199346
38142 3199346 3802051 3292639 1927064 1392600 2681187 4279470 3890639 1656858 53884
38133 53884 563988 2080644 2869117 2500994 1354437 -256536 -1664565 -1850240 -823651
38124 -823651 -110987 -991019 -2885790 -4215704 -4312821 -3786570 -3268727 -2400257 -310823
38115 -310823 2781234 4739125 3349138 -498393 -2846162 -1276543 1733600 2155772
$$ packed form
38177e736268r32476j255236p23796K131908M964713M489236O91516l541807n633698
38168e545908m904030k299747L08464J580804K043405K872517L507896K499402
38160F2803O63759N23248J945754J575129j821804m528689k847011J502840L799268
38151H75297K526250K80339n71206l20866j61195k85911k10781K74115P93304
38142C199346O02705n09412j365575n34464J288587J598283l88831k233781j602974
38133E3884N10104J516656P88473l68123j146557j610973j408029j85675J026589
38124h23651P12664q80032j894771j329914r7117N26251N17843Q68470K089434
38115c10823L092057J957891j389987l847531k347769J569619L010143M22172
$$ plain form
38107 2155772 202645 -116997 2803233 5692910 5239306 2432427 189258 -836467
38099 -836467 -1528131 -1371953 496306 2199633 481214 -4515553 -8624564 -8722184 -6240617
38090 -6240617 -4554676 -4776960 -5557433 -5500882 -4044197 -994666 2924807 5701499 6170529
38081 6170529 6280763 9118143 14417686 18244047 18023425 15786917 14873866 15273908 14518943
38072 14518943 11977194 9509045 8197095 7136245 5766027 4875829 4552264 3454510
38064 3454510 1237995 -345910 -56402 975132 1387510 1821538 3343784 5153149 5685465
38055 5685465 4907810 3971475 3712732 4849984 8156752 12758125 15807084 15792214 14667187
38046 14667187 14688509 14954487 13649218 11856702 11767553 12429215 11079046 7945911 5725250
$$ packed form
38107B155772j953127l19642K920230K889677m53604k806879k243169j025725
38099h36467o91664J56178J868259J703327j718419m996767m109011r7620K481567
38090f240617J685941k22284p80473N6551J456685L049531L919473K776692M69030
38081F170529J10234K837380N299543L826361k20622k236508r13051M00042p54965
38072A4518943k541749k468149j311950j060850j370218q90198l23565j097754
38064C454510k216515j583905K89508J031534M12378M34028J522246J809365N32316
38055E685465p77655r36335k58743J137252L306768M601373L048959j4870j125027
38046A4667187K1322K65978j305269j792516q9149O61662j350169l133135k220661
$$ plain form
38037 5725250 4595949 2122595 -1436487 -2236907 1240522 5356138 6507172 5879827
38029 5879827 6672522 9322543 11999919 13712530 14555304 14606067 14640021 16247652 19252655
38020 19252655 20745830 18846857 15817986 15043551 16225036 16191594 13694487 10730677
38012 10730677 9189375 8559873 7614195 6752051 7597935 10709984 14429831 16445939 16481102
38003 16481102 16558227 17906337 18771211 16907402 13188445 10313780 8616040 6265459
37995 6265459 3487680 2801587 4222215 4118649 669956 -3020988 -3578305 -1972932 -805174
37986 -805174 147046 2426483 5111528 5837917 4196746 1462559 -1512656 -3715836 -3298767
37977 -3298767 -357836 1516306 -407993 -3820692 -4747417 -3358038 -2834241 -3979553
$$ packed form
38037E725250j129301k473354l559082q00420L477429M115616J151034o27345
38029E879827P92695K650021K677376J712611Q42774N0763L3954J607631L005003
38020A9252655J493175j898973l028871p74435J181485l3442k497107k963810
38012A0730677j541302o29502r45678q62144Q45884L112049L719847K016108L5163
38003A6481102P7125J348110Q64874j863809l718957k874665j697740k350581
37995F265459k777779o86093J420628j03566l448693l690944n57317J605373J167758
37986h05174R52220K279437K685045P26389j641171k734187k975215k203180M17069
37977c298767K940931J874142j924299l412699r26725J389379N23797j145312
$$ plain form
37969 -3979553 -4871549 -4800992 -4621231 -3985580 -2187120 -1102114 -3185307 -6836221 -7852400
37960 -7852400 -5428818 -2661314 -1113464 696467 2907142 2974402 44405 -3264526
37952 -3264526 -4951620 -6039826 -7500548 -8119609 -6958022 -4985988 -3000061 -720848
37944 -720848 1291119 2107261 3392217 7806230 13406830 14378225 9400768 4518297 4626515
37935 4626515 6571519 4689555 -565806 -4187121 -4027524 -1865131 961862 4109117
37927 4109117 5535528 3043811 -1547537 -3745792 -2197493 78724 416429 -665536
37919 -665536 -1710991 -2451483 -2840974 -2222212 -359276 2114149 4525410 6166463 5797281
37910 5797281 2839483 -1107362 -3579284 -3970335 -3608237 -3607992 -4128943 -5068586 -5738938
$$ packed form
37969c979553q91996P0557J79761O35651J798460J085006k083193l650914j016179
37960g852400K423582K767504J547850J809931K210675O7260k929997l308931
37952c264526j687094j088206j460722o19061J161587J972034J985927K279213
37944g20848K011967Q16142J284956M414013N600600R71395m977457m882471J08218
37935D626515J945004j881964n255361l621315J59597K162393K826993L147255
37927D109117J426411k491717m591348k198255J548299K276217L37705j081965
37919f65536j045455p40492l89491O18762J862936K473425K411261J641053l69182
37910E797281k957798l946845k471922l91051L62098K45n20951r39643o70352
$$ plain form
37901 -5738938 -4527532 -821400 3302928 5299599 5505366 6230005 8134269 9766726
37893 9766726 10077966 8905227 5648557 530623 -3199559 -2006930 2467510 4385084
37885 4385084 1431719 -1958752 -1072438 2682278 4712061 4017887 3453240 4585129 6049915
37876 6049915 6952121 8585613 11749158 14595694 14528763 11140185 6465277 3209177 3136768
37867 3136768 5987545 9159280 9505498 6556393 3299140 2710944 4222397 5050820 4464130
37858 4464130 4515299 6172549 7147398 5174906 1675413 -41056 912649 2882106 4989535
37849 4989535 7559568 9400343 8159235 4424395 2274721 3908063 6437029 6341805
37841 6341805 4711838 5051873 7505067 8681879 6790752 3998506 3459067 6059808
$$ packed form
37901e738938J211406L706132M124328J996671K05767P24639J904264J632457
37893I766726L11240j172739l256670n117934l730182J192629M474440J917574
37885D385084k953365l390471Q86314L754716K029783o94174n64647J131889J464786
37876F049915R02206J633492L163545K846536o6931l388578m674908l256100p2409
37867C136768K850777L171735L46218k949105l257253n88196J511453Q28423n86690
37858D464130N1169J657250R74849j972492l499493j716469R53705J969457K107429
37849D989535K570033J840775j241108l734840k149674J633342K528966r5224
37841F341805j629967L40035K453194J176812j891127k792246n39439K600741
$$ plain form
37833 6059808 10150493 12776894 11438137 6347697 633632 -3201185 -6090180 -9724926
37825 -9724926 -12409773 -10775892 -5228137 -257332 1147145 344442 -326405 -541115 -331773
37816 -331773 1513238 5278721 8651648 9248102 7285648 4151639 59098 -4914825
37808 -4914825 -8918526 -9788236 -7830695 -5298419 -3424718 -1491393 1348747 4583326
37800 4583326 6714971 6450316 3749095 144032 -2437201 -3499433 -4006119 -4466929 -4120523
37791 -4120523 -2399805 88536 2687685 5485480 8201300 9649147 9364702 8534489
37783 8534489 8134243 7285496 4796823 1437095 -648125 -156552 2678861 6704409 10133623
37774 10133623 11275188 10231820 9025159 8969639 9034695 8008984 6887796 7385064 9274928
$$ packed form
37833F059808M090685K626401j338757n090440n714065l834817k888995l634746
37825i724926k684847J633881N547755M970805J404477q02703o70847k14710K09342
37816c31773J845011L765483L372927N96454j962454l134009m092541m973923
37808d914825m003701q69710J957541K532276J873701J933325K840140L234579
37800D583326K131645k64655k701221l605063k581233j062232n06686m60810L46406
37791d120523J720718K488341K599149K797795K715820J447847k84445q30213
37783H534489m00246q48747k488673l359728k085220M91573K835413M025548L429214
37774A0133623J141565j043368j206661n5520O5056j025711j121188M97268J889864
$$ plain form
37765 9274928 11183619 12935272 14780543 15115467 11753896 5470078 -161677 -2689986
37757 -2689986 -2422049 -240440 3395285 6677803 6793721 3868137 2252942 5498868
37749 5498868 11428036 14589793 12829297 9031288 6615744 5903484 5703803 6187797 8177243
37740 8177243 10576316 10843598 8456095 6184532 6801683 9644195 11868625 12260702 11784959
37731 11784959 10707912 7917346 3941200 1858253 3146795 4853814 3767658 1809913
37723 1809913 3596593 9183230 13358641 12916025 10627426 10065599 10132542 8002802 4935814
37714 4935814 4953029 8544309 11673234 11508931 9814480 9398539 9917293 9198257 7075996
37705 7075996 5713640 6641158 9157226 11642128 13206130 13734836 13122535 11084335 7720240
$$ packed form
37765I274928J908691J751653J845271L34924l361571o283818n631755k528309
37757b689986K67937K181609L635725L282518J15918k925584j615195L245926
37749E498868N929168L161757j760496l798009k415544p12260j99681M83994J989446
37740H177243K399073K67282k387503k271563O17151K842512K224430L92077m75743
37731A1784959j077047k790566l976146k082947J288542J707019j086156j957745
37723A809913J786680N586637M175411m42616k288599n61827O6943k129740l066988
37714D935814J7215L591280L128925j64303j694451m15941N18754p19036k122261
37705G075996j362356R27518K516068K484902J564002N28706o12301k038200l364095
$$ plain form
37696 7720240 4020532 1468223 898171 1985032 4115289 7188430 10817597 13395920
37688 13395920 13414767 11589371 10044802 9240618 7700636 5412300 4966030 7476141 9591082
37679 9591082 7543319 3006207 1510925 5112694 9969001 12004730 11897935 12788841
37671 12788841 15448766 17846379 18022619 15540152 11179485 6722118 3959530 2600084
37663 2600084 452669 -2990634 -4900675 -2970614 755776 2468826 1767429 1381505
37655 1381505 2529846 3715802 4021714 4525624 5994463 7811407 9687529 11932143
37647 11932143 13563506 12826816 10315373 8901930 9634856 10401483 9785384 9326352 10243819
37638 10243819 10716698 8778301 5770305 4521579 5814278 8813365 13133624 18033628
$$ packed form
37696G720240l699708k552309n70052J086861K130257L073141L629167K578323
37688A3395920J8847j825396j544569q04184j539982k288336m46270K510111K114941
37679I591082k047763m537112j495282L601769M856307K035729j06795Q90906
37671A2788841K659925K397613J76240k482467m360667m457367k762588j359446
37663B600084k147415l443303j910041J930061L726390J713050p01397l85924
37655A381505J148341J185956L05912N03910J468839J816944J876122K244614
37647A1932143J631363p36690k511443j413443P32926P66627o16099m59032R17467
37638A0243819M72879j938397l007996j248726J292699K999087M320259M900004
$$ plain form
37630 18033628 21341900 22046308 22587404 25573427 29247706 29419426 25356468 20523170
37622 20523170 17491354 15293432 12432121 9708397 8860061 10280989 13075661 15994851
37614 15994851 17771502 17888268 17426040 17926391 19284007 20082556 19920061 19731747 19744972
37605 19744972 18986296 17304874 16292805 17567010 21219530 26074297 30242325 31672981
37597 31672981 29968435 27693570 27915613 30191416 31086995 29123178 26837426 26888945 28378960
37588 28378960 28794369 28034542 28483244 31708036 36668589 41104856 43797527 45453025
37580 45453025 47654970 50830350 53587105 54711322 55197517 56985003 60200061 63461532
37572 63461532 66589957 70645809 75082284 77590251 77851843 78993931 83574842 89859943
$$ packed form
37630A8033628L308272P04408N41096K986023L674279J71720m062958m833298
37622B0523170l031816k197922k861311k723724q48336J420928K794672K919190
37614A5994851J776651J16766m62228N00351J357616P98549j62495j88314J3225
37605A9744972p58676j681422j012069J274205L652520M854767M168028J430656
37597C1672981j704546k274865K22043K275803Q95579j963817k285752N1519J490015
37588B8378960M15409p59827M48702L224792M960553M436267K692671J655498
37580D5453025K201945L175380K756755J124217M86195J787486L215058L261471
37572F3461532L128425M055852M436475K507967K61592J142088M580911O285101
$$ plain form
37564 89859943 93865160 93976097 92185823 91804080 94997657 101374516 107996351 112169137
37556 112169137 115241304 122005096 134987026 150929102 164576819 174603128 184018357
37549 184018357 195817897 210085298 224841126 238404636 251355876 266724961 287062390
37542 287062390 310860999 333812033 354364539 375388453 398784955 421459161 439280612
37535 439280612 452338090 462802723 469718841 470026177 463555713 452962016 439432464
37528 439432464 422498678 403575510 385231798 366749301 344874218 319806940 296064810
37521 296064810 275996062 256762769 235942196 216117388 200841468 189130023 177340639
37514 177340639 164380487 151874555 140802003 131007334 122854451 116523259 110525156
$$ packed form
37564H9859943M005217J10937j790274l81743L193577O376859O621835M172786
37556A12169137L072167O763792J2981930J5942076J3647717J0026309R415229
37549A84018357J1799540J4267401J4755828J3563510J2951240J5369085K0337429
37542B87062390K3798609K2951034K0552506K1023914K3396502K2674206J7821451
37535D39280612J3057478J0464633O916118L07336o470464j0593697j3529552
37528D39432464j6933786j8923168j8343712j8482497k1875083k5067278k3742130
37521B96064810k0068748j9233293k0820573j9824808j5275920j1711445j1789384
37514A77340639j2960152j2505932j1072552r794669q152883o331192n998103
$$ plain form
37507 110525156 103480038 96572011 91707803 87923007 82325799 74391118 66737478 61457919
37499 61457919 58003052 55169950 53057972 52061264 51353285 49506293 46164764 42688061
37491 42688061 41282071 43057419 46358571 47705586 45387557 41483951 39172374 38771231
37483 38771231 37967362 35354495 31861595 28845691 26651754 25210176 24349269 23311527
37475 23311527 21644231 20727914 22399533 25486666 25881901 21416960 15094813 11908810
37467 11908810 13388100 16618710 17956555 16523031 14488652 14758660 17957121 21329468
37459 21329468 21593846 19255734 18423150 21203540 24048811 21718930 13821098 5225589
37451 5225589 638296 951060 4360809 8336197 10351671 9520906 8370033 10499855
$$ packed form
37507A10525156p045118o908027m864208l784796n597208p934681p653640n279559
37499F1457919l454867k833102k111978r96708p07979j846992l341529l476703
37491D2688061j405990J775348L301152J347015k318029l903606k311577m01143
37483C8771231q03869k612867l492900l015904k193937j441578q60907j037742
37475B3311527j667296r16317J671619L087133L95235m464941o322147l186003
37467A1908810J479290L230610J337845j433524k034379K70008L198461L372347
37459B1329468K64378k338112q32584K780390K845271k329881p897832q595509
37451E225589m587293L12764L409749L975388K015474q30765j150873K129822
$$ plain form
37443 10499855 15402063 18154771 15875908 11904246 11104964 13202088 14174011 13069603
37435 13069603 13378085 17163931 21421299 21984990 18693745 14681282 12051299 10302247
37427 10302247 8343145 6219105 4723382 4400227 5243894 6953353 9297789 12102191
37419 12102191 14641313 15510261 14001997 11357234 9418314 8178646 6322345 4352345
37411 4352345 5008259 9561371 15646049 20168368 22496057 23040399 20858016 15664041
37403 15664041 10918410 11148727 15991304 20196676 20521444 19715168 22071702 27456797
37395 27456797 32029279 33418192 32811464 32512485 33503859 35391941 37070225 37108491 34738853
37386 34738853 30947744 27746947 25928433 24254339 21424038 18267101 17078738 18765502
$$ packed form
37443A0499855M902208K752708k278863l971662p99282K097124R71923j104408
37435A3069603L08482L785846M257368N63691l291245m012463k629983j749052
37427A0302247j959102k124040j495723l23155Q43667J709459K344436K804402
37419A2102191K539122Q68948j508264k644763j938920j239668j856301j970000
37411D352345O55914M553112O084678M522319K327689N44342k182383n193975
37403A5664041m745631K30317M842577M205372L24768q06276K356534N385095
37395B7456797M572482J388913o06728k98979R91374J888082J678284L8266k369638
37386C4738853l791109l200797j818514j674094k830301l156937j188363J686764
$$ plain form
37378 18765502 21508616 22818070 22352808 21784186 22087742 22251057 21057147 18890016 16902486
37369 16902486 15484124 14723500 15348774 17513605 19258445 18148350 14438171 10886679
37361 10886679 9329378 9158376 9364611 10120817 11718269 13697193 15750767 17772889
37353 17772889 18311775 15107072 8567562 2875643 1799598 4624759 7742057 8823606
37345 8823606 7676414 4641643 815667 -1072705 1027109 5308224 7765716 7277554
37337 7277554 6648166 8119448 10314917 10794015 9636270 8944139 10046843 12510541 14966056
37328 14966056 15871249 14429100 11756122 10118640 9967219 8943556 5269221 911653
37320 911653 -722481 433505 1184211 56062 -555682 1519379 4394872 4786567 3162183
$$ packed form
37378A8765502K743114J309454m65262n68622L03556J63315j193910k167131j987530
37369A6902486j418362p60624O25274K164831J744840j110095l710179l551492
37361A0886679j557301j71002K06235P56206J597452J978924K053574K022122
37353A7772889N38886l204703o539510n691919j076045K825161L117298J081549
37345H823606j147192l034771l825976j888372K099814M281115K457492m88162
37337G277554o29388J471282K195469M79098j157745o92131J102704K463698K455515
37328A4966056R05193j442149k672978j637482j51421j023663l674335m357568
37320I11653j634134J155986P50706j128149o11744K075061K875493L91695j624384
$$ plain form
37311 3162183 3267141 6486451 9480390 8599350 4494400 509895 -1981230 -4222357
37303 -4222357 -6692582 -7806946 -6609006 -4568630 -3365457 -2370932 10810 3313565
37295 3313565 5108636 4137295 1962028 1038695 1976617 3233258 3083404 1408134 -356714
37286 -356714 -711716 602842 2672172 4442034 5406801 5454692 4558283 2844172 780643
37277 780643 -821761 -1055820 458312 2936255 4911059 5827884 6554943 7625698 7845106
37268 7845106 5920227 2732053 222964 -1472791 -3554864 -5345180 -4312173 -33248
37260 -33248 4543793 7068219 8465923 10041626 10632179 9123325 7428442 7739403 8430229
37251 8430229 6186903 1248193 -3015487 -5218214 -6977622 -8904571 -9526604 -8957322
$$ packed form
37311C162183J04958L219310K993939q81040m104950l984505k491125k241127
37303d222357k470225j114364J197940K040376J203173R94525K381742L302755
37295C313565J795071r71341k175267r23333R37922J256641j49854j675270j764848
37286c56714l55002J314558K069330J769862R64767M7891q96409j714111k063529
37277G80643j602404k34059J514132K477943J974804R16825P27059J070755K19408
37268G845106j924879l188174k509089j695755k082073j790316J033007M278925
37260c3248M577041K524426J397704J575703N90553j508854j694883L10961O90826
37251H430229k243326m938710m263680k202727j759408j926949o22033N69282
$$ plain form
37243 -8957322 -9729711 -12261086 -12833367 -8466445 -1338346 4030496 5942637 5425789 2943106
37234 2943106 -1498248 -5691019 -5992811 -1481560 4673280 8805444 10374296 11254483
37226 11254483 12486589 12942093 11233533 8157506 6392273 7468291 9685837 9908651
37218 9908651 7185549 3617834 1698591 1866623 2805921 3070916 2139652 791638 612684
37209 612684 2258199 4358562 5265230 5421693 6210522 6797358 4744081 258002 -2980708
37200 -2980708 -2622722 -890162 -1268989 -4040847 -7050518 -8941316 -9262608 -7032861 -2014718
37191 -2014718 3493376 6736492 7794261 8546546 9191745 8449603 6661626 5670747 5532796
37182 5532796 4300643 1694586 216164 1440037 3480194 3564702 1339985 -1776173
$$ packed form
37243h957322p72389k531375n72281M366922P128099N368842J912141n16848k482683
37234B943106m441354m192771l01792M511251O154840M132164J568852Q80187
37226A1254483J232106M55504j708560l076027j765233J076018K217546K22814
37218I908651k723102l567715j919243J68032R39298K64995r31264j348014j78954
37209F12684J645515K100363R06668J56463P88829N86836k053277m486079l238710
37200b980708L57986J732560l78827k771858l009671j890798l21292K229747N018143
37191b014718N508094L243116J057769P52285O45199p42142j787977r90879j37951
37182E532796j232153k606057j478422J223873K040157Q4508k224717l116158
$$ plain form
37174 -1776173 -4877871 -7495489 -8430044 -6636020 -2999116 201365 1653244 1896286
37166 1896286 1884470 1674168 1030323 730501 2218267 5418717 7555292 5538694 -83918
37157 -83918 -4875020 -5176012 -1988106 987881 2009899 2114076 2107230 1351997 -141039
37148 -141039 -766238 439270 2194482 2727543 1996596 1217017 1184849 2002719 3556573
37139 3556573 5212009 5695534 4385802 2478051 1970625 3413819 5147580 4939694 2302506
37130 2302506 -890088 -2270141 -1386830 342836 2119104 4860230 8929632 12198757
37122 12198757 12209249 9427816 6276878 3526894 158086 -3362226 -4664856 -3144388
37114 -3144388 -1322614 -1162634 -1340783 77128 2223753 2813685 1622831 528418 824545
$$ packed form
37174a776173l101698k617618r34555J794024L636904L200481J451879K43042
37166A896286j1816k10302o43845k99822J487766L200450K136575k016598n622612
37157h3918m791102l00992L187906K975987J022018J04177o846p55233j493036
37148a41039o25199J205508J755212N33061p30947p79579l2168Q17870J553854
37139C556573J655436M83525j309732j907751n07426J443194J733761k07886k637188
37130B302506l192594j380053Q83311J729666J776268K741126M069402L269125
37122A2198757J0492k781433l150938k749984l368808l520312j302630J520468
37114c144388J821774J59980j78149J417911K146625N89932j190854j094413K96127
$$ plain form
37105 824545 2104924 3131049 2488147 -760390 -5658529 -9315719 -9545426 -6929252 -3522125
37096 -3522125 -882676 -421576 -3622756 -9627805 -14061419 -13110773 -8300612 -4768909
37088 -4768909 -5077949 -7015161 -7256239 -4761696 -535205 3487644 4919984 2614830
37080 2614830 -1481588 -4106402 -4690872 -5446953 -7058829 -7008601 -3515373 1203071 3478788
37071 3478788 2408397 -206371 -2764251 -4890500 -6538621 -7809972 -9084676 -10023818
37063 -10023818 -9223711 -6227979 -3023458 -1847825 -2012065 -618023 3663474 8954089
37055 8954089 12282606 12137628 9061244 5064883 2594359 2820193 4459368 4948353 2983026
37046 2983026 -468692 -3256454 -3440821 -371426 4154338 6220192 3289105 -2135954
$$ packed form
37105H24545J280379J026125o42902l248537m898139l657190k29707K616174L407127
37096c522125K639449M61100l201180o005049m433614R50646M810161L531703
37088d768909l09040j937212k41078K494543M226491M022849J432340k305154
37080B614830m096418k624814n84470p56081j611876N0228L493228M718444K275717
37071C478788j070391k614768k557880k126249j648121j271351j274704r39142
37063a0023818Q00107K995732L204521J175633j64240J394042M281497N290615
37055H954089L328517j44978l076384l996361k470524K25834J639175M88985j965327
37046B983026l451718k787762j84367L069395M525764K065854k931087n425059
$$ plain form
37038 -2135954 -4104578 430447 7936364 11984420 9774811 4055397 -578579 -1945423
37030 -1945423 -1200046 -903092 -2550335 -5332775 -6995241 -6111963 -3458977 -982413 215401
37021 215401 489432 764537 1782015 3952338 7008538 9648021 10309551 8785568 6717822
37012 6717822 6116478 7461445 9364044 10006226 8935009 7513020 7368747 8209764 7636756
37003 7636756 3786171 -2016361 -5997040 -5479944 -1253910 3453760 5599564 3958541
36995 3958541 -652185 -5921594 -9263278 -9306860 -6467337 -2247702 1645984 3804933
36987 3804933 3798235 2742369 2432178 3482194 4913938 5667262 5489668 4168672 1523084
36978 1523084 -974019 -337751 4365598 9718152 11267866 8572135 4963829 2796974
$$ packed form
37038b135954j968624M535025P505917M048056k209609n719414m633976j366844
37030a945423P45377K96954j647243k782440j662466Q83278K652986K476564J197814
37021B15401K74031K75105J017478K170323L056200K639483O61530j523983k067746
37012F717822o01344J344967J902599O42182j071217j421989j44273Q41017n73008
37003G636756l850585n802532l980679N17096M226034M707670K145804j641023
36995C958541m610726n269409l341684m3582K839523M219635L893686K158949
36987C804933o698j055866l10191J050016J431744P53324j77594j320996k645588
36978A523084k497103O36268M703349N352554J549714k695731l608306k166855
$$ plain form
36970 2796974 1325055 -591250 -2196595 -2235507 -776721 1416177 3843843 5626770
36962 5626770 5398359 3108164 800906 312025 988920 828127 -769424 -2361263 -2086422
36953 -2086422 731064 4964077 8151991 8396613 6255423 3841521 1866388 -869407
36945 -869407 -4593945 -7310510 -7703524 -7281467 -7810871 -8442441 -7680112 -6640793 -7514400
36936 -7514400 -9732634 -10717894 -10094457 -10068557 -11355629 -11669516 -9174229 -5092169 -1859443
36927 -1859443 -619461 -1419246 -3930210 -6828033 -8102088 -7201009 -5662853 -4789209 -4034145
36918 -4034145 -2456743 -253262 2069585 4497286 6404315 6207755 3512058 317675
36910 317675 -1372313 -2088412 -3586794 -5950163 -7547670 -7273353 -5481178 -3250025 -1925518
$$ packed form
36970B796974j471919j916305j605345l8912J458786K192898K427666J782927
36962E626770k28411k290195k307258m88881O76895j60793j597551j591839K74841
36953b086422K817486M233013L187914K44622k141190k413902j975133k735795
36945h69407l724538k716565l93014M22057n29404o31570P62329J039319q73607
36936g514400k218234r85260O23437K5900j287072l13887K495287M082060L232726
36927a859443J239982p99785k510964k897823j274055R01079J538156Q73644P55064
36918d034145J577402K203481K322847K427701J907029j96560k695697l194383
36910C17675j689988p16099j498382k363369j597507K74317J792175K231153J324507
$$ plain form
36901 -1925518 -2729283 -5452474 -7968554 -8273868 -6622577 -4586270 -2691930 -434822
36893 -434822 1868064 2976458 2553249 1650493 1061359 301777 -1401679 -3927068 -6349849
36884 -6349849 -7678720 -7513694 -6545623 -6188776 -6944660 -7338963 -5473717 -1677577 1373683
36875 1373683 1508132 -673243 -2719587 -3000715 -2100756 -1838882 -3184937 -5139080 -5735480
36866 -5735480 -4190484 -1760662 -261414 -71430 12903 1089222 2609904 2593960 -398790
36857 -398790 -5219902 -8556726 -8299489 -6149692 -5544182 -7087898 -7897333 -6004576 -3368049
36848 -3368049 -3151299 -5620951 -8413654 -9589490 -8562969 -5088252 388302 5672289
36840 5672289 8118087 7176735 4509339 1989229 809798 1670049 3943508 5262878
$$ packed form
36901a925518q03765k723191k516080l05314J651291K036307J894340K257108
36893d34822K302886J108394m23209r02756n89134p59582j703456k525389k422781
36884f349849j328871J65026R68071L56847p55884l94303J865246L796140L051260
36875A373683J34449k181375k046344k81128Q99959K61874j346055j954143n96400
36866e735480J544996K429822J499248J89984Q4333J076319J520682j5944k992750
36857c98790m821112l336824K57237K149797O05510j543716q09435J892757K636527
36848c368049K16750k469652k792703j175836J026521L474717N476554N283987
36840E672289K445798r41352k667396k520110j179431Q60251K273459J319370
$$ plain form
36832 5262878 4080598 2351865 3422896 7266682 10123982 9200816 5568744 1978598
36824 1978598 -47653 -362939 396059 705722 -616673 -2347254 -2018148 190208 1176140
36815 1176140 -303268 -1225674 1336345 5636246 7491355 5602522 2234481 -258027
36807 -258027 -1162741 -533157 911157 1340003 -537535 -3460511 -4977968 -4466090 -3084539
36798 -3084539 -1410402 666597 2148030 1622148 -168174 -994164 -685075 -1284668 -2927610
36789 -2927610 -2513885 1794810 7163252 9352801 7651983 4362643 1033295 -2049623
36781 -2049623 -3761723 -2893065 -1071030 -1852831 -5951739 -9793027 -10072721 -7718974 -5843905
36772 -5843905 -5567325 -5744634 -5413252 -4260525 -1520146 3123113 7630861 8873084 6245430
$$ packed form
36832E262878j182280j728733J071031L843786K857300r23166l632072l590146
36824A978598k026251l15286P58998L09663j322395j730581L29106K208356R85932
36815A176140j479408r22406K562019M299901J855109j888833l368041k492508
36807b58027r04714O29584J444314M28846j877538k922976j517457N11878J381551
36798c084539J674137K076999J481433n25882j790322q25990L09089n99593j642942
36789b927610M13725M308695N368442K189549j700818l289340l329348l082918
36781b049623j712100Q68658J822035p81801m098908l841288k79694K353747J875069
36772e843905K76580j77309L31382J152727K740379M643259M507748J242223k627654
$$ plain form
36763 6245430 2333252 -312618 -1290943 -984714 635481 2786425 3518695 2268824 1340619
36754 1340619 3124291 6860430 9692375 9927189 7792780 4272534 1197608 1354606
36746 1354606 5862652 11708747 14265029 12399697 9224241 7948815 9068836 11448533
36738 11448533 13681070 14063662 11647802 7965426 5669468 5094252 4401771 3295802
36730 3295802 3555193 5037064 4516039 406604 -4162500 -5306041 -3182568 -554116
36722 -554116 1357927 3040841 4447157 5190675 5702514 6018444 4948693 2587850 1608701
36713 1608701 3325089 4635782 2428473 -870576 -525968 2887938 4064136 1092788
36705 1092788 -2067315 -2297704 -1659381 -2816171 -4151978 -2519543 1752629 5457625
$$ packed form
36763F245430l912178k645870r78325L06229J620195K150944P32270j249871r28205
36754A340619J783672L736139K831945K34814k134409l520246l074926J56998
36746A354606M508046N846095K556282j865332l175456j275426J120021K379697
36738A1448533K232537L82592k415860l682376k295958n75216o92481j105969
36730C295802K59391J481871n21025m109435m569104j143541K123473K628452
36722e54116J912043J682914J406316P43518N11839L15930j069751k360843r79149
36713A608701J716388J310693k207309l299049L44608L413906J176198k971348
36705A092788l160103k30389O38323j156790j335807J632435M272172L704996
$$ plain form
36697 5457625 6475881 5085198 2922352 2391888 5377067 10686706 14275558 13624353
36689 13624353 10368871 7211793 4357448 1023400 -1619584 -1821079 -298522 775395
36681 775395 983304 1372137 1750807 1022451 -91562 580889 3234144 5343640 4995148
36672 4995148 3120971 1747129 1574129 2085258 2850885 3823407 4867942 5443460 4601028
36663 4601028 1736828 -1996851 -3751586 -1785115 2100405 4308526 3527419 1710978
36655 1710978 1140218 2180322 4171695 6688788 8960734 9418684 7195741 3642593
36647 3642593 1470355 2466595 6201430 10398811 12336791 10671256 6503092 2275305
36639 2275305 -694252 -3072469 -5656572 -7509610 -6834197 -3428323 604658 2833722
$$ packed form
36697E457625J018256j390683k162846n30464K985179N309639L588852o51205
36689A3624353l255482l157078k854345l334048k642984k01495J522557J073917
36681G75395K07909L88833L78670p28356j114013O72451K653255K109496l48492
36672D995148j874177j373842j73000N11129P65627R72522J044535N75518q42432
36663D601028k864200l733679j754735J966471L885520K208121p81107j816441
36655A710978n70760J040104J991373K517093K271946M57950k222943l553148
36647C642593k172238R96240L734835M197381J937980j665535m168164m227787
36639B275305k969557k378217k584103j853038O75413L405874M032981K229064
$$ plain form
36631 2833722 2759487 1858118 1676347 2345782 3051277 3438570 3962696 4994525 6302501
36622 6302501 7555753 8675547 9506907 9905329 10369253 11552767 12693609 11844132 8622111
36613 8622111 5343622 3897110 2858830 104738 -2559877 -699092 6200167 12610785
36605 12610785 13282213 9408207 6085594 5280759 4471822 1812931 -831915 -1224600 -465965
36596 -465965 -1067865 -2651873 -2249541 1054369 4127007 3550568 -162718 -3666405 -5156628
36587 -5156628 -5720563 -6499754 -6698988 -5388285 -3692745 -3624384 -5488052 -7888379 -9818905
36578 -9818905 -11166360 -11289871 -8934236 -4275753 236568 2126535 1331989 -383616
36570 -383616 -1784622 -2829542 -3303535 -2236835 601833 3461079 4074412 2520221 1688861
$$ packed form
36631B833722p4235r01369j81771O69435P05495L87293N24126J031829J307976
36622F302501J253252J119794Q31360L98422M63924J183514J140842q49477l222021
36613H622111l278489j446512j038280k754092k664615J860785O899259O410618
36605A2610785O71428l874006l322613q04835q08937k658891k644846l92685P58635
36596d65965o01900j584008M02332L303910L072638n76439l713286l503687j490223
36587e156628n63935p79191j99234J310703J695540O8361j863668k400327j930526
36578i818905j347455j23511K355635M658483M512321J889967p94546j715605
36570c83616j401006j044920m73993J066700K838668K859246O13333j554191q31360
$$ plain form
36561 1688861 4236950 9561939 14533306 16816711 16460296 14491824 11584055 8647759
36553 8647759 7145499 7426289 7585946 5424327 1255094 -2294184 -3001274 -736581 2909640
36544 2909640 5457971 4583281 261 -5651749 -9131059 -9819088 -9448833 -8992263 -7694044
36535 -7694044 -5318799 -3158360 -1830451 97169 3808861 7787639 9254735 7448590
36527 7448590 4134758 1246726 -701393 -1882640 -1929510 22292 4153095 8886462
36519 8886462 11391114 9990996 6164975 3190509 2504347 2484426 1282148 -558525 -1399564
36510 -1399564 -1175070 -1051708 -1018714 274979 3058613 5391920 5375221 3525819 2126109
36501 2126109 2616528 4384371 6077151 7355858 8754069 10054058 9800655 7089220
$$ packed form
36561A688861K548089N324989M971367K283405l56415j968472k907769k936296
36553H647759j502260K80790J59657k161619m169233l549278p07090K264693L646221
36544B909640K548331q74690m583020n652010l479310o88029L70255M56570J298219
36535g694044K375245K160439J327909J927620L711692L978778J467096j806145
36527G448590l313832k888032j948119j181247m6870J951802M130803M733367
36519H886462K504652j400118l826021k974466o86162j9921j202278j840673q41039
36510a399564K24494J23362L2994J293693K783634K333307j6699j849402j399710
36501B126109M90419J767843J692780J278707J398211J299989k53403k711435
$$ plain form
36493 7089220 3236920 618082 -51424 -225751 -1254512 -2725285 -3433304 -2949468 -1675560
36484 -1675560 -236621 633141 472054 -98008 121698 1007296 830462 -1230540 -3314227
36475 -3314227 -2787783 666867 4844972 7368459 7502647 6320270 5745533 6602422 7092952
36466 7092952 4610234 -138616 -2848607 -1185265 1446985 526026 -2757039 -3100953
36458 -3100953 877427 4522856 4200554 2493779 3708603 7006309 7559828 3480687
36450 3480687 -1692607 -3652416 -2060905 151840 571558 -781440 -2553997 -3859501
36442 -3859501 -4659617 -4852568 -3825719 -1490305 673712 687962 -1544888 -3740659 -3471135
36433 -3471135 -266447 4598137 9283720 11885860 11154690 8079992 6028290 7688338
$$ packed form
36493G089220l852300k618838o69506j74327j028761j470773p08019M83836J273908
36484a675560J438939Q69762j61087n70062K19706Q85598j76834k061002k083687
36475c314227N26444L454650M178105K523487J34188j182377n74737Q56889M90530
36466G092952k482718m748850k709991J663342K632250r20959l283065l43914
36458c100953L978380L645429l22302j706775J214824L297706N53519m079141
36450C480687n173294j959809J591511K212745M19718j352998j772557j305504
36442c859501q00116j92951J026849K335414K164017J4250k232850k195771K69524
36433c471135L204688M864584M685583K602140p31170l074698k051702J660048
$$ plain form
36425 7688338 11790835 14053632 11769019 6668921 2851589 2529698 4435135 6038812
36417 6038812 6428206 6612846 7596891 9106716 10351654 11111191 11437821 11033002 9883650
36408 9883650 8970106 9095465 9309987 7997939 5573049 4387684 5400529 6600909 5826697
36399 5826697 3761200 2663753 3089065 3569818 3151534 2579428 2825926 3763013 4771586
36390 4771586 5826743 7397245 9502958 11136011 10825318 8268086 5428046 5012349
36382 5012349 7235956 9123481 8113485 5446699 4405542 5730430 6696728 4798065
36374 4798065 474184 -4259359 -8012854 -9956262 -9393982 -7020644 -5350042 -5979938
36366 -5979938 -7101866 -5721959 -2113324 113960 -1208918 -4051693 -5225998 -4286950
$$ packed form
36425G688338M102497K262797k284613n100098l817332l21891J905437J603677
36417F038812L89394J84640R84045J509825J244938P59537L26630m04819j149352
36408I883650r13544J25359K14522j312048k424890j185365J012845J200380p74212
36399E826697k065497j097447M25312M80753m18284n72106K46498R37087J008573
36390D771586J055157J570502K105713J633053l10693k557232k840040m15697
36382E012349K223607J887525j009996k666786j041157J324888R66298j898663
36374D798065m323881m733543l753495j943408N62280K373338J670602o29896
36366e979938j121928J379907L608635K227284j322878k842775j174305R39048
$$ plain form
36358 -4286950 -2712180 -730323 2497010 6046868 7384094 5981757 4444207 4747021
36350 4747021 5306013 3584055 124641 -2306672 -2850575 -3369945 -5093001 -6656168 -6199281
36341 -6199281 -3867104 -1495162 -860009 -2554406 -5403893 -6772780 -4856684 -1052131
36333 -1052131 1336718 1043878 -93919 -247001 372590 1279471 3060364 5508027 6657651
36324 6657651 5559189 4014891 3538671 2758554 441262 -1122859 646685 3596177
36316 3596177 3351903 209121 -1136614 926630 2533704 963242 -906241 469366
36308 469366 3568336 4509671 2937285 1517452 1208931 703023 -244522 -381045 217510
36299 217510 -207833 -2319331 -4807860 -6481312 -7207975 -6777895 -5008792 -3171319 -3050938
$$ packed form
36358d286950J574770J981857L227333L549858J337226j402337j537550L02814
36350D747021N58992j721958l459414k431313n43903n19370j723056j563167M56887
36341f199281K332177K371942O35153j694397k849487j368887J916096L804553
36333a052131K388849k92840j137797j53082O19591R06881J780893K447663J149624
36324F657651j098462j544298m76220p80117k317292j564121J769544K949492
36316C596177k44274l142782j345735K063244J607074j570462j869483J375607
36308D69366L098970R41335j572386j419833l08521n05908r47545j36523N98555
36299B17510m25343k111498k488529j673452p26663M30080J769103J837473J20381
$$ plain form
36290 -3050938 -4065977 -3455938 -140058 3573919 5165123 4996176 4905339 5191060 4693746
36281 4693746 3094310 1543032 1164571 1990630 3306896 4304483 4396441 3407562 1590190
36272 1590190 -536244 -2199788 -2541287 -1465236 -220661 -246559 -1366378 -2074077 -1754085
36263 -1754085 -1533730 -2614848 -4882478 -7632452 -10520669 -13126859 -14643538 -14766015
36255 -14766015 -14004100 -12583255 -10219709 -7564422 -6257992 -6512773 -6413821 -5146776 -4952569
36246 -4952569 -7461728 -9821676 -7962079 -2991493 -314200 -1843682 -3168190 -355738
36238 -355738 3979373 4550417 1023011 -1904824 -1128552 1616326 3219057 2917275 1754061
36229 1754061 644393 174045 748161 1833306 2162021 1488841 1046169 1557171 2067245
$$ packed form
36290c050938j015039O10039L315880L713977J591204j68947r0837K85721m97314
36281D693746j599436j551278l78461Q26059J316266R97587R1958r88879j817372
36272A590190k126434j663544l41499J076051J244575k5898j119819p07699L19992
36263a754085K20355j081118k267630k749974k888217k606190j516679j22477
36255a4766015P61915J420845K363546K655287J306430k54781R8952J267045J94207
36246d952569k509159k359948J859597M970586K677293j529482j324508K812452
36238c55738M335111N71044l527406k927835P76272K744878J602731l01782j163214
36229A754061j109668m70348N74116J085145L28715o73180m42672N11002N10074
$$ plain form
36220 2067245 1690099 1219162 1660267 2222931 1474132 -106084 -549977 747634 2380250
36211 2380250 3333656 4231231 5499272 5997688 4737684 2704796 1461893 867140 -47763
36202 -47763 -565479 1064332 4268749 5819368 4022487 1366761 1275003 3585816 5357015
36193 5357015 5196129 4140500 2466333 -1185629 -6367129 -9438113 -8085667 -5344212
36185 -5344212 -5994905 -9706684 -11135371 -7289263 -1540757 1325628 1351929 1998781 4183462
36176 4183462 5170037 3288390 449247 -1252895 -2787650 -5879772 -9159150 -9372075
36168 -9372075 -5995407 -2080650 -189207 158008 129514 -919760 -3719989 -6575645 -7120222
36159 -7120222 -5837865 -5269411 -5880252 -5465033 -3234381 -1697646 -2926108 -5232689 -5770420
$$ packed form
36220B067245l77146m70937M41105N62664p48799j580216m43893J297611J632616
36211B380250R53406Q97575J268041M98416j260004k032888j242903n94753r14903
36202d7763n17716J629811L204417J550619j796881k655726r1758K310813J771199
36193E357015j60886j055629j674167l651962n181500l070984J352446K741455
36185e344212o50693l711779j428687L846108N748506K866385K6301O46852K184681
36176D183462R86575j881647k839143j702142j534755l092122l279378k12925
36168i372075L376668L914757J891443L47215k8494j049274k800229k855656n44577
36159g120222J282357N68454o10841M15219K230652J536735j228462k306581n37731
$$ plain form
36150 -5770420 -4789016 -4679131 -5701197 -5600069 -3609643 -2223067 -3937322 -7889807 -10828264
36141 -10828264 -10526606 -7580657 -4487327 -3263457 -3455097 -2718828 -82298 2217275
36133 2217275 1701684 -422078 -876379 343719 -518026 -5172372 -10187546 -11657090 -10231448
36124 -10231448 -8854781 -7737757 -5013693 -1191673 734085 -344122 -2258650 -3152467
36116 -3152467 -3918698 -6076567 -9076913 -10810788 -9764376 -6192908 -2047416 297679
36108 297679 333080 143591 1589105 3446928 3276657 1489410 924773 2460362 4024347
36099 4024347 4525577 5627764 8297077 10517584 10417933 9258773 9059529 9241123 8026771
36090 8026771 5567867 3263452 1369979 -284531 -614275 906810 1908226 -170004
$$ packed form
36150e770420R81404J09885j022066J01128J990426J386576j714255l952485k938457
36141a0828264L01658K945949L093330J223870j91640P36269K636530K299573
36133B217275n15591k123762m54301J220098q61745m654346n015174j469544J425642
36124a0231448J376667J117024K724064L822020J925758j078207j914528q93817
36116c152467p66231k157869l000346j733875J046412L571468M145492K345095
36108B97679L5401j89489J445514J857823j70271j787247n64637J535589J563985
36099D024347N01230J102187K669313K220507r9651j159160j99244J81594j214352
36090H026771k458904k304415j893473j654510l29744J521085J001416k078230
$$ plain form
36082 -170004 -3588939 -3899786 -148188 3718094 4269621 2418778 776105 21088 -424674
36073 -424674 -364810 534809 1542596 1967486 2220895 2345874 986316 -2269717 -4762272
36064 -4762272 -3440894 677111 3110797 1411799 -1887848 -2766623 -663688 1565765
36056 1565765 1986855 2052945 4081762 7447017 8811135 6207609 1554403 -1616612 -1946312
36047 -1946312 -843546 -328323 -1750812 -5836105 -11838994 -16650432 -16960425 -13034882
36039 -13034882 -8578747 -6117097 -4412567 -1533127 1620399 2841898 2278711 2232304
36031 2232304 3776090 5532956 5810279 4524253 2966138 2601893 3810642 5050443
36023 5050443 4052406 801027 -1845798 -1929322 -1377676 -3055462 -6059271 -6953536 -5216096
$$ packed form
36082a70004l418935l10847L751598L866282N51527j850843j642673p55017m45762
36073d24674N9864Q99619J007787M24890K53409J24979j359558l256033k492555
36064d762272J321378M118005K433686j698998l299647q78775K102935K229453
36056A565765M21090O6090K028817L365255J364118k603526m653206l171015l29700
36047a946312J102766N15223j422489m085293o002889m811438l09993L925543
36039a3034882M456135K461650J704530K879440L153526J221499n63187m6407
36031B232304J543786J756866K77323j286026j558115l64245J208749J239801
36023E050443r98037l251379k646825q3524N51646j677786l003809q94265J737440
$$ plain form
36014 -5216096 -4054097 -5331065 -6963267 -6572433 -4813659 -3403242 -2394060 -1421224
36006 -1421224 -1451434 -2966242 -4092676 -2866713 -28271 2514391 4468514 6088028
35998 6088028 6078627 3731939 1927530 4254911 9447437 12485417 11645736 10601208 12220564
35989 12220564 13936947 11667311 5693489 -39061 -2698338 -2106269 1028676 5535510
35981 5535510 8957427 8926729 5782393 2364106 1139093 2581819 5883106 9729179
35973 9729179 12558501 13544093 13473324 13615580 13844034 12963303 10705159 8225546 6743074
35964 6743074 6786466 8496793 11271346 13221456 12600990 10108654 8381167 8745166 9764127
35955 9764127 9612565 8674709 8833411 10872589 13427892 14271057 12320115 8741205 6138749
$$ packed form
36014e216096J161999j276968j632202L90834J758774J410417J009182R72836
36006a421224l0210j514808j126434J225963K838442K542662J954123J619514
35998F088028r401k346688j804409K327381N192526L037980q39681j044528J619356
35989A2220564J716383k269636n973822n732550k659277N92069L134945M506834
35981E535510L421917l0698l144336l418287j225013J442726L301287L846073
35973I729179K829322R85592p0769J42256K28454q80731k258144k479613j482472
35964F743074M3392J710327K774553J950110o20466k492336j727487L63999J018961
35955I764127j51562r37856J58702K039178K555303Q43165j950942l578910k602456
$$ plain form
35946 6138749 6098013 7501817 7942607 6732452 5593085 6275208 8480319 10373962 10248684
35937 10248684 7513002 3091701 -834106 -2508730 -2415497 -2522916 -3578521 -4361701 -3879341
35928 -3879341 -2802798 -2069159 -1481152 -579752 364022 1138552 2097630 2945798 2502036
35919 2502036 964395 931220 4396796 9781183 13735526 14996733 14601762 13250549 10905658
35910 10905658 8700308 8677298 11039998 13437741 13536791 11032734 7112890 3554421 2390461
35901 2390461 4462382 7744588 8916333 7341629 5855246 6869337 9472411 11399673
35893 11399673 12062551 12147843 11822399 11294676 12062082 15369286 19820234 22642814 23484633
35884 23484633 25064950 29410512 34970177 38589339 39543669 40471707 44441272 51811730
$$ packed form
35946F138749m0736J403804M40790j210155j139367O82123K205111J893643j25278
35937A0248684k735682m421301l925807j674624R3233j07419j055605p83180M82360
35928c879341J076543P33639N88007R01400R43774P74530R59078Q48168m43762
35919B502036j537641l3175L465576N384387L954343J261207l94971j351213k344891
35910A0905658k205350k3010K362700K397743R9050k504057l919844l558469j163960
35901B390461K071921L282206J171745j574704j486383J014091K603074J927262
35893A1399673O62878Q5292l25444n27723P67406L307204M450948K822580Q41819
35884B3484633J580317M345562N559665L619162R54330R28038L969565P370458
$$ plain form
35876 51811730 60000881 65780854 67650474 66490561 64498268 63519071 63952250 64879002
35868 64879002 65168161 64352570 62279093 58373267 52327211 45765936 41894353 42246019
35860 42246019 44440883 44565902 41554770 37901143 36188773 36456672 37200238 37351369 36539251
35851 36539251 34691055 32344144 30528235 29581309 28777378 27624866 26627713 26199314 25842424
35842 25842424 25112897 24363724 23735529 22532557 20616457 19259885 19248277 19119931 16990716
35833 16990716 13551474 11448612 11774388 12762643 12163286 9650050 6677914 5042236
35825 5042236 5729003 8168121 10454112 11173578 11017455 11704646 13549614 15342352 16500399
35816 16500399 17706188 19039121 19102947 16943415 13743265 11723198 12155145 15021476
$$ packed form
35876E1811730Q189151N779973J869620j159913j992293r79197M33179R26752
35868F4879002K89159q15591k073477l905826o046056o561275l871583L51666
35860D2246019K194864J25019l011132l653627j712370K67899P43566J51131q12118
35851C6539251j848196k346911j815909r46926q03931j152512r97153m28399l56890
35842B5842424p29527p49173o28195j202972j916100j356572j1608j28346k129215
35833A6990716l439242k102862L25776R88255n99357k513236k972136j635678
35825E042236O86767K439118K285991P19466j56123O87191J844968J792738J158047
35816A6500399J205789J332933O3826k159532l200150k020067M31947K866331
$$ plain form
35808 15021476 19454797 23512908 24606494 21691416 16745143 12946852 11630272 11967775
35800 11967775 13152749 15380342 18512623 21165740 21899401 20684211 18671451 16914898
35792 16914898 15576057 13947455 11172005 7587832 5386169 6790498 11019242 14253053
35784 14253053 13738579 10954421 9202544 8937418 7818697 5298048 4206686 6396401
35776 6396401 9272282 9106342 6281280 4368177 4695652 5000988 3690972 2209405 1904682
35767 1904682 1417076 -581166 -2059329 211895 6081113 12070522 15576099 16658108
35759 16658108 15796937 12598258 7718097 3892590 3210186 4336873 4169798 1987649
35751 1987649 439597 2056196 5996845 9237420 10326922 10526469 11153813 11625129 11373638
$$ packed form
35808A5021476M433321M058111J093586k915078m946273l798291j316580L37503
35800A1967775J184974K227593L132281K653117P33661j215190k012760j756553
35792A6914898j338841j628602k775450l584173k201663J404329M228744L233811
35784A4253053n14474k784158j751877k65126j118721k520649j091362K189715
35776F396401K875881j65940k825062j913103L27475L05336j310016j481567l04723
35767A904682m87606j998242j478163K271224N869218N989409L505577J082009
35759A6658108q61171l198679m880161l825507o82404J126687j67075k182149
35751A987649j548052J616599L940649L240575J089502J99547O27344M71316k51491
$$ plain form
35742 11373638 12063468 15339913 18981000 18543122 13613592 9262864 9469082 11997634
35734 11997634 12538620 11346223 11835131 14116844 14645183 12256289 9901915 9238251 7919415
35725 7919415 4577183 2606047 5474680 10855044 13349074 11738447 9741822 10010779
35717 10010779 10991316 10206929 7519386 4010365 156514 -3332437 -4771111 -3499125
35709 -3499125 -1589228 -1792164 -4177799 -6231933 -6109295 -4413060 -2533703 -579262
35701 -579262 2064757 4807404 5839286 4338752 1752724 193543 141653 559615 769862
35692 769862 932478 736680 -744652 -3147192 -4142771 -2033908 1735559 4115035 4126333
35683 4126333 3483792 3553343 3442113 1955694 131335 314260 3045744 6229003 7684266
$$ packed form
35742A1373638O89830L276445L641087m37878m929530m350728K06218K528552
35734A1997634N40986j192397M88908K281713N28339k388894k354374o63664j318836
35725G919415l342232j971136K868633N380364K494030j610627j996625K68957
35717A0010779R80537p84387k687543l509021l853851l488951j438674J271986
35709c499125J909897k02936k385635k054134J22638J696235J879357J954441
35701e79262K644019K742647J031882j500534k586028j559181n1890M17962K10247
35692G69862J62616j95798j481332k402540r95579K108863L769467K379476J1298
35683D126333o42541O9551j11230j486419j824359J82925K731484L183259J455263
$$ plain form
35674 7684266 7480060 6995591 6403339 4376274 447812 -3513744 -5075902 -3970089 -2146572
35665 -2146572 -1351170 -1606853 -2073492 -2290967 -2092438 -1149680 622363 2587167 3905480
35656 3905480 4327483 4096923 3382114 2284007 1250563 1014886 2007875 3927410 5853261
35647 5853261 6790408 6221690 4145179 702883 -3674217 -7562478 -9010574 -7772460
35639 -7772460 -6321965 -6997539 -8435821 -6947681 -1859530 2826681 3510600 1803877
35631 1803877 2021863 4934542 6762438 4683712 992251 339432 3941755 8125532
35623 8125532 8632809 5188913 1059949 -1291986 -2693260 -4957038 -7562590 -8295113
35615 -8295113 -6601798 -4270152 -2627406 -1186904 191466 -25425 -2653356 -5703007
$$ packed form
35674G684266k04206m84469n92252k027065l928462l961556j562158J105813J823517
35665b146572P95402k55683m66639k17475J98529R42758J772043J964804J318313
35656C905480M22003k30560p14809j098107j033444k35677R92989J919535J925851
35647E853261R37147n68718k076511l442296m377100l888261j448096J238114
35639g772460J450495o75574j438282J488140N088151M686211O83919j706723
35631A803877K17986K912679J827896k078726l691461o52819L602323M183777
35623H125532N07277l443896m128964k351935j401274k263778k605552p32523
35615h295113J693315K331646J642746J440502J378370k16891k627931l049651
$$ plain form
35607 -5703007 -6570893 -5237988 -3398327 -1251456 2650540 8489134 14020361 16741184
35599 16741184 16061839 13095758 9162262 4753523 -218644 -4852894 -6304350 -2224581
35591 -2224581 5205146 10023163 9106594 6040913 6009670 8808338 10228625 8844174 7173458
35582 7173458 6560530 5518249 3868840 4015228 6315594 7176068 4201506 -120912 -2591026
35573 -2591026 -3957474 -6053305 -7055452 -3908880 2005924 5969455 6256759 5497773
35565 5497773 5770548 6280144 6579057 8138380 10919173 11672036 8332856 3974363 3442548
35556 3442548 7072301 10431220 10023715 6834017 3905609 2632423 2580829 3408359 5168310
35547 5168310 7081681 7535095 5739978 2630959 -239699 -2139477 -3230675 -3879990
$$ packed form
35607e703007q67886J332905J839661K146871L901996N838594N531227K720823
35599A6741184o79345k966081l933496m408739m972167m634250j451456M079769
35591b224581P429727M818017r16569l065681l1243K798668J420287j384451j670716
35582G173458o12928j042281j649409J46388K300366Q60474k974562m322418k470114
35573b591026j366448k095831j002147L146572N914804L963531K87304p58986
35565E497773K72775N09596K98913J559323K780793P52863l339180m358493n31815
35556C442548L629753L358919m07505l189698k928408j273186n1594Q27530J759951
35547E168310J913371M53414j795117l109019k870658j899778j091198o49315
$$ plain form
35539 -3879990 -4345362 -4547599 -3645351 -572664 4205846 8231796 9537881 9069287 9206982
35530 9206982 10250444 10151983 7770704 4379113 1411478 -1175832 -3164283 -2736198 1103366
35521 1103366 5930921 7914662 6144855 3278313 1937068 1949613 1427521 -492757 -2424517
35512 -2424517 -1901083 2084961 7409158 10228907 8609726 4195976 -85993 -2877374
35504 -2877374 -4163289 -3679619 -1341897 1426213 2656993 2051084 863405 -152972
35496 -152972 -1236128 -2261647 -2476663 -1683688 -411915 1041881 2501230 3145895 2458003
35487 2458003 1730399 2721904 4680287 4755864 1937617 -1373043 -2579926 -1896575 -1046604
35478 -1046604 -622421 -234521 -166938 -1336115 -4031187 -7526428 -10363223 -10679490 -7609153
$$ packed form
35539c879990m65372k02237R02248L072687M778510M025950J306085m68594J37695
35530I206982J043462r8461k381279l391591k967635k587310j988451M28085L839564
35521A103366M827555J983741j769807k866542j341245J2545n22092j920278j931760
35512b424517N23434L986044N324197K819749j619181m413750m281969k791381
35504b877374j285915M83670K337722K768110J230780o05909j187679j016377
35496a52972j083156j025519k15016P92975J271773J453796J459349O44665o87892
35487B458003p27604R91505J958383P5577k818247l310660j206883O83351Q49971
35478a046604M24183L87900O7583j169177k695072l495241k836795l16267L070337
$$ plain form
35469 -7609153 -3139426 -992324 -2286954 -3685794 -1540080 3323963 7000539 7737628
35461 7737628 7246295 7078865 6532090 4926404 3538268 3676389 4405022 3973258 2652669
35452 2652669 2382578 3840375 5458264 5623107 4616061 3834797 4075039 5370520 7770886
35443 7770886 11055581 13805808 14028448 11254725 7234769 3943945 1575394 -779979
35435 -779979 -3230686 -5104043 -6537670 -8582335 -11369677 -13234871 -12170477 -7618029
35427 -7618029 -926366 5003382 6818032 3310321 -2446726 -5214898 -2885312 1660565
35419 1660565 4834768 6574845 8623408 10534113 10305589 8171280 6578065 6160090
35411 6160090 4621179 525614 -4284335 -7387236 -8821914 -9780986 -9896260 -7744755
$$ packed form
35469g609153M469727K147102j294630j398840K145714M864043L676576P37089
35461G737628m91333j67430n46775j605686j388136J38121P28633m31764j320589
35452B652669k70091J457797J617889J64843j007046p81264K40242J295481K400366
35443G770886L284695K750227K22640k773723m019956l290824k368551k355373
35435g79979k450707j873357j433627k044665k787342j865194J064394M552448
35427g618029O691663N929748J814650l507711n757047k768172K329586M545877
35419A660565L174203J740077K048563J910705k28524k134309j593215m17975
35411F160090j538911m095565m809949l102901j434678r59072j15274K151505
$$ plain form
35403 -7744755 -3161276 2491902 7574986 10388413 9247971 4225841 -1688918 -4926929
35395 -4926929 -4710718 -2870759 -951782 778167 1978649 2183188 2315756 4152030 7584293
35386 7584293 10152460 10050373 8049734 5766106 3784092 2480682 2792913 4520604
35378 4520604 5346628 3470354 183612 -2091987 -3377447 -5432847 -8005510 -8461217
35370 -8461217 -5545683 -1145588 2577928 5675317 8588952 9606076 6394030 -317879
35362 -317879 -6504267 -8801524 -7649660 -5869265 -4804986 -2996806 999909 5469136
35354 5469136 6754241 3958313 916570 2121743 7500082 12805353 14683739 13478274
35346 13478274 11195916 9050704 7772321 8196889 9979710 11015984 9652973 6627742
$$ packed form
35403g744755M583479N653178N083084K813427j140442n022130n914759l238011
35395d926929K16211J839959J918977J729949J200482K04539J32568J836274L432263
35386G584293K568167j02087k000639k283628j982014j303410L12231J727691
35378D520604Q26024j876274l286742k275599j285460k055400k572663m55707
35370h461217K915534M400095L723516L097389K913635J017124l212046o711909
35362c17879o186388k297257J151864J780395J064279J808180L996715M469227
35354E469136J285105k795928l041743J205173N378339N305271J878386j205465
35346A3478274k282358k145212j278383M24568J782821J036274j363011l025231
$$ plain form
35338 6627742 3588473 713831 -2608656 -5512519 -6139020 -4588490 -3662282 -5691381
35330 -5691381 -9387704 -10857339 -7841578 -2385939 1281903 1448159 559214 1662327
35322 1662327 4427116 6201043 6039375 5282695 4403876 2291893 -553516 -1165666 1764651
35313 1764651 5360723 6236132 4555520 2244133 -509392 -4028602 -6469664 -6008877
35305 -6008877 -4430409 -4738365 -6070267 -5179563 -2704344 -3249524 -8211577 -12868016 -12607504
35296 -12607504 -8539256 -4611265 -2225549 -494245 532961 47598 -1354889 -2320688
35288 -2320688 -2840458 -3689728 -4461674 -4008027 -2399634 -968963 -750543 -1881959 -3900943
35279 -3900943 -5707965 -6044786 -4959099 -4020540 -4352197 -5413667 -6316837 -6989383 -7293679
$$ packed form
35338F627742l039269k874642l322487k903863o26501J550530R26208k029099
35330e691381l696323j469635L015761N455639L667842J66256q88945J103113
35322A662327K764789J773927j61668p56680q78819k111983k845409o12150K930317
35313A764651L596072Q75409j680612k311387k753525l519210k441062M60787
35305f008877J578468l07956j331902Q90704K475219n45180m962053m656439K60512
35296a2607504M068248L927991K385716J731304J027206m85363j402487r65799
35288b320688n19770q49270p71946M53647J608393J430671K18420j131416k018984
35279c900943j807022l36821J085687R38559l31657j061470r03170o72546l04296
$$ plain form
35270 -7293679 -6614562 -5335847 -4981762 -5612408 -4948659 -1804549 1382612 1623507 -393106
35261 -393106 -1528217 -777543 -260791 -1936587 -5221782 -7741846 -7159104 -2841032 2986369
35252 2986369 6499590 5982848 3442640 1552429 589808 -137373 63669 1716753 3015893
35243 3015893 2265223 1265053 2984704 6658454 8697530 8173453 7770330 9020757 10181098
35234 10181098 9750155 8864314 8801909 8739616 7493201 5432909 3420917 1660671 567029
35225 567029 920467 2242765 2835461 2203414 1504694 925548 -1018880 -4423943 -6620560
35216 -6620560 -5580946 -2848712 -1275032 -1301550 -1297280 -518452 9383 -881814 -3002266
35207 -3002266 -4482683 -2684851 3391914 11152900 16132454 16143578 12532817 7511835
$$ packed form
35270g293679O79117J278715L54085o30646O63749L144110L187161K40895k016613
35261c93106j135111P50674N16752j675796l285195k520064N82742M318072N827401
35252B986369L513221n16742k540208j890211r62621p27181K01042J653084J299140
35243C015893p50670j000170J719651L673750K039076n24077m03123J250427J160341
35234A0181098m30943q85841o2405o2293j246415k060292k011992j760246j093642
35225E67029L53438J322298N92696o32047o98720n79146j944428l405063k196617
35216f620560J039614K732234J573680k6518M270P78828N27835q91197k120452
35207c002266j480417J797832O076765P760986M979554J1124l610761n020982
$$ plain form
35199 7511835 2493478 -641638 361516 5103069 9778878 11303519 10592983 10275704
35191 10275704 10905078 11129345 10029254 7528117 3822160 4821 -2014342 -1643992
35183 -1643992 -411580 403897 1159545 1770409 684445 -2162113 -3675081 -1324098 3314370
35174 3314370 7101964 9483304 11422809 12190954 10600960 8198218 7748069 9082643
35166 9082643 9443588 7577014 4918350 3284193 3759430 6851384 11078104 12636927
35158 12636927 9625238 5465200 4682531 6431890 6244845 3272330 1012568 1053759 1310709
35149 1310709 1189413 3125285 7184383 9216387 7167889 4867878 6163304 8936016
35141 8936016 8779419 5868709 4153997 5410544 7700239 8722303 7673929 4560198
$$ packed form
35199G511835n018357l135116J003154M741553M675809J524641p10536l17279
35191A0275704O29374K24267j100091k501137l705957l817339k019163L70350
35183a643992J232412Q15477P55648O10864j085964k846558j512968K350983M638468
35174C314370L787594K381340J939505P68145j589994k402742m50149J334574
35166I082643L60945j866574k658664j634157M75237L091954M226720J558823
35158A2636927l011689m160038p82669J749359j87045k972515k259762M1191K56950
35149A310709j21296J935872M059098K032004k048498k300011J295426K772712
35141H936016j56597k910710j714712J256547K289695J022064j048374l113731
$$ plain form
35133 4560198 258062 -3253012 -4650335 -4540955 -3667324 -1408197 2314554 5614836
35125 5614836 7265580 8731943 11079980 12012927 9292439 5366214 4580716 6563074
35117 6563074 6428365 1666418 -4816147 -9007058 -9795168 -7928541 -4259293 -478976
35109 -478976 988481 -449288 -2757580 -4175042 -5283592 -7211252 -9455399 -10694536
35101 -10694536 -10509539 -9321103 -7664833 -6172561 -5187419 -4030723 -1957629 -22646
35093 -22646 -193153 -2154229 -3126396 -1885784 -891076 -2806958 -6521629 -8469421 -6874515
35084 -6874515 -3021935 838233 3229877 3764002 3375503 4019773 6858798 10871772 14070560
35075 14070560 15560136 15535498 14111609 11532757 8944880 7387002 6229106 4097390
$$ packed form
35133D560198m302136l511074j397323J09380Q73631K259127L722751L300282
35125E614836J650744J466363K348037R32947k720488l926225p85498J982358
35117F563074j34709m761947o482565m190911p88110J866627L669248L780317
35109d78976J467457j437769k308292j417462j108550j927660k244147j239137
35101a0694536J84997J188436J656270J492272R85142J156696K073094J934983
35093b2646j70507j961076r72167J240612R94708j915882l714671j947792J594906
35084f874515L852580L860168K391644N34125l88499O44270K839025M012974L198788
35075A4070560J489576k4638j423889k578852k587877j557878j157896k131716
$$ plain form
35067 4097390 1345800 136703 1684384 4529939 6050246 5000222 2334529 175135
35059 175135 161229 2263476 5050709 7343536 9224562 10949346 11646227 10303528 7623059
35050 7623059 5417723 4207490 2913048 1080869 -319007 -956707 -2285040 -5307251
35042 -5307251 -8340586 -8522899 -5087464 -38626 3956906 5330332 3889522 782901
35034 782901 -1894104 -2712467 -2362412 -2687017 -4278426 -5875744 -6052159 -4523810 -1865828
35025 -1865828 904064 2385614 1769989 139647 -439517 431764 1114336 809840 1050754
35016 1050754 2914576 4330894 2466484 -1801361 -4181174 -2005698 2938897 7124349
35008 7124349 9072095 9645344 10158212 11415309 13518848 15344102 14954727 11738246 7570622
$$ packed form
35067D097390k751590j209097J547681K845555J520307j050024k665693k159394
35059A75135j3906K102247K787233K292827J881026J724784O96881j342699k680469
35050G623059k205336j210233j294442j832179j399876o37700j328333l022211
35042e307251l033335j82313L435435N048838L995532J373426j440810l106621
35034G82901k677005q18363L50055l24605j591409j597318j76415J528349K657982
35025a865828K769892J481550o15625j630342n79164Q71281O82572l04496K40914
35016A050754J863822J416318j864410m267845k379813K175476M944595M185452
35008G124349J947746N73249N12868J257097K103539J825254l89375l216481m167624
$$ plain form
34999 7570622 4774127 3516255 2464005 1434438 1727055 3852292 6584504 8716204
34991 8716204 10319428 11559532 11602154 9886211 7581518 6344055 5974902 4735469 2063919
34982 2063919 -413484 -1192225 -1099149 -2105650 -4486626 -6448902 -6676937 -6064997 -6253327
34973 -6253327 -7250743 -7562080 -6447917 -4961898 -4398521 -4480924 -3699138 -1100745 2727831
$$ packed form
34999G570622k796495j257872j052250j029567K92617K125237K732212K131700
34991H716204J603224J240104M2622j715943k304693j237463l69153j239433k671550
34982B063919k477403p78741R3076j006501k380976j962276k28035O11940j88330
34973f253327r97416l11337J114163J486019N63377q2403P81786K598393L828576
$$ [...]
##END NTUPLES=NMR SPECTRUM
##END=
