##TITLE=31Pdec_DE-139rm_3h
, 64 sc
 1.4.2026
##JCAMPDX= 6.0         $$ Bruker NMR JCAMP-DX V2.0
##DATA TYPE= NMR SPECTRUM
##DATA CLASS= NTUPLES
##ORIGIN= UXNMR, Bruker Analytische Messtechnik GmbH
##OWNER= root
$$ XWIN-NMR		Version 3.5
$$ Wed Apr  1 14:41:37 2026 Russian Standard Time (UT+4h)  she@DPX200
##.OBSERVE FREQUENCY= 81.013821
##.OBSERVE NUCLEUS= ^31P
##.ACQUISITION MODE= SIMULTANEOUS
##.ACQUISITION SCHEME= undefined
##.AVERAGES= 64
##.DIGITISER RES= 17
##SPECTROMETER/DATA SYSTEM= spect
##.PULSE SEQUENCE= zgpg30
##.SOLVENT NAME= DMSO
##.SHIFT REFERENCE= (INTERNAL, DMSO, 0, 197.392)
##AUDIT TRAIL= $$ (NUMBER, WHEN, WHO, WHERE, WHAT)
$$ ##TITLE= Audit trail, XWIN-NMR		Version 3.5
$$ ##JCAMPDX= 5.01
$$ ##ORIGIN= Bruker BioSpin GmbH
$$ ##OWNER= she
$$ F:/spectra/data/she/nmr/P31/2/pdata/1/auditp.txt
$$ ##AUDIT TRAIL=  $$ (NUMBER, WHEN, WHO, WHERE, WHAT)
(   1,<2026-04-01 14:40:34.62 +0400>,<she>,<DPX200>,
      <continue with go, POWCHK disabled, PULCHK disabled
       configuration hash MD5:
       00 E9 B6 7A A2 85 ED C7 34 08 36 98 17 FE 4E 26
       data hash MD5: 32K
       09 4F B8 0E C6 7A D3 28 36 EF 83 D1 C7 46 4E 28>)
(   2,<2026-04-01 14:40:37.56 +0400>,<she>,<DPX200>,
      <Start of raw data processing
       efp BC_mod = 2 LB = 1.5 FT_mod = 6 PKNL = 1 PHC0 = 1414.162 PHC1 = 54.70077 SI = 64K 
       data hash MD5: 64K
       41 97 81 9C 2B E8 FC E2 7B 7E B6 02 97 71 83 CB>)
(   3,<2026-04-01 14:40:56.75 +0400>,<she>,<DPX200>,
      <pk PHC0 = -25.57847 PHC1 = 0 
       data hash MD5: 64K
       AF 25 97 A5 29 3D 3D 99 BD 49 27 85 FB 72 04 55>)
(   4,<2026-04-01 14:41:01.21 +0400>,<she>,<DPX200>,
      <abs ABSG = 5 
       data hash MD5: 64K
       FD C8 02 C8 E7 99 23 67 6F F6 4D 36 B8 0C 1F 06>)
$$ ##END=
$$ 
$$ hash MD5
$$ 6C 2C 75 1C 0A D3 35 71 D7 60 5F 0A 8C C8 CD 76
##$RELAX= 
##$RELAX= 
##$RELAX= 
##$RELAX= 
##$RELAX= 
##$RELAX= 
##$RELAX= 
##$RELAX= 
$$ Bruker specific parameters
$$ --------------------------
##$DU= <F:/spectra>
##$EXPNO= 2
##$NAME= <P31>
##$PROCNO= 1
##$TYPE= <nmr>
##$USER= <she>
##$AMP= (0..31)
100 100 100 100 100 100 100 100 100 100 100 100 100 100 100 100 100 100 
100 100 100 100 100 100 100 100 100 100 100 100 100 100 
##$AQSEQ= 0
##$AQ_mod= 1
##$AUNM= <au_zg>
##$AUTOPOS= <>
##$BF1= 81.014009
##$BF2= 200.13
##$BF3= 200.13
##$BF4= 200.13
##$BF5= 200.13
##$BF6= 200.13
##$BF7= 200.13
##$BF8= 200.13
##$BYTORDA= 1
##$CFDGTYP= 0
##$CFRGTYP= 5
##$CHEMSTR= <none>
##$CNST= (0..31)
1 1 145 1 1 1 1 1 1 1 1 1 1 1 1 1 1 1 1 1 1 1 1 1 1 1 1 1 1 1 1 1 
##$CPDPRG= <waltz16>
##$CPDPRG1= <>
##$CPDPRG2= <waltz16>
##$CPDPRG3= <>
##$CPDPRG4= <mlev>
##$CPDPRG5= <mlev>
##$CPDPRG6= <mlev>
##$CPDPRG7= <mlev>
##$CPDPRG8= <mlev>
##$CPDPRGB= <>
##$CPDPRGT= <>
##$D= (0..31)
0 1 0 0 0 0 0 0 0 0.06 0 0.03 2e-05 3e-06 0 0 0.0002 0 0 0 0 0 0 0 0 0 
0 0 0 0 0 0 
##$DATE= 1775039945
##$DBL= (0..7)
120 120 120 11 120 120 24 19 
##$DBP= (0..7)
150 150 150 150 150 150 150 150 
##$DBP07= 0
##$DBPNAM0= <>
##$DBPNAM1= <>
##$DBPNAM2= <>
$$ [...]
##$SUBNAM3= <"">
##$SUBNAM4= <"">
##$SUBNAM5= <"">
##$SUBNAM6= <"">
##$SUBNAM7= <"">
##$SUBNAM8= <"">
##$SUBNAM9= <"">
##$SW= 400.765351723535
##$SWIBOX= (0..15)
0 1 3 0 0 0 0 0 0 0 0 0 0 0 0 0 
##$SW_h= 32467.5324675325
##$TD= 32768
##$TD0= 1
##$TE= 0
##$TE2= 300
##$TE3= 300
##$TEG= 300
##$TL= (0..7)
0 120 53 12 22 120 120 120 
##$TP= (0..7)
150 150 150 150 150 150 150 150 
##$TP07= 0
##$TPNAME0= <>
##$TPNAME1= <>
##$TPNAME2= <>
##$TPNAME3= <>
##$TPNAME4= <>
##$TPNAME5= <>
##$TPNAME6= <>
##$TPNAME7= <>
##$TPOAL= (0..7)
0.5 0.5 0.5 0.5 0.5 0.5 0.5 0.5 
##$TPOFFS= (0..7)
0 0 0 0 0 0 0 0 
##$TUNHIN= 0
##$TUNHOUT= 0
##$TUNXOUT= 0
##$USERA1= <user>
##$USERA2= <user>
##$USERA3= <user>
##$USERA4= <user>
##$USERA5= <user>
##$V9= 5
##$VALIST= <valist>
##$VCLIST= <CCCCCCCCCCCCCCC>
##$VD= 0
##$VDLIST= <DDDDDDDDDDDDDDD>
##$VPLIST= <PPPPPPPPPPPPPPP>
##$VTLIST= <TTTTTTTTTTTTTTT>
##$WBST= 1024
##$WBSW= 4
##$XGAIN= (0..3)
0 0 0 0 
##$XL= 0
##$YL= 0
##$YMAX_a= 66162
##$YMIN_a= -74011
##$ZGOPTNS= <>
##$ZL1= 120
##$ZL2= 120
##$ZL3= 120
##$ZL4= 120
##$ABSF1= 197.3918
##$ABSF2= -203.3724
##$ABSG= 5
##$ABSL= 3
##$ALPHA= 0
##$AQORDER= 0
##$ASSFAC= 0
##$ASSFACI= 0
##$ASSFACX= 0
##$ASSWID= 0
##$AUNMP= <proc_1d>
##$AZFE= 0.1
##$AZFW= 0.5
##$BCFW= 0
##$BC_mod= 2
##$BYTORDP= 0
##$COROFFS= 0
##$CY= -3
##$DATMOD= 1
##$DC= 0
##$DFILT= <>
##$DTYPP= 0
##$F1P= 0
##$F2P= 0
##$FCOR= 1
##$FTSIZE= 65536
##$FT_mod= 6
##$GAMMA= 0
##$GB= 0
##$INTBC= 1
##$INTSCL= 9.790993e-09
##$ISEN= 30
##$LB= 1.5
##$LEV0= 0
##$LPBIN= 0
##$MAXI= 10000
##$MC2= 0
##$MEAN= 0
##$ME_mod= 0
##$MI= 50
##$NCOEF= 0
##$NC_proc= -6
##$NLEV= 6
##$NOISF1= 182.463
##$NOISF2= 159.3651
##$NSP= 0
##$NTH_PI= 0
##$NZP= 0
##$OFFSET= 197.3918
##$PC= 4
##$PHC0= 1388.583
##$PHC1= 54.70077
##$PH_mod= 1
##$PKNL= yes
##$PPARMOD= 0
##$PSCAL= 0
##$PSIGN= 0
##$REVERSE= no
##$SF= 81.014063255964
##$SI= 65536
##$SIGF1= 159.3651
##$SIGF2= -187.1042
##$SINO= 113.3802
##$SIOLD= 16384
##$SREGLST= <1H.CDCl3>
##$SSB= 0
##$STSI= 65536
##$STSR= 0
##$SW_p= 32467.5324675325
##$SYMM= 0
##$S_DEV= 0
##$TDeff= 32768
##$TDoff= 0
##$TI= <>
##$TILT= no
##$TM1= 0
##$TM2= 0
##$TOPLEV= 0
##$USERP1= <user>
##$USERP2= <user>
##$USERP3= <user>
##$USERP4= <user>
##$USERP5= <user>
##$WDW= 1
##$XDIM= 65536
##$YMAX_p= 526136578
##$YMIN_p= -18720894
$$ End of Bruker specific parameters
$$ ---------------------------------
##NTUPLES= NMR SPECTRUM
##VAR_NAME=  FREQUENCY,     SPECTRUM/REAL,   SPECTRUM/IMAG
##SYMBOL=    X,             R,               I
##VAR_TYPE=  INDEPENDENT,   DEPENDENT,       DEPENDENT
##VAR_FORM=  AFFN,          ASDF,            ASDF
##VAR_DIM=   65536,         65536,           65536
##UNITS=     HZ,            ARBITRARY UNITS, ARBITRARY UNITS
##FACTOR=    0.49542278885378, 1,            1
##FIRST=     15991.5117654749, 0,            0
##LAST=      -16476.0207020576, 0,           0
##MIN=       -16476.0207020576, -18720894,   0
##MAX=       15991.5117654749, 526136578,    0
$$ Real data points
##PAGE= N=1
##DATA TABLE= (X++(R..R)), XYDATA
$$ [...]
46744b085156N38935J95172M39110J309076J723250R67530k14802p26810n71226
46735A575079l81672k20604J47946L64443j5714n04620l19059K41158K42043k33322
46725H95678j91125M69761O30323k06986j008736p74735K4273L44324Q7993j17792
46715A52978o1711J64M2215K06471K80623k5693m30777l87485M3578K80045J49677
46704B50085O5109J89168J26420k74092m43831P9360P88979P99375R8363m49049
46694A229887l65770j54927l45531n61621j48296O22274P63457K0588o49139l70777
46684D0145M74374Q84081O14114K54922J29505j30712p80258j361295j278085
46675a153209o08616L8809K96848L25542L95376M95388M33949J47022k16772m52911
$$ plain form
46744 -2085156 -1546221 -1351049 -911939 397137 2120387 3087917 2873115 2146305 1575079
46735 1575079 1193407 972803 1120749 1485192 1469478 964858 645799 886957 1129000 895678
46725 895678 704553 1174314 1804637 1597651 588915 -185820 -161547 182777 270770 152978
46715 152978 91267 91431 133646 340117 620740 595047 164270 -223215 -179637 100408 250085
46704 250085 315194 504362 630782 356690 -87141 -7781 781198 1580573 1678936 1229887
46694 1229887 864117 709190 363659 -197962 -346258 276016 1039473 1060061 410922 40145
46684 40145 514519 1398600 2012714 2267636 2397141 2266429 1486171 124876 -1153209
46675 -1153209 -1761825 -1723016 -1426168 -1100626 -705250 -209862 224087 371109 154337 -298574
46665b98574m45034j80815K40794N49353L86489l34254j146489j336979o66065
46656c231574L33959Q89356P32755K56673K6686K22201N04883M37326P8245r724
46646B40786M24369P43465K03305p83259r46622M3986R21130N28100n38946q53661
46636a7347k20318K44512r0518n99210n86249k63719j18704o5519K08537N39769
46626i68766M99296Q4911k21722k7411N37841Q93178N06913m99391j316918j287302
46616a799371o43276m9387L60043Q63286J240440Q74202r3852o12843j31646O11709
46606F19305P08086K86901J1790j4738j33205l65353m74391m63167m00856r4421
46596c20049M55351O50017N7201p36660q01345j53498M01210M98790M37063L17483
$$ plain form
46665 -298574 -743608 -924423 -683629 -134276 252213 -82041 -1228530 -2565509 -3231574
46656 -3231574 -2897615 -2008259 -1275504 -1018831 -992145 -769944 -265061 172265 250510 240786
46646 240786 665155 1408620 1611925 828666 -117956 -73970 847160 1375260 836314 -17347
46636 -17347 -237665 6847 -83671 -682881 -1269130 -1532849 -1651553 -1717072 -1508535 -968766
46626 -968766 -469470 -384559 -606281 -633692 -95851 797327 1304240 804849 -512069 -1799371
46616 -1799371 -2442647 -2492034 -2131991 -1268705 -28265 845937 752085 139242 7596 619305
46606 619305 1327391 1614292 1626082 1611344 1478139 1112786 638395 175228 -225628 -320049
46596 -320049 135302 785319 842520 105860 -695485 -848983 -447773 51017 488080 805563
46586H05563o9146m82056l45733J83782K26706m13421p84454k38378N13372N10788
46576i2977P789o3282L72734N28302J34740j48553J20512M36901J88530l57503
46566A127193m83953j30366O1808k16257m70112k18414K07825J75256k18232k69060
46556d34312J87103M61033R3140m19810m69151l22566n57697r29958p03717N6524
46546c039411M97075L56812L64310R21514J299764P53104k64489p47890n58419
46537d17630m02831o14747p25590k84389M85053R91312Q70085K04413n37430p62280
46527a194034k69756M34542O07440Q7681n87948q74859p24212l61145P6882M75254
46517b330155N76548K00431m08514p00553l85465K32247N93536N18924L62823
$$ plain form
46586 805563 736417 254361 -91372 92410 319116 -94305 -878759 -1117137 -603765 -92977
46576 -92977 -85188 -148470 224264 752566 887306 738753 859265 1296166 1484696 1127193
46566 1127193 643240 512874 574682 358425 -111687 -330101 -122276 52980 -165252 -434312
46556 -434312 -247209 213824 306964 -112846 -581997 -904563 -1462260 -2392218 -3095935 -3039411
46546 -3039411 -2542336 -2185524 -1821214 -899700 400064 1153168 888679 140789 -417630
46537 -417630 -820461 -1435208 -2160798 -2445187 -1960134 -968822 -98737 105676 -431754 -1194034
46527 -1194034 -1463790 -1029248 -421808 -334127 -922075 -1796934 -2521146 -2882291 -2805409 -2330155
46517 -2330155 -1753607 -1553176 -1961690 -2662243 -3047708 -2815461 -2221925 -1703001 -1340178
46508a340178M91807P63039O92267Q8290o59704r48903n12735L55457J000384
46499g0276R07697K02677m15750m33455r1587O0752k4749k402J01706q9042m58121
46488c12550l54116K95349N94424l5063q26601o86557K11168P11353L27578k78158
46478c53173m42790k86381j72996r7454Q4437L20418N31457P23666P43135L33739
46468A384058l52655p09274l98352K04406N29816M77209L02639J11132k28801
46459A320178p57872j207581j129377l28397O92474R51219P0866r90543q88114
46450b267147M01486J479799J313213M08642j68210k37072l22206n53384n65833
46441e10712k84596m1671Q2491L81069Q76882J109294P84850K49721N7111K80199
$$ plain form
46508 -1340178 -848371 -85332 606935 695225 35521 -913382 -1426117 -1070660 -70276
46499 -70276 837421 1040098 624348 190893 99306 160058 135309 132907 234613 145571 -312550
46488 -312550 -666666 -371317 223107 188044 -638557 -1325114 -1113946 -402593 -75015 -353173
46478 -353173 -795963 -1082344 -1255340 -1352794 -1268357 -947939 -416482 307184 1050319 1384058
46468 1384058 1031403 322129 -76223 128183 657999 1135208 1437847 1548979 1320178
46459 1320178 562306 -645275 -1774652 -2103049 -1410575 -459356 -388490 -1379033 -2267147
46450 -2267147 -1865661 -385862 927351 1335993 1167783 930711 608505 55121 -510712
46441 -510712 -795308 -836979 -754488 -373419 503463 1612757 2397607 2647328 2704439 2984638
46431B984638M59567J53619n49166j059450q90969k64371Q3831j86515n67075
46422A64109m09602J89315O02918N74776M10654L29759J48154k75748p08207q55915
46412A70213p23392m77390j95720O5717J43246q5615m77025o72836m12592J79809
46402b485585O30872N76541K33250J77540N21497O41567N3634p58919r07991l12378
46392a629972K63387L53181L09691N18131P21676N06205J3202k73853k13626j04882
46382D63140k29629n67093q70131q49603l94762K54288O70416O65352M27419K15027
46372b15576J10168R6512J48299K10160K92728N11992P55553N21330l79645j136382
46362I15139p61274L59230P06186k54629j222557r63134n7419K37431K7045L13978
$$ plain form
46431 2984638 3444205 3597824 3048658 1989208 1098239 833868 917699 731184 164109
46422 164109 -245493 -56178 546740 1121516 1532170 1861929 2010083 1734335 1026128 170213
46412 170213 -553179 -1030569 -1226289 -1160572 -1017326 -1102941 -1579966 -2252802 -2665394 -2485585
46402 -2485585 -1854713 -1278172 -1044922 -867382 -345885 295682 349316 -409603 -1317594 -1629972
46392 -1629972 -1366585 -1013404 -703713 -185582 536094 1042299 1055501 781648 568022 463140
46382 463140 233511 -333582 -1203713 -2053316 -2448078 -2193790 -1523374 -858022 -430603 -215576
46372 -215576 -105408 -8896 139403 349563 642291 1154283 1909836 2431166 2051521 915139
46362 915139 153865 513095 1219281 964652 -257905 -1221039 -1278458 -1041027 -1013982 -700004
46352g00004R69228P79888l96544j081723l64620O39988M61214n03081o16533
46343h12187N31127J502740J033056k64994q01130j56965M26899j73751j335306
46334e0511j451911j35434J190479J200877L78479P6454M57341M67856k90908
46325A842722q97276o28686p0816o8629l95126k95016J84961L18860p8096l98140
46315d85242k26214J11002J42729j07742l13973l47552l45051m10708m16512j20011
46305b519274M94068J018727R61809L70226r5960J04002P44247J103529P53909
46296B935283q0204q09462r71376n79478j28515j20710m98228p23028m59079J03993
46286a330804O45529J017539J028343M45170m79272r74409o66044r1500J47119
$$ plain form
46352 -700004 269224 1049112 652568 -429155 -793775 -153787 307427 -195654 -812187
46343 -812187 -281060 1221680 2254736 1989742 1188612 1031647 1458546 1284795 -50511
46334 -50511 -1502422 -1637856 -447377 753500 1131979 1208433 1665774 2133630 1842722
46325 1842722 945446 316760 245944 177315 -217811 -512827 -327866 -9006 -87102 -485242
46315 -485242 -711456 -600454 -457725 -565467 -879440 -1226992 -1572043 -1982751 -2399263 -2519274
46305 -2519274 -2025206 -1006479 -44670 325556 229596 333598 1077845 2181374 2935283
46296 2935283 2855079 2045617 1074241 494763 366248 245538 -252690 -975718 -1434797 -1330804
46286 -1330804 -685275 332264 1360607 1805777 1326505 352096 -313948 -405448 -258329
46277b58329K57627O74101J056268P17729j65710o81160n31564m08431p92640
46268a32109j129420o29252N68957J475884J331744L78345m07074l52476J19217
46259A223816J9855p61919j128339l58674O50652O44850l4193m6246O35682O02467
46249A447951n57333j358270p27200K60134J35597o29382n29784M73596R70257
46240e14434L51747m50793n60176k06051P3059K04552K07703o3332m38696m51870
46230a848291j44675r9812l65660j86997P14527J400405R59767j05075n36217
46221b12028l57O70572P38037L16710j18408l37581l22075j09869J09855O2855
46211G97711k57894n09381m07312o2611K04850K64333K60076L53752M97605N05992
$$ plain form
46277 -258329 -702 673399 1729667 2447396 2281686 1600526 1068962 660531 -132109
46268 -132109 -1261529 -1890781 -1321824 154060 1485804 1864149 1457075 1104599 1223816
46259 1223816 1243671 481752 -646587 -1005261 -354609 290241 256048 209802 845484 1447951
46249 1447951 890618 -467652 -1194852 -934718 -799121 -1428503 -1958287 -1484691 -514434
46240 -514434 -162687 -613480 -1173656 -1379707 -1306648 -1102096 -894393 -957725 -1396421 -1848291
46230 -1848291 -1992966 -2092778 -2458438 -2645435 -1930908 -530503 429264 324189 -212028
46221 -212028 -212385 458187 1196224 1512934 1394526 1056945 734870 625001 734856 797711
46211 797711 539817 30436 -376876 -439487 -234637 29696 289772 643524 1141129 1647121
46201A647121L12736O9948n1357o1731m9963M096J15632R8661k02790n12862l52463
46190A017028K24420N39512J72166m47459o66678n02199m53066o43150o81786
46181a441212l40995J09730L22796K54131M0044j86527k74169j40882M2024K9102
46171a585958j04387p5077P5656M763k41930q0678P14484J395359J051825j54468
46161I99589j090353r62988j08704N70368N93685K13255k906K34114O36337O25039
46151A707436K4848o38230p54014m17540k52934m92117o61769l12450L20163O24458
46141h52149L50310j77417m34814j57586M18752P00194L25243l21446m67381P4509
46131e41785O30924N47281j5259m25775l84332m4846L38901M86111J01951o92535
$$ plain form
46201 1647121 1959857 2029805 1978448 1916717 1866754 1870850 1986482 2085143 1882353 1369491 1017028
46190 1017028 1241448 1780960 1953126 1505667 838989 336790 -116276 -759426 -1441212
46181 -1441212 -1782207 -1672477 -1349681 -1095550 -1055506 -1242033 -1516202 -1657084 -1615060 -1585958
46171 -1585958 -1690345 -1765422 -1689766 -1685003 -1926933 -2007611 -1293127 102232 1154057 999589
46161 999589 -90764 -1053752 -1162456 -592088 1597 214852 211946 446060 1082397 1707436
46151 1707436 1732284 1094054 340040 -77500 -330434 -822551 -1484320 -1796770 -1476607 -852149
46141 -852149 -501839 -679256 -1114070 -1271656 -852904 -152710 172533 -148913 -616294 -541785
46131 -541785 89139 636420 621161 195386 -188946 -233792 105109 591220 693171 636
46121F36j164387p42924J55615O36177N33375M54466O48131O17674Q0673m35203
46111G84233m06439j45590k51235o14451n90609J3057O76915Q72407N94822J63750
46101A096860j58879k72049k11315j32865k05479m63300p82950r44759p22297
46092b797033j03142N15750O14490J93199j40123L9398L73420K62782k19351m35770
46082a696380j27833K77691M15092N41096J017483J529593J285669L9742j395236
46073A886917j876915j109000Q9836O99567M75980q4310m74789n32273k30554
46064a155541L44999P44052M28297m17255q45394l48647L30180J81091n89026
46055a327244q16227o0783P85547Q03695K42105n9285Q8689J91121J5200j13938
$$ plain form
46121 636 -1163751 -1906675 -1751060 -1114883 -581508 -127042 521089 1138763 1219436 784233
46111 784233 377794 232204 -19031 -633482 -1224091 -1211034 -534119 338288 933110 1096860
46101 1096860 937981 665932 454617 321752 116273 -347027 -1129977 -2074736 -2797033
46092 -2797033 -2900175 -2384425 -1769935 -1576736 -1716859 -1677461 -1304041 -1041259 -1260610 -1696380
46082 -1696380 -1824213 -1546522 -1131430 -590334 427149 1956742 3242411 3282153 1886917
46073 1886917 10002 -1098998 -1009162 -309595 166385 82075 -392714 -924987 -1155541
46064 -1155541 -810542 -66490 361807 -55448 -900842 -1249489 -919309 -738218 -1327244
46055 -1327244 -2143471 -2204254 -1418707 -615012 -372907 -432192 -343503 -152382 -137182 -251120
46045b51120Q240Q3339j43076l72861j71514L35827O06090M55068K68687L46003
46035A164683M29146J43748l78759o59565n05104j68876J9541r7125n12059r97334
46025a561704j140589p59797j67417K84657O76848J098879J112713L84548l97928
46016d69790k37401N81473P73481J22839o1286Q60588J570582P51065p92501j327559
46006A771491p21664k61453m24659m44858n792J74039k88434p51750o18168j09825
45996a681073L22523N00746K54543m46258r67733n83913L11354O14200K38240
45987a437371J95123P29395Q25419J03607l10642K85774P90063Q1917r69802q01372
45977e07889L36458P91016N8401o46274l78801L35676N88048L19372L4864j6782
$$ plain form
46045 -251120 -242880 -159541 -302617 -675478 -846992 -511165 94925 549993 818680 1164683
46035 1164683 1593829 1737577 1358818 699253 194149 25273 44814 -52311 -564370 -1561704
46025 -1561704 -2702293 -3462090 -3629507 -3344850 -2668002 -1569123 -456410 -71862 -469790
46016 -469790 -707191 -125718 647763 770602 709316 1569904 3140486 3891551 3099050 1771491
46006 1771491 1049827 788374 363715 -81143 -86935 87104 -201330 -953080 -1571248 -1681073
45996 -1681073 -1358550 -857804 -603261 -1049519 -2017252 -2601165 -2289811 -1675611 -1437371
45987 -1437371 -1242248 -512853 312566 416173 105531 391305 1181368 1263285 293483 -507889
45977 -507889 -171431 619585 677986 31712 -347089 -11413 576635 896007 930871 914089
45967I14089M4160O1015J3983O60P2906O5718j75437l69338p9905M69984N45968
45956A563803R3978q2567K56033K41042n21841r63872k32282O92963M71781l78402
45946A140636m18147K04698J28760o23118n43798O56194J315142M39962p59856
45937A540473q73488k63664L4241M8498K72727L82085j43608q22970p99851j80430
45927h05987K68089L07142J86542j34558p55301j145481o32332N73649J570214
45918e68023J793380J263523J74054j043492j593567j073494j52156K15126p662
45909i92311k19403k97987n28401o88251k61504M80858O57299J56419j40981K34860
45899a599402O50055M65175p602j60545k7439J2412m3395J9589R6648p6541m31249
$$ plain form
45967 914089 958249 1019264 1033247 1033907 1106813 1172531 997094 627756 547851 1017835 1563803
45956 1563803 1657781 1575214 1831247 2072289 1550448 586576 354294 1047257 1519038 1140636
45946 1140636 722489 927187 1055947 432829 -110969 545225 1860367 2300329 1540473
45937 1540473 666985 403321 437562 486060 758787 1140872 997264 174294 -625557 -805987
45927 -805987 -537898 -230756 -44214 -178772 -934073 -2079554 -2711886 -2138237 -568023
45918 -568023 1225357 2488880 2662934 1619442 25875 -1047619 -1199775 -984649 -992311
45909 -992311 -1211714 -1509701 -2038102 -2726353 -2987857 -2506999 -1849700 -1693281 -1834262 -1599402
45899 -1599402 -949347 -484172 -491774 -652319 -679758 -667346 -710741 -691152 -594504 -671045 -1102294
45888a102294o38132n15836j01882M56321Q52344P63482K99071k0339J4625K0379
45878B7739k14613k30267K73565O31316Q3587q74314j041821l30674J10389k05060
45868a770153l08080N09856J344377J068502J83726l5842L22251O4916r01138
45859D78415j273406n23663K40963K16793J86677Q69570J355913N91753n99656
45850A543359o30333L42838P56826K02212j53931K13862L29509m30184j189368
45841I84790j054923m65438j92505p9037K83906N39706K41313j73690q6740J96887
45831A94269J8947m46499n63849m03091n32043q93272q69675l64363P5622J87558
45821c596396K50328M15990N21153N85875Q06059J009260P93001K86140J19440
$$ plain form
45888 -1102294 -1740426 -2256262 -2358144 -1901823 -1049479 -285997 13074 -7265 7360 27739
45878 27739 -186874 -417141 -143576 487740 571327 -302987 -1344808 -1675482 -1565093 -1770153
45868 -1770153 -2078233 -1568377 -224000 844502 1028228 992386 1314637 1379553 478415
45859 478415 -794991 -1318654 -1077691 -860898 -674221 195349 1551262 2143015 1543359
45850 1543359 913026 1255864 2012690 2214902 2060971 2274833 2604342 2174158 984790
45841 984790 -70133 -535571 -728076 -807113 -523207 16499 257812 84122 -2618 194269
45831 194269 213216 -233283 -797132 -1200223 -1732266 -2625538 -3495213 -3859576 -3783954 -3596396
45821 -3596396 -3346068 -2930078 -2408925 -1823050 -1016991 -7731 785270 1071410 1190850
45812A190850M80249P74482M50668k88503q15958q08826m97781l85685p32268
45803f32772j173364j016995j28746P64040R69751O76325M55657L31014k2413
45794B22497m65481n49869l19905k00340j87888O0334L82299K04545m38671q10958
45784b103437n82985k50012j90384q1671L67053P85000P19873L37024Q5209N8359
45774h55971Q4073J16191J87228K23936J69037O8473q9349l41569n14309m06689
45764a358949k36194l84077o17967k17760Q62724J612551J201004R5419n86189
45755C70562m71048j12308K686J2828K01131M15869K60826k51589n33716j41285
45745b46044M57972L15925o17756j145207l82449Q61633J109860K70983l91536
$$ plain form
45812 1190850 1671099 2445581 2896249 2607746 1791788 982962 485181 99496 -632772
45803 -632772 -1806136 -2823131 -2951877 -2187837 -1218086 -541761 -86104 244910 222497
45794 222497 -242984 -792853 -1112758 -1313098 -1500986 -1440652 -1058353 -853808 -1292479 -2103437
45784 -2103437 -2686422 -2936434 -3126818 -3208489 -2841436 -2056436 -1336563 -999539 -914330 -855971
45774 -855971 -771898 -655707 -468479 -244543 -75506 -7033 -96382 -437951 -952260 -1358949
45764 -1358949 -1595143 -1979220 -2597187 -2814947 -1952223 -339672 861332 956751 370562
45755 370562 -100486 -212794 -210108 -197280 3851 419720 680546 428957 -104759 -246044
45745 -246044 211928 527853 -89903 -1235110 -1617559 -755926 353934 624917 233381
45736B33381k43481j9679l36857o71059m20665q39p6594m13619l26575J97210
45726b078777N69654M65256j419o34870j125718r90340j43950P08119Q04939K78335
45716b148771r5242R5357N59227Q03765N90558L3778m68867n55182l10562j17092
45706a613031l6607K09442N53109M89625r1859o32751p50164o47567l51753N62896
45696b308660J891093K343132J090303q73878j870416j566391r57002p35562o73811
45687c661192m12135M2002N49406R09552Q36783L94068J40424L29477M43679J22591
45677c05345q9573K88049O61323L23674k38006j89139J13109j82684o83209l14115
45667f15916O49466Q52822J61242r1255N69423R34078J86090p98346r92328o59171
$$ plain form
45736 233381 -10100 -29779 -366636 -1037695 -1458360 -1459199 -1535793 -1949412 -2275987 -2078777
45726 -2078777 -1509123 -1043867 -1045286 -1680156 -2805874 -3796214 -3940164 -3232045 -2427106 -2148771
45716 -2148771 -2244013 -2148656 -1589429 -785664 -195106 -161328 -630195 -1185377 -1495939 -1613031
45706 -1613031 -1649638 -1440196 -887087 -397462 -489321 -1122072 -1872236 -2519803 -2871556 -2308660
45696 -2308660 -417567 1925565 3015868 2141990 271574 -1294817 -2251819 -2987381 -3661192
45687 -3661192 -4073327 -4031325 -3481919 -2572367 -1735584 -1341516 -1201092 -871615 -427936 -305345
45677 -305345 -394918 -106869 554454 878128 640122 450983 564092 381408 -301801 -615916
45667 -615916 33550 886372 1047614 956359 1525782 2459860 2645950 1847604 855276 196105
45657A96105m04012n7131N49804Q07776L44003j11052J56282O70407O39629K20432
45647C012243l2627k35797o86623r50859m92812K77087N92665N45764P13660R35352
45637C678053N14782n13141j286527j292444q70968n18786l21903j24080K04429
45628e30585O48234Q96298N25913l47081r40613p17041o0721L43507L69947K46702
45618D34560j0617m03795o34767n47010m58102n33004l52214L03667Q23716O24954
45608g52612O4841k71545n73483j171952j507001q53841L30980R50450Q67852
45599b916311Q12416R30725O83665J00273j30608J03255J83638m1888o3882J44674
45589a94043q029m65966l43171N60148J192319P58584j83430p01061o68784m21832
$$ plain form
45657 196105 -207907 -265038 284766 1092542 1436545 1325493 1481775 2152182 2791811 3012243
45647 3012243 2979616 2743819 2057196 1106337 613525 890612 1483277 2029041 2742701 3678053
45637 3678053 4192835 3679694 2393167 1100723 229755 -289031 -610934 -735014 -530585
45628 -530585 117649 1013947 1539860 1192779 252166 -464875 -525596 -182089 187858 434560
45618 434560 423943 20148 -614619 -1161629 -1619731 -2152735 -2504949 -2201282 -1377566 -752612
45608 -752612 -687771 -959316 -1532799 -2704751 -4211752 -5065593 -4734613 -3784163 -2916311
45599 -2916311 -2103895 -1173170 -489505 -389232 -519840 -416585 -232947 -274835 -338717 -194043
45589 -194043 -202072 -668038 -1011209 -451061 741258 1499842 1316412 615351 -53433 -475265
45579d75265q8794J46219q6983o32759p19953j19462M00695L12911J25003K80419
45569h57969K36215m43177r38650k76012J011949J508104Q45283r3444o56371
45560C35928r64788j045926n64760L60880R83341Q78809M22875R5272p6422j66144
45550B59065n2786K10080K17658k28788p21372p32457k76289K00158M29313N35424
45540a59994O55598O00249Q0962p45075j198648p80043J62122P88920P74913N59091
45530G38095N42427N25753J71873m12563q65155r84003o99784m8205N39217M16961
45520g5384l75567q79567m08967M76399Q13313O12167N83155P75917M68675n29605
45510A460536j348494j165387k69364L46788J27128n77520r83639o59306P8660
$$ plain form
45579 -475265 -564059 -417840 -504823 -1137582 -1857535 -1976997 -1576302 -1263391 -1138388 -857969
45569 -857969 -621754 -1064931 -2003581 -2279593 -1267644 240460 1085743 992299 335928
45560 335928 -628860 -1674786 -2239546 -1878666 -895325 -16516 406359 501631 425209 259065
45550 259065 206279 416359 634017 405229 -316143 -1048600 -1324889 -1124731 -695418 -159994
45540 -159994 495604 1095853 1176815 431740 -766908 -1546951 -1384829 -595909 179004 738095
45530 738095 1280522 1806275 1978148 1565585 700430 -283573 -983357 -1031562 -492345 -75384
45520 -75384 -450951 -1330518 -1739485 -1263086 -449773 162394 745549 1521466 1990141 1460536
45510 1460536 112042 -1053345 -1322709 -975921 -848793 -1426313 -2409952 -3069258 -2990598
45501b990598N34060M13707O6246r0856j4499K21067O02335Q23725L86254n07642
45491e56201q64466l31778P5740m16866q56141j0057J347411J340988k2689o89395
45481i83454L18505J467434J161911P71n05927j80024J24384J22596J29850J19567
45471A775613j13108k99086j38052Q0295J05389L37508R11189R25598k36298j476894
45461A872154j274114J8903O62575J18220m32620k32272m464m11960q65960o04569
45451a154107J05922N91999P49194P09257K90443m96665j008948p44218q6457
45442a043580L17070M48805N97263O16234K03182l96469o29852m11652j28875
45433d27874l1108o7179j47174j48428J33254O28245Q31402M45373o7120j00237
$$ plain form
45501 -2990598 -2456538 -2042831 -1976585 -2067441 -2081940 -1860873 -1258538 -434813 -48559 -556201
45491 -556201 -1420667 -1752445 -1676705 -2093571 -2949712 -2959769 -1612358 -271370 -294059 -983454
45481 -983454 -664949 802485 1964396 1965167 1459240 1279216 1403600 1526196 1656046 1775613
45471 1775613 1662505 1363419 1225367 1305662 1411051 1748559 2659748 3585346 3349048 1872154
45461 1872154 598040 616943 1279518 1397738 965118 732846 728382 316422 -549538 -1154107
45451 -1154107 -1048185 -456186 293008 1002265 1292708 796043 -212905 -957123 -1043580
45442 -1043580 -726510 -277705 319558 935792 1138974 742505 112653 -298999 -427874
45433 -427874 -458982 -526161 -673335 -821763 -688509 -60264 771138 1216511 1149391 1049154
45423A049154J43923m0770o82009r43536k99190O61188R33929K90730n62708q65641
45413c14930n46617q4229J49380K12302K77402K53327k9919l84776l85381M4118
45403h09323N11314P01189O65803M75540O0978l75227l18492K77091O35475J41248
45393A965596o71213p64980m8970N17713K70511l69107o30074l89516j16240j33666
45383c69946k77326k02967J79160O23816Q38165P33229L10245m89426j449200
45374a04250j739510o32918J220585K018141R01539p96991j203165k96158L64513
45365b68214L5373l27604K13294J098733J134897J55203q39850r07966r1158P37939
45355I40647P56859N2162m36768q0743N55909N09250j49894m85363k22455r4075
$$ plain form
45423 1049154 1193077 1152307 470298 -473238 -772428 -111240 822689 1113419 550711 -314930
45413 -314930 -861547 -945776 -796396 -584094 -306692 -53365 -83284 -468060 -853441 -809323
45403 -809323 -298009 403180 1068983 1544523 1605501 1230274 911782 1188873 1824348 1965596
45393 1965596 1294383 529403 480433 998146 1268657 899550 269476 -120040 -236280 -369946
45383 -369946 -647272 -850239 -671079 -47263 790902 1524131 1834376 1344950 -104250
45374 -104250 -1843760 -2476678 -1256093 762048 1663587 866596 -336569 -632727 -268214
45365 -268214 -232841 -560445 -347151 751582 1886479 2041682 1201832 293866 202708 940647
45355 940647 1697506 1749668 1312900 1232157 1788066 2297316 2147422 1662059 1439604 1345529
45345A345529m62534o62429k12506K88369J78092j67714n8779L53127N03265M43559
45335A547979N27913N16730k7759p47785q65269l89228l6151o2305q9961k8510
45325C45654j95697m59225k39884M09904O55973J60509l26253j12227M21000M98366
45315A158120P9094k76310k59479R743L71017O96369P63658M65606L6822j97332
45305B847308j69667l778J82172K46494P7953j42538n2381L07015L71168j82946
45295C480800q80380j020943n55723j7202K22332K27944J65947Q5165L3130J15384
45285A856454L86403P59281R51303N56833m90383j442085j231157J87428J427932
45276B962009J166530k27077j172498q41436O5613N33822M70532L97303M93167
$$ plain form
45345 1345529 882995 220566 8060 296429 474521 306807 248028 601155 1104420 1547979
45335 1547979 2075892 2592622 2564863 1817078 951809 562581 526430 464125 374164 345654
45325 345654 149957 -309268 -549152 -139248 516725 677234 350981 238754 659754 1158120
45315 1158120 1237214 960904 701425 711168 1082185 1778554 2542212 3007818 3044640 2847308
45305 2847308 2677641 2673863 2856035 3102529 3180482 3037944 2985563 3292578 3663746 3480800
45295 3480800 2600420 1579477 1023754 1006552 1228884 1456828 1622775 1707940 1741070 1856454
45285 1856454 2242857 3002138 3953441 4510274 4019891 2577806 1346649 1534077 2962009
45276 2962009 4128539 3901462 2728964 1887528 1953141 2486963 2957495 3354798 3847965
45267C847965M87577K47407k7657j56605j73309j41103k9324J43304K12773M0576
45257D451604k69014m13787j98632K10114M02959J83098j33420l6222M98018Q27506
45247E522224L69213n64317r51847k12235J068446J789824J546984Q59062K92605
45238I719959j45074n90895q11862n39498l7543J58872k5558j76145n8293J04938
45228G598901O5328j06162j69579O8595O40711J188553J009745j24671j294900
45219H876521j296690k56144M30701K1240o10952m52367J08397P8632m67897o03817
45209E827624j05702K97927J90515k1786m618k5861l20436o32114o90925n90540
45199C924084m61771k86571j88514l42972m75046j15931M73407M34720l09624
$$ plain form
45267 3847965 4335542 4582949 4555292 4398687 4225378 4084275 4054951 4198255 4411028 4451604
45257 4451604 4182590 3768803 3570171 3780285 4183244 4366342 4232922 4196700 4694718 5522224
45247 5522224 5891437 5327120 4375273 4163038 5231484 7021308 8568292 9427354 9719959
45238 9719959 9574885 8983990 8172128 7632630 7595087 7753959 7728401 7552256 7493963 7598901
45228 7598901 7664229 7558067 7388488 7457083 8097794 9286347 10296092 10171421 8876521
45219 8876521 7579831 7323687 7754388 7775628 7164676 6712309 6820706 6899338 6431441 5827624
45209 5827624 5721922 6019849 6210364 6188578 6183960 6158099 5837663 5205549 4514624 3924084
45199 3924084 3462313 3175742 2987228 2644256 2169210 2053279 2526686 2961406 2651782
45190B651782o97648j27778M36613j39242j280584j332917J34601J705481J892154
45181C242462P06013p28963j419555j091758j25944P30282R26321O21657L87074
45172C247589L68430J77550l17468o63652n48769l24695l92085m98265j86383
45163H62252L44154M51578M8166k35605j9590K25486j08248p79020q90701n2538
45153a54066J034672J330337N94784m38038r20719o52059N260N98207P87383M11442
45143B597203k78197o30913k64816L76989N80562L71173L67298O15790L78711
45134D113800n80460j308576r46221q2530P4708m97601p07147j08973N11042N18008
45124I86050L39981N19610P53015N49834J57813O5138J01702j59537m95153l77747
$$ plain form
45190 2651782 1954134 1826356 2262969 2123727 843143 -489774 -355173 1350308 3242462
45181 3242462 3948475 3219512 1799957 708199 582255 1312537 2238858 2860515 3247589
45172 3247589 3616019 3793569 3476101 2812449 2263680 1938985 1546900 1048635 862252
45163 862252 1206406 1657984 1706150 1470545 1450955 1676441 1568193 789173 -101528 -154066
45153 -154066 880606 2210943 2805727 2367689 1446970 794911 800171 1398378 2185761 2597203
45143 2597203 2319006 1688093 1423277 1800266 2380828 2752001 3119299 3735089 4113800
45134 4113800 3533340 2224764 1278543 1196013 1270721 773120 65973 -43000 468042 986050
45124 986050 1326031 1845641 2598656 3148490 3306303 3371441 3473143 3313606 2818453 2440706
45114B440706J1483j8038n45976r42768q81221o35132l15917L19428J085045J246635
45104A764245N80117j82048m20485m61923p90513j073516p20516K3597L54520
45095i26522O9635k75236k67883k0774L24373Q07029J253766J247168O92700L220
45085B907476m37728o30316o67889n07884k22441j03031k57622l82570j85067
45076d87072J98734M53813N44722O35414O93217M99782M4536l70634m95338m03055
45066A314119k98217k17346q9235K0773j9165r2759J03600N37117O89303K56311
45056B204501k51458j12753N00220O46984k9791p28190o20161m96K41148q7134
45046A762870l49409p9798M71152P75871N77735K68n54722o69468l60805j41854
$$ plain form
45114 2440706 2452189 2434151 1888175 945407 64186 -570946 -886863 -567435 517610 1764245
45104 1764245 2344362 2162314 1741829 1279906 489393 -584123 -1304639 -1281042 -926522
45095 -926522 -856887 -1132123 -1400006 -1420780 -1096407 -289378 964388 2211556 2904256 2907476
45085 2907476 2469748 1839432 1171543 663659 441218 338187 80565 -302005 -487072
45076 -487072 -288338 165475 710197 1345611 2038828 2538610 2583146 2212512 1717174 1314119
45066 1314119 1015902 798556 709321 730094 710929 618170 721770 1258887 1948190 2204501
45056 2204501 1953043 1840290 2340510 2987494 2957703 2229513 1609352 1608856 1850004 1762870
45046 1762870 1413461 1333663 1804815 2580686 3158421 3158689 2603967 1934499 1573694 1431840
45036A431840l45503o13835m37936O5193M07965N07790O05378O03321J80279n10699
45026A893793r46117j010653j000723r04866m53490J18662K46349Q4543M23527
45017a548975J284825J613213Q58064r2616k28972J72840K69323O8566J87717
45008B583985O66726R59469Q31514M57818j21229q55724j234050q10958o9955
44999B407596N3100n09011q61459m21931M07184R47186R93935P03428K73263o0528
44989C932763j16465j2449k1945j60017k12254j14796M1925K91736O78255R48115
44979E254868P63902J60782n36075j079087j256749q25232K2486M86512J01073
44970C092480m92947m47849j4221l4723m53940m59326L4205K80533J18070J86649
$$ plain form
45036 1431840 1086337 472502 34566 99759 507724 1015514 1620892 2224213 2404492 1893793
45026 1893793 947676 -62977 -1063700 -1968566 -2422056 -2303394 -2057045 -1972502 -1548975
45017 -1548975 -264150 1349063 2207127 2114511 1885539 2058379 2327702 2396268 2583985
45008 2583985 3250711 4210180 5041694 5499512 5378283 4522559 3288509 2477551 2407596
44999 2407596 2460696 1951685 1090226 668295 1075479 2022665 3016600 3720028 3993291 3932763
44989 3932763 3816298 3803849 3781904 3621887 3409633 3294837 3336762 3628498 4306753 5254868
44979 5254868 6018770 6179552 5643477 4564390 3307641 2482409 2504895 2991407 3092480
44970 3092480 2599533 2151684 2137463 2102740 1648800 1189474 1223679 1504212 1622282 1808931
44960A808931N36231L97721k68366m29828J93598M28570l36788q79935j20127
44951A330007R29340P48638j71768k18471O01839P76648q4102o97195l60959O0795
44941B914772j07458k59054J02857L09200k06507p44373m67358K19755M51592
44932B213426L06305L63459M68600P4040n79928p48020m42697l48475n46072l77566
44922C83072L06065P66603N52210J76928J85912K82795k9005m87729m36461J48888
44912A849278O35713O46425M54358M33147N46989N30642K90453l0669k21964j35637
44902D998735K06630N36962N04176O5582l40881j84691N49452J257993J334413
44893H928371Q40483M13533M84281P87730Q23501O49838Q82047J831364K952872
$$ plain form
44960 1808931 2345162 2742883 2474517 2044689 2238287 2666857 2330069 1450134 1330007
44951 1330007 2259347 3007985 2836217 2617746 3219585 3996233 3912131 3214936 2853977 2914772
44941 2914772 2807314 2548260 2651117 2960317 2753810 2009437 1542079 1761834 2213426
44932 2213426 2519731 2883190 3351790 3425830 2845902 2097882 1655185 1306710 760638 383072
44922 383072 689137 1455740 2007950 2184878 2370790 2653585 2624580 2136851 1700390 1849278
44912 1849278 2484991 3131416 3585774 4018921 4565910 5096552 5387005 5356336 5134372 4998735
44902 4998735 5205365 5742327 6246503 6312085 5971204 5786513 6335965 7593958 8928371
44893 8928371 9768854 10182387 10666668 11454398 12277899 12927737 13809784 15641148 18594020
44884A8594020L407993L055650K634179K968127M179787N698570O880052P551580
44876E4969958Q033418Q629643R017184Q222271N455306J060735l527133o873461
44868H4987921q492214q760320q252288p397846o519637n775910n057513m221948
44860C0510245l425759k950373k709087k287690j590923j103443j268084j848939
44852A3325947k189352j940801j269785n00172R7204K24062l06582j183096j621728
44843D635697j042895L10147J519516J736240Q26310n31155j338043j086815k40401
44834D788601K23165j14830o42234n11938K44014P29848L21652n60018r95445
44825C482815o49653m3311J73584m9442k23961M3830N90806Q50597M45563l75784
$$ plain form
44884 18594020 22002013 25057663 27691842 30659969 34839756 40538326 47418378 54969958
44876 54969958 63003376 71633019 80650203 88872474 94327780 95388515 91861382 84987921
44868 84987921 76495707 67735387 59483099 52085253 45565616 39789706 34732193 30510245
44860 30510245 27084486 24134113 21425026 19137336 17546413 16442970 15174886 13325947
44852 13325947 11136595 9195794 7926009 7425837 7523041 7747103 7440521 6257425 4635697
44843 4635697 3592802 3902949 5422465 7158705 7985015 7453860 6115817 5029002 4788601
44834 4788601 5011766 4896936 4254702 3742764 3986778 4716626 5038278 4478260 3482815
44825 3482815 2833162 2789851 2963435 2913993 2690032 2733862 3324668 4175265 4620828 4245044
44815D245044r33440p80033j27029M08024L79779j98543r61769j410913j173622
44806e52502l30816N37000Q82149P72514O90212P71868O40766J26992k71978j0076
44796C256129O80890J006503N76996k02179p05242p25903m74602k16368o8210
44787C128014j3080K6459J08762K40621M27323O74923Q77813Q27016M74958R5949
44777F868758N003J70502K66889O5015l65663p66655q67161n65654q4497K10563
44767D937100L11029O42010J363000J884219J553906O51877J26447L72967Q60852
44758A2703407J043649J020278J071824J120547J014790R08840R66830J037098
44750B0887263R91869J051391J344810J439619Q15915l29585j222121j419309
$$ plain form
44815 4245044 3311604 2531571 2404542 2812566 3192345 2993802 2032033 621120 -552502
44806 -552502 -883318 -346318 535831 1308345 1998557 2770425 3411191 3538183 3266205 3256129
44796 3256129 3937019 4943522 5520518 5318339 4613097 3887194 3412592 3196224 3128014
44787 3128014 3114934 3141393 3250155 3490776 3918099 4593022 5470835 6297851 6772809 6868758
44777 6868758 6873761 7044263 7311152 7376167 7010504 6243849 5376688 4811034 4726537 4937100
44767 4937100 5248129 5890139 7253139 9137358 10691264 11343141 11469588 11842555 12703407
44758 12703407 13747056 14767334 15839158 16959705 17974495 18883335 19850165 20887263
44750 20887263 21879132 22930523 24275333 25714952 26530867 26201282 24979161 23559852
44742B3559852j210217j120761j352272j728357j922683j707981j190095p92693
44734A2534793q14936j031858r48752m46257M8850Q4020l07310p02076p82150
44725G634324o17386m74076m57118m51197l72039k69886j29531J47690L88658
44716E399439J44332n84481r96880m83147L18403K88613m61054o67049J31633
44707C089809Q30105M61433l64332n27069q0615J00901k10842m88580m51383k62188
44697B097239J1639L26907L65499R8861K17162J047929J541045N86125r87824
44688E304582j235658P8937J060545M27404q49566j305379r82172p34228o72565
44679A091900m14341p8320M0791J86469N62837O29765j7660o04898j53084Q61426
$$ plain form
44742 23559852 22349635 21228874 19876602 18148245 16225562 14517581 13327486 12534793
44734 12534793 11719857 10687999 9739247 9292990 9341840 9425860 9118550 8416474 7634324
44725 7634324 7016938 6542862 6085744 5634547 5262508 4992622 4863091 5010781 5399439
44716 5399439 5543771 4959290 3962410 3479263 3797666 4086279 3625225 2958176 3089809
44707 3089809 3919914 4381347 4017015 3489946 3409331 3510232 3299390 2810810 2359427 2097239
44697 2097239 2108878 2435785 2801284 2900145 3117307 4165236 5706281 6292406 5304582
44688 5304582 4068924 4147861 5208406 5635810 4786244 3480865 2498693 1764465 1091900
44679 1091900 677559 599239 640030 826499 1389336 2019101 2001441 1396543 1243459 2104885
44669B104885J034722J05484o92826m77831J70395L02020p7338k85489R817N23282
44659B717121P74312M63676k97558r36789q79080k13081L77061M52410K73582
44650B731654K89588N24280O91627O40013M10985K9054m92745r73233j080022
44641B771201o05086K65955R69729R71576K91314m46014o35288k99932Q3595K43377
44631C610427K99609L39965K05488j32343l02475L1575O08443Q09985N07445L11933
44621F290052P44420J419611J480147P82051J39257K24046P30039J001751J038043
44612A3849417J259946J557077J322543M42700m30332p38795n94648l75863l13881
44603A5978164o08277j322956j957662j759886p52470J44013K90431k589k49588
$$ plain form
44669 2104885 3139607 3245091 2552265 2074434 2244829 2546849 2469511 2184022 2193839 2717121
44659 2717121 3491433 3955109 3657551 2720762 1841682 1628601 2005662 2458072 2731654
44650 2731654 3021242 3545522 4237149 4877162 5288147 5317201 4824456 3851223 2771201
44641 2771201 2166115 2432070 3401799 4373375 4664689 4218675 3583387 3283455 3367050 3610427
44631 3610427 3910036 4250001 4455489 4323146 4020671 4052246 4660689 5470674 5978119 6290052
44621 6290052 7034472 8454083 9934230 10716281 10855538 11079584 11809623 12811374 13849417
44612 13849417 15109363 16666440 17988983 18431683 18001351 17262556 16667908 16292045 15978164
44603 15978164 15369887 14046931 12089269 10329383 9576913 9720926 10011357 10008768 9759180
44594I759180m50753n69184k16470N00519O32819k94155j312919j269663m38784
44585F340590R7141J10915J37908J60577l19368j056763j172470n37545O6145
44576C827130K56157M43587P73815P43624J51302n04945q46137r85899r14759
44567B943875m20632J96680K90023m7733n0809L66885M39653K139j40947K53385
44557C832519L00353l65601p22286q3811N66028J62503n99918m10265N16099R36895
44547D132516O28589L86545L44974j29266r44161j169325n79002k2940j856k2525
44537B623549L04923N68670L61543o7719l31130l37487J3591P73303J361026R38018
44527F208287k89887j028905o11981R6422Q5144l24679j68832N74931R68372M35400
$$ plain form
44594 9759180 9308427 8739243 8522773 9023292 9656111 9361956 8049037 6779374 6340590
44585 6340590 6437731 6548646 6686554 6847131 6527763 5471000 4298530 3760985 3827130
44576 3827130 4083287 4526874 5300689 6044313 6195615 5690670 4844533 3858634 2943875
44567 2943875 2523243 2719923 3009946 2962213 2911404 3278289 3717942 3720081 3579134 3832519
44557 3832519 4132872 3767271 3044985 2961174 3527202 3689705 3089787 2679522 3195621 4132516
44547 4132516 4761105 5147650 5492624 5363358 4419197 3249872 2670870 2647930 2646074 2623549
44537 2623549 2928472 3497142 3858685 3790966 3459836 3122349 3135940 3909243 5270269 6208287
44527 6208287 5918400 4889495 4277514 4373936 4459080 4134401 3965569 4540500 5508872 5944272
44517E944272n97550j297096j190967m58110K10502K32240j23956N3398J046556
44508C819289J888138J533938K98450n37346l63569K06036L96773J88038m2048
44499G387699k09864m54256o75761n84150j72462J60324P8342k26986k04647L84529
44489E482768J078924J140539L46287p86799j560257j698620j370131q46879l15219
44480A470613J06930L57234M38993L84226K28978K8100j59093k65201j36127M00538
44470B855191J186760J602469J149413J51610n22478n00382k45312k26982k56675
44461E193614K1886M16347M60443J60210m4943M0082J99303K90116M47537P36599
44451G921194R70797R85752Q09461M86815J5965m71243p61823q78148j015438
$$ plain form
44517 5944272 5346722 4049626 2858659 2400549 2611051 2843291 2719335 2772733 3819289
44508 3819289 5707427 7241365 7539815 7002469 6638900 6844936 7241709 7429747 7387699
44499 7387699 7177835 6723579 6047818 5463668 5291206 5451530 5529872 5302886 5098239 5482768
44489 5482768 6561692 7702231 8048518 7261719 5701462 4002842 2632711 1785832 1470613
44480 1470613 1577543 1934777 2373770 2757996 2986974 3015074 2855981 2590780 2454653 2855191
44470 2855191 4041951 5644420 6793833 6945443 6422965 5922583 5677271 5450289 5193614
44461 5193614 5215500 5631847 6092290 6252500 6207557 6247639 6446942 6737058 7184595 7921194
44451 7921194 8891991 9877743 10687204 11174019 11189984 10718741 9956918 9078770 8063332
44442H063332j045994m93978P01307J743465J748539P94510k34371p49507q97705
44433I629598q97818n78413R3733N37925J86503o36614j052471q12173n81935
44424E888335r09414j417460j344303n52067L61695P88795O57119L48913K76960
44415D098573M70531N07064L7181n91380o06986J22446P58442N75568o1778k98409
44405E011252L5684M86061Q70595J285955J381186O00063p14556j385912r27530
44396F642798j99729r2496l21914j71528K26782J86884l45772p58419p71368o97302
44386C697936o97831m80199J05022P05590R37784Q61120Q07464R89318J369998
44377H296202J685793J553632Q19046j41737p07737o61171l33386p7512J29058
$$ plain form
44442 8063332 7017338 6523360 7224667 8968132 10716671 11511181 11276810 10527303 9629598
44433 9629598 8731780 8153367 8247100 8785025 8971528 8334914 7282443 6470270 5888335
44424 5888335 4978921 3561461 2217158 1665091 2026786 2815581 3472700 3821613 4098573
44415 4098573 4569104 5076168 5113349 4521969 3914983 4037429 4795871 5371439 5309661 5011252
44405 5011252 5046936 5532997 6403592 7689547 9070733 9670796 8956240 7570328 6642798
44396 6642798 6443069 6350573 6028659 5857131 6083913 6270797 5925025 5166606 4395238 3697936
44386 3697936 3000105 2519906 2624928 3330518 4268302 5129422 5936886 6926204 8296202
44377 8296202 9981995 11535627 12354673 12212936 11505199 10844028 10510642 10433130 10562188
44368A0562188M40602P39213O98282K12129l66867m97664j5840N89566O14507
44359A2976116p6063q57779j042448n97332n0272J24029j38774n38167o20867
44350I178443j76012L69200K37878p05680j556249j388060m29055K98130L24944
44341F153539J11533J28445K50226K31663J86950K67253K84449J7368l65581m94592
44331F771253k54476J56227M90361O18453N34099L10393J9969k80044m40729k86279
44321G639227L7469M5700m17006p76510n07360n2460k44141r23405j028119j91984
44311C581411O73244P66372M84427N35189P48987N79768K14275K58533O39710
44302H481916P29809M40401L49144P04294J046057R55582N64231J48826k50101
$$ plain form
44368 10562188 11002790 11742003 12440285 12652414 12285547 11787883 11772043 12361609 12976116
44359 12976116 12900053 12042274 10999826 10402494 10352222 10476251 10337477 9799310 9178443
44350 9178443 9002431 9371631 9609509 8903829 7347580 5959520 5530465 5828595 6153539
44341 6153539 6265072 6393517 6643743 6875406 7062356 7329609 7614058 7631426 7265845 6771253
44331 6771253 6516777 6673004 7163365 7781818 8315917 8626310 8646279 8366235 7925506 7639227
44321 7639227 7676696 7722396 7305390 6528880 6021520 5969060 5724919 4801514 3773395 3581411
44311 3581411 4254655 5021027 5505454 6040643 6789630 7369398 7583673 7842206 8481916
44302 8481916 9211725 9652126 10001270 10705564 11751621 12707203 13271434 13420260 13170159
44293A3170159o12173p83818p45830o97405p31232p24883o36250n84209n60076
44284G094283l94437j06676L5579p8584k22556j64804O0882K89350L97831L10291
44274G221159O0072j44638j39361l1359L0751J62704M72855O80079M99965K55752
44264I067979M77620R71654J032318O15896M34174O48898M18629p07515j761234
44255A1198419j509972j21680J114805J406326J056262O54048L61001q422o38308
44246A3512479j391366j648434q67059M13547P82940k44057j340802j122548r4894
44237G999806L05316K0231J72675Q12462O91444m23960j037924k90351O00736
44228H850435L73647k39089N3696P95660O56136j50279k20703N71863Q77553K09717
$$ plain form
44293 13170159 12557986 11774168 11028338 10330933 9599701 8874818 8238568 7654359 7094283
44284 7094283 6699846 6593170 6628749 6550165 6327609 6162805 6223687 6513037 6910868 7221159
44274 7221159 7281231 7136593 6997232 6965873 6996624 7159328 7632183 8312262 8812227 9067979
44264 9067979 9545599 10517253 11549571 12165467 12599641 13248539 13667168 12959653 11198419
44255 11198419 9688447 9566767 10681572 12087898 13144160 13798208 14159209 14150787 13512479
44246 13512479 12121113 10472679 9605620 10019167 10802107 10558050 9217248 8094700 7999806
44237 7999806 8305122 8325353 8498028 9310490 10001934 9577974 8540050 8249699 8850435
44228 8850435 9224082 8984993 9038689 9834349 10490485 10340206 10119503 10691366 11568919 11778636
44218A1778636l43978j50123j9909m35515m14906P18566J766824J298417n3038
44209A4144974m91914K64442Q19182M60103R7374N36226J199063J234712Q80504
44200A9144666R04346J355438J679425J689715J708668J939404K257362K481980
44192C3161004K417085J836841R06466L73024P29810J339380J102975J4929p43646
44183D1137868n12184j55752p96207k143837k892018k480020j612011j053018
44175B9492821p62875m81297m24870q75732j530841j809197j570549j109273o86823
44166B0241364n01604q33408j639043k184193j736775n95655K11758K67210Q3630
44157A3313284J1294k87459r04065j135460n79127l5824l69229r89560o40898
$$ plain form
44218 11778636 11434658 11284535 11264626 10829111 10414205 11132771 12899595 14198012 14144974
44209 14144974 13653060 13917502 14736684 15196787 15294161 15830387 17029450 18264162 19144666
44200 19144666 20049012 21404450 23083875 24773590 26482258 28421662 30679024 33161004
44192 33161004 35578089 37414930 38321396 38694420 39424230 40763610 41866585 41881514 41137868
44183 41137868 40625684 40469932 39673725 37529888 34637870 32157850 30545839 29492821
44175 29492821 28729946 28248649 27823779 26948047 25417206 23608009 22037460 20928187 20241364
44166 20241364 19739760 18906352 17267309 15083116 13346341 12750686 12962444 13229654 13313284
44157 13313284 13324578 13037119 12133054 10997594 10418467 10382643 10013414 9023854 8382956
44148H382956N08965Q82459j53748j184450o97603P70206J405277N47813o59118
44139I802757r56555m01086J19969J33415j02247j91446o7884Q8928J15749k2086
44129H519514k25879k83757k699N29649Q57903N58254k01511p43955o89155m05627
44119G912737l71671m08989p4115M08067L44794k60079n48669r4493M28241L41669
44109G677492K4625J95446O91057P75330L07156k18087n37884p03389n00449K87883
44099G999180J123654J186856O42903M38912P10734N15311m95703j300201j054090
44090I767556l70294j92790l07360k7626L86905K60617l2979M75791J566604J861372
44080A3387796Q44864l39659n24756M3796M24544L16663N7838j33658k96980m25285
$$ plain form
44148 8382956 8891921 9774380 9620632 8436182 7738579 8508785 9914062 10461875 9802757
44139 9802757 8846202 8445116 8565085 8698500 8596253 8404807 8336923 8425851 8541600 8519514
44129 8519514 8293635 8009878 8007179 8536828 9394731 9952985 9751474 9007519 8318364 7912737
44119 7912737 7541066 7132077 7057962 7466029 7810823 7550744 7002075 6907582 7335823 7677492
44109 7677492 7702117 7897563 8588620 9363950 9671106 9453019 8915135 8211746 7711297 7999180
44099 7999180 9122834 10309690 10952593 11391505 12102239 12617550 12121847 10821646 9767556
44090 9767556 9397262 9204472 8897112 8869486 9256391 9517008 9484029 9959820 11526424 13387796
44080 13387796 14232660 13893001 13368245 13412041 13836585 14153248 14211086 14077428 13780448 13355163
44070A3355163m42582k69761K18961R22033J176192L60684r97837j509575o62692
44061A2150586N11134R66518R53982J107533J131046M67949l55683l31165L66810
44052A6968710N65845p5560o03258l02079L78211P42701P45717N78422K21625
44043A9220334j39972k4830N55386R32950Q78382J076321J899305K488584J907479
44034B8793939O19890j49330j46420j53828m85633m90787K45187J076771J117928
44025C0427717L79191l18002l02801L53413J089183J515419J763087K101194K336218
44016C9344619K021576J346858J181431J832803K414600K125490J570244J880649
44008E3718270K968200L799283M161371M793170N678429N698644M546301L686145
$$ plain form
44070 13355163 12912581 12642820 12861781 13783814 14960006 15320690 14322853 12813278 12150586
44061 12150586 12661720 13628238 14582220 15689753 16820799 17288748 16933065 16601900 16968710
44052 16968710 17534555 17458995 16855737 16553658 16931869 17674570 18420287 18998709 19220334
44043 19220334 19080362 19055532 19610918 20543868 21422250 22498571 24397876 26886460 28793939
44034 28793939 29413829 29264499 29118079 28964251 28478618 27987831 28233018 29309789 30427717
44025 30427717 30806908 30488906 30186105 30539518 31628701 33144120 34907207 37008401 39344619
44016 39344619 41366195 42713053 43894484 45727287 48141887 50267377 51837621 53718270
44008 53718270 56686470 60485753 64647124 69440294 75118723 80817367 85363668 89049813
44000H9049813M528052O601657Q462924R605857J0491147J1368625J2188605J3245738
43992A65542418J4840476J6592476J8073714J9824828K2676725K6255387K9269175
43985C13075199L1197150L2535268L3318532L2616691K9774908K5032481J8555127
43978E16105356J0031222j38404j0249633j8653106k4947565k9225942l1109133
43971D11812795l0487412k8462948k6409099k4479795k2015525j9034343j6275851
43964B44647822j4018262j1903437r815215p924075n941656l403180p45118R80534
43956A91877413J657243K312278L489547M509293M820699M997916N651991O296573
43948B25612953O234866N838920N849012N825041M398067R62092l739517q585051
$$ plain form
44000 89049813 93577865 100179522 108642446 118248303 128739450 140108075 152296680 165542418
43992 165542418 180382894 196975370 215049084 234873912 257550637 283806024 313075199
43985 313075199 344272349 376807617 410126149 442742840 472517748 497550229 516105356
43978 516105356 526136578 525998174 515748541 497095435 472147870 442921928 411812795
43971 411812795 381325383 352862435 326453336 301973541 279958016 260923673 244647822
43964 244647822 230629560 218726123 208910908 200986833 195045177 191641997 190896879 191877413
43956 191877413 193534656 195846934 199336481 203845774 208666473 213664389 219316380 225612953
43948 225612953 231847819 237686739 243535751 249360792 253758859 254720951 250981434 242396383
43940B42396383j2768409j5618117j6744382j6647086j6402671j6366611j5756996
43933A32092111j3889134j1322535r309229q371932p868376o930539n559307m637429
43925F4203630m801132n415623n080993l365559j540586j059270j730700k207942
43917C9001825k008816j948170k463660k710506j909536o65682j31344m64732
43909B6699379r22699j042337r32728p14529m68537n37226j101424j578145j216057
43900A8185697k70691J78908l12373r84668r52420k36816N24650Q54270O38819
43891A7625376M2887m57373l50077K72606O70357L52976k75109m84436j61361
43882A7235846J95707K38493J11905N7023L8097q7610k33518j52869J40803K24909
$$ plain form
43940 242396383 229627974 214009857 197265475 180618389 164215718 147849107 132092111
43933 132092111 118202977 106880442 97571213 89199281 81330905 74400366 68841059 64203630
43925 64203630 59402498 53986875 48905882 45540323 43999737 42940467 41209767 39001825
43917 39001825 36993009 35044839 32581179 29870673 27961137 27295455 27164111 26699379
43909 26699379 25776680 24734343 23801615 23087086 22618549 22081323 20979899 19401754 18185697
43900 18185697 17915006 18093914 17781541 16796873 15844453 15607637 16132287 16986557 17625376
43891 17625376 17668263 17210890 16860813 17133419 17803776 18156752 17881643 17397207 17235846
43882 17235846 17431553 17670046 17781951 17838974 17877071 17789461 17555943 17403074 17543877 17768786
43872A7768786k46618r72794j231353p55577n4919K98177L04356J89235r9370
43863A5199923n55698p22799l24224M2779l31211j031369r99061j82767L62812
43854A1458385J72020K8207N23139J043659Q46858K24002j71689l69913o29187
43845A3125481o35488o4694O15764Q23285Q43554J206565J570660J297057P60955
43836A9543139Q96844J592671J731644Q83730j47970o38625p83946r68375j105617
43827B1003495j059978r85448r35078p47604m98352m42437m46497j84080J12928
43818A5816949l5688k99206J45111J095331J349250O24434J90604R37676J989846
43809B1814307K095004J366539O94634L49091J97090M59361J118549J345804P48704
$$ plain form
43872 17768786 17522168 16549374 15318021 14562444 14507525 14805702 15110058 15299293 15199923
43863 15199923 14644225 13921426 13597202 13639981 13308770 12277401 11278340 11095573 11458385
43854 11458385 11630405 11658612 12181751 13225410 14072268 14296270 14124581 13754668 13125481
43845 13125481 12489993 12425299 13041063 13864348 14707902 15914467 17485127 18782184 19543139
43836 19543139 20439983 22032654 23764298 24648028 24500058 23861433 23077487 22109112 21003495
43827 21003495 19943517 18958069 18022991 17275387 16777035 16334598 15888101 15704021 15816949
43818 15816949 15781261 15482055 15627166 16722497 18071747 18696181 18886785 19824461 21814307
43809 21814307 23909311 25275850 25970484 26319575 26516665 26976026 28094575 29440379 30189083
43800C0189083M70588J625884L230230L355368K068611J432864K474734L933252
43792D8780614M522559M776057N723634P068530P877794Q221100Q892935R946159
43784A05809382J0572222J0253767R153570P415745M862226J536884j960276m865693
43776A42777827o737423p566325p690481p596413p527814p229072o272686m722566
43768H7435047l324442k851623l204147l315288k231175l01702J074370J068020
43760G4349060L44626L0500K97772O41695J072574J965180K862663K665410J291822
43751H5521302Q613m05273p23312j746450k782971k800843k314317k689297l906533
43742F8160919m499651l798499k852184k712661l015139k944862k624700k639362
$$ plain form
43800 30189083 30659671 32285555 35515785 38871153 40939764 42372628 44847362 48780614
43792 48780614 53303173 58079230 63802864 70871394 78749188 86970288 95863223 105809382
43784 105809382 116381604 126635371 135788941 143204686 148066912 149603796 147643520 142777827
43776 142777827 136040404 128474079 120783598 113187185 105659371 98430299 92157613 87435047
43768 87435047 84110605 81258982 78054835 74739547 72508372 72206670 73281040 74349060
43760 74349060 74693686 74724186 75021958 75663653 76736227 78701407 81564070 84229480 85521302
43751 85521302 85529915 85124642 84401330 82654880 79871909 77071066 74756749 72067452 68160919
43742 68160919 63661268 59862769 57010585 54297924 51282785 48337923 45713223 43073861
43734D3073861k859144k730562k363535k347938k615048k423703j590912q88704
43726B5254315q99912j191508j109754q42465j042865j698154k069528j731130
43718A4668999j073331o46289m91210l47452j38735M2050J78580K76248K28454
43709A2697314j8466k92630l86287k95228j19842Q5938J90811n1554o51933j194677
43699I963446j283703j003508o64059l33232K991P0930l65077r16958q76700j42845
43689D451285O26564Q33913M91152m6690m12373k72342M05907J018622P99795
43680G895833j82653r87498r40701l46792J03731J28605j35099l76316j47430
43671E011680P65173J740960J725345N93030n23072p08563m16189n64376j124625
$$ plain form
43734 43073861 40214717 37484155 35120620 32772682 30157634 27733931 26143019 25254315
43726 25254315 24354403 23162895 22053141 21210676 20167811 18469657 16400129 14668999
43718 14668999 13595668 12949379 12458169 12110717 11971982 12014032 12192612 12468860 12697314
43709 12697314 12678848 12386218 11999931 11704703 11584861 11670799 11861610 11810056 11158123 9963446
43699 9963446 8679743 7676235 7012176 6678944 6681935 6752865 6387788 5470830 4594130 4451285
43689 4451285 5077849 5911762 6402914 6356224 5943851 5671509 6077416 7096038 7895833
43680 7895833 7713180 6725682 5784981 5438189 5541920 5670525 5535426 5159110 5011680
43671 5011680 5776853 7517813 9243158 9836188 9313116 8604553 8188364 7623988 6499363
43662F499363j369882j070184o21460k57605J07364M18790N17659M92085M50091
43653E166221J87794l53339o26812j56929O14907Q79084N80123K43596J125l28853
43643F206917m67513j2114O07649O01499J82113K77160Q40697P84201j20241o59330
43633H241038j07129N55929K30670n82686p18626j61731K31511K53462M12755
43624H355193P81761Q54151M70282J9499k28782k71217K7512P22924J262302R50685
43614A2944310j4447o83703o18883l36033l20625k64744L47194J335322J944871
43605A4333262J740518J106568Q11237J129500J515276J325657P63495O38205
43597B3363718J116703J370629Q52346K67886O14504J747160K690006K993531
$$ plain form
43662 6499363 5129481 4059297 3437837 3180232 3287596 3706386 4224045 4716130 5166221
43653 5166221 5354015 5000676 4373864 4216935 4831842 5710926 6291049 6534645 6535770 6206917
43643 6206917 5739404 5727290 6334939 6936438 7118551 7395711 8236408 9020609 8900368 8241038
43633 8241038 8133909 8689838 8920508 8337822 7619196 7457465 7688976 7942438 8355193
43624 8355193 9136954 9991105 10461387 10480886 10252104 9980887 10008399 10731323 11993625 12944310
43614 12944310 12929863 12246160 11627277 11291244 10970619 10705875 11053069 12388391 14333262
43605 14333262 16073780 17180348 17991585 19121085 20636361 21962018 22725513 23363718
43597 23363718 24480421 25851050 26703396 26971282 27585786 29332946 32022952 35016483
43589C5016483K908923K532345J833834J413997K042775L257074L551551K389326
43581E4946308J015195P08263J157576J304076R62003O36605L05141n08691j636504
43572E8889972k254870k061292j672806j678539j946896k108851k164913k262312
43564D2739493k259242j910640j328509r60243j127482j701608k192523k140349
43556B9118897j547614r55713r29639j395847j657030j179671k20954M86808N59918
43547B2279155K48226n7117k94795n68981p70399o89149m42636m31713p65546
43538A8507045j038731q86020n04457l38463m32878m48479k26256L5550J64792
43529A4832103K25124K81978K72867K11186K50250M36918O34524P67974Q87576
$$ plain form
43589 35016483 37925406 40457751 42291585 43705582 45748357 49005431 52556982 54946308
43581 54946308 55961503 56669766 57827342 59131418 60093421 60730026 61035167 60526476 58889972
43572 58889972 56635102 54573810 52901004 51222465 49275569 47166718 45001805 42739493
43564 42739493 40480251 38569611 37241102 36280859 35153377 33451769 31259246 29118897
43556 29118897 27571283 26615570 25685931 24290084 22633054 21453383 21232429 21719237 22279155
43547 22279155 22527381 22470264 22175469 21606488 20836089 20146940 19704304 19272591 18507045
43538 18507045 17468314 16582294 16077837 15739374 15306496 14858017 14631761 14667311 14832103
43529 14832103 15057227 15339205 15612072 15823258 16073508 16510426 17144950 17912924 18800500
43520A8800500R09447O06411K7241l59650j90613K99641N36197K60434k25034
43511B0664574l95909k3326N49280O65350R1212n56030m62973K71737O47237P8064
43501B1529216p63020q04325N6247R14538J042236O69381N73319J158440J995662
43492B6371694K218230J476418M71376K26311Q07833J283093J113747R05352J301450
43483C6175504J827024J648077J005623Q86482J465339J930481J902148J977499
43475D8818177K589868L287244L600738L793912M173122M379205M070074L755482
43467G8467822M187493N276850O330994P109619P947678Q998240J0030608J0926832
43459A39276136J1802822J2679739J3548562J4662864J6202274J7719704J8522831
$$ plain form
43520 18800500 19709947 20316358 20343599 19983949 19793336 20092977 20629174 20889608 20664574
43511 20664574 20268665 20245339 20794619 21459969 21551181 20995151 20532178 20803915 21451152 21529216
43501 21529216 20766196 19961871 20018118 20932656 21974892 22644273 23217592 24376032 26371694
43492 26371694 28589924 30066342 30537718 30764029 31571862 32854955 33968702 34874054 36175504
43483 36175504 38002528 39650605 40656228 41542710 43008049 44938530 46840678 48818177
43475 48818177 51408045 54695289 58296027 62089939 66263061 70642266 74712340 78467822
43467 78467822 82655315 87932165 94263159 101372778 109320456 118318696 128349304 139276136
43459 139276136 151078958 163758697 177307259 191970123 208172397 225892101 244414932
43452B44414932J8552776J8225734J7425519J5452515J2135757Q175486M043203
43445C38425922o38251o042960j1175190j4765489j6741159j8011202j9018477
43438B52033194j9327047j8629214j7373172j6143338j4970246j3580398j2009652
43431A40000127j0676365r939166r663386r193707p943565o216390n140603n346835
43423G5880110n976586n658399m327347l241672l117020l201856k620879j745140
43415D5991211j491005j883858k175854k027620j737109j490163j175689q79201
43407C3130712q55419j022049j084531j076295j141983r63789k35314M12736K4730
43398B7188798j013070j093361L56316J843677J785923N76181k57177j83213J58036
$$ plain form
43452 244414932 262967708 281193442 298618961 314071476 326207233 334382719 338425922
43445 338425922 337787671 331744711 320569521 305804032 289062873 271051671 252033194
43438 252033194 232706147 214076933 196703761 180560423 165590177 152009779 140000127
43431 140000127 129323762 119384596 109721210 100527503 92583938 86367548 81226945 75880110
43423 75880110 69903524 64245125 59917778 56676106 53559086 50357230 47736351 45991211
43415 45991211 44500206 42616348 40440494 38412874 36675765 35185602 34009913 33130712
43407 33130712 32275293 31253244 30168713 29092418 27950435 26986646 26751332 27164068 27188798
43398 27188798 26175728 25082367 25438683 27282360 29068283 29644464 29387287 29204074 29362110
43389B9362110L80090O98511J051428J062575R39411J361714K282431K752027
43381C9890297K203314J133106K71154j60378j18044M97237J360327J769479J620646
43372D8467138J628794K123864K399658J865485J071695P74172O42557r4918j187779
43363E7690666j677688j465425j407936j820866k012806j572566j063078r47234
43355D5723067p54433k0525O66067M29480n00520j047675p99781m55637o94257
43346D2545786j275936j503479j094495l27757L27030M68778n2166r15785j488208
43337C6683768j469394j246469j354028j746725j943234j779310j572890j505175
43329B4066543j319266q45085l87576k50815k51589j49466k09721p20135j192838
$$ plain form
43389 29362110 29742200 30440711 31492139 32554714 33494125 34855839 37138270 39890297
43381 39890297 42093611 43226717 43497871 43337493 43219449 43716686 45077013 46846492 48467138
43372 48467138 50095932 52219796 54619454 56484939 57556634 58330806 58973363 58878445 57690666
43363 57690666 56012978 54547553 53139617 51318751 49305945 47733379 46670301 45723067
43355 45723067 44968634 44948109 45614176 46043656 45543136 44495461 43695680 43240043 42545786
43346 42545786 41269850 39766371 38671876 38344119 38671149 39139927 39087761 38171976 36683768
43337 36683768 35214374 33967905 32613877 30867152 28923918 27144608 25571718 24066543
43329 24066543 22747277 21902192 21514616 21263801 21012212 20862746 20653025 19932890 18740052
43320A8740052q46732J45141P66908O81498O85570J233539J529975Q94633J40289
43311B3970873M24905J315367J385960N30570J70802R46034J662866J189070J54962
43302C1751409j79462J69138K47230j60490l37348J01766P42976J161077J396686
43293C4892982J605283J851479K265449K876695L367506L529762L810186M738050
43285E8937392N931382O452356O133713N674523N268343M092462J627278j297779
43277I2819670l406871m386513m782724m949601m814337m456029m219932m229145
43269E7574518m245513m060239l709757l316879k983803k811836k803785k787078
43261C0855628k594817k237633j793962j329475j060123j291033j920150k275267
$$ plain form
43320 18740052 17893320 18038461 18805369 19486867 20172437 21405976 22935951 23830584 23970873
43311 23970873 24395778 25711145 27097105 27627675 27798477 28744511 30407377 31596447 31751409
43302 31751409 31571947 31741085 31988315 31827825 31490477 31592243 32335219 33496296 34892982
43293 34892982 36498265 38349744 40615193 43491888 46859394 50389156 54199342 58937392
43285 58937392 64868774 71321130 77454843 83129366 88397709 92490171 94117449 92819670
43277 92819670 89412799 85026286 80243562 75293961 70479624 66023595 61803663 57574518
43269 57574518 53329005 49268766 45559009 42242130 39258327 36446491 33642706 30855628
43261 30855628 28260811 26023178 24229216 22899741 21839618 20548585 18628435 16353168
43253A6353168j806805p70418J02268M27447L28977K587m16193o55799m59002
43244A3106230L6490M08958M39223K02684k10837o87095r05664o52096k94272
43235A1443621m21006r17467r46201r6885R06953J025674J52379q20873j046189
43226I280006n14384J54947M48961L72918K21436J24128r592j43329l1541L61354
43216A0264904O72048O34251M52541L34017K2183o54664j113332o84958J88155
43207A0115145L38589m42119j030175o02142K31993M59848R3644j21097J00168
43198I143854L98604M67255L02869j3923k74722j09705N36300J141904J247013
43189A2839449J031798Q13371L95954m51570j248631j306345p64116l53198k65751
$$ plain form
43253 16353168 14546363 13775945 13878213 14305660 14634637 14637224 14221031 13565232 13106230
43244 13106230 13142720 13551678 13990901 14193585 13982748 13295653 12389989 11737893 11443621
43235 11443621 11022615 10105148 9158947 9062062 9969015 10994689 11147068 10326195 9280006
43226 9280006 8765622 8920569 9369530 9742448 9963884 10088012 10078420 9935091 9903550 10264904
43216 10264904 10936952 11571203 12023744 12357761 12379944 11725280 10611948 9926990 10115145
43207 10115145 10453734 10011615 8981440 8379298 8611291 9071139 9164783 9043686 9143854
43198 9143854 9542458 10009713 10312582 10298659 10023937 9914232 10450532 11592436 12839449
43189 12839449 13871247 14684618 15080572 14629002 13380371 12074026 11309910 10956712 10690961
43180A0690961o8442K99343L09747k07217o71865o13106l20613l11183n92191
43171H515434p55191n00740R8317O09476N18738j81118p82908o79453k23132j82167
43161F437256n08020m56763Q2175L45915J8502j78020L19086R88131J117348Q86906
43151I052516Q19342P45862J72218o86250j072462p51496k19270R5462K57667
43142H413589M44184N98237N50475K52915j00485j41842K38546N09452L9730q41272
43132I963529r95485l2660J021565J159345P34719O12015P14629M81582K08317
43123A3867556O37289J453353J531309P29771J54449L88191O85332L62310j61732
43114A9647828l37968m67501q96098j072164l70402P02291J083319O17600R1638
$$ plain form
43180 10690961 10622519 10921862 11231609 11024392 10352527 9739421 9418808 9107625 8515434
43171 8515434 7760243 7259503 7357820 7967296 8486034 8304916 7522008 6842555 6619423 6437256
43161 6437256 5929236 5472473 5554648 5900563 5919065 5741045 6060131 7048262 8165610 9052516
43151 9052516 9871858 10617720 10789938 10103688 9031226 8279730 8060460 8155922 8413589
43142 8413589 8857773 9456010 10006485 10259400 10158915 10017073 10255619 10765071 10804801 9963529
43132 9963529 8968044 8935384 9956949 11116294 11851013 12463028 13177657 13659239 13867556
43123 13867556 14504845 15958198 17489507 18219278 18373727 18761918 19447250 19809560 19647828
43114 19647828 19309860 18842359 17946261 16874097 16503695 17205986 18289305 18906905 18998543
43105A8998543J2285J51738K19546K47493K71031K34629K60564M74688N45050
43096B1415567k3733j033700j623609j390014r37487r49448j184635r39031k14952
43087A3118958K42822O6693k41851j80694q392j46418k92553J13730P52672O79399
43077A4104366j54092n93368M8821R23153R88792O09165P23074J032743M50440
43068A8133094q11112j157605J6264J268468J139411J14763l53602P9356O00119
43059A9029156O86689N58373M54807L65205L45691M02631K21967l56353q15382
43050B0892784n63194J61738O46836P32396P74433Q18854O22372L42564L43916
43041B4772699L85433q9996q31043r10093j71823L91916N8835o98871j151935
$$ plain form
43105 18998543 19010828 19162566 19382112 19629605 19900636 20135265 20395829 20870517 21415567
43096 21415567 21391834 20358134 18734525 17344511 16407024 15457576 14272941 13333910 13118958
43087 13118958 13361780 13428473 13186622 13005928 12997536 12851118 12558565 12672295 13424967 14104366
43077 14104366 13950274 13356906 13405727 14328880 15317672 15926837 16649911 17682654 18133094
43068 18133094 17321982 16164377 16180641 17449109 18588520 18703283 18349681 18429037 19029156
43059 19029156 19715845 20274218 20729025 21094230 21439921 21842552 22064519 21708166 20892784
43050 20892784 20329590 20491328 21138164 21870560 22644993 23463847 24086219 24428783 24772699
43041 24772699 25158132 25068136 24237093 23327000 23155177 23547093 23605928 22907057 21755122
43032B1755122j352708j620522j672274j050044m5896N19176L09490k36178n31990
43023A6074176l87206k1056J75406j9391l89871n08298k95301p5211j8040N5623
43013A4590831J90400J28299j38969j88279J20505K78535q3453n43655n61029
43004A3793185l44912m22196o97284o45794k19503J36288K38261K77108K57207
42995A2372360j3673l82046m33054j74204m4518j62233j55610J18793K78696P7418
42985A1481929j50675j8137L31806M72421K27504k87768q73544j244225j092011
42976H847300m66427N2285j42494r83476j676844j437224l26516O82252O80397
42967E229253r0349m63928J50405R56514R01960J62278k33945K0230K30119j5548
$$ plain form
43032 21755122 20402414 18781892 17109618 16059574 16013678 16532854 16842344 16606166 16074176
43023 16074176 15686970 15665914 15841320 15821929 15432058 14923760 14628459 14553248 14535208 14590831
43013 14590831 14781231 14909530 14770561 14582282 14702787 14981322 14897869 14354214 13793185
43004 13793185 13448273 13026077 12328793 11682999 11463496 11599784 11838045 12115153 12372360
42995 12372360 12358687 11976641 11543587 11369383 11324865 11162632 11007022 11125815 11404511 11481929
42985 11481929 11331254 11313117 11644923 12117344 12344848 12057080 11183536 9939311 8847300
42976 8847300 8380873 8433158 8290664 7307188 5630344 4193120 3866604 4548856 5229253
42967 5229253 5138904 4674976 4825381 5781895 6683855 6846133 6612188 6632418 6862537 6846989
42957F846989k30621L8520M91029O63749N67804L51252l8607m62673m91006j23099
42947G613337K3131l01874m81714p6909L41742J22082l50514l27357L3713M4457
42937F640094k27367p3766N96099J049526P60542j10981j157464j892363j695449
42928C888871m81539P34410Q98816M10934M92381J186164J290038M04499l88496
42919H436078l42219j48259m95971q09482m10860J27857l9483n15876l44166L71834
42909E829453P45265O01609N00593N26303K54997j54545o795O74284R67601L88767
42899A0327532m53122q20449p37875o02933n17833l63995j33813P4414J49381
42890F921307R042k23476k53452j33416l76776j024559j091259J65219J777060
$$ plain form
42957 6846989 6616368 6654888 7145917 7809666 8377470 8728722 8690115 8227442 7736436 7613337
42947 7613337 7636468 7334594 6852880 6775971 7117713 7239795 6889281 6561924 6595637 6640094
42937 6640094 6412727 6338961 6935060 7984586 8745128 8634147 7476683 5584320 3888871
42928 3888871 3407332 4141742 5040558 5451492 5943873 7130037 8420075 8824574 8436078
42919 8436078 8093859 7945600 7449629 6640147 6229287 6357144 6317661 5801785 5457619 5829453
42909 5829453 6574718 7176327 7676920 8203223 8458220 8303675 8296880 8971164 9938765 10327532
42899 10327532 9874410 9053961 8316086 7713153 7195320 6831325 6697512 6771926 6921307
42890 6921307 6930349 6706873 6453421 6320005 5943229 4918670 3827411 3992630 5769690
42881E769690K028198Q02036k74119j79046L10352J92848k82627m49006m16339
42872G501987m97854l22049M34828J068141O71658m40146j095602p89538j8178
42863F513247O31035Q97241N91378k31954r71725j079065p92389n82504j76474
42854D798790R39604K233963K434180J238396k24103q54480o69062k23446J72674
42845I846516L44556J67956j8180L51388J060293J141596L58852k29822J55359
42836A3178514P53797N06701j74715j01981O50980P97839m9177o81615j54687
42827A4725656P97262R45123L16319j46320j25756j25464l47322l65622o982K93195
42817A5960089K76894K89193N47042O28765K19977j61154J33098P85293Q74246
$$ plain form
42881 5769690 7797888 8599924 8325805 8146759 8457111 8649959 8367332 7918326 7501987
42872 7501987 7004133 6682084 7116912 8185053 8856711 8416565 7320963 6531425 6513247
42863 6513247 7144282 8041523 8632901 8400947 7429222 6350157 5557768 4975264 4798790
42854 4798790 5738394 7972357 10406537 11644933 11420830 10566350 9897288 9673842 9846516
42845 9846516 10191072 10359028 10340848 10692236 11752529 12894125 13252977 13023155 13178514
42836 13178514 13932311 14439012 14264297 14162316 14813296 15611135 15561958 14880343 14725656
42827 14725656 15522918 16468041 16784360 16638040 16512284 16386820 16039498 15673876 15666894 15960089
42817 15960089 16236983 16526176 17073218 17701983 17921960 17760806 17893904 18679197 19553443
42808A9553443K04388m65770n53671l08782j80826j75659j03832O9681L89310
42799A8428282R06056J258406Q42455k50801j070186j020926o37525n98384o34302
42790A7223075k06795K93060M8302p76806j195917q94432n53819o30038p96910
42781A2509720p83864q04695q51158m80513K76212O54015L12993m4236J79248
42772A0967722M62764O2500o96450q93480l78046J96759M58478N99945O79951
42763A1460143M16106k54970r87371j445625j473154r36251P6139R83512J222591
42754I061120R81145Q26599O70290j09654j376169j947098j105707K71938P89477
42745H061941L12985q7386J97502N43139J72047o70182j082673o85993P4482O45988
$$ plain form
42808 19553443 19757831 19292061 18738390 18429608 18248782 18073123 17969291 18038972 18428282
42799 18428282 19334338 20592744 21435199 21184398 20114212 19093286 18455761 17857377 17223075
42790 17223075 17016280 17309340 17357642 16580836 15384919 14490487 13936668 13306630 12509720
42781 12509720 11725856 10921161 10070003 9589490 9865702 10519717 10832710 10788474 10967722
42772 10967722 11430486 11492986 10796536 9903056 9525010 9721769 10180247 10780192 11460143
42763 11460143 11876249 11621279 10633908 9188283 7715129 6778878 6855017 7838529 9061120
42754 9061120 10042265 10868864 11539154 11429500 10053331 8106233 7000526 7272464 8061941
42745 8061941 8374926 8287540 8485042 9028181 9200228 8530046 7447373 6761380 6835862 7481850
42735G481850Q78969Q02365M01421j40210l62791n0451M09561N35902M08127M11658
42725A0776401N23093L65643j08262n40555p53790q25745n79820K50309J177686
42716A0284960J134894o1694j187154j159710m24877l9084m3942K10759N84939
42707I299091K62854p04529j213532p40362r3224r5336m60572n59983m66194m81009
42697D747204l03131M12480J088932Q14076k34453q74788n08750K13361N30987
42688E885918N48400O14970M75507j79066p55146l29019Q40971J321216L65238
42679H788989j017655j440115r47995o24540p95904p06632J4431O58201N97052
42670D525832K34816J98580L19804J56530o0320J36813M87371M03191O9675J54559
$$ plain form
42735 7481850 8360819 9163184 9564605 9424395 9061604 9011153 9420714 9956616 10364743 10776401
42725 10776401 11299494 11665137 11556875 11016320 10262530 9436785 8856965 9107274 10284960
42716 10284960 11419854 11358160 10171006 9011296 8586419 8547335 8503393 8714152 9299091
42707 9299091 9561945 8857416 7643884 6903522 6810298 6714962 6254390 5694407 5228213 4747204
42697 4747204 4444073 4856553 5945485 6759561 6525108 5650320 5141570 5354931 5885918
42688 5885918 6434318 7049288 7524795 7345729 6590583 6261564 7102535 8423751 8788989
42679 8788989 7771334 6331219 5383224 4758684 3962780 3256148 3270579 3928780 4525832
42670 4525832 4760648 4959228 5279032 5435562 5375242 5512055 5999426 6402617 6472292 6626851
42660F626851N26456L44490m40804p68133o5226P95513P73422J09468k77671k48657
42650G375709l72549p15492o76743o5827M90204M77539K04272K00246L64882K06931
42640G489172k86477n48357k45709K31973L24803M8326j65585k14390m29219q65061
42630E339476r95973m54484K88223M60202L8895k31674J32215P48435R07402M11496
42620F644213k65579n04961j74451K08997O6237m33601m81845K19736Q74049O52797
42610F805592p1855k92565J21224L96953K71569L86251J030585J477707J078840
42601A1204301K56436j63033o061L87350P89731J011142P29043J6799l97379l1384
42591A3796945N68552N81388J04451r0982K50322O18280N59584J37129l62596
$$ plain form
42660 6626851 7153307 7497797 7056993 6288860 6223634 7019147 7792569 7902037 7624366 7375709
42650 7375709 7003160 6287668 5610925 5545098 6035302 6512841 6717113 6917359 7282241 7489172
42640 7489172 7202695 6654338 6408629 6640602 6965405 7013731 6848146 6633756 6204537 5339476
42630 5339476 4343503 3889019 4177242 4637444 4676339 4444665 4576880 5325315 6232717 6644213
42620 6644213 6378634 5873673 5699222 5908219 5974456 5540855 5059010 5278746 6152795 6805592
42610 6805592 6733737 6441172 6562396 6959349 7230918 7617169 8647754 10125461 11204301
42601 11204301 11460737 11297704 11291643 11678993 12468724 13479866 14208909 14225708 13828329 13796945
42591 13796945 14365497 14946885 15051336 14960354 15210676 15828956 16388540 16525669 16163073
42582A6163073o52012m47888K52362R54342J138385Q49656M76222J76723n0051
42573A8860812k2661L56707P50556Q74354J064401J700093K331084K191203J435930
42564B9542479R86226J146487J275410R43996N05565K45226j62729r20840j575738
42555C1986082j709700j544620j377856j014935l12990K40676J15162m83249r77666
42546B4920904j200304j252504j000567m10145n7012m71947j111710q55648M06425
42537A8967492J526686J667419J291986J158757J116397O55348J11524L16941
42529B6812550J172711J569015R78799K95048N85913J648307K425097K394541
42521C7881981J823717R76707o5563r08617j086258r27905j325636k364881l015803
$$ plain form
42582 16163073 15511061 15063173 15315535 16269877 17408262 18257918 18734140 18910863 18860812
42573 18860812 18838151 19194858 19945414 20819768 21884169 23584262 25915346 28106549 29542479
42564 29542479 30528705 31675192 32950602 33894598 34400163 34645389 34482660 33561820 31986082
42555 31986082 30276382 28731762 27353906 26338971 26025981 26266657 26381819 25898570 24920904
42546 24920904 23720600 22468096 21467529 21057384 21000372 20528425 19416715 18561067 18967492
42537 18967492 20494178 22161597 23453583 24612340 25728737 26384085 26495609 26812550
42529 26812550 27985261 29554276 30533075 30828123 31414036 33062343 35487440 37881981
42521 37881981 39705698 40682405 40616842 39708225 38621967 37694062 36368426 34003545 30987742
42512C0987742k589077j685788j161102r62053p33305p83643j405150j805982
42504A9861642r93288M92447J018835J43560p54451m97294L10213L51112n44216
42495A9388560j368536j337860o67005j27542k59111r05566j312346q68119J22003
42486A2664478O76666K77125n44355q95655n01536J42712L18945k83085j199192
42477A0656103j474914o81199M30202P76923L62163J73207O54463J107024Q63486
42468A2867458K52457p5747j23895k78896n42422n92915l34693J9961K02658L5825
42458A1429791l45658l68705L44986J173902J080849J53936l70997M6690M73194
42449A3617988J64035j33210N02064J525693J806306J376358R95501N81564m26498
$$ plain form
42512 30987742 28398665 26712877 25551775 24589722 23856417 23072774 21667624 19861642
42504 19861642 18868354 19360801 20379636 20523196 19768745 19271451 19581664 19932776 19388560
42495 19388560 18020024 16682164 16015159 15887617 15628506 14722940 13410594 12542475 12664478
42486 12664478 13341144 13618269 13073914 12178259 11676723 11819435 12138380 11855295 10656103
42477 10656103 9181189 8499990 8930192 9707115 10069278 10242485 10896948 12003972 12867458
42468 12867458 13119915 13044168 12920273 12641377 12098955 11506040 11171347 11191308 11393966 11429791
42458 11429791 11084133 10715428 11060414 12234316 13315165 13469101 13098104 13144794 13617988
42449 13617988 13782023 13648813 14150877 15676570 17482876 18859234 19854735 20436299 20009801
42440B0009801j485988j343349n7117Q46550N28842j44108j43838L38094O10787
42431A9159674O04116O17267O67049O60458O76264O74409M40645O8085j10406
42422B3457561k33989p80007j510733j519450p39259l55015j022198j692809j215200
42413A4388901k59648l45272j411583j797175o64417Q46951J276651O34342p0256
42404A2598494l47521m92457o71457n49446N4930O74369P11694K73878J06627
42395A2359111N98092J155751Q97940j74494j130318j265709q37125m39520j54432
42386A1009296K33401N43899L84569o3103j15591L87208P21941L20562k99796
42377A3122386k29139M42691O38929j92543j246716j434641p83600j84648p1961
$$ plain form
42440 20009801 18523813 17180464 17123347 17969897 18498739 18354631 18210793 18548887 19159674
42431 19159674 19763790 20381057 21048106 21708564 22384828 23059237 23499882 23567967 23457561
42422 23457561 23223572 22443565 20932832 19413382 18674123 18319108 17296910 15604101 14388901
42413 14388901 14129253 13783981 12372398 10575223 9910806 10757757 12034408 12668750 12598494
42404 12598494 12250973 11758516 11087059 10537613 10592543 11266912 11978606 12252484 12359111
42395 12359111 12957203 14112954 15010894 14836400 13706082 12440373 11603248 11163728 11009296
42386 11009296 11242697 11786596 12171165 12108062 11992471 12379679 13101620 13422182 13122386
42377 13122386 12893247 13335938 13974867 13782324 12535608 11100967 10317367 10132719 10060758
42368A0060758q5896M5451Q8813p2508j25169P0409K07631J85481L36564N96604
42358A1308138K61658p66810j317179n03198P09922P06216m11042r93676k89405
42349H704624O57345P28870Q9863n62969r76106j061914o33686K4873J69093l16851
42339F823142o36355l33828L0964o3892l11283l98806o27634j005569p41872M51799
42329C186666J493126J400861P98934Q03758J159273P92726l00020j074825j047083
42320G213416o60013k82228L7488P7550j93839r9679P45422J351882O33646o62712
42310H160933r37163l31052m08282j272014j213187K63990J288047N26262p19972
42301E357562p02663J62446M81362K78356L81231M78567k14899j005225m61911
$$ plain form
42368 10060758 9974862 10020313 10109126 10036618 9911449 9981858 10189489 10374970 10711534 11308138
42358 11308138 11569796 10802986 9485807 8982609 9692531 10398747 9987705 8994029 8704624
42349 8704624 9361969 10090839 10180702 9617733 8641627 7579713 6946027 6970900 7139993 6823142
42339 6823142 6186787 5852959 5883923 5820031 5508748 5109942 4482308 3476739 2734867 3186666
42329 3186666 4679792 6080653 6879587 7683345 8842618 9635344 9335324 8260499 7213416
42320 7213416 6553403 6271175 6308663 6386213 6192374 6092695 6838117 8189999 8823645 8160933
42310 8160933 7223770 6892718 6484436 5212422 3999235 4263225 5551272 6077534 5357562
42301 5357562 4654899 4817345 5298707 5577063 5958294 6436861 6221962 5216737 4754826
42292D754826J111604J853056J080651J24681R0955L84793Q5150n35220p03469
42283H247027m37363l07045m84095p04964q02015p79794o58772n61092o44903
42274B866984p56545n30058l677L03193J30419j48189j13413J68684M44488O77277
42264C039163Q75907Q94337O96022N20217N36743N92416M78820J91419j84812
42255G640232n38476o26222l05865O5613m4035n23096o86116l14851K3645n0872
42245D639957j72733m1466j5190k94524k73557M50624J048064M99338p02892j057708
42235D079913j73861P62780P99233M06724M37446P93790P72717J67934n69028
42226G477648r41128p65996k16773K00652M9090l98402l14774N83342J511908
$$ plain form
42292 4754826 5866430 7719486 8800137 8924818 9015773 9400566 9485716 8950496 8247027
42283 8247027 7809664 7502619 7018524 6313560 5511545 4731751 4072979 3511887 2866984
42274 2866984 2110439 1580381 1576704 1879897 2010316 1862127 1748714 1917398 2361886 3039163
42264 3039163 3915070 4809407 5505429 6025646 6562389 7154805 7633625 7825044 7640232
42255 7640232 7101756 6475534 6169669 6235282 6191247 5668151 4982035 4667184 4690829 4639957
42245 4639957 4467224 4425758 4410568 4116044 3842487 4293111 5341175 5840513 5137621 4079913
42235 4079913 3906052 4668832 5468065 5874789 6312235 7106025 7878742 8046676 7477648
42226 7477648 6536520 5770524 5553751 5754403 5803493 5405091 5090317 5673659 7185567
42217G185567J554954P33633k37925q45613r55643n16481K85485Q11806N64785
42208H580568q8501l45916n4941J99646N7644k01177l15866m99441r38078j304755
42198E089183j165372o06358j06750Q2343J48807L53181O53745P41163L92422
42189E582364k34834p04227p18856l53138J41367N43231N82638P990r42698j426333
42179B477504q42714L16603R46280O10903j03361m67616l12358J67639P29862
42170C522742J043730Q29234K36900k88303n85137p59591o25683J13964R94186
42161D482042R67279j12625r94134o49909K98933N52919l8906n32800m02144k5351
42151C545304K02745L39748M34740L62568K19801K54927L47472J62264j56977
$$ plain form
42217 7185567 8740521 9474154 9236229 8390616 7434973 6918492 7203977 8015783 8580568
42208 8580568 8492067 8146151 8091210 8290856 8348500 8147323 7831457 7332016 6393938 5089183
42198 5089183 3923811 3317453 3210703 3293046 3441853 3795034 4448779 5189942 5582364
42189 5582364 5347530 4643303 3924447 3571309 3712676 4255907 4838545 4846535 3903837 2477504
42179 2477504 1634790 1951393 2897673 3508576 3405215 2937599 2625241 2792880 3522742
42170 3522742 4566472 5395706 5632606 5344303 4759166 3999575 3373892 3487856 4482042
42161 4482042 5449321 5336696 4342562 3692653 3991586 4544505 4505599 3972799 3570655 3545304
42151 3545304 3748049 4087797 4522537 4885105 5104906 5359833 5707305 5869569 5712592
42142E712592j09826K69069L27978k03357p49837o70830j707P63802J138537P74582
42132G251003k74997j249332j272273n17294j35369o73281j240519p77305M36758
42123A547391J221837J054816M74677J30136R6690J29009N4019j72198m36420
42114D099957m46697k5438N44272P04943K14534n71384j003623o86176J60934
42105B991322Q25727P52894J24661l98518n13765n11686o15010n54204p8217N05753
42095B528957O86299M01955K0514j35150J2674L35613N03711K24443k92529m39943
42085C846544l3943L71243L07595O3378Q0855J61325j15518n59400o70800n24255
42075B927024o03747q87630q40033k87619L84810R09738J311238J383829P80490
$$ plain form
42142 5712592 5602766 5871835 6199813 5996456 5246619 4575789 4574082 5337884 6476421 7251003
42132 7251003 6976006 5726674 4454401 3937107 3801738 3128457 1887938 1110633 1547391
42123 1547391 2769228 3824044 4298721 4428857 4525547 4654556 4708575 4536377 4099957
42114 4099957 3653260 3627822 4172094 4877037 5091571 4520187 3516564 2830388 2991322
42105 2991322 3817049 4569943 4694604 4296086 3782321 3270635 2655625 2101421 2023204 2528957
42095 2528957 3215256 3617211 3637725 3502575 3515249 3850862 4354573 4579016 4286487 3846544
42085 3846544 3812601 4183844 4491439 4554817 4635672 4796997 4681479 4122079 3451279 2927024
42075 2927024 2323277 1435647 595614 307995 692805 1602543 2913781 4297610 5078100
42066E078100j87170n85099o1552N68865L75817m69413r56166m81388M88774R13889
42056D684657K32953r73211j475633p88207J78980L08093j87562j77575N87027
42047B389522J104487P21518N2368j60161j30056k84697k82773L15859R95747
42038D721814Q85491O9903n97137p38989o42246m13624Q8470N42826L77944j73953
42028D120499j75583N75244J076064N42078m49177q20162m25701K9326J00907
42019D573495n2709k25856m01419m64828k34731J49477L00832J36760r471O5359
42009C836909J33344m0615k82501k86934j17661j21966m00111o32188m85002r082
41999A594193M43007N69663L33500n0814k57143r5220K61328L89336J07646k26560
$$ plain form
42066 5078100 4890930 4305831 4244279 4813144 5188961 4719548 3763382 3281994 3770768 4684657
42056 4684657 4917610 3944399 2468766 1680559 1859539 2167632 1980070 1802495 2389522
42047 2389522 3494009 4215527 4267895 4107734 3977678 3692981 3410208 3726067 4721814
42038 4721814 5607305 5677208 5080071 4341082 3698836 3285212 3373682 3916508 4294452 4120499
42028 4120499 3944916 4520160 5596224 6138302 5689125 4868963 4443262 4472588 4573495
42019 4573495 4520786 4294930 3893511 3428683 3193952 3343429 3644261 3781021 3771550 3836909
42009 3836909 3970253 3929638 3647137 3360203 3242542 3120576 2720465 2088277 1603275 1594193
41999 1594193 2037200 2606863 2940363 2889549 2632406 2537186 2798514 3187850 3295496 3068936
41989C068936j19974L83851O96002M38530l8657j13970K88034O33595N29512K36047
41979F001906K66135O60728R31757P23198K88510J69303N26875R82658J105209
41970A1656279Q84744O64824P13539R48296J061200Q91415O55176P08422J047066
41961A9230961J270449J233526J421524K194014K875624K373278P84969m79655
41953C0904690n75275l43069q72917j772893j926803j388758j197514j532661
41945B1294800j486605q02951m24019q47851j242261r02796m38545o05464r57957
41936A3586351p36808k94337m28746q83416p96640k97781l32099r74926j186239
41927G655359m29088N36787P83320K81818m40093r58704j003926n26412K3247
$$ plain form
41989 3068936 2948962 3332813 4028815 4467345 4428688 4314718 4602752 5236347 5765859 6001906
41979 6001906 6268041 6928769 7860526 8583724 8872234 9041537 9568412 10551070 11656279
41970 11656279 12541023 13205847 13919386 14867682 15928882 16820297 17475473 18183895 19230961
41961 19230961 20501410 21734936 23156460 25350474 28226098 30599376 31384345 30904690
41953 30904690 30329415 29986346 29113429 27340536 25413733 24024975 22827461 21294800
41945 21294800 19808195 19005244 18581225 17733374 16491113 15588317 15149772 14544308 13586351
41936 13586351 12849543 12555206 12126460 11243044 10446404 10148623 9816524 8841598 7655359
41927 7655359 7226271 7763058 8546378 8828196 8388103 7429399 6425473 5899061 5922308
41918E922308N6236l57036o20601n69377n68842o25839l02618K89070L87883j34054
41908C477130l53453K64177R00655O10248k43838o46628m42363k44203k17294
41899C104431P8237P55003J332261J409095R97299K55363n33962q36418l53469
41890F207840L90622N43242J4852m79502m78096k75723k62128l31630k00204J04709
41880E233982L32981L27979R2185k38884m05416k55918l6160j72064o79778j071804
41870C127103r80058o18283m36400m92591m06591Q3463P04101R23250O27043L22233
41860B853270M78514Q30870P08604J9674n91486o91888n96388o45232n43564O101
41850A828475M86157J63311o95227j009079l29610N96269Q80268N35326J97768
$$ plain form
41918 5922308 5978544 5621508 5000907 4431530 3862688 3236849 2934231 3223301 3611184 3477130
41908 3477130 3123677 3387854 4288509 4898757 4654919 4008291 3565928 3321725 3104431
41899 3104431 3182668 3937671 5269932 6679027 7676326 7931689 7397727 6561309 6207840
41890 6207840 6598462 7141704 7156556 6677054 6198958 5923235 5661107 5329477 5129273 5233982
41880 5233982 5566963 5894942 5987127 5748243 5342827 5086909 5050749 4878685 4198907 3127103
41870 3127103 2147045 1528762 1092362 599771 193180 276643 980744 1903994 2531037 2853270
41860 2853270 3331784 4162654 4871258 4890932 4299446 3607558 3011170 2365938 1822374 1828475
41850 1828475 2314632 2477943 1782716 773637 444027 1040296 1920564 2455890 2653658
41841B653658K32725M38242M42982J73958o0746K1287J93186o2485o84694q42098
41831B506015n6830R15837J015122L80096R7568N81349J120799J106243P73928
41822H440127M79657J08990l66069m87812J8461P55461J296908J775747K369905
41813A4391375K757309K646281K389100K450438K585220K135498R46465n03221
41805B9798465j711069k460495k680528k402868j801903j061695l37580P9581
41797A7421908q1715o12215r59566j014069j226475j709720j897930j503651j092021
41788G324546j117619j108684n85862j18834m49201j043312p08242N26826J319134
41779D038752Q77796j25696p18099p44069n02302j11810K96957L94185J16996
$$ plain form
41841 2653658 2886383 3324625 3767607 3941565 3880819 3902106 4095292 4032807 3348113 2506015
41831 2506015 2449185 3365022 4380144 4760240 4857808 5439157 6559956 7666199 8440127
41822 8440127 8919784 9028774 8662705 8174893 8193354 8948815 10245723 12021470 14391375
41813 14391375 17148684 19794965 22184065 24634503 27219723 29355221 30301686 29798465
41805 29798465 28087396 25626901 22946373 20543505 18741602 17679907 17342327 17421908
41797 17421908 17340193 16727978 15768412 14754343 13527868 11818148 9920218 8416567 7324546
41788 7324546 6206927 5098243 4512381 4393547 3944346 2901034 2192792 2719618 4038752
41779 4038752 4916548 4790852 4072753 3328684 2826382 2714572 3011529 3405714 3522710
41770C522710j19119j1352K26616L00181K49661J92969Q8043J3619K56682P94078
41760E514088J046863N35211m13780r21542m64583N96244J317656J006594j03452
41751H113299j034391j041184k82388N81588J106219J109823M96092m08048p53623
41742G887387j44723N91135M15220m20885q29091n91838m47357n54349k57464
41733E648035L68321J81600j184266k396752k180074r75262P861M35011N90055
41724D94529L74575k96546p68706m70604K9890j23660o35486n95396m8953K02725
41714a837632J19325M33880J165136J378603O67100j89577l75897q172L36140
41705A688906L29806q0821o84827q91372k95795N37301O05099j23393o68732n58809
$$ plain form
41770 3522710 3403591 3392239 3618855 3919036 4168697 4361666 4449709 4463328 4720010 5514088
41760 5514088 6560951 7096162 6682382 5760840 5296257 5892501 7210157 8216751 8113299
41751 8113299 7078908 6037724 5755336 6336924 7443143 8552966 9049058 8641010 7887387
41742 7887387 7742664 8333799 8749019 8328134 7499043 6907205 6459848 5905499 5648035
41733 5648035 6016356 6197956 5013690 2616938 436864 -538398 -530537 -95526 494529
41724 494529 869104 572558 -196148 -666752 -636862 -760522 -1396008 -1991404 -2040357 -1837632
41714 -1837632 -1718307 -1284427 -119291 1259312 1926412 1736835 1360938 1352766 1688906
41705 1688906 2018712 1937891 1253064 361692 65897 603198 1208297 1084904 416172 -142637
41695a42637m12067o62626p21735n5891P43965Q15090L73172L05901P14966P55001
41685A713139n3620j059665j271621n12183M82151R39582P88391M91014L42447
41676A859635K09122j8688j08133J01945K96304J16555k42114l47469k31076k14703
41666A421378k10601J49260P56941J082766R93673Q47634P41177L77628k09007
41657E950849n19179l64505j29054q6517j01364j51981m53152q75451r33479n30337
41647A805830m8801L51567P25967O65130k80039j383717j263776K6800Q18842
41638A417803L00863l17515M8031O05164L01351k57639o8652L10575j41209q33222
41628A365550n57334J77283o3861r74663r00904K38149P64498J91439j4429P68696
$$ plain form
41695 -142637 -554704 -1217330 -1939065 -1994956 -1250991 -435901 -62729 243172 958138 1713139
41685 1713139 1659519 599854 -671767 -1183950 -701799 237783 1026174 1517188 1859635
41676 1859635 2068757 2050069 1941936 2043881 2340185 2456740 2214626 1867157 1636081 1421378
41666 1421378 1210777 1360037 2116978 3199744 4193417 5041051 5782228 6159856 5950849
41657 5950849 5431670 5067165 4938111 4851594 4750230 4598249 4145097 3269646 2336167 1805830
41647 1805830 1757029 2108596 2834563 3499693 3219654 1835937 572161 598961 1417803
41638 1417803 1718666 1401151 1449182 2054346 2355697 2098058 2029406 2339981 2198772 1365550
41628 1365550 808216 985499 921638 -53025 -953929 -715780 48718 240157 225728 994424
41618I94424J081604J8357r80566m17055Q54514J099691K69994n06241q90268
41609A524454j123716p64358N85589J889263J785442P40612L77397Q56955P42648
41600F614286m16310j220249p25185R267l40698j286770j382640m19186M37070
41591A269585M05723n5090j82561J30583N48513Q80818J079056R62794L87222
41582E426643l50044o40374k70762K53446L66601K31950M52744J070388J409007
41573G949599J051791M01312j7187k30946l55910l9887R46951J986551K300542
41564A3992816K138602K402551L125212L244696K122902M95926m93741o23668
41556B6405296n08436o31109r31897j122138j007589n69714N3886O77489J159432
$$ plain form
41618 994424 2076028 2094385 1113819 696764 1551278 2650969 2920963 2414722 1524454
41609 1524454 400738 -363620 221969 2111232 3896674 4637286 5014683 5871638 6614286
41600 6614286 6197976 4977727 4252542 4261809 3921111 2634341 1251701 832515 1269585
41591 1269585 1675308 1620218 1437657 1568240 2116753 2997571 4076627 5039421 5426643
41582 5426643 5076599 4436225 4165463 4418909 4785510 5017460 5470204 6540592 7949599
41573 7949599 9001390 9402702 9385515 9154569 8798659 8758772 9705723 11692274 13992816
41564 13992816 16131418 18533969 21659181 24903877 27026779 27522705 27028964 26405296
41556 26405296 25896860 25265751 24333854 23211716 22204127 21634413 21688299 22365788 23525220
41547B3525220J328051J034513N45912N50595J194589J382309p8501k629821m259896
41538B2592971l933213k737383k120836k028638j628959r72726p23312p77027
41530G670877m73813K852k63841j290059j842615j095876K97336J200946J245611
41521E451418O70570k56420j085852j155175l93640L35829L03873j41317k85480
41512C443806j82474l26219o08440m89962j2217K26845N8543q4165J3396J21701
41502B160814K10937N27625Q87822P03569k2044n03994l29057l2625p3343k6193
41492C503511N39165J079809Q52134J72348o5830J42564m4239q36723j387817
41483C954922j085260m14535j23034j98067j80278N865R9783Q9032K03074M22236
$$ plain form
41547 23525220 24853271 25887784 26433696 26984291 28178880 29561189 29482688 26852867 22592971
41538 22592971 18659758 15922375 13801539 11772901 10143942 9171216 8447904 7670877
41530 7670877 7197064 7199916 6936075 5646016 3803401 2707525 3004861 4205807 5451418
41521 5451418 6121988 5865568 4779716 3624541 3230901 3566730 3870603 3729286 3443806
41512 3443806 3261332 2935113 2326673 1836711 1824494 2051339 2109882 2025717 2039113 2160814
41502 2160814 2371751 2899376 3787198 4490767 4468723 3964729 3635672 3603047 3529704 3503511
41492 3503511 4042676 5122485 5974619 6146967 6081137 6223701 6179462 5342739 3954922
41483 3954922 2869662 2455127 2332093 2134026 1953748 1959613 2059396 2148428 2351502 2773738
41473B773738M33319J15906k11705j36740L54514P81868O16788r2800o20315k99999
41463C714574O49562J324314J207042P11006M94724N61800L57520m06967j356311
41454G257264j862738j631438q55592K2295N93126O15179P6179p08966j149510
41445B355799q51231j49333J70289q8962j83663M47984J150130Q87556j26900
41436C611669o23282j49376L12996j2519m94762k63679L05562K94396j71386k06691
41426B602928K41832L15583j92059l63924L58866J188855J109096L03723k37549
41417E327351j43221L5155j80800n35244n18944j06381K47959J99935j26894l82898
41407C816018m07309k73259o7267J10665K721n46311j126071j058420l79330L7404
$$ plain form
41473 2773738 3207057 3322963 3111258 2974518 3329032 4110900 4727688 4634888 4014573 3714574
41463 3714574 4364136 5688450 6895492 7606498 8101222 8663022 9020542 8613575 7257264
41454 7257264 5394526 3763088 2907496 2929791 3522917 4138096 4214275 3505309 2355799
41445 2355799 1504568 1355235 1525524 1436562 1252899 1700883 2851013 3738569 3611669
41436 3611669 2988387 2839011 3152007 3139488 2644726 2381047 2686609 2981005 2809619 2602928
41426 2602928 2844760 3160343 2968284 2604360 2963226 4152081 5261177 5564900 5327351
41417 5327351 5184130 5219285 5038485 4503241 3984297 3877916 4125875 4325810 4198916 3816018
41407 3816018 3408709 3135450 3068183 3178848 3181569 2635258 1509187 450767 71437 108841
41397A08841k52618m73940K06449J227392J297221K80153o19396n85431r0725
41388A097946J34630N5447j14982m01882o11194k11016P34932J256337P57585
41379B697803o6855l05862j46421k65568n13978k42986M36277P89003O52922M80309
41369C514644L21028j64526o93188n02222K95251O03664j9223o51929m88892q0160
41359B134447l20460r42681r45973j11933P65286R68145M80775l19164r54112
41350G54330r40318k13915N38784N18492j69648n95001j67169O75850J039680
41341A441085N22403m73997j120879q30715J97811J080215J088491L55831m12055
41332A848190p33378n86005j19670L81879M21430k19821r20945p83454J29704
$$ plain form
41397 108841 -143777 -617717 -411268 816124 2113345 2393498 1774102 1188671 1097946
41388 1097946 1232576 1288023 1173041 771159 159965 -51051 683881 1940218 2697803
41379 2697803 2630948 2325086 2178665 1913097 1399119 1156133 1592410 2381413 3034335 3514644
41369 3514644 3835672 3671146 2977958 2475736 2770987 3374651 3355428 2703499 2214607 2134447
41359 2134447 1813987 871306 -74667 -186600 578686 1546831 2027606 1708442 754330
41350 754330 -185988 -399903 138881 657373 487725 -107276 -274445 401405 1441085
41341 1441085 1963488 1489491 368612 -462103 -264292 815923 1904414 2260245 1848190
41332 1848190 1114812 528807 409137 791016 1212446 992625 71680 -711774 -582070
$$ [...]
##END NTUPLES=NMR SPECTRUM
##END=
