##TITLE=31Pdec_DE-139m2_TFA
 CCl4,64 sc
 15.4.2026
##JCAMPDX= 6.0         $$ Bruker NMR JCAMP-DX V2.0
##DATA TYPE= NMR SPECTRUM
##DATA CLASS= NTUPLES
##ORIGIN= UXNMR, Bruker Analytische Messtechnik GmbH
##OWNER= root
$$ XWIN-NMR		Version 3.5
$$ Wed Apr 15 16:06:36 2026 Russian Standard Time (UT+4h)  she@DPX200
##.OBSERVE FREQUENCY= 81.013821
##.OBSERVE NUCLEUS= ^31P
##.ACQUISITION MODE= SIMULTANEOUS
##.ACQUISITION SCHEME= undefined
##.AVERAGES= 64
##.DIGITISER RES= 17
##SPECTROMETER/DATA SYSTEM= spect
##.PULSE SEQUENCE= zgpg30
##.SOLVENT NAME= DMSO
##.SHIFT REFERENCE= (INTERNAL, DMSO, 0, 197.392)
##AUDIT TRAIL= $$ (NUMBER, WHEN, WHO, WHERE, WHAT)
$$ ##TITLE= Audit trail, XWIN-NMR		Version 3.5
$$ ##JCAMPDX= 5.01
$$ ##ORIGIN= Bruker BioSpin GmbH
$$ ##OWNER= she
$$ F:/spectra/data/she/nmr/P31/2/pdata/1/auditp.txt
$$ ##AUDIT TRAIL=  $$ (NUMBER, WHEN, WHO, WHERE, WHAT)
(   1,<2026-04-15 16:04:54.87 +0400>,<she>,<DPX200>,
      <continue with go, POWCHK disabled, PULCHK disabled
       configuration hash MD5:
       00 E9 B6 7A A2 85 ED C7 34 08 36 98 17 FE 4E 26
       data hash MD5: 32K
       31 F7 2B E2 81 91 F9 97 A5 52 04 F3 E2 1B B4 46>)
(   2,<2026-04-15 16:04:57.60 +0400>,<she>,<DPX200>,
      <Start of raw data processing
       efp BC_mod = 2 LB = 1.5 FT_mod = 6 PKNL = 1 PHC0 = 1150.434 PHC1 = 815.3004 SI = 64K 
       data hash MD5: 64K
       0F E4 87 FA ED 28 58 85 11 EA 18 5C 4B 1B 72 FD>)
(   3,<2026-04-15 16:05:15.00 +0400>,<she>,<DPX200>,
      <pk PHC0 = -0.02075436 PHC1 = 0 
       data hash MD5: 64K
       BF 2C 65 7C FD C8 C0 64 12 14 8D 66 E8 93 60 6E>)
(   4,<2026-04-15 16:05:21.42 +0400>,<she>,<DPX200>,
      <abs ABSG = 5 
       data hash MD5: 64K
       B1 CC 12 B1 77 07 CB F0 2B 06 C7 1E B7 7D D6 19>)
$$ ##END=
$$ 
$$ hash MD5
$$ FC 05 EE FA 49 BC 99 6D F6 0B BD 76 1A 3C BE 87
##$RELAX= 
##$RELAX= 
##$RELAX= 
##$RELAX= 
##$RELAX= 
##$RELAX= 
##$RELAX= 
##$RELAX= 
$$ Bruker specific parameters
$$ --------------------------
##$DU= <F:/spectra>
##$EXPNO= 2
##$NAME= <P31>
##$PROCNO= 1
##$TYPE= <nmr>
##$USER= <she>
##$AMP= (0..31)
100 100 100 100 100 100 100 100 100 100 100 100 100 100 100 100 100 100 
100 100 100 100 100 100 100 100 100 100 100 100 100 100 
##$AQSEQ= 0
##$AQ_mod= 1
##$AUNM= <au_zg>
##$AUTOPOS= <>
##$BF1= 81.014009
##$BF2= 200.13
##$BF3= 200.13
##$BF4= 200.13
##$BF5= 200.13
##$BF6= 200.13
##$BF7= 200.13
##$BF8= 200.13
##$BYTORDA= 1
##$CFDGTYP= 0
##$CFRGTYP= 5
##$CHEMSTR= <none>
##$CNST= (0..31)
1 1 145 1 1 1 1 1 1 1 1 1 1 1 1 1 1 1 1 1 1 1 1 1 1 1 1 1 1 1 1 1 
##$CPDPRG= <waltz16>
##$CPDPRG1= <>
##$CPDPRG2= <waltz16>
##$CPDPRG3= <>
##$CPDPRG4= <mlev>
##$CPDPRG5= <mlev>
##$CPDPRG6= <mlev>
##$CPDPRG7= <mlev>
##$CPDPRG8= <mlev>
##$CPDPRGB= <>
##$CPDPRGT= <>
##$D= (0..31)
0 1 0 0 0 0 0 0 0 0.06 0 0.03 2e-05 3e-06 0 0 0.0002 0 0 0 0 0 0 0 0 0 
0 0 0 0 0 0 
##$DATE= 1776254617
##$DBL= (0..7)
120 120 120 11 120 120 24 19 
##$DBP= (0..7)
150 150 150 150 150 150 150 150 
##$DBP07= 0
##$DBPNAM0= <>
##$DBPNAM1= <>
$$ [...]
##$SUBNAM3= <"">
##$SUBNAM4= <"">
##$SUBNAM5= <"">
##$SUBNAM6= <"">
##$SUBNAM7= <"">
##$SUBNAM8= <"">
##$SUBNAM9= <"">
##$SW= 400.765351723535
##$SWIBOX= (0..15)
0 1 3 0 0 0 0 0 0 0 0 0 0 0 0 0 
##$SW_h= 32467.5324675325
##$TD= 32768
##$TD0= 1
##$TE= 0
##$TE2= 300
##$TE3= 300
##$TEG= 300
##$TL= (0..7)
0 120 53 12 22 120 120 120 
##$TP= (0..7)
150 150 150 150 150 150 150 150 
##$TP07= 0
##$TPNAME0= <>
##$TPNAME1= <>
##$TPNAME2= <>
##$TPNAME3= <>
##$TPNAME4= <>
##$TPNAME5= <>
##$TPNAME6= <>
##$TPNAME7= <>
##$TPOAL= (0..7)
0.5 0.5 0.5 0.5 0.5 0.5 0.5 0.5 
##$TPOFFS= (0..7)
0 0 0 0 0 0 0 0 
##$TUNHIN= 0
##$TUNHOUT= 0
##$TUNXOUT= 0
##$USERA1= <user>
##$USERA2= <user>
##$USERA3= <user>
##$USERA4= <user>
##$USERA5= <user>
##$V9= 5
##$VALIST= <valist>
##$VCLIST= <CCCCCCCCCCCCCCC>
##$VD= 0
##$VDLIST= <DDDDDDDDDDDDDDD>
##$VPLIST= <PPPPPPPPPPPPPPP>
##$VTLIST= <TTTTTTTTTTTTTTT>
##$WBST= 1024
##$WBSW= 4
##$XGAIN= (0..3)
0 0 0 0 
##$XL= 0
##$YL= 0
##$YMAX_a= 13890
##$YMIN_a= -22733
##$ZGOPTNS= <>
##$ZL1= 120
##$ZL2= 120
##$ZL3= 120
##$ZL4= 120
##$ABSF1= 197.3918
##$ABSF2= -203.3724
##$ABSG= 5
##$ABSL= 3
##$ALPHA= 0
##$AQORDER= 0
##$ASSFAC= 0
##$ASSFACI= 0
##$ASSFACX= 0
##$ASSWID= 0
##$AUNMP= <proc_1d>
##$AZFE= 0.1
##$AZFW= 0.5
##$BCFW= 0
##$BC_mod= 2
##$BYTORDP= 0
##$COROFFS= 0
##$CY= -3
##$DATMOD= 1
##$DC= 0
##$DFILT= <>
##$DTYPP= 0
##$F1P= 0
##$F2P= 0
##$FCOR= 1
##$FTSIZE= 65536
##$FT_mod= 6
##$GAMMA= 0
##$GB= 0
##$INTBC= 1
##$INTSCL= 9.790993e-09
##$ISEN= 30
##$LB= 1.5
##$LEV0= 0
##$LPBIN= 0
##$MAXI= 10000
##$MC2= 0
##$MEAN= 0
##$ME_mod= 0
##$MI= 50
##$NCOEF= 0
##$NC_proc= -9
##$NLEV= 6
##$NOISF1= 182.463
##$NOISF2= 159.3651
##$NSP= 0
##$NTH_PI= 0
##$NZP= 0
##$OFFSET= 197.3918
##$PC= 4
##$PHC0= 1150.413
##$PHC1= 815.3004
##$PH_mod= 1
##$PKNL= yes
##$PPARMOD= 0
##$PSCAL= 0
##$PSIGN= 0
##$REVERSE= no
##$SF= 81.014063255964
##$SI= 65536
##$SIGF1= 159.3651
##$SIGF2= -187.1042
##$SINO= 113.3802
##$SIOLD= 16384
##$SREGLST= <1H.CDCl3>
##$SSB= 0
##$STSI= 65536
##$STSR= 0
##$SW_p= 32467.5324675325
##$SYMM= 0
##$S_DEV= 0
##$TDeff= 32768
##$TDoff= 0
##$TI= <>
##$TILT= no
##$TM1= 0
##$TM2= 0
##$TOPLEV= 0
##$USERP1= <user>
##$USERP2= <user>
##$USERP3= <user>
##$USERP4= <user>
##$USERP5= <user>
##$WDW= 1
##$XDIM= 65536
##$YMAX_p= 280979110
##$YMIN_p= -426867654
$$ End of Bruker specific parameters
$$ ---------------------------------
##NTUPLES= NMR SPECTRUM
##VAR_NAME=  FREQUENCY,     SPECTRUM/REAL,   SPECTRUM/IMAG
##SYMBOL=    X,             R,               I
##VAR_TYPE=  INDEPENDENT,   DEPENDENT,       DEPENDENT
##VAR_FORM=  AFFN,          ASDF,            ASDF
##VAR_DIM=   65536,         65536,           65536
##UNITS=     HZ,            ARBITRARY UNITS, ARBITRARY UNITS
##FACTOR=    0.49542278885378, 1,            1
##FIRST=     15991.5117654749, 0,            0
##LAST=      -16476.0207020576, 0,           0
##MIN=       -16476.0207020576, -426867654,  0
##MAX=       15991.5117654749, 280979110,    0
$$ Real data points
##PAGE= N=1
##DATA TABLE= (X++(R..R)), XYDATA
$$ [...]
##PAGE= N=2
##DATA TABLE= (X++(I..I)), XYDATA
7396b279651j929068l170083l927823j447106J635967Q84533k695908l488603
7388a6417742J000185O854224Q885619O306103J983555j730799m214969m763259
7380b097083k370938K135096N766061O200761L624096p54986n873619r429103
7372b799715q284709k966651Q21255q85243l782567p66176O929571J0274542N245456
7363C785763j268720j623175J936775J754711l709812q578698q422740n196006
7355b1321902k860870j945933l0144M091067Q041077P907926L054362j917579
7347d981996k143997R27096J327987k583517n425750k853215K151456M296251
7339i285685L370297K521956K358609J402676J68032K10555O94146p6541j356662
$$ y = [-2279651, -4208719, -7378802, -11306625, -12753731, -11117764, -10233231, -12929139, -16417742, -15417557, -8563333, 322286, 6628389, 8611944, 6881145, 2666176, -2097083, -4468021, -2332925, 3433136, 9633897, 13257993, 12503007, 6629388, -2799715, -11084424, -14051075, -13229820, -14115063, -17897630, -18663806, -11734235, -1459693, 3785763, 2517043, 893868, 2830643, 4585354, 875542, -7703156, -16125896, -21321902, -24182772, -26128705, -26158849, -22067782, -14026705, -6118779, -3064417, -4981996, -7125993, -6198897, -4870910, -7454427, -12880177, -15733392, -13581936, -9285685, -5915388, -3393432, -1034823, 367853, 535885, 746440, 1440586, 1364045, 7383]
7330G383j928372l134977n754107o385747k089318L537036M638437J780680K30796
7321i098189R59435K42922k347421k998073j193930p13218j779387L8989M705009
7312a2183863N461572k37819m919844j824225M654882N869865J618943j317862
7304b878351l98168L96371j477816l678238m151747m267216n145991m831622j175525
7295b7608303M648579Q979964R074174N452333J635285R73793K920622L605409
7287I681856R99379k420994l602274l056631k713869k092266j5974J663890J42297
7278a414586l309183m385135j803226J288270K143114J089046j001202l973372
7270a1366274n964417l712016K352292O555837M617059l87302j983137J176167
$$ y = [7383, -1920989, -5055966, -10810073, -17195820, -19285138, -15748102, -11109665, -9328985, -9098189, -8138754, -7895832, -10243253, -13241326, -14435256, -15148474, -16927861, -16888872, -12183863, -6722291, -6960110, -11879954, -13704179, -9049297, -3179432, -1560489, -2878351, -3276519, -2880148, -4357964, -8036202, -12187949, -16455165, -21601156, -26432778, -27608303, -22959724, -13979760, -4905586, 546747, 2182032, 3155825, 6076447, 9681856, 10681235, 8260241, 4657967, 1601336, -1112533, -3204799, -3220773, -1556883, -1414586, -4723769, -9108904, -10912130, -9623860, -7480746, -6391700, -7392902, -11366274, -17330691, -21042707, -18690415, -12134578, -7517519, -7904821, -9887958, -8711791]
7262h711791M241012L178272o12789l327671l387588j524013J448486M654725
7254d041357O147885M405577R00033q60907L48573J561488o98275n575834q338552
7245f151369n947673q47328K011339J358896R02103L610655O681276M929778j307442
7236E240235n335567k696086K696625M019566O19746k453137k403443j210945
7228a523006n37496M74440J356694k79956l422730l063521J996672N880632M204990
7219E086719R57581J577598L676705J381516m234882o574199l792884k81106J447399
7210g55553K910137L621922O57591m390181n472954j492700J251399j042313m055409
7201h768061l357265j511116k178413k718392J247008P682794J0483808P640859
$$ y = [-8711791, -4470779, -1292507, -1905296, -5232967, -8620555, -10144568, -8696082, -4041357, 2106528, 6512105, 7412138, 6551231, 6899804, 8461292, 7763017, 2187183, -6151369, -12099042, -12946370, -10935031, -9576135, -8674032, -5063377, 1617899, 6547677, 5240235, -95332, -2791418, -94793, 3924773, 4544519, 2091382, -312061, -1523006, -2060502, -1586062, -229368, -509324, -3932054, -6995575, -4998903, 881729, 5086719, 6044300, 7621898, 11298603, 12680119, 8445237, 1871038, -1921846, -2202952, -755553, 2154584, 5776506, 6434097, 2043916, -3429038, -4921738, -3670339, -4712652, -8768061, -12125326, -13636442, -15814855, -18533247, -17286239, -9603445, 880363, 8521222]
7193H521222K275862k306931m428449l371851j114250k101549o852896q619829
7185a7998671j794293Q571676J1817041N406745k441335m195369j374793J52446
7177a856553j501422l480322l109308r05945O19594j07899k072259l082012k654627
7168a8150753k069990j447740N95408L393401L702023Q41206j104827P78728L562952
7159i899592L488361K093641K445078K547411j121529n613710m376211K184520
7151h252031O179069L364424j745634l696276k754186j121231J499627M653504
7143a872734M514253n70487n456284m304293Q03499K401911j980479o609100n318288
7134a8392002J026462O286183O111870J644993k815421m268808k948316q33181
$$ y = [8521222, 10797084, 8490153, 4061704, 689853, -424397, -2525946, -9378842, -17998671, -19792964, -11221288, 595753, 6002498, 3561163, -634206, -2008999, -1856553, -3357975, -6838297, -9947605, -10853550, -10233956, -10341855, -12414114, -15496126, -18150753, -20220743, -21668483, -21073075, -17679674, -13977651, -13136445, -14241272, -13462544, -9899592, -6411231, -4317590, -1872512, 674899, -446630, -6060340, -10436551, -8252031, -2072962, 1291462, -454172, -4150448, -6904634, -8025865, -6526238, -1872734, 2641519, 2071032, -3385252, -7689545, -6886046, -4484135, -6464614, -13073714, -18392002, -17365540, -11079357, -4967487, -3322494, -6137915, -10406723, -13355039, -14188220]
7126a4188220N45431O02200p13387k606876l316796j611682J731776M761763O149974
7117h645817N433331K655201q08294k251234m64675K205188K639996J085193L03534
7108B152423J151681J471039n69822m065125o468486n699980j577347L475782
7100a0129835N972150N001078L060742K003309O31759j487952j238126K952629
7092F765754O229249L132944l523606n885200k338064J175540J209854Q19385
7084G585856J986513J546650k076702m810504l934984l198992n773870p407011
7076a6083044l017032L812502N283851J454925M09551N938614J1624469R832152
7068A9255988K126344l069110j419272K411577J673920l076245m732901r7093
$$ y = [-14188220, -13642789, -13040589, -13753976, -16360852, -19677648, -21289330, -19557554, -14795791, -8645817, -3212486, -557285, -1365579, -3616813, -4081488, -1876300, 763696, 1848889, 2152423, 3304104, 4775143, 4205321, 140196, -6328290, -12028270, -13605617, -10129835, -4157685, 843393, 3904135, 5907444, 6539203, 5051251, 3813125, 6765754, 12995003, 16127947, 12604341, 6719141, 4381077, 5556617, 6766471, 7585856, 9572369, 11119019, 9042317, 4231813, 296829, -2902163, -8676033, -16083044, -19100076, -15287574, -10003723, -8548798, -8139247, -2200633, 9423836, 19255988, 21382332, 18313222, 16893950, 19305527, 20979447, 17903202, 13170301, 13073208]
7060A3073208M486657J500978o704380j1026363q631390n736194o342646o018814
7052b5398944o95748N356541O191341L476458K471861K859005R80860j657643
7044f416269l28006L515411L051854k717761o192955k301250L833276M300189
7036c255511r22943n135997m295332j035860J22077j500272k637929n03390L697474
7027a5467683O141022M997163K333858R12214Q35975O24213k56624j716099l989346
7018e585307o061862n164900o73620L348536K888624k24850j006548J361324L007640
7009h110963J601793j116806l043177l884096l239269l33424L597457N902406
7001h626079N925076M809055K299031k319357o386517n909254k086205o97818
$$ y = [13073208, 17559865, 19060843, 12356463, 1330100, -7301290, -13037484, -19380130, -25398944, -26094692, -20738151, -14546810, -11070352, -8598491, -5739486, -4758626, -6416269, -6744275, -3228864, -177010, -2894771, -9087726, -11388976, -7555700, -3255511, -4178454, -9314451, -13609783, -14645643, -14523566, -16023838, -18661767, -19165157, -15467683, -9326661, -4329498, -1995640, -1083426, -247451, 376762, 120138, -1595961, -5585307, -11647169, -16812069, -17485689, -14137153, -11248529, -11473379, -12479927, -11118603, -8110963, -6509170, -7625976, -10669153, -14553249, -17792518, -18125942, -14528485, -8626079, -2701003, 2108052, 4407083, 2087726, -4298791, -10208045, -12294250, -12992068]
6993a2992068l625473o124065m457357q39523K014164N593160J0529744J1928273
6985B026855N734474l442065p152780m184304j020701k002103m722692n550262
6977b0313578m357025k246837R80512M832887O812551N421628K326065j72214
6969f716011j696563k207039k74332M422511Q355117O993452M46065n953250p202867
6960c832917l322411J776551M444683L544759J66584l187036l747033o37514L783539
6951a010795N896000M416741J105514j933315l901100l998819j067991L645113
6943C151348N493664J262523n708263q320534l987712K453043M819703K267981
6935A431753j232793k086670n6945K722765M035640L227441J567146Q34911J288961
$$ y = [-12992068, -16617541, -22741606, -27198963, -28038486, -26024322, -20431162, -9901418, 2026855, 7761329, 4319264, -2833516, -7017820, -8038521, -10040624, -14763316, -20313578, -24670603, -26917440, -25936928, -21104041, -14291490, -8869862, -6543797, -6716011, -8412574, -10619613, -10893945, -6471434, 1883683, 8877135, 9323200, 3369950, -3832917, -7155328, -5378777, -934094, 2610665, 2777249, -409787, -4156820, -4794334, -1010795, 4885205, 9301946, 10407460, 8474145, 4573045, 574226, -493765, 3151348, 8645012, 9907535, 4199272, -4121262, -8108974, -5655931, -836228, 1431753, 198960, -1887710, -1944655, 778110, 4813750, 8041191, 9608337, 10443248, 11732209]
6926A1732209J584569P76956n68818j505584j824301j595752o93948N32985R61773
6917I400089j77288k274503l799039l447025r11616K813428N846942O672749N022249
6908A9145986J600382k109678l735246j864817R54426r7902n143009p597693l200530
6899b048081K122722j78610p545009q525757J30522P588649M500445l520549n038284
6890a2513952N11255M060304J646508j460342j016392M87881K91857M08325K948683
6881d635873N600898N204520K199275j192994l965954n203186l378951N48003
6873d824262K475946N37628j631917j26538L269241L914841J118630j797335k997427
6864f1193l670399m455098m199141k773788j865563k057469j798797k46063J303789
$$ y = [11732209, 13316778, 14093734, 13524916, 12019332, 10195031, 8599279, 7905331, 8438316, 9400089, 9222801, 6948298, 3149259, -297766, -1209382, 1604046, 7450988, 14123737, 19145986, 20746368, 18636690, 14901444, 13036627, 13991053, 13893151, 8750142, 1152449, -2048081, 74641, -103969, -7648978, -16174735, -16044213, -8455564, -3955119, -7475668, -12513952, -12002697, -7942393, -6295885, -7756227, -8772619, -8284738, -7992881, -7584556, -4635873, 965025, 6169545, 8368820, 7175826, 3209872, -1993314, -5372265, -4824262, -2348316, -1810688, -3442605, -3569143, -299902, 3614939, 4733569, 2936234, -61193, -3731592, -8186690, -12385831, -15159619, -17025182, -19082651, -20881448, -21127511, -19823722]
6855a9823722J890119K398273L149000K342766q20744l208317r76713M629698
6847a0419640P633660M407587j711561m487425k148624J441684K651251K500589
6839a32479L766629N590576M107909j315172n643608m211974P01883K523048r11266
6830D475546m815852m528892j650768o09365j693645j375055J264838K616037
6822f317156J12427l597093m217956j450919J382638K163850J871083J925441
6814h127685K038233J455355P55135J088306K031272J356996k258861o408223
6806h069472o159725L82681Q272437R907000L811550l084054l587243J399296
6798B872470M993336L106942j948031n673303n784967k494809K226471M994494
$$ y = [-19823722, -17933603, -15535330, -12386330, -10043564, -10864308, -14072625, -15049338, -10419640, -2785980, 1621607, -89954, -4577379, -6726003, -5284319, -2633068, -132479, 3634150, 9224726, 13332635, 12017463, 6373855, 2161881, 2863764, 5386812, 4475546, -340306, -4869198, -6519966, -7129331, -8822976, -10198031, -8933193, -6317156, -6204729, -9801822, -14019778, -15470697, -14088059, -11924209, -10053126, -8127685, -6089452, -4634097, -3878962, -2790656, -759384, 597612, -1661249, -8069472, -14229197, -13846516, -5574079, 4332921, 8144471, 5060417, 1473174, 2872470, 7865806, 10972748, 9024717, 3351414, -2433553, -4928362, -2701891, 2292603]
6790B292603L538093k15283k096911j268186q02444k010876k126160L99219K271535
6781a8410M01029k582576k068141J378732L165141J850341M22265N10464O4407
6772C123252k107446l626786k330352L50862J848846J831221J203292j8768j815058
6763a540937l065062l297093l693788m480132l589032m72847J246227j171161
6755b0063825l646121L68534R554307J4356585R115918l09831m733791l490131
6747A151645k929698n553217p144344m813478j504593j83871J005947L925231
6739a6046378N197032J244729m002863k833833M936837J0347155O780036j782217
6731C840498o972034o748623n744676o787913o729193j682560O408864J0813141
$$ y = [2292603, 5830696, 5615413, 3518502, 2250316, 1447872, -563004, -2689164, -2289945, -18410, 382619, -2199957, -4268098, -2889366, 275775, 2126116, 2548381, 3058845, 3123252, 1015806, -2610980, -4941332, -4590470, -2741624, -910403, 292889, 274121, -1540937, -4605999, -7903092, -11596880, -16077012, -19666044, -20138891, -18892664, -20063825, -23709946, -23341412, -13787105, 569480, 9685398, 9375567, 4641776, 1151645, -1778053, -7331270, -14475614, -19289092, -20793685, -20977556, -19971609, -16046378, -10849346, -9604617, -13607480, -16441313, -11504476, -1157321, 5622715, 3840498, -3131536, -9880159, -15624835, -22412748, -29141941, -30824501, -24415637, -13602496]
6723a3602496P688442J308740k84146M696560Q722764M628247l823470o087902
6715C246739N76132O859280M380907k817097m871670k15309L515187J207765l697644
6706H184290n607860l667373l54073K502941L807826K401537j147802l751467
6698B368019k878644N71341L535428L817852J410129j669587k528990k17490K367375
6689F775433J554214j901719l450638j240478J231049M76007k115437l163421
6681a834990k465934k249084k861085k264440P41292M939223P805653O864934
6673H675569J433573n176807p132827k545796L041684K980446j721055l944971
6665d390184n45518L748573L866098J379371Q43886K377972K228018n49740k487614
$$ y = [-13602496, -5914054, -4605314, -4889460, -192900, 8529864, 13158111, 9334641, 3246739, 3822871, 10682151, 15063058, 12245961, 7374291, 7158982, 10674169, 11881934, 8184290, 2576430, -1090943, -1445016, 1057925, 4865751, 7267288, 6119486, 2368019, -510625, 60716, 3596144, 7413996, 8824125, 7154538, 4625548, 4408058, 6775433, 8329647, 6427928, 2977290, 1736812, 2967861, 3443868, 1328431, -1834990, -4300924, -6550008, -9411093, -11675533, -10934241, -5995018, 1810635, 8675569, 10109142, 4932335, -2200492, -4746288, -1704604, 1275842, -445213, -4390184, -4935702, -1187129, 2678969, 4058340, 4902226, 7280198, 9508216, 8958476, 6470862]
6656F470862j407404N3826j377326m469971n246161k615304N54808J721059J320818
6647d994793O32172n10547k536475m542779n389304m942822l026877Q76619N171949
6638a9262857N909009J969384j720349k50495L609674L091338j695881k961863
6630a1312040K983188R409198Q399641J402517m202174n188964l758467j621655
6622c888756J189927L080759K291063J018388K707671N423888L613253k917795
6614A2518398p546457o031838j880153j03074m20977J48420J944938L525960M834268
6605F989485O016200N449959K130868j958244m497746n631002n713069l276423
6597d89972J480829M257833K053440j415932p10959K617761K087976l257633o451948
$$ y = [6470862, 5063458, 5117284, 3739958, -730013, -5976174, -8591478, -8036670, -6315611, -4994793, -4362621, -4873168, -7409643, -11952422, -17341726, -22284548, -25311425, -24434806, -19262857, -13353848, -11384464, -13104813, -13355308, -9745634, -6654296, -8350177, -11312040, -8328852, 1080346, 9479987, 10882504, 6680330, 1491366, -2267101, -3888756, -2698829, 381930, 2672993, 3691381, 6399052, 11822940, 15436193, 12518398, 4971941, -1059897, -2940050, -3043124, -3464101, -3315681, -1370743, 2155217, 6989485, 13005685, 18455644, 20586512, 18628268, 14130522, 8499520, 2786451, -489972, 990857, 5248690, 7302130, 5886198, 5175239, 7793000, 9880976, 6623343, 171395]
6588A71395k260671N571017R298051O188639J22033l680535l463139j635126j745335
6579H566329m088774m882010j477287K929569L048628r00993l599087k540123
6571b943748m97756Q27913L789416Q626815R933234M159010l272724m102471J503787
6562A8023476N333236K150006m550118q174157o366801j692869K008222K658418
6554I389413R90952p22141j538403k542968l859740l200575M05232L690496L109700
6545E721966j20088k431075l441419m753893m936369j303854L729037M179641
6537c356054n27841l795719j111974M020695O004036M241133J081229k971634
6529C583871p777366j0373942p713457j122095N071344P865170O353052Q01824
$$ y = [171395, -2089276, 3481741, 12779792, 18968431, 19090464, 15409929, 11946790, 10311664, 8566329, 4477555, -404455, -1881742, 1047827, 4096455, 3195462, -403625, -2943748, -3441504, -2613591, 1175825, 9802640, 19735874, 23894884, 20622160, 16519689, 18023476, 23356712, 25506718, 20956600, 12782443, 6415642, 4722773, 6730995, 9389413, 10380365, 9658224, 8119821, 5576853, 1717113, -1483462, -1078230, 2612266, 5721966, 5601878, 3170803, -270616, -5024509, -9960878, -11264732, -7535695, -3356054, -3883895, -7679614, -8791588, -4770893, 1233143, 5474276, 6555505, 3583871, -4193495, -14567437, -22280894, -23402989, -18331645, -10466475, -4113423, -3311599]
6521c311599n943284q531679m323055K798228O805483O259400M007378K234807
6513d321J096276M97108j27531k157733m772958l957897J541933N932585L371341
6504A418803k723573l798240J182606M403559J397719k824412k703495m36354
6496d083387o21324j828571M07197N107415O623671L270869j10276P84183L920776
6487A3470553M128042P7385m030751l685332J93638K038696j266481n691608m949074
6478B85068O54905M089092J280275l243208l250773J40188Q24108k687401n265924
6469g173670l128492Q73362J888182m50710k942192l999207m686405n431453m854909
6460b9905494k303785R08005L701923O503521Q897541Q246906L372875j712061
$$ y = [-3311599, -9254883, -17786562, -22109617, -19311389, -12505906, -6246506, -2239128, -4321, 1091955, 1589063, 1461532, -696201, -5469159, -9427056, -7885123, -1952538, 1418803, -1304770, -5103010, -3920404, 483155, 1880874, -943538, -3647033, -4083387, -4704711, -6533282, -6126085, -1018670, 5605001, 8875870, 8765594, 9549777, 13470553, 17598595, 17675980, 13645229, 9959897, 10153535, 12192231, 10925750, 5234142, 285068, 939973, 5029065, 6309340, 3066132, -184641, -44453, 779655, -1907746, -7173670, -10302162, -9428800, -7540618, -7991328, -10933520, -14932727, -19619132, -25050585, -29905494, -32209279, -31301274, -27599351, -21095830, -12198289, -3951383, -578508, -2290569]
6452b290569j444394L681009O877449L945044j165549k460070n49460r24463n049752
6443F19245q067856n898630m35365L953745N741412N746471L937009j0763l828447
6434A756821l530546J675574O892149N790442k224947j0276865j0857995m087836
6426a4863203K694390L733503P62226r14896P18967L811923O328077O967081M255836
6417A3493904j406184n798374m859613k53982K495829R84588k386237m917881
6409b647950n774415m130101L54274N031391O389443M713801K627050r2446m826469
6400A644578q099263m449358L921474Q089495N103264J807673K754516K853577
6392A3625956k438043p582969n339981J285798L953562J746087N80104K639059
$$ y = [-2290569, -3734963, -53954, 6823495, 10768539, 9602990, 7142920, 6593460, 5668997, 619245, -7448611, -13347241, -13782606, -9828861, -4087449, 1659022, 5596031, 5585268, 1756821, -1773725, -98151, 6793998, 12584440, 10359493, 82628, -10775367, -14863203, -12168813, -8435310, -7673084, -8587980, -7869013, -4057090, 2270987, 9238068, 13493904, 12087720, 6289346, 1429733, 1175751, 3671580, 4656168, 2269931, -2647950, -8422365, -12552466, -12198192, -7166801, -777358, 3936443, 6563493, 6471047, 1644578, -6454685, -10904043, -6982569, 1106926, 6210190, 8017863, 10772379, 13625956, 11187913, 3604944, -1735037, -449239, 3504323, 5250410, 5830514, 8469573]
6384H469573M579727M542570L236539o58959q383304j4957009j3037187l626496
6376a9834546M112743M945271K951136L220622M466204K814872j674079n328077
6368d325854n107761j162619K754188J812761m043377q096404m800013J871921
6360b1097158L482238o06588k749961J003740N616937N566178K166379l42871
6352f961106n84534R04848L605981N339370L153228j639355l733261j445039O13360
6343g46508j064257l781985m016069k963993k893037k286035J013945N113972
6335a1623967O630974N425127L483025J592845q3094q53799j326897l230442n267922
6326e254150l208527L182307P791096O171373J465681j435592k750481m112713
$$ y = [8469573, 13049300, 17591870, 20828409, 20169450, 11786146, -3170863, -16208050, -19834546, -15721803, -10776532, -7825396, -4604774, -138570, 2676302, 1002223, -4325854, -9433615, -10596234, -7842046, -6029285, -10072662, -18169066, -22969079, -21097158, -17614920, -18221508, -20971469, -19967729, -14350792, -8784614, -6618235, -6961106, -7545640, -6640792, -3034811, 2304559, 5457787, 3818432, 85171, -1359868, -746508, -1810765, -5592750, -9608819, -12572812, -15465849, -17751884, -16737939, -11623967, -4992993, 432134, 3915159, 5508004, 5424910, 4571111, 3244214, 13772, -5254150, -8462677, -5280370, 2510726, 8682099, 10147780, 8712188, 5961707, 1848994]
6318A848994l127194K021089O499423M535228j418315m269422k973824k261035
6310H54944l148027j951396J082550N57287m477793p136329k630216M224818N878410
6301f745752K155325j193140j197716j49450n86472k080403l262657l821133l398158
6292b0279556q16949L719782O879593N250594N18873j124156L226799Q288028
6284E663008O997972L80723l875861k595487r18020l019705n198740k500161K702286
6275b363985M394173J945146l86227q34749j168031j613740o29776N15686j463014
6266a604517n754401p003600k477748L991800O736667M295340k81790l091820
6258e190069k630135o60208J44204k44301K65668J367192M8992l358985l597703
$$ y = [1848994, -1278200, 742889, 7242312, 11777540, 10359225, 6089803, 3115979, 854944, -2293083, -4244479, -3161929, -2604642, -7082435, -14218764, -16848980, -12624162, -6745752, -4590427, -5783567, -6981283, -7130733, -7717205, -9797608, -13060265, -16881398, -20279556, -21096505, -17376723, -10497130, -5246536, -4727663, -5851819, -2625020, 5663008, 12660980, 13041703, 9165842, 6570355, 5652335, 2632630, -2566110, -5066271, -2363985, 2030188, 3975334, 3589107, 2754358, 1586327, -27413, -657189, -141503, -1604517, -7358918, -14362518, -16840266, -12848466, -6111799, -1816459, -2098249, -5190069, -7820204, -8480412, -8336208, -8580509, -8314841, -6947649, -6898657, -10257642, -13855345]
6249a3855345J421766N901189M730388J769804K618865L874213j027456q310466
6241b877042p419073K004541P905809L126685n010924o468543j339697L856682
6233f221562N625196M217184O22999k683333k736488q51209j151047k462186R52336
6224d688110P857039Q460046l87826p715725l945734M266382M416589l001303
6216E261358p122366m161959o85100q92354j534967j12655J306871K026230M330226
6207a584716P285784O323071J284032j852367j6266K212534R1676m214392n623327
6198C906029l259237j55091J396750J371143P64167O17006P91306p19196n033177
6189c20300r061400q204867k722209K132105L045435K089242K196944K993200
$$ y = [-13855345, -12433579, -6532390, -1802002, -32198, 2586667, 6460880, 5433424, -2877042, -10296115, -8291574, -385765, 2740920, -2270004, -8738547, -10078244, -6221562, -596366, 3620818, 4243817, 1560484, -1176004, -2027213, -3178260, -5640446, -4688110, 3168929, 11628975, 11241149, 3525424, -420310, 3846072, 8262661, 5261358, -1861008, -6022967, -6708067, -7600421, -9135388, -9248043, -7941172, -5914942, -1584716, 5701068, 12024139, 13308171, 11455804, 11439538, 13652072, 13743748, 9529356, 3906029, 646792, 491701, 1888451, 3259594, 4023761, 4640767, 5432073, 4712877, -320300, -9381700, -17586567, -20308776, -18176671, -15131236, -13041994, -10845050, -7851850]
6181g851850K903733K155337J570620Q86995O7761K0515M57366o64249l856725
6172d310497o258042m893744m62508L485852M207411J960364m01139J65145L724997
6163b782161O818115O274969K729695j125947l958432m981621k251162L867921
6155D591377P419594K881750n944899r324622m614151M86786n55825m921605o732782
6146a6714377n162182k030329K822521Q320502R275052L182393l705452l904822
6138g916694K79053M61111m576918p218589l114930K643307M090884K820310L662780
6129h869686O359925O614154L398754M12432K08234N73256j738159n762561p029496
6120e833147l251842K556011N608252M717810K439009P05170r69236k638270k344379
$$ y = [-7851850, -4948117, -2792780, -1222160, -335165, -267404, -246889, 210477, -453772, -4310497, -10568539, -15462283, -15924791, -12438939, -8231528, -6271164, -6672303, -6507158, -2782161, 4035954, 10310923, 13040618, 11914671, 7956239, 2974618, 723456, 4591377, 12010971, 14892721, 8947822, -376800, -4990951, -4504165, -5059990, -9981595, -16714377, -21876559, -23906888, -21084367, -12763865, -3488813, -306420, -4011872, -7916694, -7637641, -7176530, -11753448, -18972037, -22086967, -19443660, -15352776, -12532466, -8869686, -2509761, 4104393, 7503147, 7915579, 8123813, 8697069, 6958910, 1196349, -5833147, -9084989, -6528978, -920726, 3797084, 6236093, 6941263, 5972027, 3333757, 989378]
6111I89378Q61920M520205N459403L414822K98658k381962l585014k323383L51817
6102G605844R04889k201253n266175l989051N9891J606722m44402j801110K24926
6093c299719K994049L215769J391479n68777k756647n348109n784942j502265
6085a1659162N429486R612079Q458327M591515J578432l83386k904033n199129
6077I524129m377528k62155K908812J632229j991497l512422k823486l356500
6069b258418m954018l169694K460359N333718J252626l935117k243773M299970
6061c214347O666034K393291j655901m78511K798508L992878M261325N717031
6053B0480308O212790K979762k376386o446284q310965p923378l963206K619630
$$ y = [989378, 1851298, 6371503, 11830906, 15245728, 15544386, 13162424, 9577410, 7254027, 7605844, 8510733, 6309480, 1043305, -2945746, -2885855, -1279133, -1723535, -3524645, -3299719, -305670, 2910099, 4301578, 3732801, 976154, -4371955, -10156897, -11659162, -6229676, 3382403, 11840730, 16432245, 18010677, 17627291, 14723258, 9524129, 5146601, 4884446, 7793258, 9425487, 7433990, 3921568, 1098082, -2258418, -7212436, -10382130, -7921771, -2588053, -1335427, -5270544, -7514317, -3214347, 3451687, 5844978, 4189077, 3710566, 6509074, 10501952, 14763277, 20480308, 26693098, 29672860, 27296474, 20850190, 12539225, 4615847, 652641, 3272271]
6045C272271O399501L701629j411049k237152J349770L666906J758814j947788
6037A4552902m767805o287563n632725j319937M921310Q376876O958113L211881
6029B0013052l86887m322480q383557r047814l986239L109374N983594L431480
6021F410523K28313K16519J483898J25562l251872l951220k78044L034979R17024
6012D935682m597044o781150l523762J99063J74522j278499q9022K891113L923185
6003d145912K522920J408038J833020K711433L230066L073289J432648j100518
5995A0964984j658101L62644N12830m307186r355781p977210j984205R74155o66265
5986a3134135j082062K091542M090492K001885p58618j683820k908297m347398
$$ y = [3272271, 9671772, 13373401, 11962352, 9725200, 11074970, 14741876, 16500690, 14552902, 9785097, 3497534, -2135191, -3455128, 1466182, 9843058, 16801171, 20013052, 19626165, 15303685, 6920128, -2127686, -6113925, -3004551, 2979043, 6410523, 6638836, 6855355, 8339253, 8464815, 5212943, 1261723, 983679, 4018658, 4935682, 338638, -6442512, -9966274, -9767211, -9592689, -10871188, -10960210, -8069097, -4145912, -1622992, -214954, 1618066, 4329499, 7559565, 10632854, 12065502, 10964984, 9306883, 9669527, 10182357, 5875171, -3480610, -11457820, -13442025, -12467870, -13134135, -14216197, -12124655, -8034163, -6032278, -6790896, -8474716, -11383013, -15730411]
5978a5730411j445502N609716Q769623M183205p22243N43996K339779k681456
5970H66707r118538o718204J840340M151763k463875p581783m614905R49390K996796
5961a9692309L313705M196937K352560l827963q493191n969812J518112Q703366
5953a7898595J4108014J7196721J4822855O541013j561207m503680n518049r378369
5945A3808703j3040470j0276906k583451K300290J351765j342192k427774k667498
5937a4877533k389319j59161K779615K444257j641110m709298l092432J532920
5929b0112061N754501Q486743R587255P895633L186395k043521m739049l985984
5921D029912q29578K748418M096781J481779l388496o235682m798184j262011
$$ y = [-15730411, -17175913, -11566197, -2796574, 1386631, 664388, 1208384, 3548163, 866707, -8251831, -14970035, -13129695, -8977932, -11441807, -19023590, -23638495, -22689105, -19692309, -16378604, -12181667, -9829107, -13657070, -22150261, -28120073, -26601961, -17898595, -3790581, 13406140, 28228995, 34770008, 33208801, 28705121, 23187072, 13808703, 768233, -9508673, -12092124, -9791834, -8440069, -9782261, -12210035, -14877533, -17266852, -17426013, -14646398, -12202141, -13843251, -18552549, -21644981, -20112061, -14357560, -5870817, 3716438, 11612071, 14798466, 12754945, 8015896, 4029912, 3200334, 5948752, 10045533, 11527312, 8138816, 1903134, -2895050, -4157061]
5913d157061O29753l71771k482373l313481k255893q14897l27029N71747M225104
5904h295901Q845578Q447615R30243o813902o646735q5311M239405K953274R59914
5895D534180J665099J879103o22245j672608J957989N348247K040756n495467
5887I635054q652240m405825J732973M022164K361143m32040k390708k426122
5879e55601n45924P15916j622015o306327q281000n132887l29355J555563L44358
5870b0157272r77011r44806n39284l46866O86537L205789N625949N445819K205673
5861e795472j676558l510455l158335k228313j030017J619579N317396P300780
5853c161395N923445K619533q72481m325567o135301k523392O299682J2432527
$$ y = [-4157061, -3527308, -3899079, -6381452, -9694933, -11950826, -12765723, -13092752, -12521005, -8295901, 549677, 8997292, 9927535, 3113633, -3533102, -3618413, 620992, 3574266, 4534180, 6199279, 8078382, 7456137, 5783529, 7741518, 13089765, 15130521, 9635054, 982814, -3423011, -1690038, 2332126, 4693269, 4261229, 1870521, -555601, -1101525, -385609, -2007624, -8313951, -16594951, -21727838, -22057193, -20501630, -20157272, -21134283, -22079089, -22618373, -22965239, -22278702, -19072913, -13446964, -8001145, -5795472, -7472030, -10982485, -14140820, -16369133, -17399150, -15779571, -10462175, -3161395, 2762050, 5381583, 4509102, 183535, -5951766, -8475158, -2175476, 10257051]
5845A0257051Q571536j516440p014355m112608O31486J643233J470045L547800
5837A3477748M906410J532898l865983n542284l263493j624596k654661m140031
5829a173992m128846k719761l73369J797046J556445q70655r76712L637064P510203
5820D257423M028476l868169o945360l216049j82811k235092m144069p33172M304923
5811h733900M536500K61651l609241m814803l542215J025309Q047629J2094759
5803E265689R138542L290867J467362L209349K424417j941271m434384k815961
5795A5604610j868599n011071q285529o466573p87219L371068L627914J967562
5787B152163Q79591J046084J696912J275597j156170l963243m015809r39916J618853
$$ y = [10257051, 18828587, 17312147, 10297792, 6185184, 6816670, 8459903, 9929948, 13477748, 18384158, 19917056, 16051073, 10508789, 7245296, 5620700, 2966039, -1173992, -5302838, -8022599, -8395968, -6598922, -5042477, -5913132, -6889844, -3252780, 4257423, 8285899, 4417730, -2527630, -5743679, -5926490, -8161582, -12305651, -13038823, -8733900, -4197400, -3935749, -7544990, -12359793, -15902008, -14876699, -6829070, 5265689, 14404231, 17695098, 19162460, 22371809, 24796226, 22854955, 18420571, 15604610, 13736011, 8724940, 439411, -6027162, -6814381, -3443313, 184601, 2152163, 3031754, 4077838, 5774750, 7050347, 5894177, 1930934, -2084875, -3024791, -1405938]
5778a405938N47139k607868l801539j558225J730239K857219J065475j342564
5770d516062j441160P24287J807979r0343j832138N16311M927293N432834J080431
5761F609432k413003j673646q38864m127313q013784o189665M16499M335186J602482
5752a0292676l693672n307883j621944M196705Q064192Q074917N374627K564030
5744G358296Q13974o05268j597670m90005K357149L043057p04789n139497n130582
5735i5335j627143j06173k268761m043154k453638J602k51887k377239k539268
5726a5760996R05437N637099Q052554O554128K569687j099200k899387l228807
5718G30515k781191j757129j140727k381400m410214l663618O30896M043066L078955
$$ y = [-1405938, -858799, -3466667, -7268206, -8826431, -7096192, -4238973, -3173498, -4516062, -5957222, -5232935, -3424956, -3515299, -5347437, -4831126, 96167, 5529001, 6609432, 4196429, 2522783, 1683919, -2443394, -10457178, -16646843, -16230344, -11895158, -10292676, -13986348, -19294231, -20916175, -16719470, -8655278, -580361, 4794266, 7358296, 8172270, 7567002, 5969332, 5479327, 7836476, 10879533, 10174744, 5035247, -95335, -1722478, -1828651, -4097412, -8140566, -10594204, -10592602, -10844489, -13221728, -15760996, -14855559, -9218460, -1165906, 5388222, 7957909, 6858709, 3959322, 730515, -2050676, -3807805, -4948532, -7329932, -11740146, -15403764, -14772868, -10729802, -7650847]
5709g650847R02612K432465O054644O024927K064218m9715J851513K665504j466512
5700A2828809o561715o444426j082275M425092O331728M376160j51789n042545
5692H679039p371719n968009k797568j24599K175822M744737O161750M617484
5684A0116937Q23948k845040m983222n247240l369122q7478K310724K525896K211172
5675A456575L358156M887730M229343J469540p52251j350320k111985m157143
5667G029645n385628l283823Q71348K955349J388501p97341r63950j631694o329794
5658f147387j1522688q603120L623171J4150074J2705598L356890j615934J156421
5650G103025L410975n90735n986782o065935j719955J991820L116965K364738
$$ y = [-7650847, -6748235, -4315770, 1738874, 7763801, 9828019, 9778304, 11629817, 14295321, 12828809, 6267094, -177332, -1259607, 3165485, 9497213, 13873373, 13721584, 8679039, 1307320, -4660689, -7458257, -7582856, -5407034, -662297, 5499453, 10116937, 10940885, 8095845, 3112623, -2134617, -5503739, -5591217, -3280493, -754597, 1456575, 4814731, 9702461, 13931804, 15401344, 14649093, 13298773, 11186788, 7029645, 1644017, -1639806, -768458, 2186891, 3575392, 2778051, 1814101, 182407, -6147387, -17670075, -26273195, -22650024, -8499950, 4205648, 7562538, 5946604, 7103025, 10514000, 9923265, 3936483, -2129452, -3849407, -1857587, 1259378, 3624116]
5642C624116k0532k715216k527568Q81016L016218R01001k324347k832191k061960
5633d059463k919186m005314k733859q48949j400607k913509j989750O09481J887707
5624a8373449K393805M365470N986670L654686j067589k788296k07162K752780
5616c283085L398992K624501J210630r64847k339365j389297k84176j508869k188584
5607d724100J596187O096193L954908k889437m216964K076185M959264k859214
5599C993022j2482703j1542231k164215L792406K869967K286307N578059P223833
5591d45555L612629l76825k59712L00904l235696o882032l560313M833781Q662304
5582B649485L838852l106327n034511l028870j812101j691476j97275J916825
$$ y = [3624116, 3603584, 888368, -1639200, -758184, 2258034, 3159035, 834688, -1997503, -4059463, -6978649, -10983963, -13717822, -14566771, -15967378, -18880887, -20870637, -20261156, -18373449, -15979644, -11614174, -5627504, -1972818, -3040407, -5828703, -6035865, -3283085, 115907, 2740408, 3951038, 2986191, 646826, -742471, -1026647, -2535516, -4724100, -3127913, 2968280, 6923188, 4033751, -183213, 1892972, 6852236, 3993022, -8489681, -20031912, -22196127, -18403721, -15533754, -13247447, -7669388, -445555, 3167074, 2790249, 2530537, 2831441, -404255, -7286287, -10846600, -6012819, 2649485, 6488337, 3382010, -1652501, -4681371, -6493472, -8184948, -8382223, -6465398]
5574f465398K226482K010037L932775N678928K651223l228610m839332j105552
5566H60553Q93828k307656m743569j410610L241141L383134J417337J965816K434695
5557E734669j359583n098854j943873M546504M664661j518749l877118J543144
5549B690801P217839P267602N114593M358533K234742k545771m559582q27877
5541B0950880K362972j084022o948888p327218k480186J222495J351112K42770
5533H289915j312684m107380n900432l325955K067081M983906L412298K62625
5525D369374j508638j465259K05479L353415O303198O427373K990986j710264
5517A8965664m036501j985436K094867K547274k845275q078920n746730J713901
$$ y = [-6465398, -4238916, -2228879, 1703896, 7382824, 10034047, 6805437, 1966105, 860553, 1754381, -553275, -5296844, -6707454, -3466313, -83179, 1334158, 3299974, 5734669, 4375086, -723768, -2667641, 1878863, 6543524, 5024775, 1147657, 2690801, 9908640, 17176242, 22290835, 26649368, 28884110, 26338339, 21778757, 20950880, 23313852, 22229830, 15280942, 7953724, 5473538, 6696033, 8047145, 8289915, 6977231, 2869851, -3030581, -6356536, -4289455, 694451, 4106749, 4369374, 2860736, 1395477, 1600956, 4954371, 11257569, 17684942, 20675928, 18965664, 14929163, 12943727, 15038594, 17585868, 14740593, 6661673, 914943, 2628844]
5509B628844M341202o00611m366771q03546L910645J984611l057944k807453K083483
5500C312460M026841J405859l05057R37081J164747j403476l502267l203425k508680
5491g5917k484531j656033j72738j97648j357295q00899J621048K925448J994646
5482b03919N66583l82929o39691J650595O748009R102720L446683n514944p561305
5473G211802j708921K135881j601847o153487l789542K711209N763603L972973
5465H541671J100230j300633l663622l982629l7836N341524O535794K243867l409270
5456A1369096o218426n279584j943085J613079L199617K242922K93916j128815
5448D148720j907159j753688K97545L214024L324872j239511p280052r908181
$$ y = [2628844, 6970046, 6369435, 2002664, 1199118, 5109763, 7094374, 4036430, 1228977, 3312460, 7339301, 8745160, 8440103, 9377184, 10541931, 9138455, 5636188, 2432763, -75917, -2560448, -4216481, -4389219, -4586867, -5944162, -6745061, -5124013, -2198565, -203919, 362664, -20265, -659956, 990639, 7738648, 16841368, 20288051, 14773107, 7211802, 5502881, 7638762, 6036915, -116572, -3906114, -1194905, 4568698, 8541671, 9641901, 8341268, 4677646, 695017, 657181, 5998705, 12534499, 14778366, 11369096, 5150670, -128914, -2071999, -458920, 2740697, 4983619, 5277535, 4148720, 2241561, 487873, 785418, 3999442, 7324314, 6084803, -1195249, -11103430]
5440a1103430p699366k781580K239527N370402N150420K037991j107742j805871
5432i699649m12759J203453J915192J231681j063511l741646m421237k364525
5424a7353001P59735L624783O122372O697384K748079m013733o655098j413577
5416i483056N985457P069287J745044k446052j397634R02136k5570k051478m07539
5407a09405M218807N984273K081322l101055l844575p20999R79004k48839K69608
5398E508141N180225Q804410M082961o264406j1810765q052587j756299l66346
5390d674666j937456k19971M444021N630807J165861k879950k55949O818591R767480
5381A7858768L752960o249931j0686381o356016J26211J242991j764745k051721
$$ y = [-11103430, -18802796, -21584376, -19344849, -13974447, -8824027, -6786036, -7893778, -9699649, -10112408, -8908955, -6993763, -5762082, -6825593, -10567239, -14988476, -17353001, -16593266, -12968483, -6846111, -148727, 2599352, -1414381, -8069479, -9483056, -3497599, 3571688, 5316732, 2870680, 1473046, 2375182, 2349612, 298134, -109405, 4109402, 10093675, 12174997, 9073942, 5229367, 4508368, 5487372, 5238533, 5508141, 10688366, 19492776, 23575737, 17311331, 5500566, -2552021, -4308320, -4674666, -6612122, -6832093, -2388072, 3242735, 4408596, 1528646, 1272697, 8091288, 17858768, 21611728, 15361797, 4675416, -1680600, -1554389, -311398, -2076143, -4127864]
5373d127864J695274L221116j259436o874371o956990j578968M189208O688024
5365e004007M814205j326986q452156r999983l162087N884073Q487014L833279
5357d926648j549162k931814j174729J452075L851767M413892J637192k599908
5349a827335m209515k183231M96291J563227J650144J381127O0263j647261j182579
5340e898869K064294M994410M575706J514643j132269j529087l46910L08424j157161
5331C393181l896434m940201k858550l42526j040001m465799o551164m855834
5323b5557328o52390L710141O530556O172719K315565j821680k014516J333659
5315i983274L383357J640195j014823j552894j266427k437867l787435k745888
$$ y = [-4127864, -2432590, 788526, -470910, -7345281, -14302271, -15881239, -11692031, -5004007, -189802, -1516788, -9968944, -19968927, -23131014, -17246941, -8759927, -4926648, -6475810, -9407624, -10582353, -9130278, -5278511, -864619, 772573, -1827335, -6036850, -8220081, -7723790, -6160563, -4510419, -3129292, -3069029, -4716290, -5898869, -3834575, 1159835, 5735541, 7250184, 6117915, 4588828, 4241918, 4550342, 3393181, -503253, -5443454, -8302004, -8644530, -9684531, -14150330, -20701494, -25557328, -26209718, -22499577, -15969021, -9796302, -7480737, -9302417, -11316933, -9983274, -6599917, -4959722, -5974545, -7527439, -8793866, -11231733, -15019168, -17765056]
5307a7765056j91902Q02062k4941P4331K098318L585814K605792R49010J596329
5298f270243M340917N863541L957501P0577k836002l616353l044456j730504J00279
5289c164743J146103j23301k543616k701055L63702L304185L195119J672824J701354
5280B850572K456615J055261k088503l782093l340055l032404l075560p12606
5272i668773M345176P661355N636019L35381l661690m790620m313960k695436
5264g152548O27678M560350O297296M521208J123712j007967j379221k352564
5256E237944n735990r286323q404394k382517L113627K441843k480851m560655
5248b2057316j015766L583054M508190L017812L178469N618912P145492N016352
$$ y = [-17765056, -17956958, -17154896, -17179837, -17105506, -15007188, -11421374, -8815582, -7866572, -6270243, -1929326, 3934215, 7891716, 7962293, 5126291, 1509938, -1534518, -3265022, -3164743, -2018640, -2141941, -4685557, -7386612, -7022910, -3718725, -523606, 1149218, 2850572, 5307187, 6362448, 4273945, 491852, -2848203, -5880607, -8956167, -9668773, -5323597, 2337758, 7973777, 8309158, 4647468, -143152, -4457112, -7152548, -6524870, -1964520, 4332776, 8853984, 9977696, 8969729, 7590508, 5237944, -498046, -9784369, -18188763, -20571280, -17457653, -15015810, -17496661, -22057316, -23073082, -19490028, -14981838, -11964026, -8785557, -3166645, 3978847, 8995199]
5240H995199j72683m712348m424308P75795M862043J744936n945561q715173k885728
5231a0477828L729406K707637l258933n299161j508780J935849J241470q98561
5223a1828901j980677l243039m550345k284429M123967Q782206O796255J380980
5215b803983q05408J561215M767351O588631P445909O446112J712260m973900
5207A9938187q424937o322909k076948k67257j866406m875491p069472o953258
5199a7918491m216825l89235K557906M460224N769605M772783j92560n607858
5191a0764451m997711J732754O404464L601987j253091l3836N889682Q265640
5183H845438M445256j59827j595168j886371k893004k694674q27515j069155n189840
$$ y = [8995199, 8822516, 4110168, -314140, 461655, 5323698, 7068634, 1123073, -7592100, -10477828, -6748422, -4040785, -7299718, -12598879, -14107659, -12171810, -10930340, -11828901, -13809578, -17052617, -21602962, -23887391, -19763424, -10981218, -4184963, -2803983, -3609391, -2048176, 2719175, 9307806, 16753715, 23199827, 24912087, 19938187, 11513250, 5190341, 3113393, 2846136, 979730, -3895761, -10965233, -17918491, -22135316, -22524551, -19966645, -15506421, -9736816, -4964033, -5156593, -10764451, -15762162, -14029408, -7624944, -4022957, -5276048, -5309884, 579798, 8845438, 13290694, 13130867, 11535699, 9649328, 6756324, 4061650, 3234135, 2164980, -3024860]
5174c024860q553603o027679J009290P036578Q920132P106328L247700l08644
5166I405242j332268p57930k163047n839839p015618k972941K087447L198045
5158e390909J683021J360813J472270p89856l568752k571890J667227M816912
5150a321164N614485N567505L296344l523920j0852376j0813133l192284K737968
5142a2486575P17711m401905m736360l20307K614596R51749k188038k214007K008096
5133b0055040P264003Q707061M637970r99214k657351L11799L445711L026256
5125C681195o96534n389228q123053n830208J151575O548731M560544j343447
5117e440425k310512K737388N319991Q50163m190809k843480J876650L126065
$$ y = [-3024860, -11578463, -17606142, -16596852, -9560274, -640142, 6466186, 9713886, 9405242, 8072974, 7315044, 5151997, -687842, -7703460, -10676401, -8588954, -5390909, -3707888, -2347075, -874805, -1664661, -5233413, -7805303, -6138076, -1321164, 4293321, 9860826, 13157170, 9633250, -1219126, -12032259, -15224543, -12486575, -11768864, -16170769, -20907129, -21227436, -18612840, -17661091, -19849129, -22063136, -20055040, -12791037, -4083976, 553994, -445220, -3102571, -2790772, 654939, 3681195, 2984661, -2404567, -10527620, -16357828, -15206253, -8657522, -4096978, -5440425, -7750937, -5013549, 306442, 1156605, -3034204, -5877684, -4001034, -874969]
5109h74969R08346l66720n24595k257550l918849j312649M314148O843390L973176
5100F783728k81407k181481k309761k175315j360174J95115L74560k502392o803592
5091a0260719q711171n839503M33121O067715Q171766P298492M980815P44404
5083B884920n198435q179151m051377K281622J209851o683257r220626j100317
5075b8056770N913715K23731j0299438q825870N049994J4601927J0380729J487654
5067i524328q33117J651121J840635J61007J130436L355840J677669l669145p116205
5058a1326087n632562j313798K759973M972426M477839J718270j076580k520920
5050g941439l854391n754868n632065j464908L512888M016712j02265l607762
$$ y = [-874969, 33377, -333343, -857938, -3115488, -7034337, -8346986, -4032838, 2810552, 6783728, 6502321, 4320840, 2011079, -164236, -1524410, -1329295, -954735, -3457127, -10260719, -18971890, -24811393, -24378272, -18310557, -10138791, -2840299, 2140516, 2884920, -2313515, -10492666, -14544043, -12262421, -11052570, -17735827, -26956453, -28056770, -22143055, -21919324, -32218762, -41044632, -35994638, -21392711, -11011982, -9524328, -10357445, -8706324, -6865689, -6704682, -5574246, -2218406, -540737, -4209882, -11326087, -16958649, -18272447, -15512474, -10540048, -6062209, -4343939, -5420519, -7941439, -11795830, -17550698, -23182763, -24647671, -21134783, -17118071, -17220336, -20828098]
5042b0828098k807636N28175K610718K150736M92185o34638k60700J685062M255616
5033a2808580N857391N375735L235912J481622K119098M266730L696254k324247
5025A0899915r642439j0169296k000214O746994P360659J133642l518393k433588
5017a622720J090035L601926N580252O767825L797732l630429r062312o940062
5009d17753p53331J928548K42688m41922J298388N42845m798103r179014p308407
5000a8886061j823587J059926n5951j774240j484122R71557M822694P881229O777067
4991b511488J294905l731773m262923k104219o07768R38588L760382M480595K77012
4982b466689m010058j856160L896060M622912m62869l614695j577135N81226J641
$$ y = [-20828098, -23635734, -23107559, -20496841, -18346105, -17853920, -18488558, -18749258, -17064196, -12808580, -6951189, -1575454, 1660458, 3142080, 5261178, 9527908, 13224162, 10899915, 1257476, -8911820, -10912034, -4165040, 3195619, 4329261, 810868, -1622720, -532685, 3069241, 8649493, 15417318, 19215050, 15584621, 6522309, -417753, -1171084, 757464, 1000152, 558230, 1856618, 2399463, -2398640, -11577654, -18886061, -20709648, -19649722, -19705673, -21479913, -22964035, -21992478, -17169784, -9288555, -2511488, -1216583, -4948356, -9211279, -11315498, -11923266, -10984678, -7224296, -2743701, -2466689, -6476747, -8332907, -4436847, 186065, -276804, -3891499, -5468634, -4887408, -4885767]
4973d885767R7994J432207q26659o171538o336991N35247M229912j038279n047997
4964a8011871K585000J3717688J2292155j538115j1844162r628789k021638J752158
4956a2697574J610247R86218j07168k024164k478500n85452R76630N22026j68983
4947a3966720K35646L75339m39188l71948J672304L750335L172279o93523o010744
4938a2276220r318433p755818k217232L142434N862500P006355O930036L907611
4930d718767n46186q11163M091400O784148K125496m339431n217679k781519l588143
4921i001844o714626o471855k853637j4416K207098N911969P696577L399430k737423
4912h578727l637375j067535j338808k672354J349457Q114359Q259543O41443
$$ y = [-4885767, -4787773, -3355566, -4182225, -10353763, -16690754, -16155507, -11925595, -12963874, -18011871, -15426871, -1709183, 10582972, 9044857, -2799305, -12428094, -14449732, -12697574, -11087327, -10101109, -10208277, -12232441, -14710941, -15296393, -14319763, -13797737, -13966720, -13731074, -13355735, -13794923, -14166871, -12494567, -8744232, -5571953, -6265476, -12276220, -21594653, -29350471, -31567703, -28425269, -22562769, -15556414, -8626378, -4718767, -5264953, -6076116, -1984716, 4799432, 6924928, 2585497, -2632182, -5413701, -9001844, -15716470, -22188325, -25041962, -25056378, -22849280, -16937311, -9240734, -5841304, -8578727, -12216102, -13283637, -14622445, -17294799, -15945342, -7830983, 428560, 1070003]
4904A070003o721692r710933j0654550r339567l560919K633666L185280P29491
4896c2369221J394113K636268n67847k817719K476829P067326J72649r387657
4888c1395259o067628L132540o59365j2318104r394622O018405Q017725o945178
4880d9611486j3860004o800549r463035k5509312k7520896j5777704l0567424
4873a79110410o9231223n2529230O2813550J85293487J84918727O6570323l7611487
4866A61113737m5412737p985049r73528j8196721j6712164o34193j192273j3751580
4858E6255492j1131659L317257M418453p504015j0164230j099666J393270n916289
4850B9568613p402014J218982P247422N235005K571514J266487l945259r787955
$$ y = [1070003, -5651689, -15362622, -26017172, -35356739, -38917658, -36283992, -33098712, -32369221, -30975108, -28338840, -28906687, -31724406, -29247577, -22180251, -22007602, -31395259, -37462887, -34330347, -34989712, -47307816, -56702438, -50684033, -42666308, -49611486, -63471490, -70272039, -79735074, -105244386, -132765282, -148542986, -179110410, -248341633, -300870863, -238057313, -52763826, 132154901, 198725224, 161113737, 115701000, 107715951, 106742423, 88545702, 71833538, 71199345, 70007072, 56255492, 45123833, 48441090, 52859543, 45355528, 35191298, 34091632, 35484902, 29568613, 22166599, 23385581, 30633003, 35868008, 38439522, 39706009, 35760750, 25972795]
4842B5972795p144699P16429J697279l744863l398264M468662Q202286L484929
4834C0254554p83853m4881r09262o388958r216637m956932P46562K702160L058830
4825A4461583L818813K609880n40992j478402J18624k80444l017604k982197P77473
4816A3486734L041553J762129N27260J40058k821308o979860n531463K085803
4808E710906P050030L724950k605551m489052j541251K643090N870927O245994
4800B2610043K347604k370441j922966K798828M033687p84531m939254l965166
4792A7807804k723968n645666p910065l481058M176658P068609M241623J285761
4784A4819698J087796J480342M25683j666933l635419l913146j086640K847737
$$ y = [25972795, 18828096, 19544525, 21241804, 17496941, 14098677, 18567339, 26769625, 30254554, 29470701, 29425820, 28516558, 22127600, 12910963, 7954031, 8700593, 11402753, 14461583, 18280396, 20890276, 20349284, 18870882, 18989506, 18709062, 15691458, 12709261, 13486734, 16528287, 18290416, 18817676, 18957734, 16136426, 9156566, 3625103, 5710906, 12760936, 16485886, 13880335, 9391283, 7850032, 10493122, 16364049, 22610043, 24957647, 22587206, 20664240, 23463068, 27496755, 26712224, 21772970, 17807804, 15083836, 9438170, 1528105, -1952953, 2223705, 9292314, 13533937, 14819698, 15907494, 17387836, 17813519, 16146586, 12511167, 8598021, 7511381, 10359118]
4776A0359118K729627k751140p611509o327404j740678l00274k318504k743014
4768a0703778K44659L544947N361207P054407Q311035O155074N07101l997916
4760A6476736m185037k644010l154135m817696m033864l88186K977904M156384
4752D388096M221865L922756J960437j804589m125872k250132J332589J451556
4744I096706k470913n269639l378162R7267K42719k368192k950100J51693L358840
4735c489781L265126O79106j716276k854488k908848j747949J76358Q58142j103177
4726h841787l935889m419612k361324j259604l232458n017229j842340M918579
4718b5991664P710213K591870m191009l697702L447873P917533M927407K94286
$$ y = [10359118, 13088745, 10337605, 2726096, -3601308, -5341986, -5642260, -7960764, -10703778, -10459119, -6914172, -1552965, 5501442, 13812477, 19967551, 20474652, 16476736, 12291699, 9647689, 6493554, 1675858, -2358006, -2746192, 231712, 4388096, 8609961, 12532717, 14493154, 12688565, 8562693, 6312561, 7645150, 9096706, 6625793, 1356154, -2022008, -1924741, -1682022, -4050214, -7000314, -6848621, -3489781, -224655, 454451, -1261825, -4116313, -7025161, -8773110, -8596752, -7738610, -8841787, -12777676, -17197288, -19558612, -20818216, -24050674, -29067903, -30910243, -25991664, -18281451, -15689581, -19880590, -23578292, -20130419, -12212886, -7285479, -6991193]
4710f991193P12684L935301L636350r2372j477796J395973M064378L120124R48092
4701I251541J225680L424432M246463K474515J08773o27219J99585Q69719K44319
4692B1417808j459947l826036o452522p259855l236501M348458Q086761K784129
4684A4402295n700850o501380J075993N937222J094961o685607p727864k674395
4676f779625J624825L397813N112803N620107J978734k801034k170210L927886
4668I911299Q255851N985955j37482m566595m604491j661417j65027l553710q532895
4659I31488p110026J826410Q520830N874565N54745J908995N924720K111566p592486
4650A2950807j0686158m023033K192709J920435J076339M043958N292156L65728
$$ y = [-6991193, -6278509, -2343208, 1293142, 1200770, -277026, 1118947, 5183325, 8303449, 9251541, 10477221, 13901653, 18148116, 20622631, 20731404, 20104185, 20303770, 21173489, 21417808, 19957861, 16131825, 9679303, 2419448, -817053, 3531405, 11618166, 14402295, 8701445, 2200065, 3276058, 9213280, 10308241, 3622634, -4105230, -6779625, -5154800, -1756987, 3355816, 8975923, 10954657, 8153623, 5983413, 9911299, 18167150, 24153105, 24015623, 19449028, 14844537, 13183120, 13018093, 9464383, 931488, -6178538, -4352128, 4168702, 10043267, 10598012, 12507007, 18431727, 20543293, 12950807, 2264649, -1758384, 434325, 2354760, 3431099, 7475057, 12767213, 13132941]
4642A3132941n623870o926433n319788l483120O31365O618910P921424K344046
4634I295475k179051K16582L523498M94893m651764l715527J510079K857617r28859
4625F422943m127918m225676l452932k529667p23040J04328j256291o71664N306648
4616e153269J1209347Q474172j847008r782789r256656l483912J906737M617336
4608c316042M333304J260722k990571o322749p612217n567288P13157P580342
4600a1921342Q245627K340017j794162L89001J874895l589096q834244l852444
4592a7141748O606600R240623L169336N84687O363527J1064207P256303J50492
4584B7294027l059209l612619m857452m576484m66062L541995K798148j307816
$$ y = [13132941, 7509071, 582638, -4737150, -8220270, -7588905, -969995, 6951429, 9295475, 7116424, 7333006, 10856504, 11351397, 6699633, 2984106, 4494185, 7351802, 6422943, 2295025, -1930651, -5383583, -7913250, -8636290, -8531962, -9788253, -10459917, -5153269, 6056078, 14530250, 12683242, 2900453, -6356203, -9840115, -7933378, -3316042, 1017262, 2277984, -712587, -7035336, -14647553, -20214841, -19501684, -11921342, -3675715, -1335698, -3129860, -2740859, -865964, -4455060, -13289304, -17141748, -10535148, -1294525, 1874811, 2459498, 8823025, 19887232, 27143535, 27294027, 24234818, 20622199, 15764747, 11188263, 10722201, 14264196, 17062344, 15754528]
4576A5754528m926582p047850p212336l626253K011991L486774j202117n410700
4568h172545l387460R63760R18415k078109j493497L036072N116317J867289j656946
4559d886704J39263N711852Q259415L770108m146483p887443m611262J57834L2029
4550c461391k967013j592497M599638P203769J329081o471474p213914j481262
4542a0055063L046467K599137J62139o31143Q45055L612686N629603L724168k748061
4533F184988q584964p251508P30986P211822N373042k675556q142910m523075
4525a1677175N847437J3863536J2696715M509258l036057n832635n742347m666419
4517E962313j559757K929947M405703J188163j653460L32310L210263K66398o851230
$$ y = [15754528, 10827946, 3780096, -3432240, -7058493, -5046502, -1559728, -2761845, -8172545, -11560005, -10596245, -9677830, -11755939, -13249436, -10213364, -5097047, -3229758, -4886704, -4747441, 964411, 9223826, 12993934, 8847451, 960008, -3651254, -3493420, -3461391, -6428404, -8020901, -3421263, 3782506, 5111587, -1359887, -8573801, -10055063, -7008596, -4409459, -4247320, -4878463, -4033408, -420722, 5208881, 8933049, 6184988, -2399976, -9651484, -8920498, -1708676, 3664366, 988810, -7154100, -11677175, -5829738, 8033798, 20730513, 25239771, 22203714, 16371079, 10628732, 5962313, 4402556, 7332503, 11738206, 12926369, 11272909, 11605219, 14815482, 15081880, 8230650]
4508H230650r296029l136530N718391R745122P822578L328367j216189m808579
4500A6387781o278816m876349j400736K543954N178903M331464o36890n767102
4492I482209m842682K650337Q739152N887511k973400p848460m773790k84546
4484F036331j113171m779906m857263j592530o15760k628693k207904J889762
4476i869134L231779j440586n036780l23160Q116604J0253715N454205J818407
4468A2205050K230287R99699m486030q300439n660738k90919K196320J856129
4460G49359J016854p01437l169434k933392J118982L871034J073278l774071m921719
4451g670546k720765p62349J420471O031803J0133969Q281346J008638n493831
$$ y = [8230650, -1065379, -4201909, 1516482, 11261604, 19084182, 22412549, 21196360, 16387781, 10108965, 5232616, 3831880, 6375834, 11554737, 15886201, 15249311, 9482209, 4639527, 7289864, 16029016, 21916527, 18943127, 11094667, 6320877, 6036331, 4923160, 143254, -4714009, -6306539, -6922299, -9550992, -11758896, -9869134, -6637355, -8077941, -13114721, -13437881, -5321277, 4932438, 10386643, 12205050, 14435337, 15435036, 10949006, 2648567, -3012171, -3303090, -1106770, 749359, 1766213, 1064776, -2104658, -5038050, -3919068, -48034, 1025244, -2748827, -7670546, -10391311, -11153660, -9733189, -3701386, 6432583, 14713929, 15722567, 10228736]
4443A0228736p622840o866731m844846j452372K151229L861928M253367N522404
4435E230875O839991N055622J64029l901283m162177j100259L120924N692826
4427A6940548L782206j910326n581369k742610L087492M880478J895649n74781
4419A9777287k70534l62566k529040l975944k822255j081216o21427p77573j248519
4410F088213k814006m055104k100734K018701L441235M89444k725255k312212
4402a969718P43957L210379L138346J47408l791143l905545K099392Q535784P553230
4393A5762090N51385l410436j388284k24457l998784p022886m246778k22995r52880
4384e154025l667858k386015J634630K922052J392529J174607K527110K195609
$$ y = [10228736, 2605896, -4260835, -9105681, -10558053, -8406824, -4544896, -291529, 5230875, 12070866, 17126488, 17290517, 13389234, 9227057, 8126798, 11247722, 16940548, 20722754, 18812428, 13231059, 10488449, 13575941, 18456419, 20352068, 19777287, 19506753, 19144187, 16615147, 12639203, 9816948, 8735732, 8114305, 7336732, 6088213, 3274207, -780897, -2881631, -862930, 2578305, 3067749, 342494, -1969718, -1225761, 1984618, 5122964, 5270372, 1479229, -2426316, -326924, 8208860, 15762090, 16313475, 12903039, 11514755, 11290298, 7291514, 268628, -3978150, -4201145, -5154025, -8821883, -11207898, -9573268, -6651216, -5258687, -4084080, -1556970, 638639]
4376F38639K7368j241203j261295j337222k93160L006835M885047R91438n902758
4367d86311q472467m709086M07237K686945K832721L017182M257767O880281R293225
4358A5707494P482893M19688n721996m299074K288925N827596L712917M73880
4350B5892323j186959l232729n735302n101696o92434L218121L919056K914509
4342A9994889R70888l051762p040300o346513j889873m48045l958661n771404
4334g540781j459558L745568L462704j56018j184809P63389K171439K417071K811635
4325E030640K251567k38312j574700R37943L862145K202212k566020n047565m579701
4316B78209m948708o612133n820536j628707K193805L105294K501520J600000
$$ y = [638639, 666007, -575196, -1836491, -3173713, -3466873, -460038, 4425009, 5416447, -486311, -8958778, -13667864, -13260627, -10573682, -7740961, -4723779, -466012, 6414269, 15707494, 23190387, 23610075, 17888079, 13589005, 15877930, 21705526, 25418443, 25892323, 24705364, 21472635, 15737333, 10635637, 9943203, 13161324, 17080380, 19994889, 20965777, 17914015, 10873715, 4527202, 2637329, 2189284, -1769377, -7540781, -9000339, -5254771, -1792067, -1948085, -3132894, -2369505, -198066, 2219005, 5030640, 7282207, 7043895, 5469195, 6407138, 10269283, 12471495, 9905475, 4857910, 278209, -4670499, -11282632, -17103168, -18731875, -16538070, -13432776, -10931256, -9331256]
4308i331256l60722k413700j231620L338753N997868K443495m227056o702955
4300a2487193k255406M071627N471241J295439k257597L33739P019942J0657243
4292A1849035P701265J533048k973407m372099k955669J279262N954216N671017
4284B3686668j521986r679179j1350733o416542n19178K921899M297140L471081
4276D889170k60541m315834m349646k68004L425357L635880J406906j142984k752909
4267B67395k060063J420112N329034O809698O201210N092834K419558k898944
4259B2580834p150762n619761n09833J214379j955228m383296k576284K63300
4251A863349M46488j455818l732169n604934m796257O04714O207305M507579l297054
$$ y = [-9331256, -9691978, -12105678, -13337298, -9998545, -4000677, -1557182, -5784238, -12487193, -14742599, -10670972, -5199731, -3904292, -6161889, -5828150, 1191792, 11849035, 19550300, 21083348, 18109941, 13737842, 10782173, 12061435, 18015651, 23686668, 22164682, 12485503, 1134770, -5281772, -5800950, -2879051, 1418089, 4889170, 4628629, 312795, -4036851, -4304855, -879498, 2756382, 4163288, 3020304, 267395, -1792668, -372556, 4956478, 11766176, 17967386, 23060220, 25479778, 22580834, 15430072, 9810311, 9300478, 10514857, 8559629, 4176333, 1600049, 1863349, 2309837, 854019, -2878150, -8483084, -13279341, -12674627, -6467322, -1959743, -5256797]
4242e256797o401033N08239Q792324Q303887J569693j750851N32550K314296J86892
4233H799200k578969k363483O20371M403976O926919O004876J486404l135207
4225B0164087m371751k863040j194456K89020K275848L428812K343994O80236
4217B0752750N96676Q28126j027649m083836n723719n852294n857561n036937
4209e404444j994801J770816L530397L498604L838100M581343L958424J888958
4201A5667397N3853o99022m66128R89479L156378L766629J352177k203587l517244
4192A8099932j233431K909148N030262J822891m687269o706064j54987P264381
4184B2344863N305012k725040l891264L501844O373837j415892q272790m216205
$$ y = [-5256797, -11657830, -11149591, -2357267, 5946620, 7516313, 5765462, 6298012, 8612308, 8799200, 6220231, 3856748, 4477119, 8881095, 15808014, 21812890, 23299294, 20164087, 15792336, 12929296, 11734840, 12023860, 14299708, 17728520, 20072514, 20752750, 21349426, 22177552, 21149903, 17066067, 11342348, 5490054, -367507, -5404444, -7399245, -5628429, -2098032, 1400572, 5238672, 9820015, 13778439, 15667397, 15721250, 15022228, 14556100, 15545579, 18701957, 22468586, 23820763, 21617176, 18099932, 16866501, 19775649, 24805911, 26628802, 21941533, 15235469, 15080482, 22344863, 27649875, 24924835, 21033571, 24535415, 30909252, 29493360, 21220570, 17004365]
4176A7004365K651787P49494n690406n720828m92161J669836J165796L393731
4168A4731614N946285L931252J322570L006408L706078m42423K0566J0672344
4160D2894694J7017564P681921n88037J0286805K3143485J4416586O732148L9181060
4152A60766226Q4725172O2222197m4115146j37351782j25034885l8551492J8893780
4145a8445930J0192304j3209987r288047L835996J507482l972604L445665J0795677
4137a5139444L350924o458991k456850O625082M923740k930071l442157J372421
4129a4155346J109304l144507l865105k543768m127994m282936K912099J1463009
4121a6635244J1423205M651047K48949m73214k763469o625904p235187l902727
$$ y = [17004365, 19656152, 20405646, 14715240, 8994412, 8502251, 10172087, 11337883, 14731614, 20677899, 24609151, 25931721, 28938129, 32644207, 32201784, 32222350, 42894694, 59912258, 67594179, 67006142, 77292947, 100436432, 114853018, 121585166, 160766226, 245491398, 307713595, 263598449, 126246667, 1211782, -37339710, -18445930, -8253626, -21463613, -30751660, -26915664, -25408182, -29380786, -25935121, -15139444, -11788520, -18247511, -20704361, -14079279, -9155539, -12085610, -15527767, -14155346, -13046042, -16190549, -20055654, -22599422, -26727416, -31010352, -28098253, -16635244, -5212039, -560992, -312043, -785257, -3548726, -10174630, -17409817, -21312544]
4113b1312544L77499M687416P778153N017447l924074r691990m674246M907568
4105a6834771P508767K378226k379095l661659m743862n502210k102031M155146
4097b1181489P243698O055439N456708P227423P472273M028062j93036k532291
4089A3576787l663822m150036k738165N49816L188773K955993k35412m835756
4081D648178q071628p503309m248945k197842j936419O98257O945163J0784107
4073h82438P127691M9616l077799k053312j834629k929662j237226L677198P045248
4064E884687N683110R82477m400072p938675o460339N30077P338618P152595M41957
4055I214435o001377p371531l886616K389620Q181446Q289397Q33375p521182
$$ y = [-21312544, -20935045, -16247629, -8469476, -3452029, -7376103, -17068093, -21742339, -16834771, -9326004, -6947778, -9326873, -12988532, -17732394, -23234604, -25336635, -21181489, -13937791, -7882352, -2425644, 4801779, 12274052, 16302114, 16109078, 13576787, 9912965, 5762929, 3024764, 3574580, 6763353, 9719346, 9483934, 4648178, -3423450, -10926759, -15175704, -17373546, -19309965, -18611708, -11666545, -882438, 6245253, 6294869, 3217070, 1163758, -670871, -3600533, -4837759, -1160561, 5884687, 11567797, 12550274, 8150202, 211527, -6248812, -5718735, 1619883, 8772478, 9214435, 3213058, -4158473, -8045089, -5655469, 2525977, 10815374, 11648749, 4127567]
4047D127567q029845j277637M157622M003196K132413J766052P28735k158892
4039E449211l001332J002660O313570P619477M126011j247446n655800p412416
4031G193935o549075n666113o882711p408303k679375N284932Q379650L548354
4023d778706k258239j839644K647358M521184K818155J912286L309042L841915
4015A0173351J687210r05083j766110j845570k637349l309426k149186P66780
4007A4617L861582N891989O046690L190273k805566q893720j0446944o432603
3999i573682j075905J622496K926157N664910P568436L873953l491478o034213
3991A480674n68975N142964K933183m692602r225021p519473k481166L766314
$$ y = [4127567, -3902278, -5179915, -1022293, 2980903, 5113316, 6879368, 7608103, 5449211, 2447879, 3450539, 9764109, 17383586, 21509597, 20262151, 14606351, 7193935, 644860, -5021253, -11903964, -19312267, -21991642, -16706710, -8327060, -4778706, -7036945, -8876589, -6229231, -1708047, 1110108, 3022394, 6331436, 10173351, 11860561, 10955478, 9189368, 7343798, 4706449, 1397023, -752163, 14617, 3876199, 9768188, 15814878, 19005151, 16199585, 7305865, -3141079, -9573682, -10649587, -9027091, -6100934, -436024, 7132412, 11006365, 7514887, 1480674, 911699, 6054663, 8987846, 4295244, -4929777, -12449250, -14930416, -11164102]
3983a1164102J0152581J2636299P886326K66097k319965L94556J243824k522203
3975A6573413n357489l301032k36699p81787l185076l577901k341387j744208
3967c952166j077532J336213L962068L995929J760878j71950q76248j185141r40798
3958B851253J100010M542138O270814L118875l936695q743527n535086L247010
3950B914792P886768L173289m099596m232372J762410M434568K73803m263461
3942G850201l797577j085506m90370j421371j779379k006959k053322L50239M668955
3933B34911N811027J243578m617668o622721m936465j714586K813657O956767
3925h31500O090627j09779m242174j101959L687254J938320m181890n569577k42894
$$ y = [-11164102, -1011521, 11624778, 19511104, 19777201, 17457236, 17851792, 19095616, 16573413, 11215924, 7914892, 7678193, 6896406, 3711330, 133429, -2207958, -3952166, -5029698, -3693485, 268583, 4264512, 6025390, 5853440, 4977192, 3792051, 2851253, 3951263, 8493401, 14764215, 17883090, 13946395, 5202868, -332218, 2914792, 10801560, 13974849, 9875253, 5642881, 7405291, 11839859, 12113662, 7850201, 4052624, 2967118, 2476748, 1055377, -724002, -2730961, -4784283, -4434044, 234911, 6045938, 7289516, 2671848, -3950873, -8887338, -10601924, -7788267, -831500, 5259127, 5149348, 907174, -194785, 3492469, 5430789, 1248899, -4320678, -4563572]
3916d563572M378911L025052j088750k680205j075314J456829L483648M452118
3908G388717L868592J826872j197431m767825p133761n282718Q39146O086510
3900A628102N722744J710805m22143N88258J435657M74591p09610j528559l228413
3891E671432n133228m542918j231419J698991K183046J176323P1133n59823K11843
3882d54620K410116K991010p65014n695771n509649J63158M641363L649988O05310
3873B035891o3720M23041q48996k404628j447418R4380j547808m593205l353877
3864a1706340K508410O266111L667390q76037j148404J749466K067424r85982
3856A542038k234272O45934L156681J370144j518457k06789M418460O949867N521442
$$ y = [-4563572, -184661, 2840391, 1751641, -928564, -2003878, -547049, 2936599, 7388717, 11257309, 13084181, 11886750, 7118925, -14836, -5297554, -4458408, 1628102, 7350846, 9061651, 8639508, 9227766, 10663423, 11138014, 10428404, 8899845, 5671432, 538204, -4004714, -5236133, -3537142, -1354096, -177773, -106640, -666463, -454620, 1955496, 4946506, 4181492, -1514279, -7023928, -6860770, -2219407, 1430581, 2035891, 1972171, 2395212, 1546216, -858412, -2305830, -2211450, -3759258, -8352463, -11706340, -9197930, -2931819, 735571, -140466, -1288870, 460596, 2528020, 1542038, -692234, -46300, 3110381, 4480525, 2962068, 2755279, 7173739, 14123606, 19645048]
3847A9645048K964563Q10024k214801n317399m931801o60360K878630K393588
3839A5567492n2971j518651k340054l126044j912672K114419N561856N156223
3831A9449598K283024L4535j249997k383093k604464j850228k323774m279866
3823G075735m041850j60998K734019J056811j280152M95890L302171J495278k769467
3814G907437l136227o35898k076962p501697r181485m368571M73338Q57433P16127
3805a6946505L609931N710335L149067k15172J280284O148101Q827958Q134985
3797A9698984O765877N112138J528200k666664m004516k520300k058730m426109
3789A7428880o819010o051648k682332L83976J730768K316801K996445K661591
$$ y = [19645048, 22609611, 23419635, 21204834, 15887435, 10955634, 10295274, 13173904, 15567492, 15514521, 13995870, 11655816, 8529772, 6617100, 8731519, 14293375, 19449598, 21732622, 21767157, 20517160, 18134067, 15529603, 13679375, 11355601, 7075735, 3033885, 2872887, 5606906, 6663717, 5383565, 5879455, 9181626, 10676904, 7907437, 4771210, 4135312, 2058350, -5443347, -14624832, -18993403, -18520065, -17662632, -16946505, -13336574, -7626239, -4477172, -4692344, -3412060, 2736041, 11563999, 19698984, 26464861, 31576999, 33105199, 30438535, 26434019, 23913719, 21854989, 17428880, 10609870, 4558222, 1875890, 2259866, 3990634, 6307435, 9303880, 11965471]
3781A1965471p3487l891304n459846l768480j610194j300550j374805J51932J921488
3772c439775J995411J898916L501820M083853n7325o506085r180833p037667m004916
3763a8746601r82033M403126R622805P716803j254084p570897n061565N20017
3755a1352429J562845j27204J020484L450506J749971k668245k717339L433209
3747e648202R537106R565413L663984m094440r512255j0000275o265276k065157
3739a4819102K82796K577177O220456P943633M376639j493129l545765q01772
3731G40933K388736L192613K419124R06517j066904j536717P77639K546527j85789
3722A0182679m663692m424323J82085J660870k687414n854877j951995M462000
$$ y = [11965471, 11891984, 8000680, 2540834, -1227646, -2837840, -4138390, -5513195, -5361263, -3439775, -1444364, 454552, 3956372, 8040225, 7982900, 1476815, -7704018, -14741685, -18746601, -19728634, -15325508, -5702703, 2014100, 760016, -6810881, -11872446, -11352429, -9789584, -9916788, -8896304, -5445798, -3695827, -6364072, -9081411, -5648202, 3888904, 13454317, 17118301, 13023861, 3511606, -6488669, -12753945, -14819102, -14536306, -11959129, -5738673, 2204960, 6581599, 5088470, 1542705, 740933, 3129669, 6322282, 8741406, 9647923, 8581019, 7044302, 7821941, 10368468, 10182679, 5518987, 1094664, 1276749, 2937619, 250205, -5604672, -7556667, -3094667]
3714c094667N372754J017692j793788n39368L88234k301892n704814n182753l47193
3705a2185795N142499P537788N499661M90536m012868n021680k940213r66118
3697f456190p07298O7464L511162O865527M767656l106367r816580q613808n61343
3688a4049777P580200J1134138J0067869N516751j508473p752358q891838n073134
3680b976622j634491k058334l503087k006385J103042J748888j15862n75910J990409
3671h028352M501691L662835L49239j576209J81130L573006M138649J80356m722364
3662B259981o079270m402044l485718l392170l26301N363300P245956K410843
3654d05423k670422j159866L972571N245286K396108J174185K704599K582885
$$ y = [-3094667, 2278087, 3295779, 1501991, 962623, 1350857, -951035, -6655849, -11838602, -12185795, -7043296, 494492, 5994153, 6484689, 2471821, -2549859, -5490072, -6456190, -7163488, -7096024, -3584862, 3280665, 8048321, 4941954, -4874626, -13488434, -14049777, -6469577, 4664561, 14732430, 20249181, 18740708, 10988350, 2096512, -2976622, -4611113, -6669447, -10172534, -12178919, -11075877, -9326989, -9442851, -10018761, -8028352, -3526661, 136174, 485413, -1090796, -909666, 2663340, 6801989, 6982345, 2259981, -3819289, -8221333, -11707051, -15099221, -15425522, -10062222, -2816266, -405423, -3075845, -4235711, -263140, 4982146, 7378254, 8552439, 11257038, 13839923]
3646A3839923K33090M70313M004930M499882j241233o840523n036485J956097
3638A1885994O004009L824224r24687m497218o925790r005428r541528p327509
3630a6507933l867401k097955k458755j758874K611421P973300Q503318K888044
3622d714835l257817m726496l154114k629362k241894J390389O125761N778073
3614g430295j7905l965618j136252M565988O532069L580625o47299k617992q63843
3605b000522L495112O212041L473474k390521m859412k332602n6776q03038q7253
3596F50503N064631Q917389N071821k913245o253290l279316L04051J389464J922767
3587A0874775K262141P6284l434382l719553j019839j270845o207326r330887
$$ y = [13839923, 14073013, 14543326, 18548256, 23048138, 21806905, 14966382, 9929897, 11885994, 17890003, 21714227, 20789540, 16292322, 9366532, 361104, -9180424, -16507933, -20375334, -22473289, -24932044, -26690918, -24079497, -16106197, -7602879, -4714835, -7972652, -12699148, -15853262, -18482624, -20724518, -19334129, -13208368, -7430295, -7448200, -11413818, -12550070, -7984082, -1452013, 2128612, 1481313, -1136679, -2000522, 1494590, 7706631, 11180105, 8789584, 3930172, 1597570, 1540794, 737756, 650503, 5715134, 14632523, 19704344, 16791099, 10537809, 7258493, 7562544, 8952008, 10874775, 13136916, 13213200, 9778818, 6059265, 5039426, 3768581, -2438745, -11769632]
3579a1769632n742946l9215Q52881j868673j566427L643013R351214J1816355
3571D676570J0774145O289485j290233q045964q904880m731308j886217k847117
3563e965519k573882K622700P808861O276351R0502k636886M53348L504781K124828
3554A1705084q43746j303468q2171K74797M33817J703183J801260j897969o742050
3545E048737p435364l818877j345255l012042m755340r15424P837382J4084607
3537E688424J1017211q9043r868333r596707o61127O533616M490295k981685o724660
3528b192009l885481N20324K049667J651637J742411K149495J719689Q42263N74363
3519E172359J043052J559625R80310j728483n525175o953716m276260n91005L58148
$$ y = [-11769632, -17512578, -17551793, -16698912, -18567585, -20134012, -16490999, -7139785, 4676570, 15450715, 21740200, 20449967, 12404003, 3499123, -1232185, -3118402, -5965519, -8539401, -5916701, 1892160, 8168511, 8259013, 5622127, 6075475, 9580256, 11705084, 10861338, 9557870, 9475699, 9750496, 10184313, 11887496, 13688756, 11790787, 5048737, -2386627, -6205504, -7550759, -10562801, -15318141, -16233565, -8396183, 5688424, 16705635, 16616592, 6748259, -2848448, -3509575, 3024041, 7514336, 4532651, -2192009, -6077490, -5557166, -3507499, -1855862, -113451, 2036044, 3755733, 4597996, 5172359, 6215411, 7775036, 8755346, 7026863, 1501688, -5452028, -9728288, -10319293, -9961145]
3510i961145j80907J281287L748891L298193M91681k45517J099890m21318n328597
3501f217542o919697j114419P042995J0380102P674122J459997o124941j1204700
3493e024083q386562J191970P739607N128897N7017J611505O707607N181355l617320
3484A0589993r504099o469545K39618L459822K566952L27963j831348k522020
3476c142664J5647M049913M670462N47609l704185m116443k206866r13618J80656
3467d619489K528206M782660M525809J849778j102536k582030j889852M39771
3459C932317K190708J490793j81587P3615J316466m68590n162155o904538k515983
3450f228954K880308K777700j468877l175510j65389L065329K722695O35727N87488
$$ y = [-9961145, -10142052, -8860765, -5111874, -1813681, -1322000, -1567517, -467627, -888945, -6217542, -13137239, -14251658, -7208663, 3171439, 10845561, 12305558, 6180617, -5024083, -13410645, -12218675, -4479068, 649829, 706846, 2318351, 9025958, 14207313, 10589993, 1085894, -5383651, -5144033, -1684211, 882741, 1210704, -620644, -3142664, -3127017, 922896, 5593358, 6140967, 2436782, -1679661, -3886527, -4800145, -4619489, -2091283, 2691377, 7217186, 9066964, 7964428, 5382398, 3492546, 3932317, 6123025, 7613818, 7432231, 7505846, 8822312, 8353722, 3191567, -3712971, -6228954, -3348646, -570946, -2039823, -5215333, -5380722, -2315393, 407302, 1043029, 1630517]
3441A630517K928740M722183L755787R32774j008048n17699J241172K069224J377243
3432A7131893K0018j998227n348160q549772q176342l407438K145067N105436
3424c077525O195475O813426M764946k034258r267361r444580k175169M100565
3416d124481L022619j534829j895982K301181M527518J504561k570936k931191
3408a701540q43284o31340k830001l595924k90299M739328O405145K164344m878258
3399a461829q213416m329524L090743P028183N258285K037336J112484R27923
3391E450185q73325k277620o24852J560550J25736l042645k265576K357802M320559
3382D730814P63732l347205l430089j603616j459369j924119n14200J605490K054540
$$ y = [1630517, 4559257, 9281440, 13037227, 13970001, 12961953, 12444254, 13685426, 15754650, 17131893, 17151911, 15153684, 9805524, 1255752, -6920590, -10328028, -8182961, -3077525, 3117950, 9931376, 14696322, 12662064, 3394703, -6049877, -8225046, -4124481, -1101862, -2636691, -4532673, -2231492, 2296026, 3800587, 1229651, -1701540, -2544824, -3176164, -6006165, -9602089, -9892388, -5153060, 1252085, 3416429, -1461829, -9675245, -14004769, -10914026, -3885843, 1372442, 3409778, 4522262, 5450185, 4576860, 2299240, 1674388, 3234938, 3360674, 318029, -1947547, 410255, 4730814, 5494546, 2147341, -1282748, -2886364, -4345733, -6269852, -6784052, -5178562, -3124022]
3373c124022J225597J53937j993870m722179m431222K40112N212502O951414P096356
3364F608625O939916L156944m806678r021382l250811N569297N694505k398978
3356H491438p558409n051017j291974j146487j384274P36928K091414N73923p53277
3347e291735K695L78369k15505J380914M489353L133898l698375q177542m918352
3338a2916280J261863M101888M838430O196919N005041j216592o362398l275938
3330b367067M894211R078358O827454K861537J50138j711399j605611J720031
3322A9847652M783048L091007j475771l712289l848130n926224q806510p070942
3314c118159j053343K178576m81407l626744k029348K020640L206442P72330j413381
$$ y = [-3124022, -1898425, -1744488, -3738358, -8460537, -12891759, -12651647, -7439145, -487731, 6608625, 13548541, 16705485, 11898807, 2877425, -373386, 5195911, 10890416, 8491438, 933029, -4117988, -5409962, -6556449, -7940723, -7203795, -5112381, -4538458, -5291735, -5289040, -4910671, -5126176, -3745262, 744091, 3877989, 179614, -7997928, -12916280, -11654417, -7552529, -2714099, 3482820, 8487861, 7271269, 908871, -2367067, 2527144, 11605502, 18432956, 21294493, 21444631, 19733232, 18127621, 19847652, 24630700, 27721707, 26245936, 22533647, 18685517, 12759293, 3952783, -3118159, -4171502, -1992926, -2474333, -6101077, -8130425, -6109785, -2903343, -2131013, -3544394]
3305c544394n8923L946458N956345K114160n052960p905914l245976K671465K678196
3296b441543j544710l635169k414205n93707K397865P463906R038041K019941
3288A0290419o344262l893619O961425J0682573K165816n291214j270349O325968
3280A9626757O019437P12044p00987Q5981l896865r579919q040948p06074K098745
3271E618171k128182n039020j744066K918735M073658K852497O11978l629788
3263C533983p321599m855244K547374N666636K89537o125241n652182p74107J773345
3254a0917498J868697L575020O030025M343251j971189p598847q176580m241783
3246a7088904R34175M096401L625534J349929J295863M000912M501017n33261
$$ y = [-3544394, -3603317, 343141, 6299486, 8413646, 3360686, -4545228, -7791204, -5119739, -2441543, -3986253, -7621422, -10035627, -10629334, -8231469, -767563, 8270478, 10290419, 3946157, 52538, 7013963, 17696536, 19862352, 14571138, 13300789, 19626757, 25646194, 26358238, 25657251, 25743232, 21846367, 12266448, 4225500, 3519426, 5618171, 3489989, -1549031, -3293097, -374362, 3699296, 6551793, 7163771, 3533983, -3787616, -8642860, -6095486, -428850, -139313, -6264554, -11916736, -12690843, -10917498, -9048801, -5473781, 556244, 4899495, 2928306, -4670541, -12847121, -17088904, -16154729, -12058328, -8432794, -7082865, -5787002, -1786090, 2714927, 2181666]
3238B181666o366177n751339Q17578N836288N168945K139666P11374Q8796j717809
3229C108988l317643k107512J452390M452410N055810L509525P63571k191888
3221A0725651m052827l506047l09618L603974M470959J19737n999611o909667
3213a857449p05500N643466M864755q00275l607183k064717j516725l436393k779263
3204f259284J810586L961376M17554k195535J718224O054223K204756o049071
3196A662829p269825K44223O350015M480733p15709k984787k603949j672693O57534
3187a851629L908711L937281m77003m298911l800667j967491j960562j129310
3179g639581K842027N448344K113592k915034k305034K626624M143776N37615
$$ y = [2181666, -4184511, -9935850, -9118272, -3281984, 1886961, 4026627, 4738001, 4826797, 3108988, -208655, -2316167, -863777, 3588633, 8644443, 12153968, 12917539, 10725651, 6672824, 3166777, 2857159, 6461133, 10932092, 11051829, 5052218, -1857449, -2562949, 3080517, 7945272, 7144997, 3537814, 1473097, -43628, -3480021, -6259284, -4448698, -487322, -69768, -2265303, -547079, 5507144, 7711900, 1662829, -5606996, -5362773, 987242, 5467975, 4752266, 1767479, -836470, -2509163, -1851629, 2057082, 5994363, 5517360, 1218449, -2582218, -4549709, -6510271, -7639581, -4797554, 650790, 2764382, -150652, -2455686, 170938, 4314714, 4852329]
3171D852329k071000m30435J510178O10387m99302O47378J757109Q32341N65567
3162G774552L233523N250149J941204m516051o928763k341761M519601P426575
3154A6359029N239166J455707m99920l0646J323763J558668o35081m704861p520966
3145A2544859n451516R74257N593022K838504m506199p422061j889121N729514
3137H411259P180151K633946j574332k756045l881805o554078p662525m531196
3129h734625O63894L723574L229410R77345o28736m90910P30440J572785J719473
3120B762650K183421K700376R50023l603603p360148p023787m241700k405299
3112a6038067j386848J45714J03371l147580m632850J466067J0576251J1455911
$$ y = [4852329, 2781329, 2350894, 3861072, 4471459, 3972157, 4619535, 6376644, 7208985, 7774552, 11008075, 16258224, 18199428, 13683377, 6754614, 4412853, 8932454, 16359029, 21598195, 23053902, 22553982, 22523336, 23847099, 25405767, 24770686, 20065825, 12544859, 7093343, 8067600, 13660622, 16499126, 11992927, 4570866, 2681745, 8411259, 15591410, 18225356, 16651024, 13894979, 10013174, 3459096, -4203429, -8734625, -8070731, -4347157, -1117747, -140402, -769138, -1260048, -529608, 1043177, 2762650, 4946071, 7646447, 8596470, 4992867, -2367281, -9391068, -13632768, -16038067, -17424915, -17279201, -17175830, -20323410, -24956260, -23490193, -12913942, -1458031]
3104a458031K666291m156381j199595M603271L615824j752761k778765J015633
3096E55486K822276J022343Q56178L971212N200464J646930k103804r82419L244450
3087A6233116M865208J369782m758770r284374r544133o203396k821754k326542
3079a2470863l530390k773692R20850M562868N598962N270217O165795P993628
3071A1737375P629617L084843l868768r398131j1224624r816066o455574j895929
3063b0207257K341503L622201J646398O04368M249936R537375R620159L680982
3055A5095665j033421J110382O744346Q560541M223790k773772q124583r437112
3047A4365836o471535j676689J307138J554832R39318m52716m499707q982575
$$ y = [-1458031, 1208260, -2948121, -4147716, 455555, 4071379, 2318618, -460147, 555486, 3377762, 4400105, 5256283, 9227495, 14427959, 16074889, 13971085, 12988666, 16233116, 21098324, 22468106, 17709336, 8424962, -1119171, -7322567, -10144321, -12470863, -16001253, -18774945, -17854095, -13291227, -7692265, -2422048, 3743747, 11737375, 19366992, 22451835, 18583067, 9184936, -2039688, -11855754, -18311328, -20207257, -17865754, -14243553, -12597155, -11992787, -7742851, 1794524, 11414683, 15095665, 14062244, 15172626, 21916972, 30477513, 34701303, 31927531, 23802948, 14365836, 7894301, 6217612, 7524750, 9079582, 10018900, 9566184, 5066477, -3916098]
3039c916098p503513N92670O369140L199486k943972k382310L663617O124910
3031C203930K841739O37481L263306O377331N585189J759065k877418o932797
3023A3857826p268884j678306M646269L200510n189706r774300m898493K392752
3015d712332L921021J718516J960744M121733L300867q97183m491207n361169
3007d39010l868553J17260N658366Q640532O280677J851652M69446K174729L368197
2998B4253296K676593Q13848k851547q287208j1387254q290981j809803K114945
2990b768111L155271N397257Q041750N133347l559179q990386m730910L179890
2982D858929M203153k267183p012285m412271J008647K998756K447249L489504
$$ y = [-3916098, -11419611, -10826941, -4457801, -1258315, -4202287, -6584597, -2920980, 3203930, 6045669, 6683150, 9946456, 16323787, 21908976, 23668041, 20790623, 13857826, 6588942, 4910636, 9556905, 12757415, 7567709, -2206591, -7105084, -4712332, -791311, 927205, 2887949, 7009682, 10310549, 9413366, 4922159, -439010, -4307563, -4190303, 1468063, 10108595, 16389272, 18240924, 18710370, 20885099, 24253296, 26929889, 27743737, 24892190, 16604982, 5217728, -3073253, -4883056, -2768111, 387160, 5784417, 13826167, 18959514, 15400335, 6409949, 1679039, 4858929, 9062082, 6794899, -217386, -4629657, -3621010, -622254, 1824995, 5314499]
2974E314499M877740J890165l961144m527969K787048Q771557M188420o291718
2966A3048598r628026k435747N001754M096921j012765k042318P23782Q42205
2958H594404l186186o145471m146109J019703N259282N864395K259825l402839
2950F117004o817594n652727k421306p65239n46687K25946O96405j107026l033697
2941a3304921m77820O324839J1132173R040570J744293n322862q064867n443869
2933d372464M38981M768327L453690k264923o628553n787907j590136J656749
2925a0326236K039662P20072l29638l0580J290871K393791K731143L266938M643819
2916F399842N340325L459413j85524k794673l113732k341828j853832j962136
$$ y = [5314499, 10192239, 12082404, 8121260, 3593291, 6380339, 15151896, 19340316, 13048598, 3420572, 984825, 5986579, 10083500, 9070735, 7028417, 7752199, 8594404, 5408218, -737253, -4883362, -3863659, 1395623, 7260018, 9519843, 6117004, -700590, -6353317, -8774623, -9539862, -10086549, -9860603, -9164198, -10271224, -13304921, -13782741, -7457902, 3674271, 12714841, 14459134, 9136272, 1071405, -4372464, -3933483, 834844, 4288534, 2023611, -4604942, -10392849, -11982985, -10326236, -8286574, -7566502, -7896140, -7926720, -6635849, -4242058, -1510915, 1756023, 6399842, 11740167, 15199580, 15014056, 12219383, 9105651, 6763823, 4909991, 2947855]
2908B947855k592251l213129k439546L78269L575918M918985M172752K294991
2900A0043844l96781k979359k850775P39424L785653K227910j683034k317916
2892F568966Q00761K566317M48423k283496k455806r80443N33834K219230L130203
2883A0547989R26905l137516l671776J216666N950397M732442r15778n631191
2875A0018138p726150q740617q191202l989890K690874P285794O931968L169165
2867A448080l28883r69746J128263L272249K893697Q72891K38679R07996r10065
2858H553161o216056r919155p291587o13703M341680N686425N161311L246165
2850B948241k31004k304721M46847N600766O711652K201202k464309k772723o66742
$$ y = [2947855, 355604, -2857525, -5297071, -4918802, -1342884, 3576101, 7748853, 10043844, 9647063, 6667704, 3816929, 4556353, 8342006, 10569916, 8886882, 6568966, 7369727, 9936044, 10384467, 8100971, 5645165, 4664722, 5198556, 7417786, 10547989, 11474894, 8337378, 4665602, 5882268, 11832665, 16565107, 15649329, 10018138, 2291988, -6448629, -14639831, -18629721, -15938847, -8653053, -1721085, 1448080, 1119197, 149451, 1277714, 4549963, 7443660, 8316551, 8555230, 9463226, 8553161, 2337105, -7582050, -14873637, -15487340, -11145660, -5459235, -297924, 2948241, 2717237, 412516, 859363, 6460129, 13171781, 15372983, 12908674, 10135951, 9469209]
2841I469209Q9570j99161P71493K286980J668374p51042j421963J081182L252765
2832A6247407J009993m346000o905405l458891K009921L074652j170758n718209
2824G42710o699170n139253k980251L92843N133820Q002461O199007K009610o1885
2815G599892O14096J121771L81919M37580K391357M221542L394611o1263l402347
2806A6699158l545254n98215Q20288l525405j0477882j1469837l794842M772051
2798a1119938O389131L304718K212514L260628K267527L99872K346714O067792
2790A5128958M100023l922286r200564o665675j650872m08428j678178j874853
2782f171875j731768k853727l378037j834943k68476O63164M106580R911255J1149844
$$ y = [9469209, 9558779, 9359618, 10131111, 12418091, 14086465, 13335423, 11913460, 12994642, 16247407, 17257400, 12911400, 6005995, 2547104, 4557025, 7631677, 6460919, 742710, -5956460, -11095713, -14075964, -13683121, -8549301, -546840, 5652167, 7661777, 7599892, 8213988, 9335759, 9717678, 10155258, 12546615, 16768157, 20162768, 20101505, 16699158, 13153904, 12555689, 13375977, 9850572, -627310, -12097147, -15891989, -11119938, -4730807, -1426089, 786425, 4047053, 6314580, 6714452, 9061166, 15128958, 19228981, 15306695, 6106131, -559544, -2210416, -2618844, -4297022, -6171875, -7903643, -10757370, -14135407, -15970350, -16238826, -15575662, -11469082, -1557827, 9592017]
2773I592017L811210n197781o623498j483522J837289n5759l254900m486655m398842
2764a0260441l794339k426984j066600l48060J054226L312536L459096J015045
2756i055521J459389P819103J3031925Q870215q06139n224042l028048k737887
2748A0328995p261536r537745n740598j569856j154889j5637N057704Q279066
2740a614496M301040k091336l582157j536726j422088k157931P98463N016771
2732b288460L383492l833702p758422l038312N228222Q462948L955114l900078
2724B10802q086870m346896M496854R746697N819688k589193o192459k953730
2716c895107Q13712Q70273K97215K452875M523113K128880l360788o578479n265297
$$ y = [9592017, 13403227, 8205446, 1581948, 98426, 1935715, 1879956, -1374944, -5861599, -10260441, -14054780, -16481764, -17548364, -17896424, -16842198, -13529662, -10070566, -9055521, -7596132, 222971, 13254896, 22125111, 21318972, 16094930, 13066882, 10328995, 3067459, -6470286, -12210884, -13780740, -14935629, -14951266, -9893562, -1614496, 2686544, 595208, -2986949, -4523675, -5945763, -8103694, -7305231, -2288460, 1095032, -2738670, -10497092, -13535404, -8307182, 155766, 4110880, 210802, -7876068, -12222964, -7726110, 2020587, 7840275, 5251082, -941377, -3895107, -3081395, -2211122, -1913907, 538968, 5062081, 7190961, 3830173, -2748306, -8013603]
2707h013603j557720K769748P964906J2508896J1726155L290813p606660j2355237
2699H727298q665813k924314j156562j192399K318939P891273Q566668L176874
2691A6741964q49091J400455M798848K443413l720637o549599m366611j419230
2683H479512J7269J188188J657259n89460l800413l621615l06049J195531p42575
2674C477647k305577j396793o10408j035000M58156M656056O898589M517041J662846
2665A6322557J990312K007011k301345o886934n009281J622815M657784J024092
2657A3427011l913271n065802l048536l14388J965480J942477j955685o162940
2649c125654m067387M005094Q679318L852270l933958m433990J674466M570082
$$ y = [-8013603, -9571323, -6801575, 1163331, 13672227, 25398382, 28689195, 21082535, 8727298, 61485, -2862829, -4019391, -5211790, -2892851, 4998422, 13565090, 16741964, 15892873, 17293328, 22092176, 24535589, 20814952, 14265353, 9898742, 8479512, 8496781, 9684969, 11342228, 10752768, 6952355, 3330740, 3024691, 4220222, 3477647, 1172070, -224723, -835131, -1870131, -1411975, 3244081, 10142670, 14659711, 16322557, 18312869, 20319880, 18018535, 11131601, 6122320, 7745135, 12402919, 13427011, 9513740, 4447938, 1399402, 1085014, 3050494, 4992971, 3037286, -3125654, -7193041, -3187947, 5491371, 9343641, 5409683, 975693, 2650159, 7220241]
2641G220241L30383l985961k015628K493288K380295j962066m155817j703831
2633a399096J668067K814471K830048L254821L358015K639260K073559J421218
2625A8660363p20082k695351m79914M833214N701262j217867q224297o793777
2617I063551m75952O51652m070230n344731M04136N130163K368366k830378k960615
2608A935962J72138l156l360360l823774P09451N690863O263157J625449n611610
2599C598120j0481986q161778L46601P238433O908809L167234K525971L781623
2591H923027J366472l333370k929879L345806O692360J274335p261238r728148
2583a650635m758441J635484L998862J464894l160731n424901k700023K339467
$$ y = [7220241, 7550624, 3564663, 1549035, 4042323, 6422618, 4460552, 304735, -1399096, 268971, 3083442, 5913490, 9168311, 12526326, 15165586, 17239145, 18660363, 17940281, 15244930, 14765016, 19598230, 25299492, 24081625, 15857328, 9063551, 8587599, 9239251, 5169021, -175710, 228426, 5358589, 7726955, 4896577, 1935962, 2108100, 2104944, -1255416, -5079190, -4369739, 1321124, 7584281, 9209730, 3598120, -6883866, -15045644, -14699043, -7460610, -551801, 2615433, 5141404, 8923027, 10289499, 6956129, 4026250, 7372056, 14064416, 15338751, 8077513, -1650635, -6409076, -4773592, -774730, 690164, -2470567, -7895468, -10595491, -8256024]
2575h256024M080294J018707k569734k945934r86292J379504M126295O112245
2567A959061L860306k906976q308134p061337j428967K473722K793853K346045
2559f272427K954011L586152L126229J659786k15649j060450P73555L907478L766651
2550A2225336j404163o874038p192558l099639J107539M228736P245068Q263086
2542A4499367M637926q52672k404600J2150M29020l560365p184236o401729l415111
2533d240250j154896K114596Q016927J2220696R224104R58029m834384m350551
2525A7954271j304564m64162j695567j837680M26873L468905M946532L783174
2517B5277782R05240j182867o70641R35766j56919n046293r494365q519956l095873
$$ y = [-8256024, -4175730, -3157023, -5726757, -8672691, -9658983, -8279479, -4153184, 1959061, 5819367, 2912391, -5395743, -12457080, -13886047, -11412325, -8618472, -6272427, -3318416, 267736, 3393965, 5053751, 4838102, 3777652, 4551207, 8458685, 12225336, 10821173, 3947135, -3245423, -6345062, -5237523, -1008787, 6236281, 14499367, 19137293, 18284621, 15880021, 15892171, 16321191, 12760826, 5576590, -825139, -4240250, -5395146, -3280550, 4736377, 16957073, 26181177, 27139206, 22304822, 17954271, 16649707, 16185545, 14489978, 12652298, 13079171, 16548076, 21494608, 25277782, 26183022, 25000155, 24329514, 25265280, 25108361, 20062068, 10567703, 2047747, -1048126]
2508a048126O66386l12904k020095K05212M157115M042862j23583j977448J436582
2499E026001M881449K887228k094257l888440j604295Q31218K052415M121624
2491A2212943O315065M203407l089563r383767q314232j163030M779261M342354
2483I902438p15803m187024j906398L628080N627657J314617l676017k289712
2475G697838L729845N439940q53561p954673p296265K1396N617939M766499P53784
2466A1922742r48109O98517K376876J366329r62830j214214P15690P02336l161675
2457A1495662n865150j932138M890932N109205k526963p924961l824577L997794
2449C419804O037176K426896r7326P5096q22559l013565k714313K7635J113514
$$ y = [-1048126, -381740, -694644, -2714739, -2509527, 1647588, 5690450, 5566867, 3589419, 5026001, 9907450, 12794678, 10700421, 6811981, 5207686, 6038904, 8091319, 12212943, 18528008, 22731415, 19641852, 10258085, 1943853, 780823, 5560084, 9902438, 9186635, 4999611, 3093213, 6721293, 12348950, 13663567, 9987550, 7697838, 11427683, 16867623, 16014062, 8059389, 763124, 784520, 6402459, 11168958, 11922742, 10974633, 11673150, 14050026, 15416355, 14453525, 13239311, 13955001, 14657337, 11495662, 5630512, 3698374, 8589306, 13698511, 11171548, 3246587, -577990, 3419804, 9456980, 11883876, 11786550, 11861646, 11039087, 8025522, 5311209, 5338844, 6452358]
2440F452358L21966J652059M725669L888657j731374n086695j971238K089165
2432A0340567O92062l723012m955323l003339k219506k854878j582319J140226
2424f165522J141580j992941l544991q81695K867707M007840L133836K724053
2416A289867K982339K532120J416156J086944J933857K320153M55229l044773
2408A0971892n154695m077183k360967l772642o633111m421817M214070J0379529
2400h54924N417542o080500j0896872m627875L172400L521953N8062J251613O424278
2391b614323P364247J655074l594580k357577K425463M442512K741443P62975
2383A0825234m33903k930698o280487n874339O60285Q198843Q820852J437147
$$ y = [6452358, 6774324, 8426383, 13152052, 17040709, 15309335, 10222640, 8251402, 10340567, 11032629, 7309617, 2354294, -649045, -2868551, -5723429, -7305748, -6165522, -5023942, -7016883, -10561874, -11443569, -8575862, -4568022, -1434186, 1289867, 4272206, 6804326, 8220482, 9307426, 11241283, 13561436, 14016665, 10971892, 5817197, 1740014, -620953, -4393595, -11026706, -15448523, -11234453, -854924, 4562618, -1517882, -12414754, -17042629, -13870229, -10348276, -10290214, -9038601, -2614323, 4749924, 6404998, 2810418, 452841, 2878304, 7320816, 10062259, 10825234, 10391331, 7460633, 1180146, -4694193, -4033908, 4164935, 12985787, 14422934]
2375A4422934o330368o824909n10412N984914P523926L643591l606331j0677950
$$ y = [14422934, 8092566, 1267657, 757245, 6742159, 14266085, 17909676, 14303345, 3625395]
$$ [...]
##END NTUPLES=NMR SPECTRUM
##END=
