##TITLE=31Pdec_DE-139km_TFA
 CCl4,64 sc
 9.4.2026
##JCAMPDX= 6.0         $$ Bruker NMR JCAMP-DX V2.0
##DATA TYPE= NMR SPECTRUM
##DATA CLASS= NTUPLES
##ORIGIN= UXNMR, Bruker Analytische Messtechnik GmbH
##OWNER= root
$$ XWIN-NMR		Version 3.5
$$ Thu Apr  9 13:27:31 2026 Russian Standard Time (UT+4h)  she@DPX200
##.OBSERVE FREQUENCY= 81.013821
##.OBSERVE NUCLEUS= ^31P
##.ACQUISITION MODE= SIMULTANEOUS
##.ACQUISITION SCHEME= undefined
##.AVERAGES= 64
##.DIGITISER RES= 17
##SPECTROMETER/DATA SYSTEM= spect
##.PULSE SEQUENCE= zgpg30
##.SOLVENT NAME= DMSO
##.SHIFT REFERENCE= (INTERNAL, DMSO, 0, 197.392)
##AUDIT TRAIL= $$ (NUMBER, WHEN, WHO, WHERE, WHAT)
$$ ##TITLE= Audit trail, XWIN-NMR		Version 3.5
$$ ##JCAMPDX= 5.01
$$ ##ORIGIN= Bruker BioSpin GmbH
$$ ##OWNER= she
$$ F:/spectra/data/she/nmr/P31/2/pdata/1/auditp.txt
$$ ##AUDIT TRAIL=  $$ (NUMBER, WHEN, WHO, WHERE, WHAT)
(   1,<2026-04-09 13:26:12.57 +0400>,<she>,<DPX200>,
      <continue with go, POWCHK disabled, PULCHK disabled
       configuration hash MD5:
       00 E9 B6 7A A2 85 ED C7 34 08 36 98 17 FE 4E 26
       data hash MD5: 32K
       2C C0 D9 2D 18 30 C9 C7 BD A3 21 15 AE 28 1C C4>)
(   2,<2026-04-09 13:26:15.54 +0400>,<she>,<DPX200>,
      <Start of raw data processing
       efp BC_mod = 2 LB = 1.5 FT_mod = 6 PKNL = 1 PHC0 = 1118.421 PHC1 = 849.7007 SI = 64K 
       data hash MD5: 64K
       F9 D0 9C 4A FE E9 23 0C D0 C0 D6 AD DE F0 55 BD>)
(   3,<2026-04-09 13:26:55.60 +0400>,<she>,<DPX200>,
      <pk PHC0 = 32.0132 PHC1 = -34.4003 
       data hash MD5: 64K
       A9 E8 06 F1 1F 1A 7F CE 9E 31 D4 2B AF 5B 6B 2B>)
(   4,<2026-04-09 13:26:59.53 +0400>,<she>,<DPX200>,
      <abs ABSG = 5 
       data hash MD5: 64K
       CE 33 F9 07 A5 26 2A BE C8 21 E3 07 96 81 43 19>)
$$ ##END=
$$ 
$$ hash MD5
$$ B9 77 B6 11 D2 DD A3 DF F6 FD DA D7 35 7A 50 92
##$RELAX= 
##$RELAX= 
##$RELAX= 
##$RELAX= 
##$RELAX= 
##$RELAX= 
##$RELAX= 
##$RELAX= 
$$ Bruker specific parameters
$$ --------------------------
##$DU= <F:/spectra>
##$EXPNO= 2
##$NAME= <P31>
##$PROCNO= 1
##$TYPE= <nmr>
##$USER= <she>
##$AMP= (0..31)
100 100 100 100 100 100 100 100 100 100 100 100 100 100 100 100 100 100 
100 100 100 100 100 100 100 100 100 100 100 100 100 100 
##$AQSEQ= 0
##$AQ_mod= 1
##$AUNM= <au_zg>
##$AUTOPOS= <>
##$BF1= 81.014009
##$BF2= 200.13
##$BF3= 200.13
##$BF4= 200.13
##$BF5= 200.13
##$BF6= 200.13
##$BF7= 200.13
##$BF8= 200.13
##$BYTORDA= 1
##$CFDGTYP= 0
##$CFRGTYP= 5
##$CHEMSTR= <none>
##$CNST= (0..31)
1 1 145 1 1 1 1 1 1 1 1 1 1 1 1 1 1 1 1 1 1 1 1 1 1 1 1 1 1 1 1 1 
##$CPDPRG= <waltz16>
##$CPDPRG1= <>
##$CPDPRG2= <waltz16>
##$CPDPRG3= <>
##$CPDPRG4= <mlev>
##$CPDPRG5= <mlev>
##$CPDPRG6= <mlev>
##$CPDPRG7= <mlev>
##$CPDPRG8= <mlev>
##$CPDPRGB= <>
##$CPDPRGT= <>
##$D= (0..31)
0 1 0 0 0 0 0 0 0 0.06 0 0.03 2e-05 3e-06 0 0 0.0002 0 0 0 0 0 0 0 0 0 
0 0 0 0 0 0 
##$DATE= 1775726695
##$DBL= (0..7)
120 120 120 11 120 120 24 19 
##$DBP= (0..7)
150 150 150 150 150 150 150 150 
##$DBP07= 0
##$DBPNAM0= <>
##$DBPNAM1= <>
$$ [...]
##$SUBNAM3= <"">
##$SUBNAM4= <"">
##$SUBNAM5= <"">
##$SUBNAM6= <"">
##$SUBNAM7= <"">
##$SUBNAM8= <"">
##$SUBNAM9= <"">
##$SW= 400.765351723535
##$SWIBOX= (0..15)
0 1 3 0 0 0 0 0 0 0 0 0 0 0 0 0 
##$SW_h= 32467.5324675325
##$TD= 32768
##$TD0= 1
##$TE= 0
##$TE2= 300
##$TE3= 300
##$TEG= 300
##$TL= (0..7)
0 120 53 12 22 120 120 120 
##$TP= (0..7)
150 150 150 150 150 150 150 150 
##$TP07= 0
##$TPNAME0= <>
##$TPNAME1= <>
##$TPNAME2= <>
##$TPNAME3= <>
##$TPNAME4= <>
##$TPNAME5= <>
##$TPNAME6= <>
##$TPNAME7= <>
##$TPOAL= (0..7)
0.5 0.5 0.5 0.5 0.5 0.5 0.5 0.5 
##$TPOFFS= (0..7)
0 0 0 0 0 0 0 0 
##$TUNHIN= 0
##$TUNHOUT= 0
##$TUNXOUT= 0
##$USERA1= <user>
##$USERA2= <user>
##$USERA3= <user>
##$USERA4= <user>
##$USERA5= <user>
##$V9= 5
##$VALIST= <valist>
##$VCLIST= <CCCCCCCCCCCCCCC>
##$VD= 0
##$VDLIST= <DDDDDDDDDDDDDDD>
##$VPLIST= <PPPPPPPPPPPPPPP>
##$VTLIST= <TTTTTTTTTTTTTTT>
##$WBST= 1024
##$WBSW= 4
##$XGAIN= (0..3)
0 0 0 0 
##$XL= 0
##$YL= 0
##$YMAX_a= 3533
##$YMIN_a= -8423
##$ZGOPTNS= <>
##$ZL1= 120
##$ZL2= 120
##$ZL3= 120
##$ZL4= 120
##$ABSF1= 197.3918
##$ABSF2= -203.3724
##$ABSG= 5
##$ABSL= 3
##$ALPHA= 0
##$AQORDER= 0
##$ASSFAC= 0
##$ASSFACI= 0
##$ASSFACX= 0
##$ASSWID= 0
##$AUNMP= <proc_1d>
##$AZFE= 0.1
##$AZFW= 0.5
##$BCFW= 0
##$BC_mod= 2
##$BYTORDP= 0
##$COROFFS= 0
##$CY= -3
##$DATMOD= 1
##$DC= 0
##$DFILT= <>
##$DTYPP= 0
##$F1P= 0
##$F2P= 0
##$FCOR= 1
##$FTSIZE= 65536
##$FT_mod= 6
##$GAMMA= 0
##$GB= 0
##$INTBC= 1
##$INTSCL= 9.790993e-09
##$ISEN= 30
##$LB= 1.5
##$LEV0= 0
##$LPBIN= 0
##$MAXI= 10000
##$MC2= 0
##$MEAN= 0
##$ME_mod= 0
##$MI= 50
##$NCOEF= 0
##$NC_proc= -8
##$NLEV= 6
##$NOISF1= 182.463
##$NOISF2= 159.3651
##$NSP= 0
##$NTH_PI= 0
##$NZP= 0
##$OFFSET= 197.3918
##$PC= 4
##$PHC0= 1150.434
##$PHC1= 815.3004
##$PH_mod= 1
##$PKNL= yes
##$PPARMOD= 0
##$PSCAL= 0
##$PSIGN= 0
##$REVERSE= no
##$SF= 81.014063255964
##$SI= 65536
##$SIGF1= 159.3651
##$SIGF2= -187.1042
##$SINO= 113.3802
##$SIOLD= 16384
##$SREGLST= <1H.CDCl3>
##$SSB= 0
##$STSI= 65536
##$STSR= 0
##$SW_p= 32467.5324675325
##$SYMM= 0
##$S_DEV= 0
##$TDeff= 32768
##$TDoff= 0
##$TI= <>
##$TILT= no
##$TM1= 0
##$TM2= 0
##$TOPLEV= 0
##$USERP1= <user>
##$USERP2= <user>
##$USERP3= <user>
##$USERP4= <user>
##$USERP5= <user>
##$WDW= 1
##$XDIM= 65536
##$YMAX_p= 122526691
##$YMIN_p= -214515167
$$ End of Bruker specific parameters
$$ ---------------------------------
##NTUPLES= NMR SPECTRUM
##VAR_NAME=  FREQUENCY,     SPECTRUM/REAL,   SPECTRUM/IMAG
##SYMBOL=    X,             R,               I
##VAR_TYPE=  INDEPENDENT,   DEPENDENT,       DEPENDENT
##VAR_FORM=  AFFN,          ASDF,            ASDF
##VAR_DIM=   65536,         65536,           65536
##UNITS=     HZ,            ARBITRARY UNITS, ARBITRARY UNITS
##FACTOR=    0.49542278885378, 1,            1
##FIRST=     15991.5117654749, 0,            0
##LAST=      -16476.0207020576, 0,           0
##MIN=       -16476.0207020576, -214515167,  0
##MAX=       15991.5117654749, 122526691,    0
$$ Real data points
##PAGE= N=1
##DATA TABLE= (X++(R..R)), XYDATA
$$ [...]
7500B113265L89349J922014K237327J88421j613011j063320L37390L50994o00131
7491D262298r20753n78327k09059O32156K104895K627124J041431j226547k276734
7482E456484k388286k417935j524771P74868K207507P42709j545243j318351N27000
7473E13982L45161j958332k678276n53088J329113R22123K32030J160259K100452
7464A413424J004434j134955k218242k040683j242855M34916K666921L430034
7456B312994J683313o10202j278116r71340j186255j135282O39490K895301K954659
7447E304562P44267j143412j224429n69849m56401p23868p97410o41207l02174
7438A90079K64009P34369P41930N11518K90153l45104j509592k052377j084410
$$ plain form
7500 2113265 2502614 4424628 6661955 6850376 5237365 4174045 4511435 4862429 4262298
7491 4262298 3341545 2763218 2554159 3186315 5291210 7918334 8959765 7733218 5456484
7482 5456484 3068198 650263 -874508 -99640 2107867 2850576 1305333 -13018 513982
7473 513982 859143 -1099189 -3777465 -4330553 -3001440 -2079317 -1847287 -687028 1413424
7464 1413424 2417858 1282903 -935339 -2976022 -4218877 -3783961 -1117040 2312994
7456 2312994 3996307 3386105 2107989 1136649 -49606 -1184888 -545398 2349903 5304562
7447 5304562 6048829 4905417 3680988 3111139 2654738 1930870 1133460 492253 190079
7438 190079 454088 1188457 1930387 2441905 2732058 2386954 877362 -1175015 -2259425
7429b259425J09766m63280k307497k662535k78881K738686L561275J814576o55643
7420d02958k178670k448116j834170n28544J323056L010900L433446K338871R77037
7411C690852O15712O73944k82968j721338j371262R65392K145148l6201l225195
7402A454084l540248q41918J660744K123011J510818P80761l89947j827435k431746
7393a501876j988862j260286j70102J734891L083462J864579q98816j910749p18732
7384a766491m45334k102969k206399J402320N013010L958508n69308l525875k945450
7375c187988q89033J040935K744572K940861J09804l562327l555503N00468L481476
7366c76735J503639l194336n848047m805038j684713J496267L197905K485641
$$ plain form
7429 -2259425 -2149659 -2612939 -4920436 -7582971 -7861852 -5123166 -1561891 252685 -402958
7420 -402958 -2581628 -5029744 -6863914 -7392458 -6069402 -3058502 374944 2713815 3690852
7411 3690852 4306564 4980508 4697540 2976202 1604940 2570332 4715480 4679279 1454084
7402 1454084 -2086164 -2928082 -1267338 855673 2366491 3147252 2757305 929870 -1501876
7393 -1501876 -3490738 -4751024 -4921126 -3186235 -102773 1761806 862990 -1047759 -1766491
7384 -1766491 -2211825 -4314794 -6521193 -5118873 -105863 3852645 3283337 -242538 -3187988
7375 -3187988 -4077021 -3036086 -291514 2649347 2759151 -803176 -4358679 -3858211 -376735
7366 -376735 1126904 -2067432 -7915479 -12720517 -14405230 -12908963 -9711058 -7225417
7358g225417M46368k22574J212045K295404J432614O23512J691882K456934K88874
7349B999642k545934j667689K056713K845753j576012o363310o267435k386178
7341a2904450M10345K28789o39669J39907K355618M407192N061563M061188K202485
7332E322968P13336r3103j007989k283070k836631j926779n12311J47361K52800
7323b223418O31193J101747J032794P11349P04476N33881n03017j740982j934452
7314a686429j237257q55410j046057j033299o55619l99904J08472J800774M074861
7305i29868M786166L019191M90461o04131j21777L68533k96984j725016k503472
7296B483103j624840L20372J567109J279250O92453J307080K620871K927288J765908
$$ plain form
7358 -7225417 -6779049 -7001623 -5789578 -3494174 -2061560 -1438048 253834 2710768 2999642
7349 2999642 453708 -1213981 842732 3688485 2112473 -4250837 -10518272 -12904450
7341 -12904450 -12494105 -12265316 -12904985 -12765078 -10409460 -6002268 -940705 3120483 5322968
7332 5322968 6036304 5943201 4935212 2652142 -184489 -2111268 -2623579 -2476218 -2223418
7323 -2223418 -1592225 -490478 542316 1253665 1958141 2492022 1989005 248023 -1686429
7314 -1686429 -2923686 -3779096 -4825153 -5858452 -6514071 -6913975 -6805503 -5004729 -929868
7305 -929868 3856298 6875489 7365950 6761819 6640042 7008575 6711591 4986575 2483103
7296 2483103 858263 1178635 2745744 4024994 4717447 6024527 8645398 11572686 13338594
7287A3338594K6283j852718l907660n212501m546853k497160q14095K90251J897885
7278c277974L479670L069133P74675q87175r43417j041901j532847k55048K796572
7269B181688L543288k47594m481094m149216n69280J210053J66985m96138K99119
7260b542189K90234j054042j338741P3789P83682j2315R0865K069927L306780
7251A667990K100573N37525M36026L0841k339978m441979l516024r23310K31536
7242f216800J27863J042685K584224K193009j57419j617032r49538M664j83086
7233c171430o03256l35386p4798m51139q23013o09727o2274P68294J901832J978282
7223a482615n85480m234719m813970j004368L230104L697415J384184K93077J576102
$$ plain form
7287 13338594 13364877 11512159 7604499 2391998 -2154855 -4652015 -5466110 -5175859 -3277974
7278 -3277974 201696 3270829 4045504 3158329 2214912 1173011 -359836 -614884 2181688
7269 2181688 5724976 5477382 996288 -3152928 -3722208 -2512155 -2345170 -2841308 -2542189
7260 -2542189 -2251955 -3305997 -4644738 -4570949 -3787267 -3799582 -3708717 -1638790 1667990
7251 1667990 3768563 4306088 4742114 4772955 2432977 -2009002 -5525026 -6448336 -6216800
7242 -6216800 -6088937 -5046252 -2462028 -269019 -426438 -2043470 -2993008 -2988344 -3171430
7233 -3171430 -3774686 -4110072 -4184870 -4636009 -5459022 -6068749 -6131023 -5362729 -3460897 -1482615
7223 -1482615 -2068095 -6302814 -11116784 -12121152 -8891048 -5193633 -3809449 -3516372 -1940270
7214a940270K919927K861119K299158J669399r215k288764k567599l4758K157672
7205E066669J102422j384580j496653N89426J175967o06018j066711J802490M113985
7196I296997J415932m142602o160025k741229J359143J932199N01228L06469P01191
7187B469303r03605l560865l488217o9132K651054J598968j187519j937825m31528
7178d859366O30776K68367K74795J630580K616883J615489k65390j002516o22219
7169B87399l83703p6652J361715K921045K099825j049341l292191k836601j746088
7160b714592j842621j211223K031859M993399L473850j041340k830480m18299
7152D40553J490562k36899k566387j988853k21629m79661j648372o82165J573852
$$ plain form
7214 -1940270 979657 3840776 6139934 7809333 7800118 5511354 2943755 2908997 5066669
7205 5066669 6169091 4784511 3287858 3877284 5053251 4447233 3380522 5183012 9296997
7196 9296997 10712929 6570327 410302 -2330927 -971784 960415 1461643 1768112 2469303
7187 2469303 1565698 -1995167 -5483384 -5552516 -2901462 -1302494 -2490013 -4427838 -4859366
7178 -4859366 -4228590 -3960223 -3685428 -2054848 562035 2177524 1912134 909618 287399
7169 287399 -96304 -172956 1188759 4109804 6209629 5160288 1868097 -968504 -2714592
7160 -2714592 -4557213 -5768436 -3736577 1256822 4730672 3689332 858852 440553
7152 440553 1931115 1694216 -872171 -2861024 -3082653 -3562314 -5210686 -5892851 -4318999
7143d318999J687261n15624j884817j160456r7987M09070J242005J886014M60923
7134b292610k238692k651625J53128K527497J613377n06956n21286P98086Q7351
7125c031730l077320n090739k841547K430371O256890N415057J253282j655201
7117c40937o89155J785099J930348j02972r42811K43436M72752j685184l292165
7108b621589j773889P68049R69159n06558n31296J158335J745662j06287k580278
7099c478692l614977l038980j679072l25121L68666N40560J361124L103110L793102
7090b970280J813073r85580j348950O24432J683053M88546n84221L80813J704440
7081H05326Q90405j455415k534767j194401Q84080J541596N56017l60648M17319
$$ plain form
7143 -4318999 -2631738 -3147362 -5032179 -6192635 -6290622 -5881552 -4639547 -2753533 -2292610
7134 -2292610 -4531302 -7182927 -7029799 -4502302 -2888925 -3395881 -3917167 -3119081 -3031730
7125 -3031730 -6109050 -11199789 -14041336 -11610965 -5354075 60982 1314264 -340937
7117 -340937 -1030092 755007 2685355 2582383 1639572 1883008 2355760 670576 -2621589
7108 -2621589 -4395478 -3627429 -2658270 -3164828 -3696124 -2537789 -792127 -898414 -3478692
7099 -3478692 -7093669 -10132649 -11811721 -12136842 -11768176 -11227616 -9866492 -6763382 -2970280
7090 -2970280 -1157207 -2142787 -3491737 -2867305 -1184252 -695706 -1279927 -899114 805326
7081 805326 1695731 240316 -2294451 -3488852 -2604772 -1063176 -507159 -867807 -450488
7072d50488K421861L386338J986762l37661j303518q45743p09011j444959j834230
7063H69351j323243q85568r88498p79520l3655J40311m49364j49250J813175L482250
7053A695989K774722N02017j001828j103562q61930p38063k78083M79003J069441
7044B537706J654940K359446K086036j13605k796062l313866j351423O81193J110065
7035B854430Q51474J083258J041659m10457k329634k549893n81886J704159K313040
7026C976150J137017l94339j039992q27353o28826r47909j408921j547689j594315
7017c276177j866096j809828o76703R76948J728434J442315J585134K786488L554605
7008D445120K549318Q54988M19849J142177J329217N01274k68648o22415j356818
$$ plain form
7072 -450488 1971373 5357711 7344473 7006812 5703294 4857551 4148540 2703581 869351
7063 869351 -453892 -1339460 -2327958 -3107478 -3141133 -3000822 -3450186 -3599436 -1786261 1695989
7053 1695989 4470711 4972728 3970900 2867338 2005408 1267345 989262 1468265 2537706
7044 2537706 4192646 6552092 8638128 8524523 5728461 2414595 1063172 1744365 2854430
7035 2854430 3705904 4789162 5830821 5420364 3090730 540837 -41049 1663110 3976150
7026 3976150 5113167 4718828 3678836 2851483 2222657 1274748 -134173 -1681862 -3276177
7017 -3276177 -5142273 -6952101 -7628804 -6651856 -4923422 -3481107 -1895973 890515 4445120
7008 4445120 6994438 7849426 8269275 9411452 10740669 11241943 10973295 10350880 8994062
6999H994062k337169k181169p64887O2423o18042j187388k84718O90055j28684
6990B244483j806063j965692l62466J228638J823348J551387R8107k367741l446058
6981c002057j013482K759496L498610Q90803j086973p46009q34866k567503k658771
6972d760752N39240K782790M05719k948792j757128K136163K308378j657595l480998
6963f432975l65869K974249K294230k14614p53366L42753J027093J546368K489256
6954B907125K251150m2027j973678j515238m75089r39266j215045P38704K529673
6945B266309O74973l093137l801526o44482K268599K246316O04809j160404l316255
6936c954798n195780m608018j355058J794545K836775K555402K133350J664666
$$ plain form
6999 8994062 6656893 4475724 3710837 3773260 3155218 1967830 1683112 2373167 2244483
6990 2244483 438420 -1527272 -1889738 -661100 1162248 2713635 2811742 444001 -3002057
6981 -3002057 -4015539 -1256043 2242567 3133370 2046397 1300388 465522 -2101981 -4760752
6972 -4760752 -4221512 -1438722 -1033003 -3981795 -5738923 -3602760 -1294382 -2951977 -6432975
6963 -6432975 -6798844 -3824595 -1530365 -1744979 -2498345 -2155592 -1128499 417869 2907125
6954 2907125 5158275 5116248 3142570 1627332 1152243 212977 -1002068 -263364 2266309
6945 2266309 2941282 -151855 -3953381 -4597863 -2329264 -82948 521861 -638543 -3954798
6936 -3954798 -9150578 -13758596 -15113654 -13319109 -10482334 -7926932 -5793582 -4128916
6928d128916J691620L020177M136074K194708k213979m780935l516402j465717
6920e063370j337119j213878J283028L902463K945871n53500k093261j74771K344653
6911D0116L033177K487651J892285J009152n91995k392547l639968l815502k501803
6902d479434k75312Q42099k27152j416279j54381K258697J988882j382656l602004
6893f447540j687631J885619K985596J407279P3050K55637N30007m3447m21866
6884a463296L39258J539175K109438J995210J466644K25141j772556l356636l183607
6875b101229j492640J99961J126658J878686K681215K348282P9941k539608k983884
6866h02618j107417O38455O46775Q2358N28420J436393J442360Q77505R86755
$$ plain form
6928 -4128916 -2437296 582881 4718955 6913663 4699684 -81251 -3597653 -5063370
6920 -5063370 -6400489 -7614367 -6331339 -2428876 516995 -36505 -2129766 -2304537 40116
6911 40116 3073293 5560944 7453229 8462381 7870386 5477839 1837871 -1977631 -4479434
6902 -4479434 -4754746 -3912647 -4139799 -5556078 -5710459 -3451762 -1462880 -2845536 -6447540
6893 -6447540 -8135171 -6249552 -3263956 -1856677 -1783627 -1527990 -997983 -1041430 -1463296
6884 -1463296 -1124038 415137 2524575 4519785 5986429 6211570 4439014 1082378 -2101229
6875 -2101229 -3593869 -3393908 -2267250 -388564 2292651 4640933 4720874 2181266 -802618
6866 -802618 -1910035 -1271580 -624805 -542447 -14027 1422366 2864726 3742231 4728986
6857D728986J467314R82428j82617k65430R46929J425174n3963k061104k702169
6848D285548k038040j177086l66645O57433J492005J625352J435549J459397J384219
6839H757732Q44728L76786L75188K0817j319136k563464k570041k413310l644345
6830b135045m818599k838728J777910M278295K030341j380175j171437J631239
6822b626199J922284j551245m130618k045209K296110L955509J860514j146495
6814a465349k953607l732666l550080j760293P09989J353707l42714j532550J37712
6805a3135851L030426L810549K024527K29701J46388Q44424Q11044k7006q17302
6796c083100r93192n01456K55075N19457P2427j51853N13951P92198j001056l692172
$$ plain form
6857 4728986 6196300 7178728 6996111 6730681 7677610 9102784 9048821 6987717 4285548
6848 4285548 2247508 1070422 703777 1361210 2853215 4478567 5914116 7373513 8757732
6839 8757732 9602460 9979246 10354434 10375251 9056115 6492651 3922610 1509300 -2135045
6830 -2135045 -6953644 -9792372 -8014462 -3736167 -1705826 -3086001 -4257438 -2626199
6822 -2626199 -703915 -2255160 -6385778 -8430987 -6134877 -2179368 -318854 -1465349
6814 -1465349 -4418956 -8151622 -11701702 -13461995 -12752006 -11398299 -11741013 -13273563 -13135851
6805 -13135851 -10105425 -6294876 -4270349 -4040648 -3894260 -3049836 -2238792 -2265798 -3083100
6796 -3083100 -4076292 -4577748 -4322673 -3803216 -3730789 -3882642 -3368691 -2576493 -3577549 -7269721
6786g269721l784392j56091L856509M569854K408715L62747n18586j528379k909881
6777d969225k973694j063690J038901J786826K040168L054453L725227J897931
6769D536897k016719m753947m012648j130410R26358J212378J180721J934924
6761b122446K740649K615740J881026J077945m42990l141183n126710l637850
6753f155819Q83054M235821L217317m83571k560330j178829J793229L798866L855602
6744G405340K025234j270968m659914n936157l902728K53031L878377M945421
6736B737636L323033O03560j227749j463384j082873j200543j544821j227602
6728a082743n51585q00535k239890l566297l616211k505253p08446J799053M711868
$$ plain form
6786 -7269721 -11054113 -11210204 -7353695 -2783841 -375126 -12379 -530965 -2059344 -4969225
6777 -4969225 -7942919 -9006609 -7967708 -6180882 -4140714 -1086261 2638966 4536897
6769 4536897 2520178 -2233769 -6246417 -7376827 -6450469 -5238091 -4057370 -2122446
6761 -2122446 618203 3233943 5114969 6192914 5749924 2608741 -2517969 -6155819
6753 -6155819 -5272765 -1036944 2180373 1696802 -863528 -2042357 -249128 3549738 7405340
6744 7405340 9430574 8159606 3499692 -2436465 -6339193 -6086162 -2207785 2737636
6736 2737636 6060669 6664229 5436480 3973096 2890223 1689680 144859 -1082743
6728 -1082743 -1634328 -2434863 -4674753 -8241050 -11857261 -14362514 -15070960 -13271907 -8560039
6719h560039O566846N780305K426009j470051l452295k621118m85168L87938q73042
6710b300615k345098j664602J026430L520828M336712L587945J641035r63657
6702F838978k368304p85289K304976K920829k16143l659751m033882k409257j652110
6693c059953j682943m89364J606185K201189Q76079k27674Q916M11944J94081
6684a61540K06699Q71097J274060J050148R36222Q17260m06867k275147k730746
6675d18814j723118j956508m265765n131006j547456L855646N888916L654981
6667a643124Q91483J44238K16010l45886p37412j42430L12787l23795p68985L86293
6657b010821J809405Q49914k594177n474893n052575j737237J818546L554613
$$ plain form
6719 -8560039 -1993193 3787112 6213121 4743070 1290775 -1330343 -1815511 -1427573 -2300615
6710 -2300615 -4645713 -6310315 -5283885 -1763057 2573655 6161600 7802635 6838978
6702 6838978 4470674 3685385 5990361 8911190 8695047 5035296 1001414 -1407843 -3059953
6693 -3059953 -4742896 -5232260 -3626075 -1424886 -548807 -776481 -767565 -355621 -161540
6684 -161540 45159 916256 2190316 3240464 4176686 4993946 4587079 2311932 -418814
6675 -418814 -2141932 -4098440 -8364205 -13495211 -15042667 -11187021 -5298105 -1643124
6667 -1643124 -751641 -607403 -391393 -737279 -1474691 -1617121 -1304334 -1628129 -2397114 -2010821
6657 -2010821 -201416 648498 -1945679 -7420572 -12473147 -14210384 -12391838 -8837225
6649h837225L450956K663124J890966R03987m30864j303548q94853R2668M1761
6640b423028j076052j126976J176658L763046L450358L63173j892263r30272J366300
6631B670944J625281o23439k941569l470897k558455j201167K00605J224478J246970
6622c827249N67762L92181J001421J210371M06897k64188J66018P54752L16731
6613G24696l94572n6690N78495l22213k391096l193373j941653p96734j575907
6604i369047l033102k682993q3322K911080M351370L695946J776617J01259k28697
6595b560889N51283J254010J018712k91021k438855m381004m038625m43803L931361
6586g398831N207547K869551K47290l16647p8510n71258p08092O70955K003260
$$ plain form
6649 -8837225 -5386269 -2723145 -832179 71808 -359056 -1662604 -2557457 -2464789 -2423028
6640 -2423028 -3499080 -4626056 -3449398 313648 3764006 4127179 2234916 1304644 2670944
6631 2670944 4296225 3672786 731217 -2739680 -5298135 -6499302 -6298697 -5074219 -3827249
6622 -3827249 -3259487 -2867306 -1865885 -655514 -248617 -512805 -346787 407965 724696
6613 724696 330124 273434 851929 529716 -1861380 -5054753 -6996406 -7793140 -9369047
6604 -9369047 -12402149 -15085142 -15168464 -12257384 -7906014 -4210068 -2433451 -2332192 -2560889
6595 -2560889 -2009606 -755596 263116 -27905 -2466760 -6847764 -10886389 -11330192 -7398831
6586 -7398831 -2191284 678267 925557 608910 530400 -40858 -748950 -77995 1925265
6577A925265J524190N22227J049312K055012J137343j047082j657525k97141P42415
6568E954016N68990M92385P17850j10165j570237j345125N49670R99675j202545
6559E054514k968827j652531P98893J039839o71889j535169o31361N50805J039367
6550A023641J255710J416829J127629L60670n79061j589164k172622j304392P75005
6541C14245J834544M19054j760035k112195q18736L1261J12077R30415K356718
6532A307348K005608r51397l612609k645420J353189M355688L560374M45997j270160
6523D548618k24089J091655o586k371631k578618j07583J805270J235360L46798
6514C739194J108601J334966j533703m956058m147428M24671L205726J631827
$$ plain form
6577 1925265 3449455 3971682 5020994 7076006 8213349 7166267 5508742 5211601 5954016
6568 5954016 6523006 7015391 7733241 7623076 6052839 4707714 5257384 6257059 5054514
6559 5054514 2085687 433156 1232049 2271888 1599999 64830 -566531 -15726 1023641
6550 1023641 2279351 3696180 4823809 5184479 4605418 3016254 843632 -460760 314245
6541 314245 2148789 2567843 807808 -1304387 -2123123 -2091862 -1979785 -1049370 1307348
6532 1307348 3312956 2361559 -1251050 -3896470 -2543281 1812407 5372781 5818778 4548618
6523 4548618 4324529 5416184 5409598 3037967 459349 351766 2157036 3392396 3739194
6514 3739194 4847795 6182761 4649058 -307000 -4454428 -4029757 -824031 807796
6506H07796o43382j01546J487571R94896n88875k73157J621517K168474Q00068
6497F273362k3359J038776K407348K271454O44920j703435m178571n569917m368009
6488c207431r61388J952768K297372R48811J92030P62429J493829J263199J32762
6479D874381j221315k237977k559644k099477j223432m37700K63099J400526L149344
6470i2195M652933M483243J957209j916537m873930n068872k595662O20617K516060
6461c17134K434529J082120n67901j868696k308460j585748j73928Q13842Q04593
6452a686783L72408K14039Q8291m86235j008357n79204N08646J018519O55443
6443i03233L60407M39658p8784j504534k409183j677310l87187j94188q42524
$$ plain form
6506 807796 164414 62868 1550439 2545335 1956460 1683303 3304820 5473294 6273362
6497 6273362 6250003 7288779 9696127 11967581 12612501 10909066 6730495 1160578 -3207431
6488 -3207431 -4168819 -2216051 81321 1030132 1222162 1984591 3478420 4741619 4874381
6479 4874381 3653066 1415089 -1144555 -3244032 -4467464 -4905164 -4642065 -3241539 -92195
6470 -92195 4560738 9043981 11001190 9084653 4210723 -858149 -3453811 -2833194 -317134
6461 -317134 2117395 3199515 2631614 762918 -1545542 -3131290 -3305218 -2491376 -1686783
6452 -1686783 -1314375 -1100336 -1012045 -1498280 -2506637 -3085841 -2577195 -1558676 -903233
6443 -903233 -542826 -103168 -181952 -1686486 -4095669 -5772979 -6160166 -6354354 -7196878
6434g196878r26899l09084J17288M98736J671948K878189K196475k61760j845737
6425c177722j057900K26459l26647j967392k072095K4807K290521K858717K095545
6416a105707J582475K047215K686782K150684P2225k333598l460915l020949j917967
6407c299755n77440J301112L037898K788169K66581j836558r72101J667162K646766
6398E021834Q65199j459963k204520j526820l86169Q82184J737972J261301j4746
6389D176272M9243K034958L357238J747079j073977j634075K25684J310558R205
6380A0202185j596593j338728j00994J68820l77810k40615P28736J258139O27951
6371I331091q05467k441225l415893k552041K5781J912224R65014j593919k608235
$$ plain form
6434 -7196878 -8123777 -8432861 -8315573 -7816837 -6144889 -3266700 -1070225 -1331985 -3177722
6425 -3177722 -4235622 -4009163 -4335810 -6303202 -8375297 -8350490 -6059969 -3201252 -1105707
6416 -1105707 476768 2523983 5210765 7361449 7433674 5100076 1639161 -1381788 -3299755
6407 -3299755 -3877195 -2576083 461815 3249984 3516565 1680007 707906 2375068 5021834
6398 5021834 5887033 4427070 2222550 695730 309561 1191745 2929717 4191018 4176272
6389 4176272 4225515 6260473 9617711 11364790 10290813 8656738 8882422 10192980 10202185
6380 10202185 8605592 7266864 7165870 7334690 6956880 6716265 7445001 8703140 9331091
6371 9331091 8525624 6084399 2668506 116465 142246 2054470 3019484 1425565 -1182670
6362a182670j218641N34313J200641J406851J455882K60638k127507l405425k088059
6353e163977K89609J648986K078420K296731J532848o38364k117214q62597J463336
6344E27778J458490r82322k567357j432807P61032J839370J629740Q80975p9710
6335B035189q23491p25927m9938K60161N6022j63688o57034j898101k934072k400125
6325g301004r16085j60647L1034Q67630J431023k0781j696439J54284M380226
6316c230759M885944q9792l855478n80725N627555O485179J416550k698697k442263
6307E517514j776650m106718o479163m657613J25025L087845K414727O71709N99656
6298d603668J982104K756014J763380k5130o44362N95278K168043K072984K03855
$$ plain form
6362 -1182670 -2401311 -1866998 -666357 740494 2196376 2457014 329507 -3075918 -5163977
6353 -5163977 -4874368 -3225382 -1146962 1149769 2682617 2044253 -72961 -935558 527778
6344 527778 1986268 1003946 -1563411 -2996218 -2235186 -395816 1233924 2114899 2035189
6335 2035189 1211698 485771 435833 695994 752016 588328 -68706 -1966807 -4900879 -7301004
6325 -7301004 -8217089 -8377736 -8346702 -7479072 -6048049 -6068830 -7765269 -7610985 -3230759
6316 -3230759 1655185 1565393 -2290085 -2870810 2756745 9241924 10658474 7959777 5517514
6307 5517514 3740864 -365854 -6845017 -11502630 -11377605 -8289760 -5875033 -5203324 -4603668
6298 -4603668 -2621564 134450 1897830 1872700 1228338 1823616 3991659 6064643 6268498
6289F268498j707947k208831j364323j95802K42750m89181j692513k040343j271958
6280d459650n77595n25573M6704J692801K461413N57881k274682k751865p48806
6271f579372R34122J182826J646003K873044K825362M85787j983073k329571j105392
6262b050264M5906O82707N75175j081169l386283l092814J008615N007501M430310
6253B139684N89876j233611N39556J865075m31403l859386m018075o97921K321047
6244b785158K357479L40337j387544j747349j162107n71675o40996j023270l24625
6235f944908K101848M336841L552392Q6148k091943m94062K087360J372191j985144
6226B020723l112154o7482L343358L182885N23864j249957j502327j661648j485284
$$ plain form
6289 6268498 4560551 2351720 987397 791595 1034345 545164 -1147349 -3187692 -4459650
6280 -4459650 -5037245 -5562818 -5516114 -3823313 -1361900 -804019 -3078701 -5830566 -6579372
6271 -6579372 -5645250 -4462424 -2816421 56623 2881985 3367772 1384699 -944872 -2050264
6262 -2050264 -2004358 -1321651 -746476 -1827645 -5213928 -8306742 -7298127 -2290626 2139684
6253 2139684 2729560 1495949 2035505 3900580 3469177 -390209 -4408284 -5106205 -2785158
6244 -2785158 -427679 -87342 -1474886 -3222235 -4384342 -4956017 -5597013 -6620283 -6944908
6235 -6944908 -4843060 -506219 3046173 3132321 1040378 546316 2633676 4005867 2020723
6226 2020723 -1091431 -1158913 2184445 5367330 5891194 4641237 3138910 1477262 -8022
6217h022L58993K823929L092937O98879j812178k472715j594269J02155K226817
6208C416526L309841J635397j687619l235813j910781m31748r04458j597685q6057
6199a492397K624404L514400J719006r17499k580842k899341k214766j069740
6191c316775j59527K77397O91267J252472J406956R39443M24882P869r56801k223564
6181a656381k099530J88494K806654L369389J743874l97265j827597k273262j573255
6172a718879J91847K110515K968627K104992m63892l745367n436119l691842K3330
6163g656788J857624N08641r35706K43597K185423J641895n60779p94012J443862
6154b066243K586067M23147k678490l221698r80120J542272K570803K416785K021474
$$ plain form
6217 -8022 350971 3174900 6267837 6966716 5154538 2681823 1087554 1189709 3416526
6208 3416526 6726367 8361764 6674145 3438332 1527551 1095803 191345 -1406340 -1492397
6199 -1492397 1132007 4646407 6365413 5447914 2867072 -32269 -2247035 -3316775
6191 -3316775 -3476302 -3198905 -2507638 -1255166 151790 1091233 1516115 1523984 567183 -1656381
6181 -1656381 -3755911 -3567417 -760763 2608626 4352500 3955235 2127638 -145624 -1718879
6172 -1718879 -1527032 583483 3552110 5657102 5193210 1447843 -3988276 -7680118 -7656788
6163 -7656788 -5799164 -5290523 -6226229 -5982632 -3797209 -2155314 -2716093 -3510105 -2066243
6154 -2066243 519824 942971 -1735519 -4957217 -5937337 -4395065 -1824262 592523 2613997
6145B613997J478266K71422j454772k414362j533966L28003J068522J34119n96959
6136a05730M47965K171094K440092J020908o61012j820435k557255k341021l51915
6127a757309K452636L431802J266343k152158l680157k341200j18763O55967P3282
6118b169557M1732J092781J403775L3314o88330J580743M767002M567844P32951
6109A1362255k588323l081093k668822k731467j686699N61627O82111k266158
6101b416569l701951m73058L352114K845485M64338J556156M651902L734172j279519
6092H733070m154808k499236p30639j660610k286066k99330J635794J146611J82725
6083F7511O41252R23032r349Q6336K084344K794045N22105j249339J76845J530055
$$ plain form
6145 2613997 4092263 4363685 2908913 494551 -1039415 -711412 357110 491229 -105730
6136 -105730 342235 2513329 4953421 5974329 5313317 3492882 935627 -1405394 -1757309
6127 -1757309 695327 4127129 5393472 3241314 -438843 -2780043 -2898806 -2242839 -2169557
6118 -2169557 -2127825 -1035044 368731 402045 -286285 1294458 6061460 10629304 11362255
6109 11362255 8773932 5692839 3024017 292550 -1394149 -832522 -150411 -2416569
6101 -2416569 -6118520 -6591578 -3239464 -393979 70359 1626515 6278417 10012589 8733070
6092 8733070 4578262 2079026 1348387 -312223 -2598289 -2897619 -1261825 -115214 67511
6083 67511 708763 1631795 1622446 1708782 3793126 6587171 7109276 5859937 6036782 7566837
6073G566837q25892m048020l116159R82752L144192K185168J270994J561439J054316
6064I775627o05472j328695q25081j105060k276138j941692N43834K876072L516005
6055H629400L248578K485536M31946k218490k998752j247074P62245J313538J299544
6046A1706471J718052J632561L2498k197244l429285l031558j325896P00848J383022
6037G189469j28197k148111k216661o62042l4301q07768o14385J389659K533041
6028D500704P59686j879732k126435k0737J732122J546314Q7357j291201j490213
6019A817865j26779J343396K85775l467169o025452l888020J079773L892958L079926
6010b007727J906911K798604L925200K760586K43958q72636n5629J035055J539769
$$ plain form
6073 7566837 6740945 2692925 -423234 559518 3703710 5888878 7159872 8721311 9775627
6064 9775627 9170155 7841460 7016379 5911319 3635181 1693489 2237323 5113395 8629400
6055 8629400 11877978 14363514 14795460 12576970 9578218 8331144 9093389 10406927 11706471
6046 11706471 13424523 15057084 15089582 12892338 9463053 6431495 5105599 5806447 7189469
6037 7189469 7061272 4913161 2696500 2034458 2000157 1192389 578004 1967663 4500704
6028 4500704 5260390 3380658 1254223 1233486 2965608 4511922 4599279 3308078 1817865
6019 1817865 1691086 3034482 3320257 -146912 -6172364 -10060384 -8980611 -5087653 -2007727
6010 -2007727 -100816 2697788 6622988 9383574 9627532 8754896 8699267 9734322 11274091
6001A1274091J923872J918711L27976k749086n292904n503160l359933k5713K814501
5992A328355L151542L52722k955162l108718l49933J108024o97007k300421l42279
5983c812877K763431K522003m56750j651504N5166J306364N08565j7091Q59501
5974B076808Q01256j242130k525260j224761M21090M03293L58656J573242J656318
5965B298512q61056k440548J29024L528191K576163j293584k308641L06669J699392
5956C634122j54585j782108r69727k07989j381731k198733n67443J682452K219238
5947B73496J798250J728705R75538j292230k969341j895890N27995J425314N89114
5938A160951K6862O26589J542942J913772J312084n29611k813858l549512j890143
$$ plain form
6001 11274091 13197963 15116674 15444650 12695564 7402660 1899500 -1460433 -1486146 1328355
5992 1328355 4479897 4832619 1877457 -1231261 -1581194 -473170 -1170177 -3470598 -3812877
5983 -3812877 -1049446 1472557 1015807 -635697 -580531 725833 1234398 1217307 2076808
5974 2076808 2878064 1635934 -889326 -2114087 -1692997 -1289704 -931048 642194 2298512
5965 2298512 1437456 -1003092 -874068 2654123 5230286 3936702 1628061 1934730 3634122
5956 3634122 3479537 1697429 727702 519713 -862018 -3060751 -3628194 -1945742 273496
5947 273496 2071746 3800451 4775989 3483759 514418 -1381472 -853477 571837 1160951
5938 1160951 1187813 1814402 3357344 5271116 6583200 6053589 3239731 -309781 -2199924
5929b199924L72153J023928J19734q09164j100237j121447j016959o15988j411
5920e349315O65861J273160J414126R23953P13734J529477K081592O55361j470791
5911B437158j189514J388855K514925N86482j346369p67302L93534k15908j008779
5902B793082K74969J943612J162306r11920j229955l50905j138214l023746k509692
5893b990463P06955K796132J671894k65260l23428J050307K218531K665800K138205
5884I668673J27283k625903m293947m306268l424895j519360J822649M431296
5876a20472L075273j252723l450553j307955J389425R20816r80125q42331P73315
5867a795330J103979L44402O92679J723295J076749q50559j187127K69560K99725
$$ plain form
5929 -2199924 -1827771 -803843 -684109 -1493273 -2593510 -3714957 -4731916 -5347904 -5349315
5920 -5349315 -4683454 -3410294 -1996168 -1072215 -358481 1170996 3252588 3907949 2437158
5911 2437158 1247644 2636499 5151424 5737906 4391537 3624235 4017769 3801861 2793082
5902 2793082 3068051 5011663 6173969 5262049 4032094 3681189 2542975 -480771 -2990463
5893 -2990463 -2283508 512624 2184518 1919258 1595830 2646137 4864668 7530468 9668673
5884 9668673 9795956 7170053 2876106 -1430162 -4855057 -6374417 -4551768 -120472
5876 -120472 2954801 1702078 -1748475 -3056430 -1667005 -746189 -1726314 -2568645 -1795330
5867 -1795330 -691351 -346949 345730 2069025 3145774 2295215 1108088 1377648 1677373
5858A677373k313979m312715k789902M57912J843158J170427J130248K666010
5850d71468L646456K262957m34169k154918k093382j075425P5042J096660J495767
5841B347520M66107j824679l556453k773722L43502L268392L494495J025460j566647
5832A223975j612739Q96011L026871J932775j655847l907281k553885R4823L66242
5823b189055j468270j617217J398135M169860L044869r01560l564058k961615
5815d088911n11755J773607K996970K807759J448993L35872O52081J468940J166496
5806H050052L96660J143073K803498K261494j157429l800859k660140K42796R33627
5797H212772q63493k037748j041539M38805O01118k78319j115487j400993q45352
$$ plain form
5858 1677373 -636606 -4949321 -7739223 -7281311 -5438153 -4267726 -3137478 -471468
5850 -471468 3174988 5437945 5003776 2848858 755476 -319949 -244907 851753 2347520
5841 2347520 2813627 988948 -2567505 -5341227 -4997725 -1729333 1765162 2790622 1223975
5832 1223975 -388764 507247 3534118 5466893 3811046 -96235 -2650120 -2555297 -2189055
5823 -2189055 -3657325 -5274542 -3876407 293453 3338322 2436762 -1127296 -4088911
5815 -4088911 -4600666 -2827059 169911 2977670 4426663 4762535 5414616 6883556 8050052
5806 8050052 8446712 9589785 12393283 14654777 13497348 9696489 7036349 7279145 8212772
5797 8212772 7349279 5311531 4269992 4708797 5309915 5031596 3916109 2515116 1669764
5788A669764O04036J917761J726103L69316k90444L83742P41835p03858l000447
5779C417808l844472k245593M83776J956789Q82544j431924k160342m03956J317804
5770b027566N54531j242894r79993Q03504O17675j775441k155495J460409N020279
5761B75009M235259P05393j425459k030677l629007n346459l583904J423706M637750
5752d738389K984118p32300k217922q91361J060801K295345K855949K612027J128662
5743D356930j236611l030328k619795J29757K701084J823712k109437m224514
5735d209202j140900L828332M737181J108875k041043j762633j58303N52567J096831
5726B011705J885799J314347n63105q85398J011281J552961j147231l370631j546726
$$ plain form
5788 1669764 2273800 4191561 5917664 6286980 5996536 6380278 7122113 6418255 3417808
5779 3417808 -426664 -2672257 -2188481 -231692 650852 -781072 -2941414 -3345370 -2027566
5770 -2027566 -1473035 -2715929 -3695922 -2892418 -2274743 -4050184 -6205679 -4745270 275009
5761 275009 4510268 5215661 3790202 1759525 -1869482 -7215941 -10799845 -9376139 -4738389
5752 -4738389 -1754271 -2486571 -4704493 -5595854 -4535053 -2239708 616241 3228268 4356930
5743 4356930 3120319 89991 -2529804 -2400047 301037 2124749 15312 -4209202
5735 -4209202 -5350102 -1521770 3215411 4324286 2283243 520610 362307 914874 2011705
5726 2011705 3897504 5211851 4648746 3763348 4774629 6327590 5180359 1809728 263002
5717B63002J694598J718779p25549j326092M74083J204917l51635j590121j012057
5708C49925l78507j021694j509122k69113J913281L099768K314218R2397j828080
5699B763073j742423j93346J09372j797579l024587j103094J563566J084297j541187
5690c881908j848840Q10610K280522N47818j075244M22540K998216L125205J130884
5681D509803m0842M62942P76473m57296k424351l433610k521642k1311K624464
5672e25370L896976L499304K342477J303128N60492j44913j343430l322746m833505
5663A432413l428140J173690N102542M174740p28292m647519m741585k797961
5655d460112j424150p37704J49565Q99815P61157M5670m32980l99231K4124N80989
$$ plain form
5717 263002 1957600 3676379 2950830 1624738 2098821 3303738 2952103 1361982 349925
5708 349925 -28582 -1050276 -2559398 -2828511 -915230 2184538 4498756 4591153 2763073
5699 2763073 1020650 827304 936676 -860903 -3885490 -4988584 -3425018 -2340721 -3881908
5690 -3881908 -5730748 -4920138 -2639616 -2091798 -3167042 -2744502 253714 3378919 4509803
5681 4509803 4468961 4931903 5708376 5251080 2826729 -606881 -3128523 -3149834 -525370
5672 -525370 3371606 6870910 9213387 10516515 11077007 10932094 9588664 6265918 1432413
5663 1432413 -1995727 -822037 4280505 8455245 7726953 3079434 -1662151 -4460112
5655 -4460112 -5884262 -6621966 -6472401 -5572586 -4811429 -4765759 -5198739 -5597970 -5573846 -4992857
5645d992857Q25385O58946N97545O10478k45007j700505j550009P21663J715934
5636c358427j021479l911729j903593L071401M099156o0908k719497M54599N004680
5627c45797M960316J391241p30691l61935k29607j288042j941000j565516j071138
5618a182169o64222J08567Q34420R35256Q78494R79688N29429l08659J16517J751014
5608C978335J574633j884493n160623m090857L62397L626649L445462J426077
5600C277580q2406l5710J198567J612790r38165m974777n534386p48145M415944
5591a808708M518059J273707N24170L480102N830293M644626J363531j920312
5583A7905468m674753o068992m962434k510716j399153j833838j355806Q83923
$$ plain form
5645 -4992857 -4167472 -3508526 -2910981 -2300503 -2545510 -4246015 -5796024 -5074361 -3358427
5636 -3358427 -4379906 -8291635 -10195228 -7123827 -3024671 -3085579 -5805076 -5350477 -345797
5627 -345797 4614519 6005760 5275069 4913134 4683527 3395485 1454485 -111031 -1182169
5618 -1182169 -1846391 -1737824 -903404 31852 910346 1890034 2419463 2110804 2227321 3978335
5608 3978335 5552968 3668475 -1492148 -5583005 -5220608 -1593959 1851503 3277580
5600 3277580 3195174 3159464 4358031 5970821 5032656 57879 -5476507 -6224652 -1808708
5591 -1808708 2709351 3983058 4507228 7987330 13817623 18462249 19825780 17905468
5583 17905468 13230715 7161723 2199289 -311427 -1710580 -3544418 -4900224 -4016301
5575d016301K708647K377953O91918r77821k282308l000319k729326j820649q85428
5566i933634L21061J767889J955238J73634j381233o15889Q22279L48836p02476
5557g244295O92101L414163L609177J329112L42943J251101N82441k321524l442159
5548a786940r87808J440922J143761N10767J814318K809578J346637q9365J139446
5539G341316K532877M56953l411398m541997k423567k71179O07901J456412K004273
5530C751591M73659k366994l349215j680002j6966O457L7968J498631K678982
5521A034111J398943j178225j711489P42648L260947K881580O68435K29087K269517
5512I595554L080805Q8835l407532k428971J968728L627163K15255l554483l346092
$$ plain form
5575 -4016301 -1307654 1070299 1762217 784396 -1497912 -4498231 -7227557 -9048206 -9933634
5566 -9933634 -9612573 -7844684 -5889446 -5715812 -7097045 -7712934 -6890655 -6541819 -7244295
5557 -7244295 -6552194 -3138031 471146 1800258 2143201 3394302 3976743 1655219 -1786940
5548 -1786940 -2774748 -1333826 -190065 320702 2135020 4944598 6291235 6201870 7341316
5539 7341316 9874193 10331146 6919748 2377751 -45816 -316995 290906 1747318 3751591
5530 3751591 4225250 1858256 -1490959 -3170961 -3187927 -3181470 -3143502 -1644871 1034111
5521 1034111 2433054 1254829 -456660 285988 3546935 6428515 7096950 7326037 9595554
5512 9595554 12676359 12765194 9357662 6928691 8897419 12524582 12739837 9185354 5839262
5503E839262j177113q83322j651184m24578J991822K149941m834r95343M66232
5494E310883J709604N80019j712870l106198l317784k952859k144784j159686
5486f793675p73059j093140j076890J10820J944813L073688K613068J005517j80091
5477a168949J52406J091467Q24397n99053j306682p70374n44351r11955K00437
5468c032657L048309M044175J036159k269479j343256J888448J857444j694777
5460C534366l286496n49394K221865J248232j108134j022463N23295J46228j875383
5451a67884k230608j76382J372467M65256j210421j088545Q96746K709979K800739
5442C371347J419744o0966n47053j27563J88310l43674j405246k079243j795148
$$ plain form
5503 5839262 4662149 3778827 2127643 1703065 3694887 5844828 5839994 4844651 5310883
5494 5310883 7020487 7600506 5887636 2781438 -536346 -3489205 -5633989 -6793675
5486 -6793675 -7566734 -8659874 -9736764 -9625944 -7681131 -4607443 -1994375 -988858 -1168949
5477 -1168949 -1016543 74924 899321 300268 -1006414 -1776788 -2321139 -3233094 -3032657
5468 -3032657 15652 4059827 5095986 2826507 1483251 3371699 5229143 3534366
5460 3534366 247870 -301524 1920341 3168573 2060439 1037976 1561271 1707499 -167884
5451 -167884 -2398492 -2574874 -1202407 -737151 -1947572 -3036117 -2139371 570608 3371347
5442 3371347 4791091 4730125 4183072 4055509 4243819 3900145 2494899 415656 -1379492
5433a379492o10904J044164K490503K942636K103209O72679j39702J59296Q11530
5424H093919P45412j09225q77733j090270j256388j699262j622582k72660J486664
5415C397875J931460N95061j470579l205620l934064k682346Q11973M260155M340392
5406D044307R57709k056289j678476P20440J873100R32339l80124n49192N31019
5397D394833K153074L188965K735999J318208L43079j92229j636789l658745l841529
5388D804866j660501o9175j107859k681171k159557m13482O40936J633858L314473
5379B302388L384426K01147k765205j364554K098399J931514j723677l048179
5371A016259n7726K525901J321149r28134j069706n45319j397409j935117k56410
$$ plain form
5433 -1379492 -1990396 -946232 1544271 4486907 6590116 7262795 7123093 7282389 8093919
5424 8093919 8839331 8730106 7852373 6762103 5505715 3806453 2183871 1911211 3397875
5415 3397875 5329335 5924396 4453817 1248197 -2685867 -5368213 -4556240 -296085 4044307
5406 4044307 5002016 2945727 1267251 1987691 3860791 4793130 4413006 3863814 4394833
5397 4394833 6547907 9736872 12472871 13791079 14134158 13941929 12305140 8646395 4804866
5388 4804866 3144365 3075190 1967331 -713840 -2873397 -3286879 -2645943 -1012085 2302388
5379 2302388 5686814 5887961 3122756 1758202 3856601 5788115 4064438 1016259
5371 1016259 958533 3484434 4805583 3877449 2807743 2262424 865015 -1070102 -1326512
5362a326512J488713L62533k353447l083026j140833J083354J780231J084205
5354b104782n2064n16805J91502P74012m23778k091025r78879K675051M412597
5345A885829K144526m82135p9670J114902l39207k892111k927928j125274p23655
5336c424723j357123q6342K422378K314524q22608k930717j859396j07332M3688
5327e807651j52321Q09005J842535J870945K159547L713645M811705L551360J038694
5318A3837464k60347p5094j44683j299551k588608k989955k564586j915622j420122
5309E78896j125501r71614r53772r96588o95822L03256J433650J527184N19887
5300c80424k07661Q0887M69585N82707J862156M602385N660062K333114k699171
$$ plain form
5362 -1326512 162201 524734 -1828713 -4911739 -6052572 -4969218 -3188987 -2104782
5354 -2104782 -2156846 -2673651 -2482149 -1708137 -2131915 -4222940 -5201819 -2526768 1885829
5345 1885829 4030355 3548220 3468550 4583452 4244245 1352134 -1575794 -2701068 -3424723
5336 -3424723 -4781846 -4868188 -2445810 -131286 -953894 -3884611 -5744007 -5851339 -5807651
5327 -5807651 -5959972 -5150967 -3308432 -1437487 722060 4435705 9247410 12798770 13837464
5318 13837464 13577117 13502023 13357340 12057789 9469181 6479226 3914640 1999018 578896
5309 578896 -546605 -1518219 -2471991 -3468579 -4164401 -3861145 -2427495 -900311 -380424
5300 -380424 -588085 -507198 -37613 545094 2407250 7009635 12669697 15002811 12303640
5291A2303640m185300j705403n8783j697819l241261j394725J714672K162290
5283C897311K07806q50970O8837J159387J220566O83523k66962j682755k236019
5274B200724m06509K591478L654020J984894N0641l19185l78123j768774l489804
5265D119362l448147j740868l41145o6279J89096J119820J665572P59053p61282
5256A495182j137266j61055M54219o27930k487377k960606j250953J120332K128504
5247c426950J529485Q45187J221708J999154J814278N85005m94130q41815j208109
5238B023813j998701k102023o36497J000468O62501j208732j893967m71354O58866
5229c965626m60857k134349j605638O13387J559021K83019j127544r78530J21196
$$ plain form
5291 12303640 8118340 6412937 6354154 4656335 1415074 20349 1735021 3897311
5283 3897311 4105117 3254147 3322984 4482371 5702937 6386460 6119498 4436743 2200724
5274 2200724 1794215 4385693 8039713 10024607 10075248 9756063 9377940 7609166 4119362
5265 4119362 671215 -1069653 -1410798 -1477077 -1287981 -168161 1497411 2256464 1495182
5256 1495182 357916 196861 651080 23150 -2464227 -5424833 -6675786 -5555454 -3426950
5247 -3426950 -1897465 -1052278 169430 2168584 3982862 4567867 4073737 3231922 2023813
5238 2023813 25112 -2076911 -2713408 -1712940 -1050439 -2259171 -4153138 -4624492 -3965626
5229 -3965626 -4426483 -6560832 -8166470 -7553083 -5994062 -5711043 -6838587 -7817117 -7695921
5220g695921J268163K714467M183268L890837J030394k154314k712183p64539
5212b39828P49542o7130j859639j883897P85006M165936N160820K546447j600455
5203G756802l878659l186681j613661j264282j365021J70365L076938M559865
5195D255666K996696J56376j150480n22096Q6789o93158k008115k180556q00772
5186A40350J048415K116633J955378Q03769q20131k231740k744096k100737o20139
5177b452298J234136L130449M491583M333721K188120q91204k906927k712472
5169F415108r11123R59772J662390Q28442r01092k146857j945331q81635l65281
5160B714393o26775m79042M95726Q38039o29046k592421k721239p77749J293058
$$ plain form
5220 -7695921 -6427758 -3713291 469977 4360814 5391208 3236894 524711 -239828
5212 -239828 509714 442584 -1417055 -3300952 -2515946 1649990 6810810 9357257 7756802
5203 7756802 3878143 691462 -922199 -2186481 -3551502 -3381137 -304199 4255666
5195 4255666 7252362 7408738 6258258 5736162 5822951 5129793 3121678 941122 140350
5186 140350 1188765 3305398 5260776 6064545 5244414 3012674 268578 -1832159 -2452298
5177 -2452298 -1218162 1912287 6403870 10737591 12925711 12034507 9127580 6415108
5169 6415108 5503985 6463757 8126147 8954589 8053497 5906640 3961309 3079674 2714393
5160 2714393 2087618 1608576 2104302 2942341 2313295 -279126 -3000365 -3778114 -2485056
5151b485056K045638J686083P58833m14361q33953N41782K612131K682222K90240
5142F883559j591304p84741O59076m59542l547501n171592m021972j900778j83202
5133a0117997J445796K561898J758091k42715n27305J475456K568339Q70839q63120
5124a070718J70733J881982Q10062j542917o98814L154103M501730M70334m774965
5115B901530n633159j984083J864104K997976K180063J426561J468533J492333
5107F713858L56698j812746l146354k011394N57455J842081J032055N4575L38522
5098C924750Q04327J30955r12475r52373l53277l90776j085300j391545q57608
5089a083322J08708R68613J134597J91389j119597j217787Q8419R40542J08473
$$ plain form
5151 -2485056 -439418 1246665 2005498 1591137 757184 1298966 3911097 6593319 6883559
5142 6883559 5292255 4507514 5166590 4707048 1159547 -4012045 -8034017 -9934795 -10117997
5133 -10117997 -8672201 -6110303 -4352212 -4594927 -5122232 -3646776 -1078437 -207598 -1070718
5124 -1070718 -899985 981997 1792059 249142 -449672 2704431 7206161 7676495 2901530
5115 2901530 -2731629 -4715712 -2851608 146368 2326431 3752992 5221525 6713858
5107 6713858 7070556 5257810 2111456 100062 657517 2499598 3531653 3586228 3924750
5098 3924750 4729077 4860032 3947557 2995184 2641907 2251131 1165831 -225714 -1083322
5089 -1083322 -974614 -6001 1128596 1319985 200388 -1017399 -928980 11562 120035
5080A20035j029878o17454Q52559J578446J299845J143613J235791M82423j334589
5071C730791k912791l103976k079892o92684M43171J134102J439487J340369N68878
5062a32545o21066o66362J825506N361802O172602K764605j686137l075225j278368
5053H664812M04693k07522k006049k566689r10637J518003J982599p25710m238215
5044A915285m810510k067947N41109Q94200R31099K380570K965152K70737l046000
5035b6305k330051J897816M342249K488784m72147j109156l20819p08295k228330
5026A533746k674956j043732J272833K099312O14821j671126k171000j06002K443359
5017B97255L246045K575315J837336J071289j05778n79880M53757J001975j089294
$$ plain form
5080 120035 -909843 -1527297 -674738 903708 2203553 3347166 4582957 5065380 3730791
5071 3730791 818000 -2285976 -4365868 -5058552 -4615381 -3481279 -2041792 -701423 -132545
5062 -132545 -753611 -1419973 405533 5767335 11939937 14704542 13018405 9943180 8664812
5053 8664812 9069505 8861983 6855934 4289245 3378608 4896611 6879210 6153500 1915285
5044 1915285 -2895225 -4963172 -4422063 -3527863 -2596764 -216194 2748958 3019695 -26305
5035 -26305 -2356356 -458540 3883709 6372493 5900346 4791190 4470371 3762076 1533746
5026 1533746 -1141210 -2184942 -912109 1187203 1802024 130898 -2040102 -2146104 297255
5017 297255 3543300 6118615 7955951 9027240 8921462 8341582 8795339 9797314 8708020
5008H708020l847722l341387P1904J784425j61304k335675j564932M96237P77147
4999E86713k75046j13506J464384K230849J090615o61670j561496j722709j962092
4990i23958k166658j323390P94339K687068K803592J760145J249653Q86564j174921
4981D592434l825018k868438K433926O362129M006832j420373l127110l38525
4973E815857J871259R33700o66129q52060n53608m50370R0024M15678o27746j328842
4963D647763P57384L545865K643604j208475k843418j133788k46438j572250j505773
4954C084474R21338J572739p97576j413950J868979L922166J131285j899148k33266
4945H157041K769629J403895k598564l375137o13818J050044Q5416q91434p19198
$$ plain form
5008 8708020 4860298 1518911 1590815 3375240 3213936 878261 -686671 -190434 586713
4999 586713 311667 198161 1662545 3893394 4984009 4322339 2760843 1038134 -923958
4990 -923958 -3090616 -4414006 -3619667 -932599 1870993 3631138 4880791 5767355 4592434
4981 4592434 767416 -2101022 332904 6695033 10701865 9281492 6154382 5815857
4973 5815857 7687116 8620816 7954687 7102627 6549019 6098649 6188673 6604351 5976605 4647763
4963 4647763 5405147 8951012 11594616 10386141 7542723 6408935 6162497 4590247 3084474
4954 3084474 4005812 5578551 4780975 3367025 5236004 9158170 10289455 8390307 8157041
4945 8157041 10926670 12330565 9732001 6356864 5743046 6793090 6878506 5987072 5267874
4936E267874o88430q39617p0558P75018p6215j978615k704617j541313Q15396
4927a041077L550122M872883K704381j589265l548518j920766m49356j028085
4919A550319m29057K774406M089557P66638k283307k39988L214593K012322k245744
4910I209739l549653j253738N17840M88324P11482J753961K905845M493898N438038
4901B0715736K596669k893089m200925Q86655M841542K011693k070330p57747
4893B1130204K326227J302563o26935J464735L503097P16641j561111J898274
4885C0153695M255225p89395m549102J577774P719577K647273k649318O170977
4877D4536706J6559111R981417J865343J7478878L2105236r142312r7392950j42994497
$$ plain form
4936 5267874 4579444 3739827 3669269 4444287 4368072 2389457 -315160 -1856473 -1041077
4927 -1041077 2509045 7381928 10086309 8497044 4948526 3027760 2578404 1550319
4919 1550319 1121262 3895668 7985225 8751863 6468556 6228568 9443161 11455483 9209739
4910 9209739 5660086 4406348 4924188 5412512 6123994 7877955 10783800 15277698 20715736
4901 20715736 23312405 20419316 16218391 17105046 21946588 23958281 21887951 21130204
4893 21130204 23456431 24758994 24132059 25596794 29099891 29816532 28255421 30153695
4885 30153695 34408920 33619525 29070423 30648197 38367774 41015047 38365729 44536706
4877 44536706 61095817 71077234 72942577 90421455 122526691 113384379 15991429 -127003068
4869a27003068q7512099J2697775O0177822L8857217J0159569J1002934J7773481
4862f3846369P892394k553823K602833R376279L297668m128661M17993P666570
4854c9275116N262049J01145K400988N725881J069915m627682j608044M206493
4846b6744371K692708j830479P0722M634874K367796l735133l433287K622968
4838b3354202M867378J303186j415578q26626m84442q29453Q56722K866587J283794
4829a5732634j699811q33296K476880K486620m17207o96224J897478K008928j268646
4820a1777912k747702l52814J904622J427241M51073N07045r3857j584747j412204
4811a3679255O12269J135621q63337j892371K52203K863833K897056J497750J371941
$$ plain form
4869 -127003068 -214515167 -201817392 -141639570 -102782353 -92622784 -81619850 -63846369
4862 -63846369 -55953975 -58507798 -55904965 -46528686 -43231018 -47359679 -46941686 -39275116
4854 -39275116 -34013067 -33911922 -31510934 -25785053 -24715138 -29342820 -30950864 -26744371
4846 -26744371 -24051663 -25882142 -25811420 -21176546 -18808750 -22543883 -25977170 -23354202
4838 -23354202 -18486824 -17183638 -18599216 -19425842 -19910284 -20739737 -19883015 -17016428 -15732634
4829 -15732634 -17432445 -18265741 -15788861 -13302241 -13719448 -14415672 -12518194 -10509266 -11777912
4820 -11777912 -14525614 -14878428 -12973806 -11546565 -11095492 -10588447 -10682304 -12267051 -13679255
4811 -13679255 -13066986 -11931365 -12794702 -14687073 -14434870 -11571037 -8673981 -7176231 -5804290
4802e804290K392122K400699O84313j445096k632000k643069j961459r99868J33401
4793i875247R71908K95588k275651m508734l646506o09661P95511k59939k00485
4784a9313216K666773M506831J888298k203079k588721M47706K368160J501215
4776a0726033K44762Q4235p0577p17614q11095k01952K6667l06155m99552o41200
4766a3618514r11661k37598J775056K888453J219158j141704q37138J589449K785954
4757f488545J835687O60564J1216r62814j633147m94350J243586P40186j529315
4748f616932j908059P00317L015926K364586R2477j266744j310876q98534l48619
4739f176458K38683O10525R62181J397405R50019q91109k162936n00536L013107
$$ plain form
4802 -5804290 -3412168 -1011469 -327156 -1772252 -4404252 -7047321 -9008780 -10008648 -9875247
4793 -9875247 -8903339 -8607751 -10883402 -15392136 -19038642 -19648303 -18852792 -19112731 -19313216
4784 -19313216 -16646443 -12139612 -10251314 -12454393 -15043114 -14595408 -12227248 -10726033
4776 -10726033 -10481271 -10397036 -10467613 -11185227 -11996322 -12198274 -12171607 -12477762 -12977314 -13618514
4766 -13618514 -14530175 -14767773 -12992717 -10104264 -8885106 -10026810 -10863948 -9274499 -6488545
4757 -6488545 -4652858 -3992294 -3981078 -4943892 -6577039 -7071389 -5827803 -5087617 -6616932
4748 -6616932 -8524991 -7824674 -4808748 -2444162 -2351685 -3618429 -4929305 -5827839 -6176458
4739 -6176458 -5937775 -5327250 -4365069 -2967664 -2017645 -2908754 -5071690 -5572226 -2559119
4730b559119M798478L532018J265843j09015p05687r45260q42898j075711k131931
4721A226718k621722j185881N54355K45668q40073J63353J933849L53977l955684
4712d125440n192962j188444K834737K208654l95816n6198K452921K497378r19483
4703a884653l955064l349400K70100L996293N163014K931559p06118k285655p24114
4694e44038J284135R93396q72277j892487j533266r60129n73096K36334J596181
4685b265247K881874L302290K065695p87396l207626k700363J60202J995034J335166
4676B779629M29684J004277J269261o27976k983493l210824j898946j249506j355874
4667e843768j035635o83481j188091j458591j85110J231923P62733m27443K50171
$$ plain form
4730 -2559119 2239359 5771377 7037220 6928205 6222518 5277258 4434360 3358649 1226718
4721 1226718 -1395004 -2580885 -2026530 -1780862 -2620935 -2457582 -523733 -169756 -4125440
4712 -4125440 -9318402 -10506846 -7672109 -5463455 -5859271 -5915469 -3462548 -965170 -1884653
4703 -1884653 -5839717 -9189117 -8919017 -4922724 240290 3171849 2465731 180076 -544038
4694 -544038 740097 1733493 861216 -1031271 -2564537 -3524666 -4097762 -3861428 -2265247
4685 -2265247 616627 3918917 5984612 5197216 1989590 -710773 -550571 1444463 2779629
4676 2779629 3209313 4213590 5482851 4854875 1871382 -1339442 -3238388 -4487894 -5843768
4667 -5843768 -6879403 -7562884 -8750975 -10209566 -10394676 -9162753 -8400020 -8827463 -8577292
4658h577292K079466J851405q70199k975239k531136r01290L37564J393301K373209
4649g820211K304234J142345M39014J029019J953138K205047J617865r6329k772310
4640A812m152578j859145K344605L584219N35847k260488q88596K268486K443836
4631B017998l50745k044801j242900r20667k906473m510419k627973J343127L340028
4622g902825K245248R42437J669359K791679J551585j623287l704411l406345
4614g436560k561719k688299k538359o25644J605523J503769o71026j799519j45614
4605a5357448K528863L544100K265794o6664j857281j761085O89910L981657N276958
4596g55196L329013j0954k073308k279736j737978q63961R06887L157329L933139
$$ plain form
4658 -8577292 -6497826 -4646421 -5516620 -8491859 -11022995 -11924285 -11586721 -10193420 -7820211
4649 -7820211 -5515977 -4373632 -3934618 -2905599 -952461 1252586 2870451 2774122 1812
4640 1812 -4150766 -6009911 -3665306 -81087 454760 -1805728 -2694324 -425838 2017998
4631 2017998 1667253 -377548 -1620448 -2541115 -5447588 -9958007 -12585980 -11242853 -7902825
4622 -7902825 -5657577 -4715140 -3045781 -254102 1297483 -325804 -4030215 -7436560
4614 -7436560 -9998279 -12686578 -15224937 -15850581 -14245058 -12741289 -13412315 -15211834 -15357448
4605 -15357448 -12828585 -9284485 -7018691 -7085355 -8942636 -10703721 -10013811 -6032154 -755196
4596 -755196 2573817 2562863 489555 -1790181 -3528159 -4392120 -3485233 -327904 3605235
4587C605235J995063j263087l237029l225437k962598l652218l749196j205232
4579a3694499K676869L963973J356070j560977j091113J420431J885280k16291
4571e260257j228124Q73340L490089L484266J374034m95702j675071k978198l636784
4562f052407j983680J336018L296714K095032p70225k481763j847504R1795J512465
4553d803555J462580M95249k05901l55608o76072j294420j179758k1495N77208
4544f001772p00910k438229k177592k6547J653172K013278K604015L936925L875818
4535B738158J045775k296552k985721j179233L92020M82979K06431K73888L011
4526a319244n99109k53280J124281J511703k15651k075969j568746P09058J965172
$$ plain form
4587 3605235 5600298 4337211 1100182 -2125255 -5087853 -8740071 -12489267 -13694499
4579 -13694499 -11017630 -7053657 -5697587 -7258564 -8349677 -6929246 -5043966 -5260257
4571 -5260257 -6488381 -5615041 -2124952 1359314 2733348 2237646 562575 -2415623 -6052407
4562 -6052407 -8036087 -6700069 -3403355 -1308323 -2078548 -4560311 -6407815 -6316020 -4803555
4553 -4803555 -3340975 -2845726 -3051627 -3407235 -4083307 -5377727 -6557485 -6578980 -6001772
4544 -6001772 -6702682 -9140911 -11318503 -11345050 -9691878 -7678600 -5074585 -1137660 2738158
4535 2738158 3783933 1487381 -1498340 -2677573 -2285553 -1802574 -1596143 -1322255 -1319244
4526 -1319244 -1918353 -2171633 -1047352 464351 248700 -1827269 -3396015 -2686957 -721785
4517g21785J013175p65532j882867k195574j894632r37987J92203Q61159J726515
4508d605325L952937O468551O190763K205436k259909l719228k596767j569278
4500D067180j387270r72279n26816j315926k545197j739036J079023K542436N83751
4491b14134k554668l584083k374273j039910n31396k20256K83743Q72972J683759
4482g678246K491072K335793J303068J307530L060171L730453N42185m214547
4474B877479n258217j425271K806668L641453K296852J461653Q29911j060038
4466F170490k956889k315196M14568K038950J067029o18287q36112J97757Q57234
4457D019544L01373r69318j829970j451374j59976O53416J68141o53659m14837
$$ plain form
4517 -721785 291390 -474142 -2357009 -4552583 -6447215 -7385202 -7192999 -6331840 -4605325
4508 -4605325 -652388 5816163 12006926 14212362 11952453 8233225 5636458 4067180
4500 4067180 2679910 1707631 1180815 -135111 -2680308 -4419344 -3340321 -797885 -214134
4491 -214134 -2768802 -6352885 -8727158 -9767068 -10298464 -10518720 -10234977 -9362005 -7678246
4482 -7678246 -5187174 -2851381 -1548313 -240783 2819388 6549841 7092026 2877479
4474 2877479 -2380738 -3806009 -999341 2642112 4938964 6400617 7230528 6170490
4466 6170490 3213601 898405 1312973 3351923 4418952 3800665 2964553 3162310 4019544
4457 4019544 4320917 3351599 1521629 70255 -89721 563695 731836 78177 -336660
4448c36660N64536O62184o83925k271278k709505j574658P56517L099461L585027
4439A091699J469378j199046j525354M05331J549075K10154j705412j633910L62020
4430i76065K462799L519795L190722J235996j604185l289889k816601j806457
4422h3885j975845k158988j72975L047216L907549J034491k637018l551934j650142
4413d241531K86476L49612n60485k84833J718193L398080K467755l65372j804804
4404I63091k64484J827947J527036l81910j001806r5224j21718j688320k331454
4395a566842p08486J019104N76595j068709j646346j026536p07096j142229j456017
4386g726562r86936L06636K124403L360525K503188k33731k365783k072504m67177
$$ plain form
4448 -336660 227876 890060 206135 -2065143 -4774648 -6349306 -5592789 -2493328 1091699
4439 1091699 2561077 1362031 -163323 242008 1791083 2001237 295825 -1338085 -976065
4430 -976065 1486734 5006529 8197251 9433247 7829062 4539173 1722572 -83885
4422 -83885 -2059730 -4218718 -4391693 -1344477 2563072 3597563 960545 -2591389 -4241531
4413 -4241531 -3955055 -3605443 -4165928 -4450761 -2732568 665512 3133267 2767895 963091
4404 963091 698607 2526554 4053590 3671680 2669874 2574650 2452932 764612 -1566842
4395 -1566842 -2275328 -1256224 -679629 -1748338 -3394684 -4421220 -5128316 -6270545 -7726562
4386 -7726562 -8713498 -8406862 -6282459 -2921934 -418746 -652477 -3018260 -5090764 -5557941
4377e557941M16206M46517N29511M50267k57056n28662P40588K358635K394290
4368I92355J203729L53044n30730k707727m715191l497191N46559L239167K314825
4359b801160J50936m34691Q4300R7214k60012m72604j257501k564194k446787
4350i904499l24086J168479L69167o343K727006N742294M297462m55547k487159
4341A126774J85611K758584J193866k154717k920147r96167O04424N03608m75345
4332a73509j599814k282954j352505J130680K664591J440863o51230q12873K90688
4323a346063J56069p18944L87037L013288L221097k24241l316101k500091L02009
4314a025940R74991r45638k676080k736311j991599j086008J17138Q15442j66316
$$ plain form
4377 -5557941 -5141735 -4695218 -4165707 -3715440 -3972496 -4501158 -3760570 -1401935 992355
4368 992355 2196084 2549128 2018398 -689329 -5404520 -8901711 -8355152 -5115985 -2801160
4359 -2801160 -2650224 -3084915 -3000615 -2903401 -3163413 -3636017 -4893518 -7457712 -9904499
4350 -9904499 -10228585 -9060106 -8690939 -8697282 -5970276 -227982 4069480 3613933 1126774
4341 1126774 1312385 4070969 5264835 3110118 189971 -806196 -201772 301836 -173509
4332 -173509 -1773323 -4056277 -5408782 -4278102 -1613511 -172648 -823878 -1636751 -1346063
4323 -1346063 -1189994 -1908938 -1521901 1491387 4712484 4488243 1172142 -1327949 -1025940
4314 -1025940 -50949 -996587 -3672667 -6408978 -8400577 -9486585 -9369447 -8554005 -8720321
4305h720321j845988j683954O49658K406297J630479j63529n31262M65978J145214
4296f647428J206662J686778K529349K512998J711295J739595K684567J955409
4288I379225j915744n840961n345345r38323J756068n76597m125625l077117K223140
4279h461279N662368L606830p90244k582411j256891J48251m1560q45273j201045
4270e761254j150909n89371R38626K786063L187816J321072j531285l169617k304632
4261f273491M55395K672593J802068j921729m890649l867923J56773L432515M122940
4252d311508L383792K230413K47395k041480k476991m57402J518583J337221K97536
4243b72441N17729J106385k71758l006619l835224j589943J119926J743666R89118
$$ plain form
4305 -8720321 -10566309 -12250263 -11600605 -9194308 -7563829 -7727358 -8258620 -7792642 -6647428
4296 -6647428 -5440766 -3753988 -1224639 1288359 2999654 4739249 7423816 9379225
4288 9379225 7463481 1622520 -3722825 -4661148 -2905080 -3481677 -7607302 -10684419 -8461279
4279 -8461279 -2798911 807919 17675 -2564736 -3821627 -3673376 -3714936 -4560209 -5761254
4270 -5761254 -6912163 -7501534 -6562908 -3776845 -589029 732043 -799242 -3968859 -6273491
4261 -6273491 -5818096 -3145503 -1343435 -3265164 -8155813 -12023736 -11866963 -8434448 -4311508
4252 -4311508 -927716 1302697 1550092 -491388 -2968379 -3425781 -1907198 -569977 -272441
4243 -272441 245288 1351673 1079915 -1926704 -5761928 -7351871 -6231945 -4488279 -3499161
4234c499161Q90200J467120J137499l96341j468881o61703J548108L604467M443431
4225G064739L875592K144668j77234k093226k698148k060087j297144j494189
4217C264971k580341l428068l093184j886491j089905j481009k246428j739433
4209a4279888N69997L352588M888725M742116L568949K019156O20423k6287j09235
4200E346544r41977k944130m061210k294341P59663J630854J33621n01510P95297
4191b077189J086350j179165k848865j028243J972838K247149J84842j151595
4183b793878j317179j862115k164767n24176J636003J271363j125696k242467
4175i122912j342187n61803l18486Q69934K224224J316892j048302j521574N3876
$$ plain form
4234 -3499161 -2608961 -1141841 -4342 -400683 -1869564 -2531267 -983159 2621308 7064739
4225 7064739 10940331 13084999 12907765 10814539 8116391 6056304 4759160 3264971
4217 3264971 684630 -2743438 -5836622 -7723113 -8813018 -10294027 -12540455 -14279888
4209 -14279888 -13709891 -10357303 -5468578 -726462 2842487 4861643 5482066 5455779 5346544
4200 5346544 4404567 1460437 -2600773 -4895114 -4135451 -2504597 -2370976 -2872486 -2077189
4191 -2077189 -990839 -2170004 -5018869 -6047112 -4074274 -1827125 -1642283 -2793878
4183 -2793878 -4111057 -5973172 -8137939 -8662115 -7026112 -5754749 -6880445 -9122912
4175 -9122912 -10465099 -11026902 -11345388 -10475454 -8251230 -6934338 -7982640 -9504214 -9450338
4166i450338P10570K75358J491200L730388K831154j548389m589602l838384j927095
4157a2315138m60137J996197M290684K696616j409335k177618J01621j372114
4149h649224o771390p961798m831132q902272k1235815k1883193K703808L3204091
4141d4326925L8359544J6509823m380362o281996N50757J469014j229484M60399
4133A130770M064306L217397k80932j309984o66932j173556j249929N59393J013623
4124E304156j547647k695881L88988L194082J744696m21967O87939K097571K2405
4115H774342k896445l219104l240558m959085m120395J874256O519229L514984
4107B247224k192966k240710J353353O59710l862529m764309j061587Q75924p76441
$$ plain form
4166 -9450338 -8739768 -8464410 -6973210 -3242822 -411668 -1960057 -6549659 -10388043 -12315138
4157 -12315138 -12775275 -10779078 -6488394 -3791778 -5201113 -7378731 -7277110 -8649224
4149 -8649224 -15420614 -23382412 -28213544 -37115816 -58351631 -80234824 -77531016 -44326925
4141 -44326925 -5967381 10542442 6162080 -119916 430841 1899855 670371 1130770
4133 1130770 5195076 8412473 8131541 6821557 6154625 4981069 3731140 4290533 5304156
4124 5304156 3756509 1060628 1449616 4643698 6388394 5966427 6654366 8751937 8774342
4115 8774342 5877897 2658793 -581765 -5540850 -9661245 -7786989 -1267760 2247224
4107 2247224 54258 -2186452 -833099 -173389 -4035918 -8800227 -9861814 -8985890 -9762331
4098i762331j062673J592750K708411N73111r18555J06585Q21597J81716P42993
4089e016396K502801J997099q83780j966030k04980O14682r28196j669117l93862
4080e947779J53467m68416R50785M237163M451435K52286l111890k231621l94851
4071b109421p02717r55322O22833R85442j658465l179284j96196L641127L508847
4062d3156J107379Q31215K084879J415918n99269o37433J028686J010012j359506
4053D838725l370908l493637k656726j608590l66857L93937K75864N23035J925074
4044c540083K759098J430048m70276n69694M36755L18047q20941j256433q88302
4035b601781p11505l00843J060642J877055L48433k012012k000815L47699J610683
$$ plain form
4098 -9762331 -10825004 -9232254 -6523843 -5950732 -6869287 -6762702 -5941105 -5759389 -5016396
4089 -5016396 -2513595 -516496 -1400276 -3366306 -3571286 -2956604 -3884800 -5553917 -5947779
4080 -5947779 -5794312 -6262728 -5311943 -1074780 3376655 3628941 517051 -1714570 -2109421
4071 -2109421 -2812138 -3767460 -3144627 -2159185 -3817650 -6996934 -7193130 -3552003 -43156
4062 -43156 1064223 1895438 3980317 5396235 4796966 4159533 5188219 6198231 4838725
4053 4838725 1467817 -2025820 -4682546 -6291136 -6657993 -6264056 -5988192 -5465157 -3540083
4044 -3540083 -780985 649063 178787 -390907 45848 363895 -457046 -1713479 -2601781
4035 -2601781 -3313286 -3614129 -2553487 -676432 -327999 -2340011 -4340826 -3993127 -2382444
4026b382444l6569k360991k205670P64077L939718M303826J183100k707319l629875
4017c132147j087880J363300O27768j979090k782571n52914K465504L617817K503100
4008A042887R30198Q89323K081478J736504j668546n173390m581073p24371J292627
3999d174363k42915j217935J244970L952391L067945K67192o73236j53632r06595
3990A163822k209683r48047K623671M689718L209373m1062k483246k926540j301549
3981A776457J198495K384034J580868O61228P63486K36911j766606k572489k74215
3972C988169K100656R12663k119017k943947j836583j716395j853371N97402L982349
3963A111926L732049L72016q24711J094130R47238l403439o676868m247075R01412
$$ plain form
4026 -2382444 -2419013 -4780004 -6985674 -6221597 -2281879 2021947 3205047 497728 -3132147
4017 -3132147 -4220027 -2856727 -2228959 -4208049 -6990620 -7543534 -5078030 -1460213 1042887
4008 1042887 1973085 2862408 4943886 6680390 5011844 -161546 -4742619 -5466990 -4174363
3999 -4174363 -4417278 -5635213 -4390243 -437852 2630093 2897285 2224049 2070417 1163822
3990 1163822 -1045861 -1993908 629763 5319481 8528854 8487792 6004546 3078006 1776457
3981 1776457 2974952 5358986 6939854 7601082 8364568 8601479 6834873 4262384 3988169
3972 3988169 6088825 7001488 4882471 1938524 101941 -1614454 -3467825 -2870423 1111926
3963 1111926 4843975 5215991 4391280 5485410 6432648 3029209 -3647659 -7894734 -6993322
3954f993322L186835K062032O33515J22712j98731q564J298737K385087J614478
3945D102779j99191j071314p60537m62403p25514j286795j860643j892912q50289
3936e006819L69838L7831j572053k030683m24108J172688J156939Q25763J637044
3927c833560K459113J736499M28010M08250J361353J505177L89206r61259j837446
3918A655343k112763j518814j97125O52410j1104j602849k456028j350308J721721
3909e219517N272113O664378M279285k38523l415220l925331l391040l084632
3901c058487k280047o05790N46108K96358k07810J06389O64561J015944J940723
3892a582051L323298L234955R76987j090515q25902M77693L35346j150416k072018
$$ plain form
3954 -6993322 -3806487 -1744455 -1110940 -988228 -1186959 -1195523 103214 2488301 4102779
3945 4102779 3903588 2832274 2071737 1609334 883820 -402975 -2263618 -4156530 -5006819
3936 -5006819 -4636981 -4599150 -6171203 -8201886 -8625994 -7453306 -6296367 -5470604 -3833560
3927 -3833560 -1374447 362052 790062 1198312 2559665 4064842 4454048 3492789 1655343
3918 1655343 -457420 -1976234 -2173359 -1520949 -1532053 -3134902 -5590930 -6941238 -5219517
3909 -5219517 52596 6716974 10996259 10757736 7342516 3417185 26145 -3058487
3901 -3058487 -5338534 -5944324 -5398216 -5101858 -5309668 -5203279 -4538718 -3522774 -1582051
3892 -1582051 1741247 4976202 5953189 4862674 4036772 4514465 4849811 3699395 1627377
3883A627377j902912j530095j086893O675J449348K364510K698243K844923K527839
3874H999015J375048r1867j190040j999902k615052k510286j616889r08965j012339
3865a571277j357968j333831q72776M16115K642956L841703J702110j970025k037665
3856e40658K765549O911255N210827k40567l720255l734593l071470l041573k341621
3847a803106p95304J58803N86815J842074L190484K296349n83125k318037j483818
3838A091135j48184k56292j021070r72373k48476L19896O30722Q66529R38906
3829A200793Q63422O15795k46151j573637j890438m12002R89240R8427k023968
3820b378519k388210o00360R53265J336792K118024L647302L710836J282556j271856
$$ plain form
3883 1627377 -275535 -1805630 -2892523 -2885848 -1436500 928010 3626253 6471176 8999015
3874 8999015 10374063 10282196 9092156 7092254 4477202 1966916 350027 -558938 -1571277
3865 -1571277 -2929245 -4263076 -5135852 -4719737 -2076781 1764922 3467032 1497007 -540658
3856 -540658 2224891 9136146 14346973 14106406 10386151 6651558 3580088 538515 -1803106
3847 -1803106 -2598410 -2439607 -1852792 -10718 3179766 5476115 4892990 2574953 1091135
3838 1091135 942951 686659 -334411 -1306784 -1555260 -1235364 -604642 261887 1200793
3829 1200793 2064215 2680010 2433859 860222 -1030216 -1442218 -452978 -354551 -2378519
3820 -2378519 -4766729 -5367089 -4413824 -3077032 -959008 2688294 6399130 7681686 6409830
3811F409830j514046k16792L51710n22432k270163m454711o056904m986892n37839
3802a3798239M526648O318696L989241K17696k046838k038478o68446R63852K078148
3793d57720K077793Q09027q57221j289020J83108J846918J193021j521527k838994
3784h54615n76657K727225K991078K37958j657876o64358R36065N20096j120761
3775B538155j601779o25609J20920k06786o95555m15844K07944Q4865j037187
3766a630876k096799j769954J24883K500393M115152M232612K432659q96616l670011
3757C341443l502715q89034Q11352k00662j731381j274510J33373L08563J11318
3748b892253J767076M293985M475821J962557l20062q45657r75685j552638j656240
$$ plain form
3811 6409830 4895784 4678992 5030702 4508270 2238107 -2216604 -8273508 -13260400 -13798239
3802 -13798239 -9271591 -2952895 1036346 1254042 -792796 -2831274 -3499720 -2535868 -457720
3793 -457720 1620073 2429100 1571879 282859 465967 2312885 3505906 1984379 -854615
3784 -854615 -1431272 1295953 4287031 4524989 2867113 2202755 3138820 3658916 2538155
3775 2538155 936376 310767 431687 224901 -470654 -886498 -678554 -593689 -1630876
3766 -1630876 -3727675 -5497629 -5372746 -2872353 1242799 5475411 7908070 7011454 3341443
3757 3341443 -161272 -1050306 -238954 -439616 -2170997 -3445507 -3312134 -3003571 -2892253
3748 -2892253 -1125177 3168808 7644629 9607186 9287124 8441467 7465782 5913144 4256904
3739D256904j353719k102192l490608l046139m31272J542171J395394J076807
3731b152654K001608K447077R82492o82021p21299k98903j072351k061494j699771
3722c257316q57671j039572j376756k34202J592922K005829R48348K60750Q93086
3713a064582K104632K717664J894722j87046j509984L1738K957812K913763j157938
3704H700781m537184l130089M89334J069863j540800k959283j379454M25242J55967
3695b705623j026898j320158q29620k88063L24866R99978J393793J735355K343629
3686F27259K252441L02294k373892l132198j418522M22055M22846p29732j287258
3677d914707o87570N53353J949767L127898L364465J793400j566658m794812m857287
$$ plain form
3739 4256904 2903185 800993 -2689615 -5735754 -6167026 -4624855 -3229461 -2152654
3731 -2152654 -151046 2296031 3278523 2596502 1875203 1576300 503949 -1557545 -3257316
3722 -3257316 -4114987 -5154559 -6531315 -6765517 -5172595 -3166766 -2218418 -1957668 -1064582
3713 -1064582 1040050 3757714 5652436 5465390 3955406 3987144 6944956 9858719 8700781
3704 8700781 4163597 1033508 1522842 2592705 1051905 -1907378 -3286832 -2861590 -2705623
3695 -2705623 -3732521 -5052679 -5882299 -6170362 -5845496 -4845518 -3451725 -1716370 627259
3686 627259 2879700 3181994 808102 -2324096 -3742618 -3320563 -2897717 -3627449 -4914707
3677 -4914707 -5602277 -5048924 -3099157 28741 3393206 5186606 3619948 -1174864 -6032151
3668f032151r52416L262468L242945l13482k071099J17117J955681j87828l113350
3659d092115k055749J289129J700067o89960r11263J964238L086474O6946l104041
3650b746274k668698m98387Q8780k84498P41794K709916L295563J872489l53994
3641B156691k157915k548094j087588P23032N73359j074355j257307N24297J070991
3632c076889j017382k408278l29586K754564L196654J776378J285618J154950
3624C336029r02851l630687l466870m03942J810487J268923k46707j140083j880886
3615e256587k457276j576445N28224J592551Q46074L32182J408306K422658J484955
3606f75358m81030j274225o55956l11500j163966j994909q03236K691254N849398
$$ plain form
3668 -6032151 -6984567 -3722099 -479154 -792636 -2863735 -2746618 -790937 -978765 -4092115
3659 -4092115 -6147864 -4858735 -3158668 -3848628 -4759891 -2795653 290821 357767 -2746274
3650 -2746274 -5414972 -5913359 -5824579 -6109077 -5367283 -2657367 638196 2510685 2156691
3641 2156691 -1224 -2549318 -3636906 -2913874 -2340515 -3414870 -4672177 -4147880 -3076889
3632 -3076889 -4094271 -6502549 -6832135 -4077571 -880917 895461 2181079 3336029
3624 3336029 2433178 -1197509 -4664379 -5068321 -3257834 -1988911 -2235618 -3375701 -5256587
3615 -5256587 -7713863 -9290308 -8762084 -7169533 -6323459 -5991277 -4582971 -2160313 -675358
3606 -675358 -1156388 -2430613 -3086569 -3398069 -4562035 -6556944 -7360180 -4668926 1180472
3597A180472N133847K30232m682559n291812k107619P61016J074375K39185o5953
3588c528816j2618K00818J330230K932641K761006J050k932364l558964k431781
3579e238798j261897J22995K498308M337517L153493n38436l162728k401688K58891
3570b232343J796330J061061o33871j360169m85359Q43758J046710Q7634m84966
3561c61215J55595R06765P82603P82326J978156K965677J767831l85736l87322
3552H204680J410610Q40431l494470o745487m076155J908913M026711Q9566m464963
3543b300164m208539l42678K208824J545194j67295r00092r19015q18236o4779
3534e966780J469820K248916Q66702j576681k351408m39508K179965L208334K982878
$$ plain form
3597 1180472 6314319 6544551 1861992 -3429820 -5537439 -4776423 -3702048 -3462863 -3528816
3588 -3528816 -3541434 -3340616 -2010386 922255 3683261 3684311 751947 -2807017 -5238798
3579 -5238798 -6500695 -6377700 -3879392 458125 3611618 3073182 -89546 -2491234 -2232343
3570 -2232343 -436013 625048 -8823 -1368992 -1854351 -1010593 36117 123751 -361215
3561 -361215 -205620 701145 1483748 2266074 4244230 7209907 8977738 8592002 8204680
3552 8204680 9615290 10455721 6961251 215764 -3860391 -1951478 2075233 2164799 -2300164
3543 -2300164 -6508703 -6851381 -4642557 -3097363 -3264658 -4164750 -5083765 -5902001 -5966780
3534 -5966780 -4496960 -2248044 -1381342 -2958023 -5309431 -5748939 -3568974 -360640 2622238
3525B622238L332980L883346J788126l701259q459477p793330k565827J916360
3517h976843K894739K603715L082888K581946m77089l442587l026619n93022L01726
3508e051146j3649J479636L967914L026548j731848m625094j944030K523747L310633
3499I42711Q41440q07198p50438j142243j871088m69137K797021M224371K025243
3490E790682j069889j825388m17526R42993J062595R4789j401964k445929k028277
3481a297914n86147P3856q31297j862418j340787M97379K076920K330538J336553
3472C96683j08357j037658j049497o85929m78495N8006J390630K447613J916516
3463B849512Q32576J542683L691621L812520J71539m215331n227790k689224J51321
$$ plain form
3525 2622238 5955218 9838564 11626690 7925431 -534046 -8327376 -10893203 -8976843
3517 -8976843 -6082104 -3478389 -395501 2186445 1709356 -1733231 -4759850 -5352872 -5051146
3508 -5051146 -5064795 -3585159 382755 3409303 1677455 -2947639 -4891669 -2367922 942711
3499 942711 1784151 976953 226515 -915728 -2786816 -3255953 -458932 3765439 5790682
3490 5790682 4720793 2895405 2477879 3420872 4483467 4578256 3176292 730363 -1297914
3481 -1297914 -1884061 -1810205 -2641502 -4503920 -5844707 -5347328 -3270408 -939870 396683
3472 396683 288326 -749332 -1798829 -2484758 -2963253 -2905247 -1514617 932996 2849512
3463 2849512 3682088 5224771 8916392 12728912 12900451 8685120 3457330 768106 919427
3454I19427R91434L27899l67031m08823P7181O11429Q06564Q99812J323022J453983
3444F634897P7781k242197k993375j230023N43003m3917j427484n71919J958070
3435G04836K698827Q14411n78882N63928K065246J182460j042559j547011L8661
3426D899917J097647J91644q81576m0090J695084J428708j334061l448269k184852
3417A424152P08412J043006j918388m161548k541777P92549J805124M83657K22354
3408b142459K152946L536049K156094o19775k093757j299902R55895L026619K796676
3399H468386n35221m253754m211904k16964L229133K914203Q38717K60866P47019
3390G240481J9675j616666k129074j486444j077085n02045J453338L294003K076461
$$ plain form
3454 919427 1910861 2238760 1871729 1462906 1540087 2151516 2958080 3857892 5180914 6634897
3444 6634897 6712678 4470481 1477106 247083 790086 746169 -681315 -1253234 704836
3435 704836 3403663 4218074 3639192 4203120 6268366 7450826 6408267 4861256 4899917
3426 4899917 5997564 6189208 5307632 5267542 6962626 8391334 7057273 3609004 1424152
3417 1424152 2132564 3175570 1257182 -2904366 -5446143 -4653594 -2848470 -2364813 -2142459
3408 -2142459 10487 3546536 5702630 5082855 2989098 1689196 2645091 5671710 8468386
3399 8468386 7933165 3679411 -532493 -749457 2479676 5393879 6232596 6493462 7240481
3390 7240481 7260156 5643490 3514416 2027972 950887 448842 1902180 5196183 7272644
3381G272644j706841m128303l326833j632414j246633j176049j13258O62056l44036
3372e739667j714034r96628J462205K904891J870826l26058j640967j389072k53670
3363e822174P68119J153785R97927O06277K25387L59403J603608L312046L314151
3354F518529N26934k776232l329570j218231M21854j5620r71038j003129p76176
3345b622679q20545k02359J167537J622425P58308O46394K173029K994655J414433
3336G131198n50310o95915l75105j428346k154816m10270J617799M48318k572494
3327A010059l297196j802882j807402l432331k631733J302658L704818J998607
3319d955402l85218l38813o9790k020724l443732q50629L452823M401821J690867
$$ plain form
3381 7272644 5565803 1437500 -1889333 -3521747 -4768380 -5944429 -6057687 -5395631 -5739667
3372 -5739667 -7453701 -8450329 -6988124 -4083233 -2212407 -2538465 -4179432 -5568504 -5822174
3363 -5822174 -5054055 -3900270 -2902343 -2296066 -2070679 -1711276 -107668 3204378 6518529
3354 6518529 7045463 4269231 939661 -278570 143284 127664 -843374 -1846503 -2622679
3345 -2622679 -3443224 -3645583 -2478046 -855621 -97313 549081 2722110 5716765 7131198
3336 7131198 6580888 5884973 5509868 4081522 1926706 1516436 3134235 3582553 1010059
3327 1010059 -2287137 -4090019 -5897421 -9329752 -11961485 -10658827 -6954009 -4955402
3319 -4955402 -5340620 -5679433 -5749223 -7769947 -11213679 -12064308 -8611485 -4209664 -2518797
3310b518797n74084m66131J37274k9251J01944J013779J579363J479457J699817
3301B423371K168147J544640j53498j104464m10489O87290O93344o62042k735708
3292B450591m124955l073799K27080K519208J251346j295520r73071J595520J595430
3283A71830k049494l958508O3759O423075Q254017M173097j065807l280213k686281
3274F045475j447247o49172l57874m87100p22093p57156r69729j897564k999146
3265d241606k989941j568620P4820O79249K55560m8650R29939L158635N010392
3256A259778M598260J949468q06318j909948j723542j328093o43353O78383J554957
3247C629592O40944j225158j765280n45900L62210n64759k301101l012252k313096
$$ plain form
3310 -2518797 -3092881 -3559012 -3421738 -3450989 -3349045 -2335266 -755903 723554 2423371
3301 2423371 4591518 6136158 5982660 4878196 4467707 5154997 5848341 5186299 2450591
3292 2450591 -1674364 -4748163 -4521083 -2001875 -750529 -2046049 -3019120 -1423600 171830
3283 171830 -1877664 -5836172 -5772413 650662 8904679 13077776 12011969 8731756 6045475
3274 6045475 4598228 3949056 3591182 3104082 2381989 1624833 655104 -1242460 -4241606
3265 -4241606 -7231547 -8800167 -8725347 -8046098 -7790538 -7839188 -6909249 -3750614 1259778
3256 1259778 5858038 7807506 7001188 5091240 3367698 2039605 1396252 2074635 3629592
3247 3629592 4270536 3045378 1280098 734198 1096408 531649 -1769452 -4781704 -7094800
3238g094800r43839M93844J468774J287137M6470r90181r84927p10413j123438
3229h551373j599039q82209Q52710K351133L243797M065941M513681L465576J006239
3220H466456j240127k310615k829205l051009j808697J237595L872251L780937
3212F117586J761488L76609M505j274642l710968m474545j551072K809512M406402
3203D464875K052613j355100k454847q45746J171379J389402j13464j349458q35354
3194B124300P19038J604530J441131J031793J96987k106489m916146n015557j351432
3185f271845K381530K167016p81568j982922k83414J213308Q01892O05925K000500
3176a49578K556804K46137k449833k225995n82485j480380m321574m045578R85749
$$ plain form
3238 -7094800 -8038639 -7544795 -6076021 -4788884 -4742414 -5732595 -6717522 -7427935 -8551373
3229 -8551373 -10150412 -11032621 -10179911 -7828778 -4584981 -519040 3994641 7460217 8466456
3220 8466456 7226329 4915714 2086509 -964500 -2773197 -1535602 2336649 6117586
3212 6117586 7879074 8255683 8260188 6985546 3274578 -1199967 -2751039 58473 4464875
3203 4464875 6517488 5162388 2707541 1861795 3033174 4422576 4309112 2959654 2124300
3194 2124300 2843338 4447868 5888999 6920792 7117779 5011290 95144 -4920413 -6271845
3185 -6271845 -3890315 -1723299 -2504867 -4487789 -4771203 -3557895 -2756003 -2150078 -149578
3176 -149578 2407226 2653363 203530 -2022465 -2604950 -4085330 -8406904 -12452482 -11466733
3167a1466733N620162M804543N55963j273113P84797K676604J419783j044817
3159B077189j696677r89227j235515k308215j800684R60839L611698L920443K305621
3150D845472M05032j132049k213800k117608m54777J440781J791910O92200m06756
3141B850405j171940k482532m018922l914789j649210N56402N96506n57242k95740
3132a0087062K009643M332213M590331K716975L50658n92681O28255K648746K973400
3123I570478Q63390j358425j141494Q29021J764133R35439L56101R79422Q29688
3114A3627753j638628m446001m576270k313343o42655q32428j142775j81949Q99924
3105a246372O60614j29589Q0706Q66798M00145j625023l355393l175943j344488
$$ plain form
3167 -11466733 -5846571 -1042028 -486065 -1759178 -974381 1702223 3122006 2077189
3159 2077189 380512 -608715 -1844230 -4152445 -5953129 -4992290 -1380592 2539851 4845472
3150 4845472 5250504 4118455 1904655 -212953 -667730 773051 2564961 3257161 2850405
3141 2850405 1678465 -804067 -4822989 -8737778 -10386988 -9830586 -9234080 -9791322 -10087062
3132 -10087062 -8077419 -3745206 845125 3562100 3912758 3320077 3948332 6597078 9570478
3123 9570478 10433868 9075443 7933949 8762970 10527103 11462542 11818643 12798065 13627753
3114 13627753 11989125 7543124 2966854 653511 10856 -821572 -1964347 -2146296 -1246372
3105 -1246372 -585758 -715347 -634641 232157 632302 -992721 -4348114 -7524057 -8868545
3096h868545J025847L192919M329794L231621q4399l126473k982930J01189K608023
3087e72954K029619J54853O05849L567714N036298K126809k673691m496749k410283
3078C367465j85856o31903k047364j787512p49061j472501l305788l009013j8534
3069i840067K386922K053346R26003J405526K456555J712110n30857k054212k109509
3060c594183j458143r3346K229335L817888K491254p26634k287554j018103M38929
3051b00557l1518j005886m08293J008530J249128M76641M12893J190168J117470
3042C808576m71624j945535j390744J076206L332671L202250N56672k249703k606123
3033C312646p02420M97593r60176l282017l235627n02871J920354J650040l14958
$$ plain form
3096 -8868545 -7842698 -4649779 -319985 2911636 2827237 -299236 -3282166 -3180977 -572954
3087 -572954 1456665 1611518 2217367 5785081 10821379 12948188 10274497 5777748 3367465
3078 3367465 3181609 2549706 502342 -1285170 -2034231 -3506732 -6812520 -9821533 -9840067
3069 -9840067 -7453145 -5399799 -4473796 -3068270 -611715 1100395 569538 -1484674 -3594183
3060 -3594183 -5052326 -5145672 -2916337 901551 3392805 2666171 378617 -639486 -200557
3051 -200557 -232075 -1237961 -1646254 -637724 611404 1088045 1500938 2691106 3808576
3042 3808576 3336952 1391417 673 1076879 4409550 7611800 8168472 5918769 3312646
3033 3312646 2610226 3107819 2147643 -1134374 -4370001 -4872872 -2952518 -1302478 -1617436
3024a617436j328065m57434R08971J363352J226173J562217K152368J501294r51408
3015D360032l602931m422208l239087j349961N10752K388231L626449K981366
3007A252643O22951j470164j768146p08488M99945J364243J871602J966757J817444
2998E448787J559829O34534j186258k191178m45085K479810K400215j509260m627858
2989B563536l019243J028813K549748P40709j324844k201287l108200m018646
2981f789414k934023L20865L032765L329057K262911J389817Q01967L06693J17612
2972A838250k95014j634597k624540j213859J535962K042592l29756j978640q28236
2963c487838M56957m92258j344862O35270L145611K414446N5524R62789N062871
$$ plain form
3024 -1617436 -2945501 -3402935 -2493964 -1130612 95561 1657778 3810146 5311440 4360032
3015 4360032 757101 -3665107 -6904194 -8254155 -7743403 -5355172 -1728723 1252643
3007 1252643 1875594 405430 -1362716 -2071204 -1571259 -207016 1664586 3631343 5448787
2998 5448787 7008616 7643150 6456892 4265714 3820629 6300439 8700654 7191394 2563536
2989 2563536 -455707 573106 3122854 3863563 2538719 337432 -2770768 -6789414
2981 -6789414 -9723437 -9402572 -6369807 -3040750 -777839 611978 1413945 1720638 1838250
2972 1838250 1543236 -91361 -2715901 -3929760 -2393798 -351206 -680962 -2659602 -3487838
2963 -3487838 -3030881 -3523139 -4868001 -4232731 -1087120 1327326 1382850 2345639 7408510
2954G408510O652797K802347k418945l976980k167436m02741J21176M95674Q76878
2945I391280L33082r11065j554621j255703q34238p69650r15416j249414j556444
2936F77811r17200J003641K629453K079282p0481j248364k04936J582485K018937
2927G550628N64587j921946m127157m678990k960767j68525J511348J289077L18371
2918b623374l71122r83228j499332r74394O08004J567349J130676J064622K711112
2909F30313M057933K489831o86869j720092p852J242364K64168r19667n37505
2900D812624k4970q94484j514043K47974L044992L507224O71129l258040n721115
2891H71291n560515l029580O3732J256170K70268k66644J248642K520309R80515
$$ plain form
2954 7408510 14061307 16863654 14444709 10467729 8300293 7897552 8018728 8514402 9391280
2945 9391280 9724362 8813297 7258676 6002973 5168735 4399085 3483669 2234255 677811
2936 677811 -239389 764252 3393705 5472987 5402506 4154142 3949206 5531691 7550628
2927 7550628 8115215 6193269 2066112 -2612878 -5573645 -5742170 -4230822 -2941745 -2623374
2918 -2623374 -2994496 -3977724 -5477056 -6451450 -5843446 -4276097 -3145421 -2080799 630313
2909 630313 4688246 7178077 6491208 4771116 4763264 6005628 6269796 5350129 4812624
2900 4812624 4787654 3893170 2379127 2627101 5672093 9179317 9850446 6592406 871291
2891 871291 -4689224 -7718804 -7655072 -6398902 -6128634 -6395278 -5146636 -2626327 -1645812
2882a645812j487834r94604K240696M184685L132085J454899Q17033j24183j957025
2873E619940k528230r26645K0402j910679m216610l132417O51623L117156K734945
2864e70515J842349K349835L045439J969981n72599k552080k756345j817866r52194
2855a3995l53085O39483J751537J220282j730243m588216l886729J6407K857512
2846d087047J992171l82227r54416J08116N39137J02005M61695J790405K323155
2837A892994J258315j88415q25049o71808P4685J399462K385596J526689j110868
2828E741601l352580l340302j509901N16841K016907L190281L784521K975037
2820A0022405P86942j258892j607463n08870L41724O3504m18852j26931L06619
$$ plain form
2882 -1645812 -3133646 -4128250 -1887554 2297131 5429216 6884115 7701148 7576965 5619940
2873 5619940 3091710 2165065 2185467 274788 -3941822 -7074239 -6422616 -3305460 -570515
2864 -570515 1271834 3621669 6667108 8637089 8064490 5512410 2756065 938199 -13995
2855 -13995 -367080 272403 2023940 3244222 1513979 -3074237 -6960966 -6944559 -4087047
2846 -4087047 -2094876 -2477103 -3431519 -3323403 -2784266 -2682261 -2220566 -430161 1892994
2837 1892994 3151309 2962894 2137845 1466037 1540722 2940184 5325780 6852469 5741601
2828 5741601 2389021 -951281 -2461182 -1944341 72566 3262847 7047368 10022405
2820 10022405 10809347 9550455 7942992 7434122 7775846 7839350 7420498 7293567 7600186
2811G600186j21856q04146n55296j09188j285932l536562l867389j162402J751003
2802b091582J862613j49074j593087j605718j146178m26513J125376K738432K425501
2793A139770l66495l602931m572294k414851J088672K966846J947319P3112K69726
2784c471126K177547K400810m06155l212326k929178n73871J140080K032370L258242
2775D16393L755956J626387j744405k599481R4716L457240M728002L818905J771255
2766A5324968o50231k517086l215578l533743m255009m154691j915227O86299
2758d230298Q28582m71166N57068M132851N940693L680119M77485k84678K17521
2749A0848177o59018k293315k453900j409939j020109j213174n94419L28494m38833
$$ plain form
2811 7600186 7478330 6674184 6118888 6009700 4723768 1187206 -2680183 -3842585 -2091582
2802 -2091582 -228969 -378043 -1971130 -3576848 -4723026 -5149539 -4024163 -1285731 1139770
2793 1139770 773275 -2829656 -7401950 -9816801 -8728129 -5761283 -3813964 -3740852 -3471126
2784 -3471126 -1293579 1107231 701076 -2511250 -5440428 -6014299 -4874219 -2841849 416393
2775 416393 4172349 5798736 4054331 1454850 1549566 5006806 9734808 13553713 15324968
2766 15324968 14674737 12157651 8942073 5408330 1153321 -3001370 -4916597 -4230298
2758 -4230298 -3401716 -3872882 -3315814 817037 6757730 10437849 10915334 10630656 10848177
2749 10848177 10189159 7895844 5441944 4032005 3011896 1798722 1204303 1532797 1093964
2740A093964k919557m576531l440694k47590K620691L270816J674522k28944l59719
2731c113042R29822J134058q07676k673281j996777M82972K063429J595573o148
2722b391070j701269k740381j939516J124367M294535M367785R92001k463263
2714d56811k620402K14233K633217J951571r43154k596349q70127K546116M142789
2705D001083K656193j70986k560802m284886m903102l117481M98984K482931O98125
2696d699941k011313j279318K508284M503005K035875j933651k951462l86863
2688d215384K793270L994963L041256R98992j270879l070887l508521k164216
2680c401406j8610J110793N09236o04767p99965l88981o49800j556695j722471
$$ plain form
2740 1093964 -1825593 -6402124 -9842818 -10090408 -7469717 -4198901 -2524379 -2753323 -3113042
2731 -3113042 -2183220 -1049162 -1856838 -4530119 -6526896 -6043924 -3980495 -2384922 -2391070
2722 -2391070 -4092339 -6832720 -8772236 -7647869 -3353334 1014451 2006452 -456811
2714 -456811 -3077213 -2862980 -229763 1721808 778654 -1817695 -2687822 -141706 4001083
2705 4001083 6657276 6486290 3925488 -359398 -5262500 -8379981 -7880997 -5398066 -4699941
2696 -4699941 -6711254 -7990572 -5482288 -979283 1056592 -877059 -3828521 -4215384
2688 -4215384 -1422114 2572849 5614105 6613097 5342218 2271331 -1237190 -3401406
2680 -3401406 -3420016 -2309223 -1799987 -2404754 -3204719 -3593700 -4243500 -5800195 -7522666
2671g522666n55783R99578K035097K514729K369069J408807M40225O26133J267704
2662C582893K68623k457058m216524l191509o35458J747971M047383N996859N292840
2653A0436020Q66880m009952m958623j907485J206581J314941j358268m682132
2645c092038o172223m203388N5607K938799K600860J561646K570301L951106K496875
2636B707545p19341j739176n7976J037214L52227K67801J672733K084748K96397
2627E902172j338891j112332m95436l99881J006293L913333M275558l91183n622277
2618E737356n142855K50552L708406J743183j927411k581627m56013J259232J318790
2609C909613Q18737M13651k92131j039853p02900Q50411K075417J645319J75106
$$ plain form
2671 -7522666 -8078449 -7078871 -5043774 -2529045 -159976 1248831 1689056 2315189 3582893
2662 3582893 3851516 1394458 -2822066 -6013575 -6649033 -4901062 -853679 5143180 10436020
2653 10436020 11302900 7292948 2334325 426840 1633421 2948362 1590094 -3092038
2645 -3092038 -9264261 -13467649 -13412042 -10473243 -7872383 -6310737 -3740436 210670 2707545
2636 2707545 1988204 249028 191052 1228266 1580493 1848294 3521027 5605775 5902172
2627 5902172 4563281 3450949 2955513 2555632 3561925 7475258 11750816 11359633 5737356
2618 5737356 594501 845053 4553459 6296642 4369231 1787604 1331591 2590823 3909613
2609 3909613 4728350 5142001 4849870 3810017 3107117 3957528 6032945 7678264 7853370
2600G853370p72270q10769p68178q64766k81634J127809K125771J854678R83502
2591A0447513J26957j320361l240240l328529m8801L945211M274555N68166l076031
2582H348440l593633k091232q65983k52908J65408k10328j574734k342303j189517
2573c606790P54911J508806J073519J071887K195830L388380L289183J690378
2565A1366104j78258o47113M36396R94676p09488l132198l171127q05947O86068
2556D839113k79981j453254q54031J94187J65613K89333J553338J656533j289663
2547D821188m227555k787137J689701L429844M27937l164400l577994k013003
2539e401419j063659m99204Q06066J780461J092147J23201Q50278K133767J403801
$$ plain form
2600 7853370 7081100 6270331 5502153 4637387 4355753 5483562 7609333 9464011 10447513
2591 10447513 10574470 9254109 6013869 2685340 2636539 6581750 10856305 11424471 8348440
2582 8348440 4754807 2663575 1797592 1544684 1710092 1499764 -74970 -2417273 -3606790
2573 -3606790 -2851879 -1343073 -269554 802333 2998163 6386543 9675726 11366104
2565 11366104 11187846 10540733 10977129 11971805 11262317 8130119 4958992 4153045 4839113
2556 4839113 4559132 3105878 2251847 2446034 2611647 2900980 4454318 6110851 4821188
2547 4821188 593633 -2193504 -503803 2926041 3353978 189578 -3388416 -5401419
2539 -5401419 -6465078 -6964282 -6158216 -4377755 -3285608 -3162407 -2312129 -178362 1225439
2530A225439o84159q29071J433494K404568j43112l111611k510633M40832J214175
2521e60078r32028j892198N29768K891506J541446j532567j981571j15744j17540
2512b169006k867836m356142k197442O08402N49337j259747j567880k6597J233577
2503a2053334J270560P72470J92641j9357J317914M000178M954948J903571k519785
2494a80194l611411r73530J424114J373463P92076J310178J401837k33450j635450
2485c32367n77986J515616J479681q92289k678831j990800l5119J145743J121404
2476a244948O54881K59080J26571O23842J712778K215666R03294j430591k196281
2467A624292j89176K431811K757753J057669J19791P95133P01554j763040m555264
$$ plain form
2530 1225439 541280 -287791 1145703 3550271 3407159 295548 -2215085 -1774253 -560078
2521 -560078 -1492106 -3384304 -2854536 36970 1578416 45849 -1935722 -2051466 -2169006
2512 -2169006 -5036842 -9392984 -11590426 -10982024 -10432687 -11692434 -13260314 -13286911 -12053334
2503 -12053334 -10782774 -10010304 -9817663 -9837020 -8519106 -4518928 436020 2339591 -180194
2494 -180194 -3791605 -4765135 -3341021 -1967558 -1175482 134696 1536533 1303083 -332367
2485 -332367 -910353 605263 2084944 1192655 -1486176 -3476976 -3512095 -2366352 -1244948
2476 -1244948 -590067 -330987 -204416 419426 2132204 4347870 5251164 3820573 1624292
2467 1624292 1435116 3866927 6624680 7682349 7802140 8597273 9298827 7535787 2980523
2458B980523m868292k968772j079750o750P67186R53812J78563q2798J707013
2449b419265L891501L369376N93216o36423R77845K174294M50225j983886k070369
2440D346514r03049j483413l242068k689952P83928L429421K398956l40692j024851
2431A274794R08072K834490K880529J701807N74010k66721q64294q10160l02353
2422G930174o21128k146040k941957j202708J509574J826677n36864k061585n21707
2413A234436J744132J477131o93269j598510l30540J136225J537105J641126J779622
2404G927458P47289j787612l775085l186004q86267K78881r77784k770354k378555
2395f808033J55431J749964L79951j564758j81960L857014N297711J694232k523155
$$ plain form
2458 2980523 -1887769 -4856541 -5936291 -5943041 -5175855 -4222043 -4043480 -4126278 -2419265
2449 -2419265 1472236 4841612 5434828 4798405 5776250 7950544 8400769 6416883 4346514
2440 4346514 3443465 1960052 -1282016 -3971968 -3188040 241381 2640337 2299645 1274794
2431 1274794 2182866 5017356 7897885 9599692 10173702 9906981 9042687 8232527 7930174
2422 7930174 7309046 5163006 2221049 1018341 2527915 4354592 3817728 1756143 1234436
2413 1234436 2978568 4455699 3762430 2163920 1833380 2969605 4506710 6147836 7927458
2404 7927458 8674747 6887135 3112050 -73954 -960221 -681340 -1659124 -4429478 -6808033
2395 -6808033 -6652602 -4902638 -4522687 -6087445 -6269405 -2412391 2885320 4579552 2056397
2386B056397k195701J132323J943254q67548l095786k233389m32178K99999J174189
2377b218440K973535L336794N25412k884247l062002J550K956400L383986J521313
2368F534301j247458l578720m361439l288604j160473R18124K107963J701383
2360b374923j04232j227512L85169L318338L586943Q2487l388415l191077n95879
2351c509101Q41535N64440P61193K053566K586827J341847k23246m56864K42414
2342D202611K56729r69521k082590j334348R55159K033411l3065l147547l260590
2333c379751P5485K708630J542980j302015j898106M5554J679744J539355P63144
2324A775020L57509j39433j067259j699683j412881n62579J98373P19313J254107
$$ plain form
2386 2056397 -139304 993019 2936273 2068725 -1027061 -3260450 -3692628 -3392629 -2218440
2377 -2218440 755095 4091889 4617301 1733054 -1328948 -1327398 1629002 5012988 6534301
2368 6534301 5286843 1708123 -2653316 -5941920 -7102393 -6184269 -4076306 -2374923
2360 -2374923 -2479155 -3706667 -3321498 -3160 3583783 3666270 277855 -2913222 -3509101
2351 -3509101 -2667566 -2103126 -1341933 711633 3298460 4640307 4417061 3960197 4202611
2342 4202611 4459340 3489819 1407229 72881 1028040 3061451 3028386 -119161 -3379751
2333 -3379751 -3304266 -595636 947344 -354671 -2252777 -2207223 -527479 1011876 1775020
2324 1775020 2132529 1993096 925837 -773846 -2186727 -2749306 -2550933 -1831620 -577513
2315e77513J926917K311943J673539R2695j076453r46428p31265j870338l036041
2306b232944j691990J309886K043438n65712k602455q70679K456246L438556J830496
2297C114842m556j233708k334059k620631j366130l1186k66976r22659J7430J841782
2287c805851K469976K007415J734795R67532j482654l891289l555214j365980
2279f921270n27671j272045r53829Q32031J570706O32547N24526K354118L809673
2270D8786K968555R46308m48647q88571m44628Q76953J731341L86568k183850
2261B992815k989532j436984o9619k80790n50731J80171P77737P38312J405526
2252G66905K914880L085378R37797j607563k930228l541580l452132j295213K161325
$$ plain form
2315 -577513 1349404 3661347 5334886 5427581 4351128 3404700 2673435 803097 -2232944
2306 -2232944 -3924934 -2615048 -571610 -1137322 -3739777 -4610456 -2154210 1284346 3114842
2297 3114842 3110286 1876578 -457481 -3078112 -4444242 -4475428 -4742404 -5665063 -5647633 -3805851
2287 -3805851 -1335875 671540 2406335 3373867 1891213 -2000076 -5555290 -6921270
2279 -6921270 -7448941 -8720986 -9674815 -8842784 -7272078 -6639531 -6115005 -3760887 48786
2270 48786 3017341 3963649 3515002 2626431 2181803 3058756 4790097 5176665 2992815
2261 2992815 3283 -1433701 -1503320 -1784110 -2334841 -2154670 -1376933 -638621 766905
2252 766905 3681785 6767163 7704960 6097397 3167169 -374411 -3826543 -5121756 -2960431
2243b960431L405524J459661Q7745J824745L425068J065322k935708l220870M97156
$$ plain form
2243 -2960431 445093 1904754 1992499 3817244 7242312 8307634 5371926 2151056 2648212
$$ [...]
##END NTUPLES=NMR SPECTRUM
##END=
