##TITLE=31Pdec_DE-139km2_TFA
 CCl4,24 sc
 23.4.2026
##JCAMPDX= 6.0         $$ Bruker NMR JCAMP-DX V2.0
##DATA TYPE= NMR SPECTRUM
##DATA CLASS= NTUPLES
##ORIGIN= UXNMR, Bruker Analytische Messtechnik GmbH
##OWNER= root
$$ XWIN-NMR		Version 3.5
$$ Thu Apr 23 14:09:25 2026 Russian Standard Time (UT+4h)  she@DPX200
##.OBSERVE FREQUENCY= 81.013821
##.OBSERVE NUCLEUS= ^31P
##.ACQUISITION MODE= SIMULTANEOUS
##.ACQUISITION SCHEME= undefined
##.AVERAGES= 24
##.DIGITISER RES= 17
##SPECTROMETER/DATA SYSTEM= spect
##.PULSE SEQUENCE= zgpg30
##.SOLVENT NAME= DMSO
##.SHIFT REFERENCE= (INTERNAL, DMSO, 0, 197.392)
##AUDIT TRAIL= $$ (NUMBER, WHEN, WHO, WHERE, WHAT)
$$ ##TITLE= Audit trail, XWIN-NMR		Version 3.5
$$ ##JCAMPDX= 5.01
$$ ##ORIGIN= Bruker BioSpin GmbH
$$ ##OWNER= she
$$ F:/spectra/data/she/nmr/P31/2/pdata/1/auditp.txt
$$ ##AUDIT TRAIL=  $$ (NUMBER, WHEN, WHO, WHERE, WHAT)
(   1,<2026-04-23 14:07:57.70 +0400>,<she>,<DPX200>,
      <created by zg, POWCHK disabled, PULCHK disabled
       configuration hash MD5:
       00 E9 B6 7A A2 85 ED C7 34 08 36 98 17 FE 4E 26
       data hash MD5: 32K
       EF 92 9D 95 53 84 5A 87 9A 57 AE D9 FC 41 8B 0B>)
(   2,<2026-04-23 14:08:06.48 +0400>,<she>,<DPX200>,
      <Start of raw data processing
       efp BC_mod = 2 LB = 1.5 FT_mod = 6 PKNL = 1 PHC0 = 1151.94 PHC1 = 815.3004 SI = 64K 
       data hash MD5: 64K
       07 44 72 3F 2A 0D A0 59 55 A9 36 12 51 D3 63 83>)
(   3,<2026-04-23 14:08:21.28 +0400>,<she>,<DPX200>,
      <pk PHC0 = -7.840002 PHC1 = 0 
       data hash MD5: 64K
       D7 7B BC 05 F1 E6 58 0C C5 95 A0 D7 0F 0F 5A 57>)
(   4,<2026-04-23 14:08:44.50 +0400>,<she>,<DPX200>,
      <pk PHC0 = 14.4 PHC1 = 0 
       data hash MD5: 64K
       B4 CE 69 27 42 56 2F 71 CD FA 45 CD 9F C4 E7 DF>)
$$ ##END=
$$ 
$$ hash MD5
$$ 1D 8C C6 2C DD 49 38 C1 51 4F 64 10 30 66 BD 13
##$RELAX= 
##$RELAX= 
##$RELAX= 
##$RELAX= 
##$RELAX= 
##$RELAX= 
##$RELAX= 
##$RELAX= 
$$ Bruker specific parameters
$$ --------------------------
##$DU= <F:/spectra>
##$EXPNO= 2
##$NAME= <P31>
##$PROCNO= 1
##$TYPE= <nmr>
##$USER= <she>
##$AMP= (0..31)
100 100 100 100 100 100 100 100 100 100 100 100 100 100 100 100 100 100 
100 100 100 100 100 100 100 100 100 100 100 100 100 100 
##$AQSEQ= 0
##$AQ_mod= 1
##$AUNM= <au_zg>
##$AUTOPOS= <>
##$BF1= 81.014009
##$BF2= 200.13
##$BF3= 200.13
##$BF4= 200.13
##$BF5= 200.13
##$BF6= 200.13
##$BF7= 200.13
##$BF8= 200.13
##$BYTORDA= 1
##$CFDGTYP= 0
##$CFRGTYP= 5
##$CHEMSTR= <none>
##$CNST= (0..31)
1 1 145 1 1 1 1 1 1 1 1 1 1 1 1 1 1 1 1 1 1 1 1 1 1 1 1 1 1 1 1 1 
##$CPDPRG= <waltz16>
##$CPDPRG1= <>
##$CPDPRG2= <waltz16>
##$CPDPRG3= <>
##$CPDPRG4= <mlev>
##$CPDPRG5= <mlev>
##$CPDPRG6= <mlev>
##$CPDPRG7= <mlev>
##$CPDPRG8= <mlev>
##$CPDPRGB= <>
##$CPDPRGT= <>
##$D= (0..31)
0 1 0 0 0 0 0 0 0 0.06 0 0.03 2e-05 3e-06 0 0 0.0002 0 0 0 0 0 0 0 0 0 
0 0 0 0 0 0 
##$DATE= 1776938877
##$DBL= (0..7)
120 120 120 11 120 120 24 19 
##$DBP= (0..7)
150 150 150 150 150 150 150 150 
##$DBP07= 0
##$DBPNAM0= <>
##$DBPNAM1= <>
$$ [...]
##$SUBNAM2= <"">
##$SUBNAM3= <"">
##$SUBNAM4= <"">
##$SUBNAM5= <"">
##$SUBNAM6= <"">
##$SUBNAM7= <"">
##$SUBNAM8= <"">
##$SUBNAM9= <"">
##$SW= 400.765351723535
##$SWIBOX= (0..15)
0 1 3 0 0 0 0 0 0 0 0 0 0 0 0 0 
##$SW_h= 32467.5324675325
##$TD= 32768
##$TD0= 1
##$TE= 0
##$TE2= 300
##$TE3= 300
##$TEG= 300
##$TL= (0..7)
0 120 53 12 22 120 120 120 
##$TP= (0..7)
150 150 150 150 150 150 150 150 
##$TP07= 0
##$TPNAME0= <>
##$TPNAME1= <>
##$TPNAME2= <>
##$TPNAME3= <>
##$TPNAME4= <>
##$TPNAME5= <>
##$TPNAME6= <>
##$TPNAME7= <>
##$TPOAL= (0..7)
0.5 0.5 0.5 0.5 0.5 0.5 0.5 0.5 
##$TPOFFS= (0..7)
0 0 0 0 0 0 0 0 
##$TUNHIN= 0
##$TUNHOUT= 0
##$TUNXOUT= 0
##$USERA1= <user>
##$USERA2= <user>
##$USERA3= <user>
##$USERA4= <user>
##$USERA5= <user>
##$V9= 5
##$VALIST= <valist>
##$VCLIST= <CCCCCCCCCCCCCCC>
##$VD= 0
##$VDLIST= <DDDDDDDDDDDDDDD>
##$VPLIST= <PPPPPPPPPPPPPPP>
##$VTLIST= <TTTTTTTTTTTTTTT>
##$WBST= 1024
##$WBSW= 4
##$XGAIN= (0..3)
0 0 0 0 
##$XL= 0
##$YL= 0
##$YMAX_a= 3318
##$YMIN_a= -4705
##$ZGOPTNS= <>
##$ZL1= 120
##$ZL2= 120
##$ZL3= 120
##$ZL4= 120
##$ABSF1= 0
##$ABSF2= 0
##$ABSG= 0
##$ABSL= 0
##$ALPHA= 0
##$AQORDER= 0
##$ASSFAC= 0
##$ASSFACI= 0
##$ASSFACX= 0
##$ASSWID= 0
##$AUNMP= <proc_1d>
##$AZFE= 0.1
##$AZFW= 0.5
##$BCFW= 0
##$BC_mod= 2
##$BYTORDP= 0
##$COROFFS= 0
##$CY= -3
##$DATMOD= 1
##$DC= 0
##$DFILT= <>
##$DTYPP= 0
##$F1P= 0
##$F2P= 0
##$FCOR= 1
##$FTSIZE= 65536
##$FT_mod= 6
##$GAMMA= 0
##$GB= 0
##$INTBC= 1
##$INTSCL= 9.790993e-09
##$ISEN= 30
##$LB= 1.5
##$LEV0= 0
##$LPBIN= 0
##$MAXI= 10000
##$MC2= 0
##$MEAN= 0
##$ME_mod= 0
##$MI= 50
##$NCOEF= 0
##$NC_proc= -10
##$NLEV= 6
##$NOISF1= 182.463
##$NOISF2= 159.3651
##$NSP= 0
##$NTH_PI= 0
##$NZP= 0
##$OFFSET= 197.3918
##$PC= 4
##$PHC0= 1158.5
##$PHC1= 815.3004
##$PH_mod= 1
##$PKNL= yes
##$PPARMOD= 0
##$PSCAL= 0
##$PSIGN= 0
##$REVERSE= no
##$SF= 81.014063255964
##$SI= 65536
##$SIGF1= 159.3651
##$SIGF2= -187.1042
##$SINO= 113.3802
##$SIOLD= 16384
##$SREGLST= <1H.CDCl3>
##$SSB= 0
##$STSI= 65536
##$STSR= 0
##$SW_p= 32467.5324675325
##$SYMM= 0
##$S_DEV= 0
##$TDeff= 32768
##$TDoff= 0
##$TI= <>
##$TILT= no
##$TM1= 0
##$TM2= 0
##$TOPLEV= 0
##$USERP1= <user>
##$USERP2= <user>
##$USERP3= <user>
##$USERP4= <user>
##$USERP5= <user>
##$WDW= 1
##$XDIM= 65536
##$YMAX_p= 398189468
##$YMIN_p= -239445275
$$ End of Bruker specific parameters
$$ ---------------------------------
##NTUPLES= NMR SPECTRUM
##VAR_NAME=  FREQUENCY,     SPECTRUM/REAL,   SPECTRUM/IMAG
##SYMBOL=    X,             R,               I
##VAR_TYPE=  INDEPENDENT,   DEPENDENT,       DEPENDENT
##VAR_FORM=  AFFN,          ASDF,            ASDF
##VAR_DIM=   65536,         65536,           65536
##UNITS=     HZ,            ARBITRARY UNITS, ARBITRARY UNITS
##FACTOR=    0.49542278885378, 1,            1
##FIRST=     15991.5117654749, 0,            0
##LAST=      -16476.0207020576, 0,           0
##MIN=       -16476.0207020576, -239445275,  0
##MAX=       15991.5117654749, 398189468,    0
$$ Real data points
##PAGE= N=1
##DATA TABLE= (X++(R..R)), XYDATA
$$ [...]
44393a9431276k340048L513293R362252J2720100J2245301Q174568K378597k758310
$$ -19431276 -21771324 -18258031 -8895779 3824321 16069622 24244190 26622787 23864477
44385B3864477o003531p456294p320483n532414k657874p1453J098968O53954
$$ 23864477 17860946 10404652 3084169 -2448245 -5106119 -5177572 -4078604 -3424650
44377c424650p50059j587133k24797K811461M211118J642630k487336l542211
$$ -3424650 -4174709 -5761842 -5986639 -3175178 1035940 2678570 191234 -3350977
44369c350977m44718L822482O813004Q088352O660705J718593l820765n732747
$$ -3350977 -3795695 26787 6839791 14928143 21588848 23307441 19486676 13753929
44361A3753929n128482o593680q773026m973999L895209O621788j813935j0247832
$$ 13753929 8625447 2031767 -6741259 -11715258 -7820049 -1198261 -3012196 -13260028
44353a3260028o855200L436304Q200945O982542P608234Q401181J015740j0513035
$$ -13260028 -20115228 -16678924 -8477979 -1495437 6112797 14513978 15529718 5016683
44345E016683j1777071j573804M402939r67002m831094K381890R338671L120655
$$ 5016683 -6760388 -8334192 -3931253 -4898255 -9729349 -7347459 1991212 5111867
44337E111867p808606o945047L442000P011741k64516o273617l985241r1040p18453
$$ 5111867 -2696739 -9641786 -6199786 811955 547439 -5726178 -9711419 -9802459 -10520912
44328a0520912k524065j498195O39193K446105N725411R335977Q485856K993169
$$ -10520912 -13044977 -14543172 -13903979 -11457874 -5732463 3603514 12089370 15082539
44320A5082539j517063k830320m609274p506679o229445J271129R151806J1518296
$$ 15082539 13565476 10735156 6125882 -1380797 -7610242 -6339113 2812693 14330989
44312A4330989Q335894J436014p569559j2887648p187154O621627J4540825Q419266
$$ 14330989 22666883 24102897 16533338 3645690 -3541464 3080163 17620988 26040254
44304B6040254l236181p561887l804083k45172l41257n72207Q71164J406998n55271
$$ 26040254 22804073 15242186 11438103 11192931 10851674 10279467 11150631 12557629 12002358
44295A2002358l462310n502137n387028j432786N992774J2231330J2499765P606227
$$ 12002358 8540048 3037911 -2349117 -3781903 2210871 14442201 26941966 34548193
44287C4548193K438076j61174j094313j790326k330246k463976k596725l887072
$$ 34548193 36986269 36825095 35730782 33940456 31610210 29146234 26549509 22662437
44279B2662437p394976j1570712j1477825m211244N226848Q540908N166550K552615
$$ 22662437 15267461 3696749 -7781076 -11992320 -6765472 1775436 6941986 9494601
44271I494601L942625L389965l224767r710174q402708j814432J668266k32346
$$ 9494601 13437226 16827191 13602424 3892250 -4510458 -6324890 -4656624 -4888970
44263d888970k932318l306982k211656p30457M88052J77489o68984J837590P365100
$$ -4888970 -7821288 -11128270 -13339926 -14070383 -13582331 -13404842 -14073826 -12236236 -4871136
44254d871136Q306950N57693p424050n131180L916775O786074R3331o533785o297919
$$ -4871136 3435814 3993507 -3430543 -8561723 -4644948 2141126 2234457 -4299328 -10597247
44245a0597247l529072l388388l252801P38830O134497Q454017P543017N246665
$$ -10597247 -14126319 -17514707 -20767508 -20028678 -13894181 -5440164 2102853 7349518
44237G349518J528026l084374n501653m454872l284904m838940o657120m439822
$$ 7349518 8877544 5793170 291517 -4163355 -7448259 -12287199 -18944319 -23384141
44229b3384141J989906Q420196J0027869M789481l990977q633282m642112K795362
$$ -23384141 -21394235 -12974039 -2946170 1843311 -2147666 -10780948 -15423060 -12627698
44221a2627698M844801J162604p14969J597660J724758l199057n910825m95341
$$ -12627698 -7782897 -6620293 -7335262 -5737602 -4012844 -7211901 -13122726 -13618067
44213a3618067P294997Q611161M366440J454791Q57001j556604n141548m459923
$$ -13618067 -6323070 2288091 6654531 8109322 8966323 7409719 2268171 -2191752
44205b191752J277450O234429N888698J238129m659960q874068q024991j528401
$$ -2191752 -914302 5320127 11208825 12446954 7786994 -1087074 -9112065 -10640466
44197a0640466M795261M338199r86566l116834K58655K978680R15659j892950
$$ -10640466 -5845205 -1507006 -2493572 -5610406 -5351751 -2373071 -1457412 -3350362
44189c350362o64537K781013M171814L219190J483819j665541n729650n490405
$$ -3350362 -4014899 -1233886 2937928 6157118 7640937 5975396 245746 -5244659
44181e244659K669453J2541916J3090583K483568q582712r740579k513002M060375
$$ -5244659 -2575206 9966710 23057293 25540861 16958149 7217570 4704568 8764943
44173H764943N387077M024990K430303p58032n722093p960887l869929K801829
$$ 8764943 14152020 18177010 20607313 19849281 14127188 6166301 2296372 5098201
44165E098201M604792k55472o276350q321509o794321m409249k096585j24821
$$ 5098201 9702993 9447521 3171171 -5150338 -11944659 -16353908 -18450493 -18575314
44157a8575314L76610k55989P99424M785355Q632355Q827351N673745J371991
$$ -18575314 -18198704 -18454693 -17655269 -12869914 -4237559 4589792 10263537 11635528
44149A1635528l155420o582439n769340l60231L852729J117712o269666j0666453
$$ 11635528 8480108 1897669 -3871671 -4231902 -379173 738539 -5531127 -16197580
44141a6197580q342956j763917N291099R698783Q167153Q24456n519398m388376
$$ -16197580 -24540536 -26304453 -21013354 -11314571 -3147418 -2322962 -7842360 -12230736
44133a2230736Q92844J997016j034503m59807M476164M630121l201511q489546
$$ -12230736 -11337892 -9340876 -10375379 -10835186 -6359022 -1728901 -4930412 -13419958
44125a3419958k522486P257179Q196985J235482k145579K085068O817202O750649
$$ -13419958 -15942444 -8685265 -488280 747202 -1398377 686691 7503893 14254542
44117A4254542M107194N93531n923668j3494952j3862610l648142Q316546J0692982
$$ 14254542 18361736 18955267 13031599 -463353 -14325963 -17974105 -9657559 1035423
44109A035423L213182m278016m166583J660193N878356L937991j883029n377362
$$ 1035423 4248605 -29411 -4195994 -2535801 3342555 7280546 5397517 20155
44101B0155l327445J068783K909753K033671J484895J051510k232843o833573
$$ 20155 -3307290 -2238507 671246 2704917 4189812 5241322 3008479 -3825094
44093c825094o316822J094783Q155438P920668K967851M74826J806155K762391
$$ -3825094 -10141916 -9047133 -891695 7028973 9996824 10471650 12277805 15040196
44085A5040196J692657Q30127K18658l238597r389336j2730429r116959j134155
$$ 15040196 16732853 17562980 17781638 14543041 5153705 -7576724 -16693683 -17827838
44077a7827838N359824P473200O366900M492558L588612L799621L500447J283361
$$ -17827838 -12468014 -4994814 1372086 5864644 9453256 13252877 16753324 18036685
44069A8036685j648399l156234l944504n983927o833772j113162R531338J3982332
$$ 18036685 16388286 13232052 9287548 3303621 -3530151 -4643313 4888025 18870357
44061A8870357N339473p307201r304095p96422L503552l616757j1118922p139187
$$ 18870357 24209830 16902629 7598534 6802112 10305664 6688907 -4430015 -11569202
44053a1569202K507279L750247l675574o554093N35800P516392N843025J466747
$$ -11569202 -9061923 -5311676 -8987250 -15541343 -15005543 -7489151 -1646126 -179379
44045a79379L505922Q746411P068731k438167j0277666r665405k983769L942036
$$ -179379 3326543 12072954 19141685 16703518 6425852 -3239553 -6223322 -2281286
44037b281286O887781L070179o839524j5812976j5886571p632326J018587N410633
$$ -2281286 4606495 7676674 837150 -14975826 -30862397 -38494723 -37476136 -32065503
44029c2065503P326440P554256L614423k688881l756239L002445R548192P910510
$$ -32065503 -24739063 -17184807 -13570384 -16259265 -20015504 -17013059 -7464867 445643
44021D45643R62220l282556l072360j978526p27257K381352N224051L638674j105271
$$ 445643 1407863 -1874693 -4947053 -6925579 -7652836 -5271484 -47433 3591241 2485970
44012B485970l235125j190770K19749k823284q243212j1373823r605496l478288
$$ 2485970 -749155 -1939925 -1720176 -4543460 -12786672 -24160495 -33765991 -37244279
44004c7244279L673702P429430O584501M855612N500234O430102M541949K018683
$$ -37244279 -33570577 -26141147 -19556646 -14701034 -9200800 -2770698 1771251 3789934
43996C789934K633146M068350J011055n021508o574488j464119M294121O032806
$$ 3789934 6423080 10491430 11502485 6480977 -93511 -1557630 2736491 8769297
43988H769297N588720M950303K221746k835496n940417m727832k172361l57024
$$ 8769297 14358017 19308320 21530066 18694570 12754153 8026321 5853960 5496936
43980E496936K628380N909872L584149n157068j1033279p198969k61685J44778
$$ 5496936 8125316 14035188 17619337 12462269 1428990 -5769979 -6031664 -5886886
43972e886886k764231J345006J1357578J4611823O364688k640928k536413J700622
$$ -5886886 -8651117 -7306111 4051467 18663290 25027978 22387050 19850637 21551259
43964B1551259k29335p420942r721503l477270L260750K419846l564152o458751
$$ 21551259 21321924 13900982 4179479 702209 3962959 6382805 2818653 -3640098
43956c640098l917876j552654l581206o273147l846755K112658M340358O13482
$$ -3640098 -7557974 -9110628 -12691834 -18964981 -22811736 -20699078 -16358720 -15745238
43948a5745238k868640n88174N159204R480507J2045454J3983862J2072682L142607
$$ -15745238 -18613878 -19202052 -14042848 -4562341 7483113 21466975 33539657 36682264
43940C6682264p801958j1383834n918924P82969K467075J043638N17580M94752
$$ 36682264 28880306 17496472 11577548 12360517 14827592 15871230 16388810 16883562
43932A6883562r53860k692843k743867k028135k361848k919564j865616l704M9972
$$ 16883562 15929702 13236859 10492992 8464857 6103009 3183445 1317829 1314125 1364097
43923A364097k278986m463059l576734O24406M983885N660421K627399M07107
$$ 1364097 -914889 -5377948 -8954682 -8330276 -3346391 2314030 4941429 5348536
43915E348536K221103M775770K395362m345426q498564n656053J266712O872839
$$ 5348536 7569639 12345409 14740771 10395345 1896781 -3759272 -2492560 4380279
43907D380279Q426820N224063j881687q198735p779313j528971K089258j790923
$$ 4380279 12807099 18031162 16149475 7950740 171427 -1357544 731714 -1059209
43899a059209p336639o607419n49737M408401O625914Q817023J0033734O438040
$$ -1059209 -8395848 -15003267 -15553004 -11144603 -4518689 4298334 14332068 20770108
43891B0770108l60303l897182l044249l976533r332215j2636118q071682k4909
$$ 20770108 20409805 16512623 13468374 9491841 159626 -12476492 -20548174 -20573083
43883b0573083L021411M48436q03938L244990R092156J1445464Q697448K424416
$$ -20573083 -17551672 -17103236 -17907174 -14662184 -5570028 5875436 14572884 16997300
43875A6997300m329309p437199m291024K365816O278074M970577K288663J846772
$$ 16997300 12667991 5230792 939768 3305584 9583658 14554235 16842898 18689670
43867A8689670J352203l054397r159058j0147211l729028M258472O774211L364773
$$ 18689670 20041873 16987476 7828418 -2318793 -6047821 -1789349 4984862 8349635
43859H349635o20856p82593J989534L047306r06143p483935r774403l836984N284146
$$ 8349635 7728779 6946186 8935720 11983026 11076883 3592948 -6181455 -10018439 -4734293
43850d734293Q380265L690895l76581L359838J0588838J1029891K135092p599488
$$ -4734293 3645972 7336867 6960286 10320124 20908962 31938853 34073945 26474457
43842B6474457q807668r23058Q494692J0949697L507090q677832j5857945j2424086
$$ 26474457 17666789 16743731 25238423 36188120 39695210 31017378 15159433 2735347
43834B735347k605793M507656M864958J487876k165473o030068r881989j0693026
$$ 2735347 129554 4637210 9502168 10990044 8824571 2794503 -7087486 -17780512
43826a7780512o199225J445856P569586Q924431N192166r94177m936690l532766
$$ -17780512 -23979737 -22533881 -14964295 -6039864 -847698 -1841875 -6778565 -10311331
43818a0311331J097047L987054L396355J554127j73777k435484l946018j721935
$$ -10311331 -9214284 -5227230 -1830875 -276748 -450525 -2886009 -6832027 -8553962
43810h553962L155674N266524K719247J86926J152341K374168N9916l289476l103783
$$ -8553962 -5398288 -131764 2587483 2774409 3926750 6300918 6360834 3071358 -32425
43801c2425L6721K350672K702002J713004j494609o360298q014748l418936K294754
$$ -32425 4296 2354968 5056970 6769974 5275365 -1084933 -9099681 -12518617 -10223863
43792a0223863K071310k572390m126993o47545K651563K851198K693805L680205
$$ -10223863 -8152553 -10724943 -14851936 -15499481 -12847918 -9996720 -7302915 -3622710
43784c622710L228053P91761J73398K878122M909871L332724Q24421J87082q56285
$$ -3622710 -394657 397104 570502 3448624 8358495 11691219 12515640 12702722 11846437
43775A1846437n035823r427823q806901l095074K664363M710607L665183J885371
$$ 11846437 6810614 -2617209 -11424110 -14519184 -11854821 -7144214 -3479031 -1593660
43767a593660N08298o88615j943223k257349L80970O358411J2187671J2936266
$$ -1593660 -1085362 -1773977 -3717200 -5974549 -5593579 764832 12952503 25888769
43759B5888769P317666j415802r456338j4707597j5330500j0065091j477697M656708
$$ 25888769 33206435 31790633 22334295 7626698 -7703802 -17768893 -19246590 -14589882
43751a4589882N575662M587866N739132P853824O608071J061323m464633m778454
$$ -14589882 -9014220 -4426354 1312778 9166602 15774673 16835996 12371363 7592909
43743G592909R31755P643810Q393741J417126o812497q514083m530977l092476
$$ 7592909 8524664 16168474 24562215 25979341 19166844 10652761 6121784 3029308
43735C029308p442807j0093912l500848P708954J1451687L977544n211649n672005
$$ 3029308 -4413499 -14507411 -18008259 -10299305 1152382 5129926 -81723 -5753728
43727e753728J489481O544819L817216k642442n886618m778553l403038l841682
$$ -5753728 -4264247 2280572 6097788 3455346 -2431272 -7209825 -10612863 -14454545
43719a4454545l698798j409541K74592r70167k135008Q48256N968306P547155
$$ -14454545 -18153343 -19562884 -19288292 -20258459 -22393467 -21545211 -15576905 -8029750
43711h029750N001663L435849N061341O041967L590950K65676j690086m545467
$$ -8029750 -3028087 407762 5469103 11511070 15102020 15367696 13677610 9132143
43703I132143r438960j1645254p005280N84516M073816L192409L378726O234007
$$ 9132143 -306817 -11952071 -18957351 -18372835 -14299019 -11106610 -7727884 -1493877
43695a493877P469858M529227L49177j945466l227802n003540n645528k880222
$$ -1493877 5975981 10505208 10854385 8908919 5681117 677577 -4967951 -7848173
43687g848173K079106N363451M532506M84611l846384n700749m186881q34158
$$ -7848173 -5769067 -405616 4126890 4611501 765117 -4935632 -9122513 -9956671
43679i956671J602481J350172j018371l040168k409490N62279K787041K140802
$$ -9956671 -8354190 -7004018 -8022389 -11062557 -13472047 -12909768 -10122727 -7981925
43671g981925R68176L179261P539820P726794J232625n613686n511663l36675
$$ -7981925 -7013749 -3834488 3705332 11432126 12664751 7051065 1539402 1202727
43663A202727J768315j746838m805658k488215J773152K035214j044757j595680
$$ 1202727 2971042 1224204 -3581454 -6069669 -4296517 -2261303 -3306060 -4901740
43655d901740K418440O221887N156281R25880j528180j128131j086068k767879
$$ -4901740 -2483300 3738587 8894868 9820748 8292568 7164437 6078369 3310490
43647C310490l221106l60187K969636L152822J382381J211389K410682J842683
$$ 3310490 89384 -270803 2698833 5851655 7234036 8445425 10856107 12698790
43639A2698790n70469j737485r07175o3367J059074M202882O256583J120883r581813
$$ 12698790 12128321 10390836 9483661 9420294 10479368 14682250 20938833 22059716 12477903
43630A2477903j5223323r954201q83996K924870K900012N292134Q985216Q023674
$$ 12477903 -2745420 -12699621 -13583617 -10658747 -7758735 -2466601 6518615 14542289
43622A4542289K796610n27662j09676M71478K24764J499588L033331O37317m441643
$$ 14542289 17338899 16811237 16701561 17173039 17397803 18897391 21930722 22568039 18126396
43613A8126396n843698k207186O77374k22112p27733K034436L741838p4877o329868
$$ 18126396 12282698 10075512 10752886 10530774 9803041 11837477 15579315 15504438 9174570
43604I174570q234267l531515M162434R362512Q345907K150859l015663k237679
$$ 9174570 940303 -2591212 1571222 10933734 19279641 21430500 18414837 16177158
43596A6177158R77740q13601p172200r384112l553267L549113N072597L034203
$$ 16177158 17154898 16341297 9169097 -215015 -3768282 -219169 4853428 7887631
43588G887631J942727O36973l082716n548367k540020K402857K554799j474468
$$ 7887631 9830358 10467331 7384615 1836248 -703772 1699085 4253884 2779416
43580B779416k918379N74393M028133K895904j446224m647888m266668j316708
$$ 2779416 -138963 435430 4463563 7359467 5913243 1265355 -3001313 -4318021
43572d318021Q23576m19496l307714l307513M75567L441388K077099j395484l624142
$$ -4318021 -3494445 -3913941 -7221655 -10529168 -10053601 -6612213 -4535114 -5930598 -9554740
43563i554740m970382o080792m245009J924167Q138147R915981Q601901O687020
$$ -9554740 -14525122 -20605914 -24850923 -22926756 -14788609 -4872628 3729273 10416293
43555A0416293J861634p251709j3704535r497626J812123Q587474O415651J622812
$$ 10416293 12277927 5026218 -8678317 -18175943 -16363820 -7776346 -1360695 262117
43547B62117j23164j6537m5450R15959K789860L006217J510802R45235Q11762
$$ 262117 138953 122416 76966 992925 3782785 6789002 8299804 9245039 10056801
43538A0056801j779470m650470j692140O552187J1347458P676228K03824n503242
$$ 10056801 8277331 3626861 1934721 8486908 19834366 27510594 27714418 22211176
43530B2211176r544483j1743717q023191J376924P755502M908932k048077n272483
$$ 22211176 12666693 922976 -7100215 -5723291 2032211 6941143 4893066 -379417
43522c79417n013757m675755k129090M605803Q729094K917213p011967q156129
$$ -379417 -5393174 -10068929 -12198019 -7592216 1136878 4054091 -2957876 -11114005
43514a1114005P94385P983620O071189Q28579k88568J635333K285104J646817
$$ -11114005 -10319620 -2336000 3735189 4563768 4275200 5910533 8195637 9842454
43506I842454J368977O66574o84530l34167J790608J579503k360800m748908j111446
$$ 9842454 11211431 11878005 11193475 10859308 12649916 14229419 11868619 7119711 6008265
43497F008265M947258O809946L818558L57247j223621j834607j882348j092524
$$ 6008265 10955523 17765469 21584027 21941274 20717653 18883046 17000698 15908174
43489A5908174p74609k059409l118121k043303r63054k891322n742334m440680
$$ 15908174 15133565 13074156 9956035 7912732 6949678 4058356 -1683978 -6124658
43481f124658J382272O666513Q053163O941014M934669J521351k099841k172538
$$ -6124658 -4742386 1924127 9977290 16918304 21852973 23374324 21274483 19101945
43473A9101945J523253L125811j699216q854157j1030242p545656m008068l411423
$$ 19101945 20625198 23751009 22051793 13197636 2167394 -5378262 -9386330 -12797753
43465a2797753l119770j155150P1459j206191j827707J489780N793078N205912
$$ -12797753 -15917523 -17072673 -17001214 -18207405 -20035112 -18545332 -12752254 -7546342
43457g546342j24588l315337k06253M798841N309215K084038R13710K653939J211074
$$ -7546342 -7670930 -10986267 -11192520 -6393679 -1084464 999574 1913284 4567223 5778297
43448E778297o632901j4373320j3286411m237945L313073L678749R69219J412438
$$ 5778297 -854604 -15227924 -28514335 -32752280 -29439207 -25760458 -24791239 -23378801
43440b3378801M752402O692444O140849N377365M967211L288442M64687j693107
$$ -23378801 -18626399 -11933955 -5793106 -415741 4551470 7839912 8304599 6611492
43432F611492l534417o691014q875179m956227M524385J0968212P767556r70539
$$ 6611492 3077075 -3613939 -12489118 -17445345 -12920960 -1952748 5814808 4844269
43424D844269o176866n326659l068569k520687k110961p91991l45155j190130
$$ 4844269 -1332597 -6659256 -9727825 -12248512 -14359473 -15151464 -15496619 -16686749
43416a6686749r79563Q37563J575876L30070j83897R00273L62802k438065j952626
$$ -16686749 -17666312 -16828749 -15252873 -14922803 -15106700 -14206427 -13843625 -16281690 -18234316
43407a8234316N168757J2368263J0747771J882800m246900l122895J05500O23219
$$ -18234316 -13065559 -697296 10050475 11933275 7686375 4563480 4668980 5292199
43399E292199J81885R38097M22441l133632o213807n388120k496852j1845L662623
$$ 5292199 5474084 6412181 6834622 3700990 -2512817 -7900937 -10397789 -10409634 -6747011
43390f747011Q740003R187836J104812p716760n924071M952930J1758592Q093093
$$ -6747011 1992992 11180828 12285640 4568880 -1355191 3597739 15356331 23449424
43382B3449424J734768R32841K918262J614673j359325j080702R53835k10462
$$ 23449424 25184192 26117033 29035295 30649968 29290643 28209941 29163776 28953314
43374B8953314l850029n372852m713083m845181l905936K028432Q784803O989848
$$ 28953314 25103285 19730433 15017350 10172169 6266233 8294665 17079468 24069316
43366B4069316k670079p278013J57499R402886P477244k561777o993396j577477
$$ 24069316 21399237 14121224 14278723 23681609 31158853 28597076 21603680 20026203
43358B0026203M311380L065653j822066m205375m444589n519496o293444m213141
$$ 20026203 24337583 27403236 25581170 21375795 16931206 11411710 5118266 905125
43350I05125p22401J212077K026348L044453J771589m339261j0902128j0092964
$$ 905125 182724 1394801 3421149 6465602 8237191 3897930 -7004198 -17097162
43342a7097162j613307O219837Q076031P833140R750554R983215L458986n219225
$$ -17097162 -18710469 -12490632 -4414601 3418539 13169093 23152308 26611294 21392069
43334B1392069o378002L70656N132885K459263j522747n75332J155372k869828
$$ 21392069 15014067 15384723 20517608 22976871 21454124 20878792 22034164 19164336
43326A9164336r036624q354589j241438K252096k457217q175168p431692k323413
$$ 19164336 10127712 1773123 531685 2783781 326564 -7848604 -15280296 -17603709
43318a7603709J461635L497475N614252N633329J345406k958878j817199J499849
$$ -17603709 -16142074 -12644599 -7030347 -1397018 -51612 -3010490 -4827689 -3327840
43310c327840j232994r440357j2242256l433925R083230J3285533P406205m78487
$$ -3327840 -4560834 -14001191 -26243447 -29677372 -20594142 -7308609 97596 -380891
43302c80891l449792j048744L948515Q352369Q762926M042722j670200k310749
$$ -380891 -3830683 -4879427 -930912 7421457 16184383 20227105 18556905 16246156
43294A6246156K710594P595514P523578L678838l08782l287176n361280m854877
$$ 16246156 18956750 26552264 34075842 37754680 37445898 34158722 28797442 23942565
43286B3942565n35148M359629M358587j589425q563779j1232084q600839l233246
$$ 23942565 23407417 27767046 32125633 30536208 21972429 10740345 2139506 -1093740
43278a093740J222595J389316l089047o717152k332700Q906822J5713335R422691
$$ -1093740 128855 1518171 -1570876 -8288028 -10620728 -1713906 13999429 23422120
43270B3422120m317448j2039339q686500j148230L287046M358689L756221Q52145
$$ 23422120 19104672 7065333 -1621167 -2769397 517649 4876338 8632559 9484704
43262I484704k741080j488907N607556J0394566N804417l532281p773851n553742
$$ 9484704 6743624 5254717 10862273 21256839 27061256 23528975 15755124 10201382
43254A0201382l460047m038607l015639J440800N029736M853816L646262L788133
$$ 10201382 6741335 2702728 -312911 1127889 6157625 11011441 14657703 18445836
43246A8445836L093151l88286m430128o466096o937631o416990m088874j346863
$$ 18445836 21538987 21150701 16720573 10254477 3316846 -3100144 -7189018 -8535881
43238h535881j487274l112320j13209P786518J1207200L846314o860288r305328
$$ -8535881 -10023155 -13135475 -13248684 -5462166 5745034 9591348 2731060 -6574268
43230f574268l335228K017136K812393K727929L251973J614883j198675k82667
$$ -6574268 -9909496 -7892360 -5079967 -2352038 899935 2514818 1316143 1033476
43222A033476L495873L077874k498111m750057O45954N827706K861713l899564
$$ 1033476 4529349 7607223 5109112 359055 1005009 6832715 9694428 5794864
43214E794864n683600l166911k940262m546326j722347N182847Q646445O376309
$$ 5794864 111264 -3055647 -5995909 -10542235 -12264582 -7081735 1564710 7941019
43206G941019M463411N979473N590043n39472p359521q574395n358929k126587
$$ 7941019 12404430 18383903 23973946 23434474 16074953 7500558 2141629 15042
43198A5042P65670M095499M524568n81559o307069n370240J635610P667531R184423
$$ 15042 780712 4876211 9400779 8819220 2512151 -2858089 -1222479 6445052 15629475
43189A5629475P875396M049533l410766j0259703q855733L66868P024174M334544
$$ 15629475 23504871 27554404 24143638 13883935 5028202 5395070 12419244 16753788
43181A6753788k012732l283932j72462J72217m454141r153217r107233l970870
$$ 16753788 14741056 11457124 11284662 11456879 7002738 -2150479 -11257712 -15228582
43173a5228582L209668P595825N525623k49244j522495M558740R486450M517845
$$ -15228582 -12018914 -4423089 1102534 853290 -669205 3889535 13375985 17893830
43165A7893830n567159q087873l70460P082774O177975J025487r83500l8084o32380
$$ 17893830 12326671 4238798 3868338 10951112 17129087 18154574 17171074 17132990 16500610
43156A6500610k788725k359493K225646P560827Q666807L362739m934114q777762
$$ 16500610 13711885 11352392 13578038 21138865 29805672 33168411 28234297 19456535
43148A9456535m506154J772058R15584o584924j1239696q685151m842824m028640
$$ 19456535 14950381 16722439 17638023 11053099 -186597 -8871748 -13714572 -17743212
43140a7743212j353404O736816J2885379Q943518k80339l418116J141080N399718
$$ -17743212 -19096616 -12359800 525579 9469097 9188758 5770642 6911722 12311440
43132A2311440N556265M965253M316756J7946o359831p529219k321389J360399
$$ 12311440 17867705 22832958 27149714 27167660 20807829 13278610 10957221 12317620
43124A2317620q62475l430367j932039j467902o532272j0159815l087467J0304663
$$ 12317620 11455145 8024778 6092739 4624837 -1907435 -12067250 -15154717 -4850054
43116d850054J5486004O771828n775548j0024314n521391o40901r53541m427905
$$ -4850054 10635950 17407778 11632230 1607916 -3913475 -4554376 -5507917 -9935822
43108i935822n983931l363541J470803N038420N770321M871508M166528M002692
$$ -9935822 -15919753 -19283294 -17812491 -12774071 -7003750 -2132242 2034286 6036978
43100F036978L677036K823132J396575q21019l480456n018290m069828j471035
$$ 6036978 9714014 12537146 13933721 13112702 9632246 4613956 544128 -926907
43092i26907J13460j098153l885276m894696k124597K428957M818246M397081
$$ -926907 -813447 -1911600 -5796876 -10691572 -12816169 -10387212 -5568966 -1171885
43084a171885M863164Q063953R318642L166912p398662j2902066r301932k490159
$$ -1171885 3691279 11755232 21073874 24240786 16842124 3940058 -5361874 -7852033
43076g852033J050766K349841M923912O955042M583933J0137m54420M123463P557867
$$ -7852033 -6801267 -4451426 472486 7427528 12011461 12021598 11567178 15690641 23248508
43067B3248508M987159j580894p145708r083025p406336l343846N81706J771756
$$ 23248508 28235667 26654773 19509065 10426040 3019704 -324142 257564 2029320
43059B029320L56366j226128j834840k036492q99623L273351P790852O438351
$$ 2029320 2385686 1159558 -675282 -2711774 -3611397 -338046 7452806 13891157
43051A3891157j113006n757343m76087Q157966P602470k606294r170922l709995
$$ 13891157 12778151 7020808 6544721 14702687 22305157 19698863 10527941 6817946
43043F817946N334943N415184j949031m691257Q96176N174861Q23619n937140
$$ 6817946 12152889 17568073 15619042 10927785 11823961 16998822 17822441 11885301
43035A1885301n386066J054009L938806L46241k888496n09568L750594L630772
$$ 11885301 6499235 7553244 11492050 11838291 8949795 8440227 12190821 15821593
43027A5821593p16637l746320k026403K125935L665500J19615n695532q388566
$$ 15821593 15104956 11358636 9332233 11458168 15123668 15243283 9547751 1159185
43019A159185o235518l146618k278354l59833O734967J4562241J3653860L477310
$$ 1159185 -5076333 -8222951 -10501305 -10861138 -4126171 10436070 24089930 27567240
43011B7567240n090114m818190j980076n043523j0274156p803868J610021O456266
$$ 27567240 22477126 17658936 15678860 10635337 361181 -7442687 -5832666 623600
43003F23600J382357n241462l729710M275605R920513Q699289L273648j754646
$$ 623600 2005957 -3235505 -6965215 -2689610 7230903 15930192 19203840 17449194
42995A7449194l451485j072129L182321N094170K922115j66195l47939J813911
$$ 17449194 13997709 12925580 16107901 21202071 24124186 23957991 23610052 25423963
42987B5423963L082760K498433J305885q08099n239274j0022493j0133203m331208
$$ 25423963 28506723 31005156 32311041 31502942 26263668 16241175 6107972 1776764
42979A776764J385336M28465n677023q762847m315688L016592N683962K175141
$$ 1776764 3162100 3590565 -2086458 -10849305 -15164993 -12148401 -6464439 -4289298
42971d289298k941178n725625n624301k449122M120236J0524544J0015474J399989
$$ -4289298 -7230476 -12956101 -18580402 -21029524 -16909288 -6384744 3630730 5030719
42963E030719o415512l969297O080067J1258631M557982p469608j3371619r404034
$$ 5030719 -1384793 -5354090 725977 11984608 16542590 9072982 -4298637 -13702671
42955a3702671j086991M657370N716439M551430M508435O482402Q314527P633337
$$ -13702671 -14789662 -10132292 -4415853 135577 4644012 11126414 19440941 27074278
42947B7074278M953602K604440J034352j321939m196637m548931j029441L007731
$$ 27074278 32027880 34632320 35666672 34344733 30148096 25599165 24569724 27577455
42939B7577455L061110j282103o192577p592887m448705M14211K140437j457730
$$ 27577455 30638565 29356462 23163885 15570998 11122293 11536504 13676941 12219211
42931A2219211o389590o430840j512069J633256o64044k978425J057416Q291174
$$ 12219211 5829621 -601219 -2113288 -480032 -1144076 -4122501 -3065085 5226089
42923E226089J0016333M688242l72530l83231R80196l13656j367330J570081M595574
$$ 5226089 15242422 19930664 19558134 19174903 20155099 19841443 18474113 20044194 24639768
42914B4639768R55503p411908j0755133n229274J038204n26599o560883p027262
$$ 24639768 25595271 18183363 7428230 2198956 3237160 2710561 -3850322 -10877584
42906a0877584k06282N084938K973115j215950k86196L142934J209755n803765
$$ -10877584 -11083866 -5998928 -3025813 -4241763 -4527959 -1385025 -175270 -5979035
42898e979035q744609k816603N605207P989845L781252j709163m392447k504310
$$ -5979035 -14723644 -17540247 -11935040 -3945195 -163943 -1873106 -6265553 -8769863
42890h769863M332589J1961751J2024193J938142q662771q676883l98628M444785
$$ -8769863 -4437274 7524477 19548670 21486812 12824041 4147158 3748530 8193315
42882H193315J994787k79855J753236J822386m541545j0631112q924941l232395
$$ 8193315 10188102 9908247 11661483 13483869 8942324 -1688788 -10613729 -13846124
42874a3846124j489024k097591K112106R572857J1095525N153382Q87517L171020
$$ -13846124 -15335148 -17432739 -15320633 -5747776 5347749 10501131 11388648 14559668
42866A4559668M854549p72736q109183p314387R84020O955718N056564q41133
$$ 14559668 19414217 18641481 10532298 3217911 4201931 11157649 16214213 15373080
42858A5373080m976174o009600n190442l444960j908563j553865o41964M217552
$$ 15373080 10396906 4387306 -803136 -4248096 -6156659 -7710524 -8352488 -4134936
42850d134936J2354697J6964765J1813533n60314r889261q459471O81152P189121
$$ -4134936 8219761 25184526 36998059 36437745 26548484 18089013 18770165 25959286
42842B5959286M982934j700386n147776m529198n274479q939156r817065m206255
$$ 25959286 30942220 29241834 24094058 19564860 14290381 5351225 -4465840 -8672095
42834h672095K587016L660461R52849J605773N977571O924304J400809m603135
$$ -8672095 -6085079 -2424618 -1471769 134004 6111575 13035879 14436688 9833553
42826I833553n119324j915930L30349J197102K400807K838307R66325p61491Q80301
$$ 9833553 4714229 2798299 3128648 4325750 6726557 9564864 10531189 9769698 10649999
42817A0649999M024484M082025P83156k063496l048632m169706n427872m039513
$$ 10649999 14674483 18756508 19539664 17476168 14427536 10257830 4829958 790445
42809G90445k94986J257528q95808j625128L172224R024876Q211096P94907n196037
$$ 790445 495459 1752987 857179 -767949 2404275 11429151 19640247 20435154 15239117
42800A5239117m757216j882150k547997n926955o345760j877070L289605M975821
$$ 15239117 10481901 8599751 6051754 124799 -6220961 -8098031 -4808426 167395
42792A67395L755092K280461R70705j112303k990188k524297P7366K368427L326594
$$ 167395 3922487 6202948 7173653 6061350 3071162 546865 624231 2992658 6319252
42783F319252M035285M155634J035891n657894j1101725j0214572m151067J101776
$$ 6319252 10354537 14510171 15546062 9888168 -1213557 -11428129 -15579196 -14477420
42775a4477420K015182L09238j475694l399217n369915m308855K106792R966530
$$ -14477420 -12462238 -12153000 -13628694 -17027911 -22397826 -26706681 -24599889 -14633359
42767a4633359J1761077N801625n80561k07296M182579L953260k525864o962885
$$ -14633359 -2872282 2929343 2348782 2141486 6324065 10277325 7751461 788576
42759G88576l171355L616816M218062j551203n512247k908504K791449O467063
$$ 788576 -2382779 1234037 5452099 3900896 -1611351 -4519855 -1728406 4738657
42751D738657O423751K384118n082752j1383473j0372491k606466M505226P140870
$$ 4738657 11162408 13546526 8463774 -2919699 -13292190 -15898656 -11393430 -4252560
42743d252560Q983681J1481624Q450979l055526j3649347j2437741k449848M182180
$$ -4252560 4731121 16212745 24663724 21608198 7958851 -4478890 -6928738 -2746558
42735b746558L507617K342745M913095P200776N697731K697421N41170j765456
$$ -2746558 761059 3103804 8016899 15217675 20915406 23612827 24153997 22388541
42727B2388541l831664k824034M63249J214665j293242j928588J313250L559750
$$ 22388541 18556877 15732843 16196092 17410757 16117515 14188927 15502177 19061927
42719A9061927J550646j152590j408114j944707m700281n461785j176907L258749
$$ 19061927 20612573 19459983 18051869 16107162 11406881 5945096 4768189 8026938
42711H026938K282402j090445m08209L656125N181210K679959k30246j974005
$$ 8026938 10309340 9218895 8810686 12466811 17648021 20327980 20097734 18123729
42703A8123729l961491n367422l312879J859373O620216R238755J0294464R127553
$$ 18123729 14162238 8794816 5481937 7341310 13961526 23200281 33494745 42622298
42695D2622298M452130k042225o786185q309109o924449k662559K505782L393314
$$ 42622298 47074428 45032203 38246018 29936909 23012460 20349901 22855683 26248997
42687B6248997k008058p392910n603369Q19621L336885J14742k524695q82584
$$ 26248997 24240939 16848029 11244660 12064281 15401166 15515908 12991213 12108629
42679A2108629J667221J731600J40536k074350n050956o122590j546506N918897
$$ 12108629 13775850 15507450 15647986 13573636 8522680 2400090 853584 6772481
42671F772481Q218988L243926j981435k112457m66728j693228m405319n461050
$$ 6772481 14991469 18235395 16253960 14141503 13674775 11981547 7576228 2115178
42663B115178n061387k859161M235324J4402135J7655147Q120313n268149q992026
$$ 2115178 -2946209 -5805370 -1570046 12832089 30487236 38607549 33339400 24347374
42655B4347374k732609J999859o58014m475703l296700p03740l156660r226361
$$ 24347374 21614765 23614624 22956610 18480907 15184207 14480467 11323807 2097446
42647B097446j1153924n173086L840171Q326226O559165L718814M277652N289413
$$ 2097446 -9056478 -14229564 -10389393 -2063167 4495998 8214812 12492464 17781877
42639A7781877M94409r166201j4203324q417726K364258P720115N332274J045607
$$ 17781877 18276286 9110085 -5093239 -13510965 -11146707 -3426592 1905682 2951289
42631B951289j016346j965493k859888k538238j406619j712171k827389j329314
$$ 2951289 1934943 -30550 -2890438 -5428676 -6835295 -8547466 -11374855 -12704169
42623a2704169K872516N467437M443375K798397K489721J182466j728018j595840
$$ -12704169 -9831653 -4364216 79159 2877556 5367277 6549743 4821725 3225885
42615C225885L668053P031116R69128r776318j2646469n122875N24753n338772
$$ 3225885 6893938 13925054 14894182 5117864 -7528605 -12651480 -12126727 -17465499
42607a7465499j4592529j1554015M702535J7453655J3614245K20239n644861J561154
$$ -17465499 -32058028 -43612043 -38909508 -21455853 -7841608 -7621369 -13266230 -11705076
42599a1705076J1488017J3245323P287050O71558k466008j960824J348869M541976
$$ -11705076 -217059 13028264 20315314 20986872 18520864 16560040 17908909 22450885
42591B2450885K592310m684965q558187j197338J1624599J5274654M764008q726040
$$ 22450885 25043195 20358230 11800043 10602705 22227304 37501958 42265966 33539926
42583C3539926j2632304p653663l009385k749147l449370k303407k21327K304137
$$ 33539926 20907622 13253959 10244574 7495427 4046057 1742650 1521323 3825460
42575C825460N705051P142561K239002o847903j0901060m981590M180994O825149
$$ 3825460 9530511 16673072 18912074 12064171 1163111 -3818479 362515 7187664
42567G187664K864540L46425L099593O457652N764035K902544J728139J843249
$$ 7187664 10052204 10398629 13498222 19955874 25719909 28622453 30350592 32193841
42559C2193841O65262j658138l377092m809659o870040p692993m935708l40760
$$ 32193841 32859103 31200965 27823873 23014214 16144174 8451181 3515473 3174713
42551C174713K229975K578279L505350M762053K875328k156290n227789l286749
$$ 3174713 5404688 7982967 11488317 16250370 19125698 16969408 11741619 8454870
42543H454870L56010J481762P55608J039385K370697L003628K819099K666678
$$ 8454870 8810880 10292642 11048250 12087635 14458332 17461960 20281059 22947737
42535B2947737K638638L333106N762396P603814L733811n774806j2490517r522207
$$ 22947737 25586375 28919481 34681877 42285691 46019502 40244696 27754179 18231972
42527A8231972r12924M546294N214983N182683M116963j978231j0157502j0669849
$$ 18231972 17319048 21865342 27080325 32263008 36379971 34401740 24244238 13574389
42519A3574389q61977Q913008P903700j894682r482645p833134M17078P201666
$$ 13574389 12712412 21625420 29529120 27634438 18151793 10318659 10735737 17937403
42511A7937403O341691q33334o073587l459761K464469K972348j386353j844246
$$ 17937403 24279094 23445760 17372173 13912412 16376881 19349229 17962876 16118630
42503A6118630L283184N043026j87102k657181M452124J0945452M044134j0130251
$$ 16118630 19401814 24444840 24257738 21600557 26052681 36998133 41042267 30912016
42495C0912016j3823295l287181P296581P478108K086493j456430l914664o780161
$$ 30912016 17088721 13801540 21098121 28576229 30662722 29206292 25291628 18511467
42487A8511467n688562Q53730N059794P87045n755093m914508J780946M847663
$$ 18511467 12822905 13676635 18736429 19523474 13768381 8853873 10634819 15482482
42479A5482482J531884j635373r498L297845L520799L31252l427791n058134l389516
$$ 15482482 17014366 15378993 15369495 18667340 22188139 22519391 19091600 14033466 10643950
42470A0643950J35110J928827L84058j573881p31472J565240K185024J509658
$$ 10643950 10779060 12707887 13091945 11518064 10786592 12351832 14536856 16046514
42462A6046514J671818J757905p383j163235J640820N140798K451861n655947
$$ 16046514 17718332 19476237 19468854 18305619 19946439 25087237 27539098 21883151
42454B1883151r616795l843323N357959Q307435L803233j492534k194098J124877
$$ 21883151 12266356 8423033 13780992 22088427 25891660 24399126 22205028 23329905
42446B3329905M347169L873994m74805m882129n256410k184652R1928k03345p59016
$$ 23329905 27677074 31551068 31076263 26194134 20937724 18753072 18845000 18641655 17882639
42437A7882639r1117M58109R59806L976079Q780723R551474L143723n525157r872391
$$ 17882639 17791522 18249631 19209437 23185516 31966239 41517713 44661436 39136279 29263888
42428B9263888r488131p343564l444773L058588Q686461R026176N693434L942351
$$ 29263888 19775757 12432193 8987420 12046008 20732469 29758645 35452079 39394430
42420C9394430M338186K637028k322261o237040n615150j978205J051391J408156
$$ 39394430 43732616 46369644 44047383 37810343 32195193 30216988 31268379 32676535
42412C2676535j024358m709823p186649p711724p930243p862855m351871L021161
$$ 32676535 31652177 26942354 19755705 12043981 4113738 -3749117 -8100988 -5079827
42404e079827Q474983P673090M644745M347963K999044m487569j0944470l849864
$$ -5079827 3395156 11068246 15712991 20060954 23059998 18572429 7627959 3778095
42396C778095J3811172K3167073J4190129j239569p229071l865103j018754j535071
$$ 3778095 17589267 40756340 54946469 53706900 46477829 42612726 41593972 40058901
42388D0058901j040540J520237L356933M254874M997037K657299m543039j0898153
$$ 40058901 39018361 40538598 43895531 48150405 53147442 55804741 51261702 40363549
42380D0363549r843056m106093j149713j288166P11877M303909L471429j816313
$$ 40363549 30520493 26414400 25264687 23976521 24688398 28992307 32463736 30647423
42372C0647423m306182j199046J694948J76366j946104l14072K871528L554811
$$ 30647423 26341241 25142195 26837143 27013509 25067405 24753333 27624861 31179672
42364C1179672K498065K810824M315644M269826J632176k057443m745790n587403
$$ 31179672 33677737 36488561 40804205 45074031 46706207 44648764 39902974 34315571
42356C4315571n723252p024193q531384o134445J107304P040419N852557J049815
$$ 34315571 28592319 21568126 13036742 6902297 8009601 15050020 20902577 21952392
42348B1952392L68561L348407K285299m259457q097585m163593J936489L507860
$$ 21952392 22320953 25669360 27954659 23695202 15597617 11434024 13370513 16878373
42340A6878373K542901M349969Q180001R305635O594355K657115p25916l066205
$$ 16878373 19421274 23771243 31951244 41256879 47851234 50508349 49782433 46716228
42332D6716228l745754l558153m682494o362300m619938O48272L224881m45623
$$ 46716228 42970474 39412321 34729827 28367527 23747589 24395861 27620742 27175119
42324B7175119m671211k476752L868298O632455M050822J256232J231651J282548
$$ 27175119 22503908 20027156 23895454 30527909 34578731 35834963 37066614 38349162
42316C8349162j313959n148064o912932m736163M87660M942252M683361P60270
$$ 38349162 37035203 31887139 24974207 20238044 20725704 25667956 30351317 31111587
42308C1111587j264818M81139O97435m169294q437796n314925J441477K696258
$$ 31111587 29846769 30327908 31025343 26856049 18418253 13103328 14544805 17241063
42300A7241063j097607j5263R116780J6078079J0937437k686727j3100700j4241021
$$ 17241063 16143456 16128193 25244973 41323052 52260489 49573762 36473062 22232041
42292B2232041q777162j363384N243319Q725535P398033L051642L44206J449020
$$ 22232041 13454879 12091495 17334814 26060349 33458382 36510024 36854230 38303250
42284C8303250K781432q62616q896097j3843670r521150R80127Q469161Q379181
$$ 38303250 41084682 40222066 31325969 17482299 7961149 8941276 17410437 25789618
42276B5789618M464948J541273j80949j409621k48661L358416M733471J445088
$$ 25789618 30254566 31795839 31614890 30205269 29956608 33315024 38048495 39493583
42268C9493583j366386J015659M086091J359290l448482j598093N291315O601880
$$ 39493583 38127197 39142856 43228947 44588237 41139755 39541662 44832977 51434857
42260E1434857N3263m417365j521161M76878n741745j3321568j1645578k842393
$$ 51434857 51488120 47070755 45549594 46026472 40284727 26963159 15317581 12475188
42252A2475188K108746m05411l849015k908256J037740N311250R143203J0814238
$$ 12475188 14583934 14178523 10329508 7421252 8458992 13770242 22913445 33727683
42244C3727683Q039912K662857j10365J264661K431806o10189o236743r477604
$$ 33727683 41767595 44430452 44320087 45584748 48016554 47406365 41169622 31692018
42236C1692018p149681o4706P562438J0499506O627138o64022n778442o529069
$$ 31692018 24542337 24477631 32040069 42539575 49166713 48502691 42724249 36195180
42228C6195180m842173k694899p2255K972851M890616M276780J586135j221269
$$ 36195180 31353007 28658108 28585853 31558704 36449320 40726100 42312235 41090966
42220D1090966j877616R01311N941503R713985R200890M596220j241654m976557
$$ 41090966 39213350 40114661 46056164 55770149 64971039 69567259 68325605 63349048
42212F3349048m208373P74954N286836L390278m461370r877998o629703J72592
$$ 63349048 59140675 59915629 65202465 68592743 64131373 54253375 47623672 47796264
42204D7796264K67364p737161j4717331j3585491o878932M9147O512753J2678115
$$ 47796264 48063628 40326467 25609136 12023645 5144713 5193860 11706613 24384728
42196B4384728J3994616O520999m625617r385909n556778j224378k688777n755181
$$ 24384728 38379344 44900343 40274726 30888817 25332039 24107661 21418884 15663703
42188A5663703k979622M572888Q461617M461004k456581n583493m322198k325682
$$ 15663703 12684081 17256969 25718586 30179590 27723009 22139516 17817318 15491636
42180A5491636j481105j169928j138210j132625J047377O787679J2114829J0559241
$$ 15491636 14010531 12840603 11702393 10569768 11617145 18404824 30519653 41078894
42172D1078894J958781n669174n505650N1833L697878K766475N58443k75102j103653
$$ 41078894 43037675 37368501 31862851 31914684 35612562 38379037 38937480 38662378 37558725
42163C7558725l568204o047643n771500k943077j162739l606254q775026j0416548
$$ 37558725 33990521 27942878 22171378 19228301 18065562 14459308 5684282 -4732266
42155d732266l427008R130607J6917161J2655546M93692q589842q966864m793616
$$ -4732266 -8159274 971333 17888494 30544040 31037732 22447890 13481026 8687410
42147H687410k454451k637313j905431Q95918L334125L776814L860531N434573
$$ 8687410 6232959 3595646 1690215 2586133 5920258 9697072 13557603 18992176
42139A8992176P035928N650793J639183o86000J122897L308561M89953o097410
$$ 18992176 26028104 31678897 33318080 32632080 33754977 37063538 37553491 31456081
42131C1456081q990462m369631K284685L175781k107967p437027q544156o380156
$$ 31456081 22465619 18095988 20380673 23556454 21448487 14011460 5467304 -912852
42123i12852l209995R5154K714421L835679M662196P023425R404273Q037118K878567
$$ -912852 -4122847 -4027693 -1313272 2522407 7184603 14208028 23612301 31649419 34527986
42114C4527986j466192k447276l232370p088163j1628980j2083655p726925j599955
$$ 34527986 33061794 30614518 27382148 20293985 8665005 -3418650 -11145575 -12745530
42106a2745530L983331P977419Q697851N817759L051738L998225N748071K068195
$$ -12745530 -8762199 -784780 7913071 13730830 16782568 20780793 26528864 28597059
42098B8597059o270188j0283706m733877L946919O206167J840431j828982j554239
$$ 28597059 22326871 12043165 7309288 11256207 17462374 19302805 17473823 15919584
42090A5919584p83027j058108J446019Q087166J2945974J0526592L705851j145086
$$ 15919584 15136557 14078449 15524468 23611634 36557608 47084200 50790051 49644965
42082D9644965l207677n255009n574712J88810R341029J2376414N378986m402411
$$ 49644965 46437288 41182279 35607567 35796377 45137406 57513820 62892806 58490395
42074E8490395q806373q742395r390702j0468860p435828K22670P715790J1018513
$$ 58490395 49684022 40941627 31550925 21082065 13646237 13868907 21584697 32603210
42066C2603210R875676N741537O43919k842092l977919n027837p003765o636137
$$ 32603210 42478886 48220423 48864342 46022250 42044331 37016494 30012729 23376592
42058B3376592j653600L700998L925436P64018j7635J375428k28069m451367m640540
$$ 23376592 21722992 25423990 29349426 30113444 30095809 31471237 31243168 26791801 22151261
42049B2151261Q39396N234351M263142J923642J401624j075532p159851r404223
$$ 22151261 22990657 28225008 32488150 34411792 35813416 34737884 27578033 18173810
42041A8173810k030838P453876P386563j074030o365548m031911j217195l208735
$$ 18173810 16142972 23596848 30983411 29909381 23543833 19511922 18294727 15085992
42033A5085992n723492l756172J46889J029062p13246r05244K893616J0126362
$$ 15085992 9362500 5606328 5753217 6782279 6069033 5163789 8057405 18183767
42025A8183767J7685526J9880717J2724914M59936p204657o877107n021016o716942
$$ 18183767 35869293 55750010 68474924 68934860 61730203 54853096 49832080 43115138
42017D3115138p619863k541097M249046N248333K040779K206262N935767N714473
$$ 43115138 35495275 32954178 37203224 42451557 44492336 46698598 52634365 58348838
42009E8348838J8468k673720K742307R164816P797702J090462k110789j24704
$$ 58348838 58367306 55693586 58435893 67600709 75398411 76488873 74378084 74253380
42001G4253380R96977j284691k469294L73696L785361M511036M959936P991589
$$ 74253380 75250357 73965666 71496372 71870068 75655429 80166465 85126401 93117990
41993I3117990J0795062R013211M079405J155371J430322J952808K442070O120394
$$ 93117990 103913052 112926263 117005668 118161039 119591361 121544169 123986239 130106633
41985A30106633J2494981J5150916J0059065J928792j611090P22951M327164O172389
$$ 130106633 142601614 157752530 167811595 169740387 168129297 168852248 173179412 179351801
41977A79351801P463030R838426J2833829J5058442J5306778J3227447J0982534
$$ 179351801 186814831 196653257 209487086 224545528 239852306 253079753 264062287
41970B64062287J2083997J5567693J4615407O166513j320371K397969J3339894
$$ 264062287 276146284 291713977 306329384 312495897 311175526 313573495 326913389
41963C26913389J7034129R669429M263438J0272581J7810522J2225980k981086
$$ 326913389 343947518 353616947 357880385 368152966 385963488 398189468 395208382
41956C95208382j0465679l579421N772906M902694m634717j3205896j5943560
$$ 395208382 384742703 381163282 386936188 391838882 387204165 373998269 358054709
41949C58054709j4701910j2794029j2202702j2803849j2100617q735303o333468
$$ 358054709 343352799 330558770 318356068 305552219 293451602 284716299 278382831
41942B78382831q902096j2705097r977048j733828J856238l173232q387553p245823
$$ 278382831 269480735 256775638 246798590 245064762 246921000 243747768 235360215 228114392
41934B28114392n575541r565433j2733826o706088J864545l93697j1320257j4567479
$$ 228114392 222538851 212973418 200239592 193533504 195398049 195004352 183684095 169116616
41926A69116616m186984O752130O410330j95796k826135j821956k645740l263396
$$ 169116616 164929632 171681762 178092092 177896296 175070161 173248205 170602465 167339069
41918A67339069J538782Q043560P257617p63841o319217m445026j169755k975428
$$ 167339069 168877851 176921411 184179028 183415187 177095970 172650944 171481189 168505761
41910A68505761p185357p010356j660830L036619K254146k840515p155214o794456
$$ 168505761 161320404 154310048 152649218 155685837 157939983 155099468 147944254 141149798
41902A41149798k128119L203011N784242M657900N67146n208397j0304190j1520063
$$ 141149798 139021679 142224690 148008932 152666832 153233978 148025581 137721391 126201328
41894A26201328q067684l929074m453386j0018463j4690376j2263848l253638
$$ 126201328 118133644 114204570 109751184 99732721 85042345 72778497 69524859
41887F9524859M885359N107203j602284p036723n047581J504637M989770K517085
$$ 69524859 74410218 79517421 77915137 70878414 65830833 67335470 72325240 74842325
41879G4842325k094100m644420m295578j215358L992740P337652L891306m045463
$$ 74842325 72748225 68103805 63808227 62592869 66585609 73923261 77814567 73769104
41871G3769104o992865o63152O863015N616870k775053q105031n142480J872425
$$ 73769104 66776239 66113087 72976102 78592972 75817919 67712888 62570408 64442833
41863F4442833O307231N068333r44957p047445p026845k63526N305538K529246
$$ 64442833 70750064 75818397 74873440 67825995 60799150 60535624 65841162 68370408
41855F8370408n028060q294829n069988k84701L385467O783280P982843M163695
$$ 68370408 63342348 55047519 49977531 49692830 53078297 59861577 67844420 72008115
41847G2008115q52158p40417J685547k212013j0997212j2868730m475773K809681
$$ 72008115 71155957 70415540 72101087 69889074 58891862 46023132 41547359 44357040
41839D4357040J165855j801818K248212P754725O327845K273270L776556O356790
$$ 44357040 45522895 43721077 45969289 53724014 60051859 62325129 66101685 72458475
41831G2458475P8412j1424253j4657665p321527o01678O4294J579419P442763
$$ 72458475 72536887 61112634 46454969 39133442 38531764 38596058 40175477 47618240
41823D7618240R778412L516536l366658k142576L087424K952008k646221o469447
$$ 47618240 57396652 60913188 57546530 55403954 58491378 61443386 58797165 52327718
41815E2327718n912294m351249l118492k65093L350406L775979O37791j311020
$$ 52327718 46415424 42064175 38945683 38680590 42030996 45806975 46444766 45133746
41807D5133746R11441L756353J580368n779632j1878673j0575549l419012J637078
$$ 45133746 46045187 49801540 51381908 45602276 33723603 23148054 19729042 21366120
41799B1366120o1495l977341l271032J132827L007941J684337K412005N236582
$$ 21366120 21304625 17327284 14056252 15189079 18197020 19881357 22293362 27529944
41791B7529944L126933m865470q363131j012822P315824L999342o677050r629177
$$ 27529944 30656877 25791407 17428276 16415454 23731278 27730620 21053570 11424393
41783A1424393j632768N627854N315723M261673P925802R358651J160853j0774360
$$ 11424393 9791625 15419479 20735202 24996875 32922677 42281328 43442181 32667821
41775C2667821j4650950q083152J946630R417702J1821511P302263j921294o970843
$$ 32667821 18016871 9933719 11880349 21298051 33119562 40421825 38500531 31529688
41767C1529688k403637L963656J228528o949289o779029L641683J0146841M132664
$$ 31529688 29126051 33089707 34318235 27368946 20589917 24231600 34378441 38511105
41759C8511105m552638l845013K312893K421024l574074n701524n69600M942070
$$ 38511105 33958467 30113454 32426347 34847371 31273297 25571773 25002173 29944243
41751B9944243N621391L505710J025748k486104n775716m925986j13806L170826
$$ 29944243 35565634 39071344 40097092 37610988 31835272 26909286 26795480 29966306
41743B9966306J918642r43792k624462m069357n330192l420524K006654O144324
$$ 29966306 31884948 30941156 28316694 24247337 18917145 15496621 17503275 23647599
41735B3647599N641631L036868J395822m19305l245210l552472P63225M454242
$$ 23647599 29289230 32326098 33721920 33302615 30057405 26504933 27268158 31722400
41727C1722400Q85932q136781j3997165j1751695m500173J925338M464684L290067
$$ 31722400 32608332 24471551 10474386 -1277309 -5777482 -3852144 612540 3902607
41719C902607M35958j442478r38315J415891M882979R070169J1708070Q973607
$$ 3902607 4338565 2896087 1957772 3373663 8256642 17326811 29034881 38008488
41711C8008488N60323q056824j1113956q284456k998866J890570M329077K598816
$$ 38008488 38568811 30511987 19398031 11113575 8114709 10005279 14334356 16933172
41703A6933172j882233m445024l205184j720833k255535j162759M001758P749768
$$ 16933172 15050939 10605915 7400731 5679898 3424363 2261604 6263362 14013130
41695A4013130M129276k798998m107811O33656L650662J530456j248303j520329
$$ 14013130 18142406 15343408 11235597 11869253 15519915 17050371 15802068 14281739
41687A4281739j511639k365121j793561l79646k463266p889857j0188439o347579
$$ 14281739 12770100 10404979 8611418 8231772 5768506 -2121351 -12309790 -18657369
41679a8657369j423751L52439J898719N832767P729163L621516j171549J234252
$$ -18657369 -20081120 -19728681 -17829962 -11997195 -4268032 -646516 -1818065 -583813
41671e83813Q658048J0871322L698767n597474q081554l312858K082996K820677
$$ -583813 8074235 18945557 22644324 17046850 8965296 5652438 7735434 10556111
41663A0556111j60391k095002l96035K307530J838254j476392k797171O60657
$$ 10556111 10395720 8300718 7904683 10212213 12050467 10574075 7776904 8437561
41655H437561N664129O939328L068956k852713o610044n938898k145702O07080
$$ 8437561 14101690 21041018 24109974 21257261 14647217 8708319 6562617 7169697
41647G169697l71810k540889j374755K770514M929262L159736J221382K010299
$$ 7169697 6797887 4256998 2882243 5652757 10582019 13741755 14963137 16973436
41639A6973436L149421J879879n8873n0643M95066j136290m008161n160162m203323
$$ 16973436 20122857 22002736 21943863 21893220 22388286 21251996 17243835 12083673 7880350
41630G880350k835475j457275N39096K441128K890712J771415m03520l191577
$$ 7880350 5044875 3587600 4126696 6567824 9458536 11229951 10826431 7634854
41622G634854m699405k123085L637800O531939J963979o551115j0444331n423051
$$ 7634854 2935449 812364 4450164 10982103 12946082 6394967 -4049364 -9472415
41614i472415M088896R480623O224648j585101n246697j419910L523560K249355
$$ -9472415 -5383519 4097104 10321752 8736651 3489954 2070044 5593604 7842959
41606G842959k752583k966411K705186O047843K244373l410105m257578m62715
$$ 7842959 5090376 2123965 4829151 10876994 13121367 9711262 5453684 4990969
41598D990969M675354R200685R875587L205549o575021r112529k667677K098665
$$ 4990969 9666323 18867008 28742595 31948144 25373123 16260594 13592917 15691582
41590A5691582q02776k827272K925214P347561L77619r368304o615254N233085
$$ 15691582 14888806 12061534 14986748 22334309 22711928 13343624 6728370 11961455
41582A1961455Q960046R77876m687303m16837N149012M850984L648738N553458
$$ 11961455 20921501 21899377 17212074 16795237 21944249 26795233 30443971 35997429
41574C5997429N225304K41816j931267K018269K717150o243364j5060748j1656764
$$ 35997429 41222733 41464549 39533282 41551551 44268701 38025337 22964589 11307825
41566A1307825j72148O491007N790242M678495M481464k0691p771554r907061
$$ 11307825 11135677 17626684 23416926 28095421 32576885 32556194 24784640 14877579
41558A4877579k857792O022533Q468511M594374K02986k88208L278992P298238
$$ 14877579 12019787 18042320 26510831 31105205 31308191 31019983 34298975 41597213
41550D1597213P013584J592632l639376l049797J898181M445398J281126l916571
$$ 41597213 48610797 50203429 46564053 43514256 45412437 49857835 51138961 47222390
41542D7222390n865294l785789j342652j949428m827961o005138l766842j581542
$$ 47222390 41357096 37571307 36228655 34279227 29451266 23446128 19679286 18097744
41534A8097744k852864m360112o3279Q723691J3385461R779130L228034q87295
$$ 18097744 15244880 10884768 10821489 19545180 32930641 42709771 45937805 45050510
41526D5050510m049083p709007p381065q02907M497348Q48273o660954o635978
$$ 45050510 41001427 33292420 25911355 25108448 29605796 30454069 23793115 17157137
41518A7157137J641363P674318N804369J916029K151262L766930J490661l375526
$$ 17157137 18798500 26472818 32277187 34193216 36344478 40111408 41602069 38226543
41510C8226543n403219l179422n36708q40327k998149l439879j104564N85151
$$ 38226543 32823324 29643902 29107194 28266867 25268718 21828839 20724275 21309426
41502B1309426j685500n064732l107370M094433P696829K185410n496968n392998
$$ 21309426 19623926 14559194 11451824 15546257 23243086 25428496 19931528 14538530
41494A4538530R76191L822390L62010k632173j310903J10622j210819j485380
$$ 14538530 15514721 19337111 19699121 17066948 15756045 15866667 14655848 13170468
41486A3170468J480839K896459p67007m717401l113280J767897L877886K703074
$$ 13170468 14651307 17547766 16780759 12063358 8950078 10717975 14595861 17298935
41478A7298935J693308P70020k408713n648239m175560P76605K475546p98284
$$ 17298935 18992243 19762263 17353550 11705311 7529751 8306356 10781902 9983618
41470I983618k264833L141065J0246480J0063270J938313n613399n590552R488
$$ 9983618 7718785 10859850 21106330 31169600 33107913 27494514 21903962 21913450
41462B1913450L961455J896715m717814j1211466j3227116r093203j189726N255290
$$ 21913450 25874905 27771620 23053806 11842340 -1384776 -10477979 -11667705 -6412415
41454f412415O657493M548346L186760L970170M184658J473128k729517n186875
$$ -6412415 245078 4793424 7980184 11950354 16135012 17608140 14878623 9691748
41446I691748m540139k014102N8340l39344l310805o153319n826779k837581m74949
$$ 9691748 5151609 3137507 3195847 2856503 -454302 -6607621 -12434400 -15271981 -15746930
41437a5746930J41447J062950K788255K771078O81265N02391L879572N945755
$$ -15746930 -15605483 -14542533 -11754278 -8983200 -8301935 -7799544 -3919972 2025783
41429B025783K809223q50263J623283P357931P074239p44743p084999n665983
$$ 2025783 4835006 3984743 5608026 12965957 20040196 19295453 12210454 6544471
41421F544471j363047j394880m216553l039738K857691O491288K796361m362123
$$ 6544471 5181424 3786544 -430009 -3469747 -612056 5879232 8675593 4313470
41413D313470o605668j012099O199585O983165J619930j545610K165388O547305
$$ 4313470 -2292198 -3304297 2895288 9878453 11498383 9952773 12118161 18665466
41405A8665466L463179m461955p269905k607041J337438n97449k904520J30289
$$ 18665466 22128645 17666690 10396785 7789744 9127182 8529733 5625213 5755502
41397E755502M233619K547906k539165l596255p84212r24131m909130n703328
$$ 5755502 9989121 12537027 9997862 6401607 5617395 4693264 -215866 -5919194
41389e919194p44628K632626j256612o653338m702402L035037O967582L389519
$$ -5919194 -6663822 -4031196 -5287808 -11941146 -16643548 -13608511 -6640929 -3251410
41381c251410j541488k064087j1035O24264K76722Q77576R00854j465296l160209
$$ -3251410 -4792898 -6856985 -6868020 -6243756 -5967034 -5089458 -4188604 -5653900 -8814109
41372h814109j3738N768393P713297M451801J220676J262128J555549q86360l906559
$$ -8814109 -8827847 -3059454 4653843 9105644 10326320 11588448 13143997 12257637 8351078
41363H351078m426521l208946k103951o72308J090895R10021j146848p18408L600106
$$ 8351078 3924557 715611 -1388340 -2060648 -969753 -59732 -1206580 -1924988 1675118
41354A675118N748182Q91457n565275n029830J102097L558978p20655m945495
$$ 1675118 7423300 8314757 2749482 -2280348 -1178251 2380727 1660072 -3285423
41346c285423l384237J644736N153527N384326K790969j098721k636076M58552
$$ -3285423 -6669660 -5024924 128603 5512929 8303898 7205177 4569101 5027653
41338E027653L900796J466135m629748n585537J79118L673774o47535n966261
$$ 5027653 8928449 10394584 5764836 179299 358417 4032191 3384656 -2581605
41330b581605l788293L587758Q075177P712445O262432M915993J901436j754078
$$ -2581605 -6369898 -2782140 5293037 13005482 19267914 24183907 26085343 24331265
41322B4331265k716606p67539J226527J731928Q91340j812049o070991q710609
$$ 24331265 21614659 20847120 22073647 23805575 24696915 22884866 16813875 8103266
41314H103266p281501m017050k352976j614076O77371L511218M136033L061309
$$ 8103266 821765 -3195285 -5548261 -7162337 -6484966 -2973748 1162285 4223594
41306D223594K386418J209752j776137l195340O46702N415430K960717n028803
$$ 4223594 6610012 7819764 6043627 2848287 3494989 8910419 11871136 6842333
41298F842333o282433M837296J6650435J3842093k137692j4405059j1794257j066611
$$ 6842333 559900 5397196 22047631 35889724 33752032 19346973 7552716 6486105
41290F486105M405757J566424k346844k838642l120695n545760n913845p73262
$$ 6486105 10891862 12458286 10111442 7272800 4152105 -1393655 -7307500 -8080762
41282h080762N098749M812175j81669k530466k63362J536980J47935j086117J83560
$$ -8080762 -2982013 1830162 1648493 -881973 -1145335 391645 539580 -546537 -362977
41273c62977J419929O98873r6352j94000k067732n714740o647056k852802J821050
$$ -362977 1056952 1755825 1659473 1465473 -602259 -6316999 -12964055 -15816857 -13995807
41264a3995807M263058O033245P708379O373834K539043J630444L764948J038967
$$ -13995807 -9732749 -3699504 4008875 10382709 12921752 14552196 18317144 19356111
41256A9356111q203416j2106855k202005J1031400J1955342K594469k494677J18150
$$ 19356111 11152695 -954160 -3156165 7875235 19830577 22425046 19930369 20048519
41248B0048519P343o985006j1787694q181359j982008O07815J906972M419732
$$ 20048519 20055862 13070856 1283162 -6898197 -8880205 -8272390 -6365418 -1945686
41240a945686M241503n71282m005976j520132J965175N10137k821552j682799
$$ -1945686 2295817 1724535 -2281441 -3801573 -1836398 -1326261 -4147813 -5830612
41232e830612K891462M882035K910298Q25925Q39677J571626J533603M13049j730744
$$ -5830612 -2939150 1942885 4853183 5679108 6518785 8090411 9624014 10037063 8306319
41223H306319l566465k740895N40294K757294K158491J322423J970675R78925
$$ 8306319 4739854 1998959 2539253 5296547 7455038 8777461 10748136 11727061
41215A1727061m483821j0605096j0259272j882628Q174103J2071892P688460q9335
$$ 11727061 7243240 -3361856 -13621128 -15503756 -7329653 4742239 12430699 12341364
41207A2341364m398349l062772K26824J859389K704218M059265L062584k391862
$$ 12341364 7943015 4880243 5107067 6966456 9670674 13729939 16792523 14400661
41199A4400661p191980m830985K025352N091242L547641L875020O537605M272695
$$ 14400661 7208681 2377696 4403048 9494290 13041931 16916951 23454556 27727251
41191B7727251l810438q271053m248904J038247J711010K363255N841515M178727
$$ 27727251 23916813 15645760 11396856 12435103 14146113 16509368 22350883 26529610
41183B6529610o873295j5135578q224190N636861R016198J884832o99613N020198
$$ 26529610 19656315 4520737 -3703453 1933408 10949606 12834438 12134825 17155023
41175A7155023O363148k368557r401561n069311L141319M172431J03054j047649
$$ 17155023 23518171 21149614 11748053 6678742 9820061 13992492 14095546 13047897
41167A3047897p2551k859179p859233q326546m012040q92964q00490j96851J158137
$$ 13047897 12975346 10116167 2256934 -6069612 -10081652 -10974616 -11775106 -11971957 -10813820
41158a0813820r58244o205421p238796J07808R770286J2919435Q763879L410832
$$ -10813820 -11772064 -17977485 -25216281 -25108473 -15338187 -2418752 6345127 9755959
41150I755959N11623j608089l953976l582713J269699O526116O492784J183408
$$ 9755959 10267582 8659493 4705517 1122804 2392503 8918619 15411403 16594811
41142A6594811m055295n619612m947587m578526m236629k066304K383944P254453
$$ 16594811 12539516 6919904 1972317 -2606209 -6842838 -8909142 -6525198 729255
41134G29255Q941170M249562n078466j0806463n902685N571148J1460050O227853
$$ 729255 9670425 13919987 8841521 -1964942 -7867627 -2296479 9163571 15391424
41126A5391424k621718n604298l041757j135342j177336P38184N501058Q701512
$$ 15391424 12769706 7165408 4123651 2988309 1810973 2549157 8050215 16751727
41118A6751727O499013j34529o727794q466469l723303L147824M938342j1163
$$ 16751727 23250740 23116211 16388417 7921948 4198645 7346469 12284811 12273648
41110A2273648n558381o356140m479391m224684n391092o151057o997913o232454
$$ 12273648 6715267 359127 -4120264 -8344948 -13736040 -19887097 -26885010 -33117464
41102c3117464K063749J7591504K7351063K0006070K762926p298148n942195l470592
$$ -33117464 -31053715 -13462211 13888852 33894922 36657848 29359700 23417505 19946913
41094A9946913n202947m669785J437312N444378J555338m603320n811728l420508
$$ 19946913 14743966 10074181 11511493 16955871 18511209 13907889 8096161 4675653
41086D675653j357073J416926N555999O187594O22336n175812n036056j748099
$$ 4675653 3318580 4735506 10291505 16479099 17101435 11925623 6889567 5141468
41078E141468q63631j149171J192504M012966L129874N29167L97268M94515l932008
$$ 5141468 4277837 3128666 4321170 8334136 11464010 11993177 12390445 12884960 8952952
41069H952952j0167537j0709288m786515Q25217K080120J395091J226082J014082
$$ 8952952 -1214585 -11923873 -16710388 -15885171 -13805051 -12409960 -11183878 -10169796
41061a0169796J049403K824511M592682K523041k562484n024576k247393K213134
$$ -10169796 -9120393 -6295882 -1703200 819841 -1742643 -6767219 -9014612 -6801478
41053f801478M420593M327445L161554J150950p11642o71747P73397J483210J775977
$$ -6801478 -2380885 1946560 5108114 6259064 5547422 4875675 5649072 7132282 8908259
41044H908259L649945N509593L056603k970805n566326r92624N377425O693727
$$ 8908259 12558204 18067797 21124400 18153595 12587269 11594645 16972070 23665797
41036B3665797L882543K374641K822301J175500l131115n416874l460931j595458
$$ 23665797 27548340 29922981 32745282 33920782 30789667 25372793 21911862 20316404
41028B0316404l893989p078364m939689J725185N015673Q94298m576471l357818
$$ 20316404 16422415 9344051 4404362 6129547 11145220 12039518 7463047 4105229
41020D105229L533402P861665N430882J77162k909581l383161k440290J64003
$$ 4105229 7638631 15500296 20931178 21108340 18198759 14815598 12375308 12539311
41012A2539311L391233L608240m40934m959055o672700p116904p613029m728376
$$ 12539311 15930544 19538784 19097850 14138795 7466095 349191 -7263838 -11992214
41004a1992214L540707J1027218J0088651K745778k446407l242882m901259q410871
$$ -11992214 -8451507 2575711 12664362 15410140 12963733 9720851 4819592 -3591279
40996c591279p093007J743357J0120580R957379M226799J187622J801592R3273
$$ -3591279 -10684286 -8940929 1179651 11137030 15363829 16551451 18353043 18446316
40988A8446316n814027j0073140p424405r7044N633669O738548N080779L373277
$$ 18446316 12632289 2559149 -4865256 -4962300 671369 7409917 12490696 15863973
40980A5863973J921242j50946j932675j124882K059388L749940J413730j946993
$$ 15863973 17785215 17634269 15701594 14576712 16636100 20386040 21799770 19852777
40972A9852777k091252n19120k037587n623363m398210K974813P764841L201457
$$ 19852777 17761525 17242405 15204818 9581455 5183245 8158058 15922899 19124356
40964A9124356m558912m807685J926008N274664J263018k564536p10221Q14330
$$ 19124356 14565444 9757759 11683767 16958431 18221449 15656913 14946692 15761022
40956A5761022n122974j3405374j2358505m43122J1099665J2847348P293454K135520
$$ 15761022 10638048 -2767326 -15125831 -15568953 -4469288 8378060 15671514 17807034
40948A7807034m6868r88437m41044L035657O838153O128191J455877o34914L352112
$$ 17807034 17760166 16771729 16330685 19366342 26204495 32332686 33788563 33153649 36505761
40939C6505761Q331806P269843N75010n007265n816715n585886r315157j5658914
$$ 36505761 44837567 52107410 52682420 47675155 41858440 36272554 26957397 11298483
40931A1298483j7883760j1898782j286277O567705Q145876N889136L166976J78219
$$ 11298483 -6585277 -18484059 -19770336 -13202631 -5056755 832381 3999357 4177576
40923D177576l590275n693269l209208K076555M860515K981498n10690k422719
$$ 4177576 587301 -5105968 -8315176 -6238621 -1378106 1603392 1092702 -1330017
40915a330017k870816k633268j029499J505453K322340O86352r4577K463722N881912
$$ -1330017 -4200833 -6834101 -7863600 -6358147 -4035807 -3349455 -3444032 -980310 4901602
40906D901602O482387M476637J963069j158508n085574o605974k848547L017341
$$ 4901602 11383989 15860626 17823695 16665187 11579613 4973639 2125092 5142433
40898E142433N089424K996073J766494L777620O020740N670073L259064m12591
$$ 5142433 10231857 13227930 14994424 18772044 24792784 30462857 33721921 33309330
40890C3309330n347256r027082p368110j371338K051081q59139m962479l482843
$$ 33309330 27962074 18934992 11566882 10195544 12246625 11387486 6425007 2942164
40882B942164K228253M811945J059844m645612o919346n580685m118052m404407
$$ 2942164 5170417 9982362 11042206 6396594 -522752 -6103437 -10221489 -14625896
40874a4625896m846896l254408m1678K381127L039319L576319N232625O438944
$$ -14625896 -19472792 -22727200 -22768878 -20387751 -17348432 -13772113 -8539488 -2100544
40866b100544N180416K115585j059055m574148q436937q959113k669219O271217
$$ -2100544 3079872 5195457 4136402 -437746 -8874683 -17833796 -20503015 -14231798
40858a4231798Q492629J433670o327547o234195n90979K683111K430391M321006
$$ -14231798 -5739169 -4305499 -10633046 -16867241 -17458220 -14775109 -12344718 -8023712
40850h023712R273878R600894L53253j0804163j1460306r69049P517702L919511
$$ -8023712 1250166 10851060 11204313 400150 -11060156 -12029205 -4511503 -591992
40842e91992n349178o327876L258557J1467152R163977J376601k028206K28913
$$ -591992 -5941170 -12269046 -9010489 2456663 11620640 12997241 10969035 11197948
40834A1197948K828930L666966M165595L703888J733476K374330Q145587J1715763
$$ 11197948 14026878 17693844 21859439 25563327 27296803 29671133 37816720 49532483
40826D9532483M379376q314480j1498178l073473J948984o061494j6769749j5744497
$$ 49532483 53911859 45597379 34099201 31025728 32974712 26913218 10143469 -5601028
40818e601028m866637L043729K739724o90276k634471k484874M69226N491547
$$ -5601028 -10467665 -7423936 -4684212 -5374488 -8008959 -10493833 -10024607 -4533060
40810d533060P023427J296804n660558m849597K542430P067403M860544J046216
$$ -4533060 2490367 3787171 -1873387 -6722984 -4180554 2886849 7747393 8793609
40802H793609l03084r98889k555188k886231r75784J295013L100712M874493M532752
$$ 8793609 8490525 7491636 4936448 2050217 1074433 2369446 5470158 10344651 14877403
40793A4877403j18252n207814m253254J540594L958992O6883l902950k920020
$$ 14877403 14759151 9551337 5298083 6838677 10797669 10864552 6961602 4041582
40785D041582N39419L336346O515368R103196N270351o001987j4971097j2269269
$$ 4041582 4581001 7917347 14432715 23535911 28806262 22804275 7833178 -4436091
40777d436091j676414N340333M823544L017900N305213R088621Q572137K398701
$$ -4436091 -6112505 -772172 4051372 7069272 12374485 21463106 30035243 32433944
40769C2433944m886468p457821m247501n36380j802618o241273p041785k465360
$$ 32433944 27547476 20089655 15842154 15305774 13503156 7261883 220098 -2245262
40761b245262J549329P12539j451686l13404K374865K497464O51325p5364J32609
$$ -2245262 -695933 16606 -1435080 -1748484 626381 3123845 3775170 3699806 3832415
40752C832415o10000j694919k066655k856404l323301J005761J0075755J4614734
$$ 3832415 3222415 1527496 -539159 -3395563 -6718864 -5713103 4362652 18977386
40744A8977386Q074076j473951j854661M182731L175887o634857j1575943m508773
$$ 18977386 27051462 25577511 23722850 27905581 31081468 24446611 12870668 8361895
40736H361895L678295J861480m264498l307142K976020M357483j33814k207038
$$ 8361895 12040190 13901670 9637172 6330030 9306050 13663533 13529719 11322681
40728A1322681M16659J357307j436745j763531K933238N886536J901000m252182
$$ 11322681 11739340 13096647 11659902 9896371 12829609 18716145 20617145 16364963
40720A6364963n879528m190401l930179m554056k750589q6743o46757k814127
$$ 16364963 10485435 6295034 2364855 -2189201 -4939790 -5026533 -5673290 -8487417
40712h487417q31275N345082Q619533N006926n01562j567568L29291j244891p720568
$$ -8487417 -9318692 -3973610 4645923 9652849 9151287 7583719 7913010 6668119 -1052449
40703a052449j2878286j0489220j612939P169522J1185082J1121670R165760M810798
$$ -1052449 -13930735 -24419955 -26032894 -18863372 -7678290 3443380 12609140 17419938
40695A7419938k441525p961931n304936L595011P407000m69318j1219093j1100034
$$ 17419938 14978413 7016482 1711546 5306557 12713557 12244239 1025146 -10074888
40687a0074888J2009R038835Q067488K739456L30222n08362k909896l635942L91004
$$ -10074888 -10062879 -1024044 7043444 9782900 10113122 9604760 6694864 3058922 3449926
40678C449926L932651O91166n688733o784986k372047Q09332Q68658J718119L431076
$$ 3449926 7382577 8073743 2385010 -4399976 -6772023 -5962691 -5094033 -3375914 55162
40669E5162J830897j885042j183224M389652P414717M692133J592295J216490
$$ 55162 1886059 1017 -1182207 3207445 10622162 15314295 16906590 18123080
40661A8123080o57782n171633n335129J768872P278244L652347k810754k462781
$$ 18123080 17465298 12293665 6958536 8727408 16005652 19657999 16847245 14384464
40653A4384464J782449M35360n828761p748528l014472J847225L861615N978678
$$ 14384464 16166913 16602273 10773512 3024984 10512 1857737 5719352 11698030
40645A1698030P174798K438167n557062o718648Q01306O166602K093882m566089
$$ 11698030 18872828 21310995 15753933 9035285 9836591 16003193 18097075 13530986
40637A3530986m806478r46907l53891k927135l355432q22144J365636J946202
$$ 13530986 8724508 7777601 7423710 4496575 1141143 318999 1684635 3630837
40629C630837Q30454l501127q794567o370750P376035K0847397J9184431M623128
$$ 3630837 4461291 960164 -7834403 -14205153 -6829118 14018279 33202710 37825838
40621C7825838o007477m370063O0037l375658j1327750j3969935r636200m320226
$$ 37825838 31818361 27448298 27508335 24132677 12804927 -1165008 -10801208 -15121434
40613a5121434j471894L74393K404897M246873O579808R923644J1629974Q463201
$$ -15121434 -16593328 -16218935 -13814038 -9567165 -2987357 6936287 18566261 27029462
40605B7029462J777414l534022m901138l754442k007279k78200N74723m88370
$$ 27029462 28806876 25272854 20371716 16617274 14609995 14331795 14906518 14418148
40597A4418148k532574l065243j188777J442450K867117K352355q298l383885
$$ 14418148 11885574 8820331 7631554 9074004 11941121 14293476 14285178 10901293
40589A0901293o039212o525953m680739p64823M518741P938285N032121l346879
$$ 10901293 4862081 -1663872 -6344611 -7109434 -2590693 5347592 10379713 7032834
40581G032834r190822o852392j420900j277371m779908k953311N059735R469142
$$ 7032834 -2157988 -9010380 -10431280 -11708651 -16488559 -19441870 -14382135 -4912993
40573d912993N393843P37707K933175O969037M728263j009864j754172K297358
$$ -4912993 480850 1218557 4151732 11120769 15849032 14839168 13084996 15382354
40565A5382354L455541l09579l413036k937351j571364m92852J616476K185585
$$ 15382354 18837895 18528316 15115280 12177929 10606565 10113713 11730189 13915774
40557A3915774l187749j0961406j1394796k672649N534482N743794J400656j324852
$$ 13915774 10728025 -233381 -11628177 -14300826 -8766344 -3022550 -1621894 -2946746
40549b946746j571120L24355N492740R995970N580675o301269j1410641k473303
$$ -2946746 -4517866 -4193511 1299229 11295199 16875874 10574605 -836036 -3309339
40541c309339P943719N595083l572168m102127L321092M241081m210643q650738
$$ -3309339 4634380 10229463 6657295 2555168 5876260 10117341 5906698 -2744040
40533b744040k282092M641098L007748j222049L54826M063136K282600k853462
$$ -2744040 -5026132 -385034 2622714 1400665 1755491 5818627 8101227 5247765
40525E247765m330511k573010k899367m908272l706441Q48524M199221M485944
$$ 5247765 917254 -1655756 -4555123 -9463395 -13169836 -12321312 -8122091 -3636147
40517c636147K918794r70056p065099r563656k500621R640327J4867305Q852853
$$ -3636147 -717353 -1687409 -8752508 -18316164 -20816785 -11176458 3690847 12543700
40509A2543700J08615k575844j180069k417677n847916m769838K370026P939379
$$ 12543700 12652315 10076471 8896402 6478725 630809 -4139029 -1769003 6170376
40501F170376M872889l389033o882683k139543L402985K027412l152325k491825
$$ 6170376 11043265 7654232 771549 -1367994 2034991 4062403 910078 -1581747
40493a581747O277653J4250167J2631483K895833o738257j0901313j0030372o907263
$$ -1581747 4695906 18946073 31577556 34473389 27735132 16833819 6803447 -103816
40485a03816l722310r04222L119302Q854170J1717982N797910n985349j1372429
$$ -103816 -3826126 -4730348 -1611046 7243124 18961106 24759016 18773667 7401238
40477G401238l612415Q101159R986847J948264l864698j262503K558143m87571
$$ 7401238 3788823 11889982 21876829 23825093 19960395 18697892 21256035 20768464
40469B0768464p683788j0621723o568858p6364L651770L158449L40764j518203
$$ 20768464 13084676 2462953 -4105905 -4182269 -530499 2627950 2968714 1450511
40461A450511l93897K318516L477231K389399J171705P56080k53192j890474j709498
$$ 1450511 1056614 3375130 6852361 9241760 10413465 11169545 10916353 9025879 7316381
40452G316381P30004J721440j377180n445865n521356j874821K53078k305148
$$ 7316381 8046385 9767825 8390645 2944780 -2576576 -4451397 -4198319 -6503467
40444f503467o593553p122005k096305M489529O715348K910902k182925k489744
$$ -6503467 -13097020 -20219025 -22315330 -17825801 -11110453 -8199551 -10382476 -12872220
40436a2872220K252072O273382N234259J513648K17193J811538J951553j300372
$$ -12872220 -10620148 -4346766 887493 2401141 2618334 4429872 6381425 5081053
40428E081053l371582J074537R463218J2305631M936882m830415n510744K567736
$$ 5081053 1709471 2784008 12247226 24552857 29489739 24659324 19148580 21716316
40420B1716316P036696P56136p697824o424772K545161O870968J928332m541305
$$ 21716316 28753012 29509148 21811324 15386552 17931713 24802681 26731013 22189708
40412B2189708n858789m569339m401971l181441J109989M417136K847196n84420
$$ 22189708 16330919 11761580 7359609 4178168 5288157 9705293 12552489 11968069
40404A1968069j290073m42857j187941k243918j693187k598810p370612j0496219
$$ 11968069 10677996 10235139 9047198 6803280 5110093 2511283 -4859329 -15355548
40396a5355548n592353L049055N588989K045769K154020R005450J3473118Q463533
$$ -15355548 -20947901 -17898846 -12309857 -10264088 -8110068 895382 14368500 22832033
40388B2832033o47937n061963m316458k881198j341395J953203M829392M058143
$$ 22832033 22184096 17122133 12805675 9924477 8583082 10536285 15365677 19423820
40380A9423820J701181K337484N338724N444725M65587o027793r335919p658935
$$ 19423820 21125001 23462485 28801209 34245934 34711521 28683728 19347809 11688874
40372A1688874k547002J650161M28013n531779r494349o428703O07217N272833
$$ 11688874 9141872 10792033 11220046 5688267 -3806082 -10234785 -9627568 -4354735
40364d354735N982355M595415Q77145m927660o863999N03867J1048700J1657819
$$ -4354735 1627620 6223035 7100180 2172520 -4691479 -4187612 6861088 18518907
40356A8518907p5811j1389893j1203232l496724J138440J20498j645246j421839
$$ 18518907 18443096 7053203 -4150029 -7646753 -6508313 -6387815 -8033061 -9454900
40348i454900j91431K031567N152902N460266Q9050o326408o213352L29711N950089
$$ -9454900 -9646331 -7614764 -2461862 2998404 3087454 -3238954 -9452306 -9122595 -3172506
40339c172506O795555N959312N487093K413333m225849q729976n889381Q73798
$$ -3172506 3623049 9582361 15069454 17482787 13256938 4526962 -1362419 -488621
40331d88621L075224k762051j1623501j5373552r802556K003699J1749151J3135670
$$ -488621 2586603 -175448 -11798949 -27172501 -36975057 -34971358 -23222207 -10086537
40323a0086537Q263515M931511O799114R154640N937224k179521r043520r897529
$$ -10086537 -1823022 3108489 9907603 19062243 24999467 22819946 13776426 3878897
40315C878897m835296K230649N997180L736199j020926j571355L003246N630167
$$ 3878897 -956399 1274250 7271430 11007629 9986703 8415348 11418594 17048761
40307A7048761J211249n279885n633699p7332M106850L672585K135025J829228
$$ 17048761 18260010 12980125 7346426 7269094 11375944 15048529 17183554 19012782
40299A9012782O18492j933532j949259J988021M987009K805774j644673l081188
$$ 19012782 19631274 17697742 15748483 17736504 22723513 25529287 23884614 20803426
40291B0803426j691155j448351l002821l313537j361238M37302N26436k6954n33349
$$ 20803426 19112271 17663920 14661099 11347562 9986324 10423626 10950062 10923108 10389759
40282A0389759j923946m017879m565424k514851k1004L68700j034498k013931
$$ 10389759 8465813 4447934 -117490 -2632341 -2653345 -2284645 -3319143 -5333074
40274e333074j443503l5920J045605J220765P56627Q18775K614993N736020P919012
$$ -5333074 -6776577 -6812497 -5766892 -4546127 -3789500 -2970725 -355732 5380288 13299300
40265A3299300P045818K834972l489344r743219j2589269r250446j411100M625432
$$ 13299300 20345118 23180090 19690746 9947527 -2641742 -11892188 -13303288 -8677856
40257h677856M667980K044224K410597M268401N30049r166567j4405279p106713
$$ -8677856 -4009876 -1965652 444945 4713346 5243395 -3923172 -18328451 -25435164
40249b5435164O170449J1880492O901040O39427K74666K375593J662069J55804
$$ -25435164 -19264715 -7384223 -483183 156244 430910 2806503 4468572 4624376
40241D624376K096346N263566M290486n6673j643726J505378M275800K158482
$$ 4624376 6720722 11984288 16274774 16218101 14574375 16079753 20355553 22514035
40233B2514035k479533l864390j55637M499991M567670p88963o310391o264212
$$ 22514035 20034502 16170112 16014475 20514466 25082136 24293173 17982782 11718570
40225A1718570j398455K053926Q44603j400542n57199J995388L134657L504601
$$ 11718570 10320115 12374041 13218644 11818102 11260903 13256291 16390948 19895549
40217A9895549M424514L218876k010268o067963k889206L673414M011829k416884
$$ 19895549 24320063 27538939 25528671 19460708 16571502 20244916 24256745 21839861
40209B1839861n767300j089451M459862L526015j030735l137661l215627l937514
$$ 21839861 16072561 14983110 19442972 22968987 21938252 18800591 15584964 11647450
40201A1647450k688354L486717R783541R026903K597496k063397l114312n184717
$$ 11647450 8959096 12445813 22229354 31256257 33853753 31790356 28676044 23491327
40193B3491327r052394r058729k807808L647071L685270j602576n999115n477107
$$ 23491327 14438933 5380204 2572396 6219467 9904737 8302161 2303046 -3174061
40185c174061o79151M717510O175438J853842m182729n199606m6012M721132L088897
$$ -3174061 -3853212 864298 7039736 8893578 4710849 -488757 -534769 4186363 7275260
40176G275260k774378n845766l161117J690204L989786K769259Q258k664154m936200
$$ 7275260 4500882 -1344884 -4506001 -2815797 1173989 3943248 3951506 1287352 -3648848
40167c648848o130555m310170J433293P992170R730934M551226k911342o193157
$$ -3648848 -9779403 -14089573 -12656280 -4664110 5066824 9618050 6706708 513551
40159E13551m095867n56799J484644K624073L399063K208742j313221l917434
$$ 513551 -3582316 -4139115 -2654471 -30398 3368665 5577407 4264186 346752
40151C46752k563924J020530K447189O88672p16819J074489M002820L834340K05176
$$ 346752 -2217172 -1196642 1250547 1939219 1222400 2296889 6299709 10134049 10339225
40142A0339225k319018k50611L372977K205246m587919r806535o698041K168711
$$ 10339225 8020207 7769596 11142573 13347819 8759900 -1046635 -7744676 -5575965
40134e575965P848321O071677J537553L66443J989519J359298k814379n803441
$$ -5575965 2272356 8344033 9881586 10248029 12237548 13596846 10782467 4979026
40126D979026l304087K569783N617355K857826k424118m895081k558274K668739
$$ 4979026 1674939 4244722 9862077 12719903 10295785 5400704 2842430 5511169
40118E511169P549241Q852738M131607n323998j2865432j1859709l738016K789274
$$ 5511169 13060410 21913148 26044755 20720757 7855325 -4004384 -7742400 -4953126
40110d953126K178334j625308j622613K702802N828184M250559L39279j492053
$$ -4953126 -2774792 -4400100 -6022713 -3319911 2508273 6758832 7098111 5606058
40102E606058J10029K210982N13441n446310r883034o557758K129078O399486
$$ 5606058 5716087 7927069 8440510 2994200 -6888834 -13446592 -11317514 -4918028
40094d918028K036415l232271j057026M982474N498897M50933j141281L910843
$$ -4918028 -2881613 -6113884 -7170910 -2188436 3310461 3761394 2620113 6530956
40086F530956P892773M460409k080162m046489r85819J790770J223939j433454
$$ 6530956 14423729 18884138 16803976 12757487 11771668 13562438 14786377 13352923
40078A3352923l933989m690715k803269R09294M087719N235738M282755Q68206
$$ 13352923 9418934 4728219 1924950 2834244 6921963 12157701 16440456 17308662
40070A7308662m515025p546314l282970N816270J0078075M083344o005670j0076259
$$ 17308662 12793637 5247323 1964353 7780623 17858698 21942042 15936372 5860113
40062E860113n637916J820210O846980Q040973O001589J677906l293720o987225
$$ 5860113 222197 2042407 8889387 16930360 22931949 24609855 21316135 14328910
40054A4328910p870181m835535J248232N597265K973657m958149r610752n833410
$$ 14328910 6458729 1623194 2871426 8468691 11442348 6484199 -3126553 -8959963
40046h959963J030792K067472l732650q698648n814650M047669J3258327J4189198
$$ -8959963 -7929171 -5861699 -9594349 -18292997 -24107647 -20059978 -6801651 7387547
40038G387547O412810k100266l467049M77761J345722l050800n947163l493570
$$ 7387547 13800357 11700091 8233042 8710803 10056525 7005725 1058562 -2435008
40030b435008j039781k887556m114575M8380M062836Q67739m808455l037129M794754
$$ -2435008 -3474789 -6362345 -10476920 -10428540 -6365704 -5497965 -10306420 -13343549 -8548795
40021h548795P875900L289948l28874K509664O851929P350588N676431M278593
$$ -8548795 -672895 2617053 2288179 4797843 11649772 19000360 24676791 28955384
40013B8955384J661789j934399k225728J287832K674127p38238l505039j828143
$$ 28955384 30617173 28682774 26457046 27744878 30419005 29680767 26175728 24347585
40005B4347585l27837k869260m417552j90594L722229j108462j0598629j2514840
$$ 24347585 24019748 21150488 16732936 16542342 20264571 19156109 8557480 -3957360
39997c957360m042657N089954P225740N143819M019923L513263J534891n26165
$$ -3957360 -8000017 -2910063 4315677 9459496 13479419 16992682 18527573 18001408
39989A8001408p01271m03764j902984m775471p271315q290707o308147n6359P467939
$$ 18001408 17300137 16896373 14993389 10217918 2946603 -5344104 -11652251 -11708610 -4240671
39980d240671R658872M269959k519803l686041k53630J477390p08535l234674
$$ -4240671 5418201 9688160 7168357 3482316 3228686 4706076 3997541 762867
39972G62867l250870j793855l56778R83792J236099j178097m368589l780923P70921
$$ 762867 -2488003 -4281858 -4638636 -3654844 -2418745 -3596842 -7965431 -11746354 -10975433
39963a0975433L488268J308394l66454M200543J0832923J0259186J810265n163317
$$ -10975433 -7487165 -6178771 -6545225 -2344682 8488241 18747427 20557692 15394375
39955A5394375m418931j99020J205031O28380K029522M412440L961128J495246
$$ 15394375 10975444 10776424 11981455 12609835 14639357 19051797 23012925 24508171
39947B4508171J434775L954248L817509j859361q740742j0047879m216882L357283
$$ 24508171 25942946 29897194 33714703 31855342 23114600 13066721 8849839 12207122
39939A2207122N455828Q9943p051499q534132m109784q00062k448121l677009
$$ 12207122 17662950 17752893 10701394 2167262 -1942522 -2742584 -5190705 -8867714
39931h867714J243750P519853N294168n120615j1780199p000540K457553N292501
$$ -8867714 -7623964 -104111 5190057 69442 -11710757 -18711297 -16253744 -10961243
39923a0961243K18233n003955n528625l730019k243018P95286O979610J2291773
$$ -10961243 -10743010 -15746965 -21275590 -25005609 -27248627 -26453341 -19473731 -7181958
39915g181958J0879690L303080k856825j867103L433492O029182L668104r973
$$ -7181958 3697732 7000812 4143987 2276884 5710376 11739558 15407662 15397689
39907A5397689j862865k090978q70557K263855M362910O26615o916741q797068
$$ 15397689 13534824 11443846 10573289 12837144 17200054 17826669 10909928 2112860
39899B112860j202949O553344M760878k003322k252864M135010O343255M92263
$$ 2112860 909911 7463255 12224133 10220811 7967947 12102957 18446212 18938475
39891A8938475m769869k936645R59969M11676k178217j440686J507482K214062
$$ 18938475 14168606 11231961 12191930 12603606 10425389 8984703 10492185 12706247
39883A2706247O13137m79244q85153j769995k008289n93782K47933j274433k591719
$$ 12706247 13319384 12840140 11954987 10184992 8176703 7582921 7830854 6556421 3964702
39874C964702p71005K239865K647559Q91846O15267L078875N789457N347387j73736
$$ 3964702 3193697 5433562 8081121 8972967 9588234 12667109 18456566 23803953 23630217
39865B3630217r196688j5477200j2802422l131459M165311L867219R20141J583335
$$ 23630217 14433529 -1043671 -13846093 -16977552 -12812241 -8945022 -8024881 -6441546
39857f441546M124095L457781J86362j393634r20523j095400j469318N69415L852754
$$ -6441546 -2317451 1140330 1326692 -66942 -987465 -2082865 -3552183 -2982768 869986
39848H69986M200218P10215l200124m532225k976521L90953L533866M181996K809687
$$ 869986 5070204 5780419 2580295 -1951930 -4928451 -4537498 -1003632 3178364 5988051
39839E988051K548407L901614L356570l2756j887778k76408r1422l946018n266337
$$ 5988051 8536458 12438072 15794642 15761886 13874108 13597700 13506278 9560260 4293923
39830D293923J370482Q661991N618265n325356j1214350p090092o31221J801798
$$ 4293923 5664405 14326396 19944661 14619305 3404955 -3685137 -4316358 -2514560
39822b514560K810191N460428O955390M669940J093843q41731j517310j323204
$$ -2514560 295631 5756059 12711449 17381389 18475232 17633501 16116191 14792987
39814A4792987N92313K381618L18647m510269o318947l347325m02913n97847q49804
$$ 14792987 15385300 17766918 18085565 13575296 7256349 3909024 3506111 2908264 2058460
39805B058460J475038L214476L89910n586713r637681q050676p55220Q014204
$$ 2058460 3533498 6747974 7137884 1551171 -8086510 -16137186 -16892406 -8878202
39797h878202J1498919P335816K035634L087566P726024O727031j135478p072238
$$ -8878202 2620717 9956533 11992167 15079733 22805757 29532788 28397310 21325072
39789B1325072n794043k136039j602634k666549k057753m41935P26577J654848
$$ 21325072 15531029 13394990 11792356 9125807 7068054 6626119 7352696 9007544
39781I007544J095808k425030m793814j41219P706742P681773j418591p338393
$$ 9007544 10103352 7678322 2884508 2743289 10450031 18131804 16713213 9374820
39773I374820k969015K833867L55299n753952n725606l57411K586712Q03096k927021
$$ 9374820 6405805 9239672 9594971 3841019 -1884587 -2241998 344714 1147810 -1779211
39764a779211p111928r077588l391228Q162999J2934193M197582o362160n049356
$$ -1779211 -8891139 -17968727 -21359955 -13196956 -262763 3934819 -2427341 -7476697
39756g476697K807083K819930l999461m275944L305197N498330k139464p335205
$$ -7476697 -4669614 -1849684 -5849145 -10125089 -6819892 -1321562 -3461026 -10796231
39748a0796231j844467N392241L776985k552631l174361K499409O795643O016927
$$ -10796231 -12640698 -7248457 -3471472 -6024103 -9198464 -6699055 96588 6113515
39740F113515L213099J796886K185591L043725K458065m49164l624163m125391
$$ 6113515 9326614 11123500 13309091 16352816 18810881 18361717 14737554 10612163
39732A0612163k225831l82046R57977K284394J430103l186676p315498n861754
$$ 10612163 8386332 8004286 8962263 11246657 12676760 9490084 2174586 -3687168
39724c687168j840321k264970o034387n460301j114K357988o94839j693611K639433
$$ -3687168 -5527489 -7792459 -13826846 -19287147 -19288261 -16930273 -17625112 -19318723 -16679290
39715a6679290M872410M17252l224602J002695P184323O125932K45357j684122
$$ -16679290 -11806880 -11389628 -14614230 -13611535 -6427212 -301280 -55923 -1740045
39707a740045P22438Q43597k147291k600588O72629K572726J216595P01977K847523
$$ -1740045 -1017607 -174010 -2321301 -4921889 -4249260 -1676534 -459939 242038 3089561
39698C089561L503396k29053m521532l654282K659138Q675670P830843j241947
$$ 3089561 6592957 6363904 1842372 -1811910 847228 9522898 17353741 16111794
39690A6111794j1952549j4379154n665389N545314Q564176L140729j743924m05898
$$ 16111794 4159245 -10219909 -15885298 -10339984 -1775808 1364921 -379003 -784901
39682g84901L668232M904340K963240N82743j335788k709975j343563M248767
$$ -784901 2883331 7787671 10750911 11333654 9997866 7287891 5944328 10193095
39674A0193095R882235Q415957q76827r314811q559436j165909L180642J193957
$$ 10193095 20075330 28491287 27614460 18299649 9740213 8574304 11754946 12948903
39666A2948903l83290L424354P146593L548004m015121n868284m25327M164667
$$ 12948903 12565613 15989967 23136560 26684564 22669443 16801159 16375832 20540499
39658B0540499K711607j052683k804835l841687n734903n912151k820714M02355
$$ 20540499 23252106 22199423 19394588 15552901 9817998 3905847 1085133 1487488
39650A487488J672973L850946Q444427J0879391P245464R72797k661584m257260
$$ 1487488 3160461 7011407 15455834 26335225 33580689 34553486 31891902 27634642
39642B7634642o689807p876795l809406L827030R175920R373960N189044k461590
$$ 27634642 20944835 13068040 9258634 13085664 22261584 31635544 36824588 34362998
39634C4362998j0842461j3467548o965798K073685M263644N7061k082595Q72831
$$ 34362998 23520537 10052989 3087191 5160876 9424520 9481581 7398986 8271817
39626H271817L166687R24276k196365k484749j930551k846699l015990p80505
$$ 8271817 11438504 12362780 10166415 7681666 5751115 2904416 -111574 -892079
39618h92079R3984l855988q473220o271012K934539J0669131R644552J346154
$$ -892079 -798095 -4654083 -13127303 -19398315 -16463776 -5794645 3849907 5196061
39610E196061p224575j1174675r947960m498874L660367J0541639J1109462N275341
$$ 5196061 -2028514 -13203189 -23151149 -27650023 -23989656 -13448017 -2338555 2936786
39602B936786l65681k28217L010464L019603k97613j243233K034044M897739M076549
$$ 2936786 2571105 2342888 5353352 8372955 8075342 6832109 8866153 13763892 17840441
39593A7840441J660519l73931k948684m924318k499021L173508N058115R83972
$$ 17840441 19500960 19127029 16178345 11254027 8755006 11928514 16986629 17970601
39585A7970601k229252j61926J943999n45820k920739p51909M85698m298341p949701
$$ 17970601 15741349 15579423 17523422 16977602 14056863 13304954 13790652 9492311 1542610
39576A542610k052940O709244N548767l384689o345059k74788M195792K190586
$$ 1542610 -510330 6198914 11747681 8362992 2017933 1743145 5938937 8129523
39568H129523R49458M146749N187148P85172k613931j356822o33883k558582j374955
$$ 8129523 9078981 13225730 18412878 19198050 16584119 15227297 14593414 12034832 10659877
39559A0659877L074227R51534r875842j5143149m398665J1575626J6146602R904573
$$ 10659877 13734104 14685638 4809796 -10333353 -14732018 -3156392 12990210 22894783
39551B2894783M609354K193171m431945j4010836j6285376q541128K55600L309975
$$ 22894783 27504137 29697308 25265363 11254527 -5030849 -13571977 -13316377 -10006402
39543a0006402L399589M601016N646160M174772J148131r80581l57686L665237
$$ -10006402 -6606813 -2005797 3640363 7815135 8963266 7982685 7624999 11290236
39535A1290236Q200442P465616M24029n682446n030243j961341k928348m873064
$$ 11290236 19490678 26956294 27380323 21697877 16667634 14706293 11777945 6904881
39527F904881j290426M421848L539210k368988l465870P97523P8599q060311j1513638
$$ 6904881 5614455 10036303 13575513 11206525 7740655 8538178 8616777 556466 -10957172
39518a0957172k078124J1021552J4301337P853396J317403r44809j404423j136890
$$ -10957172 -13035296 -2013744 12287593 20140989 21458392 20513583 19109160 17972270
39510A7972270M77757N71423l853319q401085n248559M723691J0912818O445823
$$ 17972270 18450027 19021450 15168131 6767046 1518487 6242178 17154996 23600819
$$ [...]
##END NTUPLES=NMR SPECTRUM
##END=
