##TITLE=31Pdec_DE-139k_TFA
 ,64 sc
 6.4.2026
##JCAMPDX= 6.0         $$ Bruker NMR JCAMP-DX V2.0
##DATA TYPE= NMR SPECTRUM
##DATA CLASS= NTUPLES
##ORIGIN= UXNMR, Bruker Analytische Messtechnik GmbH
##OWNER= root
$$ XWIN-NMR		Version 3.5
$$ Mon Apr  6 16:01:15 2026 Russian Standard Time (UT+4h)  she@DPX200
##.OBSERVE FREQUENCY= 81.013821
##.OBSERVE NUCLEUS= ^31P
##.ACQUISITION MODE= SIMULTANEOUS
##.ACQUISITION SCHEME= undefined
##.AVERAGES= 64
##.DIGITISER RES= 17
##SPECTROMETER/DATA SYSTEM= spect
##.PULSE SEQUENCE= zgpg30
##.SOLVENT NAME= CDCl3
##.SHIFT REFERENCE= (INTERNAL, CDCl3, 0, 197.392)
##AUDIT TRAIL= $$ (NUMBER, WHEN, WHO, WHERE, WHAT)
$$ ##TITLE= Audit trail, XWIN-NMR		Version 3.5
$$ ##JCAMPDX= 5.01
$$ ##ORIGIN= Bruker BioSpin GmbH
$$ ##OWNER= she
$$ F:/spectra/data/she/nmr/P31/2/pdata/1/auditp.txt
$$ ##AUDIT TRAIL=  $$ (NUMBER, WHEN, WHO, WHERE, WHAT)
(   1,<2026-04-06 16:00:03.76 +0400>,<she>,<DPX200>,
      <continue with go, POWCHK disabled, PULCHK disabled
       configuration hash MD5:
       00 E9 B6 7A A2 85 ED C7 34 08 36 98 17 FE 4E 26
       data hash MD5: 32K
       54 DD C5 9A 1C FD 96 B8 49 24 AE 74 63 86 57 90>)
(   2,<2026-04-06 16:00:09.71 +0400>,<she>,<DPX200>,
      <Start of raw data processing
       efp BC_mod = 2 LB = 1.5 FT_mod = 6 PKNL = 1 PHC0 = 1386.454 PHC1 = 116.9007 SI = 64K 
       data hash MD5: 64K
       9E 23 42 2A E0 2F A6 A4 02 75 83 50 36 38 3D 28>)
(   3,<2026-04-06 16:00:27.28 +0400>,<she>,<DPX200>,
      <pk PHC0 = 11.65185 PHC1 = 0 
       data hash MD5: 64K
       19 3F 81 79 90 CF 75 4C 2A 93 4F 47 6D 8E CA 58>)
(   4,<2026-04-06 16:00:35.75 +0400>,<she>,<DPX200>,
      <abs ABSG = 5 
       data hash MD5: 64K
       07 9E DD 99 F9 F0 C0 91 11 C5 87 A4 E7 3F 8C D6>)
$$ ##END=
$$ 
$$ hash MD5
$$ CE 7D 4F D7 0D AE 33 71 2F 2C 94 1D C0 8F 22 24
##$RELAX= 
##$RELAX= 
##$RELAX= 
##$RELAX= 
##$RELAX= 
##$RELAX= 
##$RELAX= 
##$RELAX= 
$$ Bruker specific parameters
$$ --------------------------
##$DU= <F:/spectra>
##$EXPNO= 2
##$NAME= <P31>
##$PROCNO= 1
##$TYPE= <nmr>
##$USER= <she>
##$AMP= (0..31)
100 100 100 100 100 100 100 100 100 100 100 100 100 100 100 100 100 100 
100 100 100 100 100 100 100 100 100 100 100 100 100 100 
##$AQSEQ= 0
##$AQ_mod= 1
##$AUNM= <au_zg>
##$AUTOPOS= <>
##$BF1= 81.014009
##$BF2= 200.13
##$BF3= 200.13
##$BF4= 200.13
##$BF5= 200.13
##$BF6= 200.13
##$BF7= 200.13
##$BF8= 200.13
##$BYTORDA= 1
##$CFDGTYP= 0
##$CFRGTYP= 5
##$CHEMSTR= <none>
##$CNST= (0..31)
1 1 145 1 1 1 1 1 1 1 1 1 1 1 1 1 1 1 1 1 1 1 1 1 1 1 1 1 1 1 1 1 
##$CPDPRG= <waltz16>
##$CPDPRG1= <>
##$CPDPRG2= <waltz16>
##$CPDPRG3= <>
##$CPDPRG4= <mlev>
##$CPDPRG5= <mlev>
##$CPDPRG6= <mlev>
##$CPDPRG7= <mlev>
##$CPDPRG8= <mlev>
##$CPDPRGB= <>
##$CPDPRGT= <>
##$D= (0..31)
0 1 0 0 0 0 0 0 0 0.06 0 0.03 2e-05 3e-06 0 0 0.0002 0 0 0 0 0 0 0 0 0 
0 0 0 0 0 0 
##$DATE= 1775476689
##$DBL= (0..7)
120 120 120 11 120 120 24 19 
##$DBP= (0..7)
150 150 150 150 150 150 150 150 
##$DBP07= 0
##$DBPNAM0= <>
##$DBPNAM1= <>
##$DBPNAM2= <>
$$ [...]
##$SUBNAM3= <"">
##$SUBNAM4= <"">
##$SUBNAM5= <"">
##$SUBNAM6= <"">
##$SUBNAM7= <"">
##$SUBNAM8= <"">
##$SUBNAM9= <"">
##$SW= 400.765351723535
##$SWIBOX= (0..15)
0 1 3 0 0 0 0 0 0 0 0 0 0 0 0 0 
##$SW_h= 32467.5324675325
##$TD= 32768
##$TD0= 1
##$TE= 0
##$TE2= 300
##$TE3= 300
##$TEG= 300
##$TL= (0..7)
0 120 53 12 22 120 120 120 
##$TP= (0..7)
150 150 150 150 150 150 150 150 
##$TP07= 0
##$TPNAME0= <>
##$TPNAME1= <>
##$TPNAME2= <>
##$TPNAME3= <>
##$TPNAME4= <>
##$TPNAME5= <>
##$TPNAME6= <>
##$TPNAME7= <>
##$TPOAL= (0..7)
0.5 0.5 0.5 0.5 0.5 0.5 0.5 0.5 
##$TPOFFS= (0..7)
0 0 0 0 0 0 0 0 
##$TUNHIN= 0
##$TUNHOUT= 0
##$TUNXOUT= 0
##$USERA1= <user>
##$USERA2= <user>
##$USERA3= <user>
##$USERA4= <user>
##$USERA5= <user>
##$V9= 5
##$VALIST= <valist>
##$VCLIST= <CCCCCCCCCCCCCCC>
##$VD= 0
##$VDLIST= <DDDDDDDDDDDDDDD>
##$VPLIST= <PPPPPPPPPPPPPPP>
##$VTLIST= <TTTTTTTTTTTTTTT>
##$WBST= 1024
##$WBSW= 4
##$XGAIN= (0..3)
0 0 0 0 
##$XL= 0
##$YL= 0
##$YMAX_a= 8199
##$YMIN_a= -15471
##$ZGOPTNS= <>
##$ZL1= 120
##$ZL2= 120
##$ZL3= 120
##$ZL4= 120
##$ABSF1= 197.3918
##$ABSF2= -203.3724
##$ABSG= 5
##$ABSL= 3
##$ALPHA= 0
##$AQORDER= 0
##$ASSFAC= 0
##$ASSFACI= 0
##$ASSFACX= 0
##$ASSWID= 0
##$AUNMP= <proc_1d>
##$AZFE= 0.1
##$AZFW= 0.5
##$BCFW= 0
##$BC_mod= 2
##$BYTORDP= 0
##$COROFFS= 0
##$CY= -3
##$DATMOD= 1
##$DC= 0
##$DFILT= <>
##$DTYPP= 0
##$F1P= 0
##$F2P= 0
##$FCOR= 1
##$FTSIZE= 65536
##$FT_mod= 6
##$GAMMA= 0
##$GB= 0
##$INTBC= 1
##$INTSCL= 9.790993e-09
##$ISEN= 30
##$LB= 1.5
##$LEV0= 0
##$LPBIN= 0
##$MAXI= 10000
##$MC2= 0
##$MEAN= 0
##$ME_mod= 0
##$MI= 50
##$NCOEF= 0
##$NC_proc= -9
##$NLEV= 6
##$NOISF1= 182.463
##$NOISF2= 159.3651
##$NSP= 0
##$NTH_PI= 0
##$NZP= 0
##$OFFSET= 197.3918
##$PC= 4
##$PHC0= 1398.106
##$PHC1= 116.9007
##$PH_mod= 1
##$PKNL= yes
##$PPARMOD= 0
##$PSCAL= 0
##$PSIGN= 0
##$REVERSE= no
##$SF= 81.014063255964
##$SI= 65536
##$SIGF1= 159.3651
##$SIGF2= -187.1042
##$SINO= 113.3802
##$SIOLD= 16384
##$SREGLST= <1H.CDCl3>
##$SSB= 0
##$STSI= 65536
##$STSR= 0
##$SW_p= 32467.5324675325
##$SYMM= 0
##$S_DEV= 0
##$TDeff= 32768
##$TDoff= 0
##$TI= <>
##$TILT= no
##$TM1= 0
##$TM2= 0
##$TOPLEV= 0
##$USERP1= <user>
##$USERP2= <user>
##$USERP3= <user>
##$USERP4= <user>
##$USERP5= <user>
##$WDW= 1
##$XDIM= 65536
##$YMAX_p= 523408175
##$YMIN_p= -363287739
$$ End of Bruker specific parameters
$$ ---------------------------------
##NTUPLES= NMR SPECTRUM
##VAR_NAME=  FREQUENCY,     SPECTRUM/REAL,   SPECTRUM/IMAG
##SYMBOL=    X,             R,               I
##VAR_TYPE=  INDEPENDENT,   DEPENDENT,       DEPENDENT
##VAR_FORM=  AFFN,          ASDF,            ASDF
##VAR_DIM=   65536,         65536,           65536
##UNITS=     HZ,            ARBITRARY UNITS, ARBITRARY UNITS
##FACTOR=    0.49542278885378, 1,            1
##FIRST=     15991.5117654749, 0,            0
##LAST=      -16476.0207020576, 0,           0
##MIN=       -16476.0207020576, -363287739,  0
##MAX=       15991.5117654749, 523408175,    0
$$ Real data points
##PAGE= N=1
##DATA TABLE= (X++(R..R)), XYDATA
$$ [...]
44869a421983K182852K995181m69974m540668m470062r90489J925398K782547
44861b007198K517560J622725Q24966J847486M001465L100856k152621n885867
44853C869372k360318M823483O790470J473617m544963o177920n439470n452662
44845g018391m812845j230233L357613N172852L805596J735659K3434k444888
44837a411203n619558o697747l092006L625120P989551N964338j80183m001044
44829c422732k484287O84917R18103q63641o39620J833446K638058k44415m189364
44820e769535n501864k813700K860789Q220337Q209032O55233q928219j1343407
44812a4411334m170403N139980Q282284M915285N35253j092018l73706R42130
$$ y = [-1421983, 760869, 3756050, 3286076, -1254592, -5724654, -6715143, -4789745, -2007198, 510362, 2133087, 2958053, 4805539, 8807004, 11907860, 9755239, 3869372, 1509054, 6332537, 13123007, 14596624, 10051661, 3873741, -1565729, -7018391, -11831236, -13061469, -9703856, -4531004, -725408, 1010251, 1033685, -1411203, -7030761, -13728508, -16820514, -13195394, -5205843, 758495, 578312, -3422732, -5907019, -5222102, -4303999, -5167640, -5807260, -3973814, -1335756, -1580171, -5769535, -11271399, -14085099, -11224310, -3003973, 5205059, 5860292, -3067927, -14411334, -18581737, -13441757, -5159473, -244188, 291065, -800953, -1174659, -232529]
44804b32529J676219J028296j030508l095723l298264j028301K441240M591594
44796A052024L452466p753j983570r4640L219328L680425N15993l736977p183100
44787a085804q678110n828066J710499P834125N540665k545293o201872j765683
44779a1019539L321155K957323R89581K243357L101391j259932o682649o211945
44771a2561258j883095o00031j526299J658567P313529O294965k564909q389810
44763a2258341l809023M613648P099532M277300L192355N017905M408834j081797
44755A1460413p319509r088760n211253J574513P005929Q031354N160681J496957
44747A3110325j292051m024458o349572n546285j077790L086806L672744K594599
$$ y = [-232529, 1443690, 2471986, 1441478, -1654245, -4952509, -5980810, -3539570, 1052024, 4504490, 4496737, 2513167, 2418527, 5637855, 9318280, 9834273, 6097296, -1085804, -9763914, -15591980, -13881481, -6047356, -506691, -3051984, -9253856, -11019539, -7698384, -4741061, -3751480, -1508123, 1593268, 333336, -6349313, -12561258, -14444353, -15044384, -16570683, -14912116, -7598587, -1303622, -3868531, -12258341, -16067364, -11453716, -4354184, -76884, 3115471, 8133376, 12542210, 11460413, 4140904, -4947856, -10159109, -8584596, -1578667, 6452687, 11613368, 13110325, 11818274, 7793816, 1444244, -4102041, -5179831, -2093025, 1579719, 4174318]
44739D174318K933729L483982J576458j146048r71460J088084K19503m212218
44731G146348o660940l032238L454507O259113L076559k487902n498203m636006
44723b378762k953455l705587n348049k721073N051034J0683675O907907l174612
44715B361078r325853p397075l100187j519769o0150M428161Q182495O519784
44707H8484K637135K890113N981168N061050k13317k489987Q17661K383046l457306
44698A3698047j0888567j0545683k793098L594356L712745J030974J03003N67171
44690a521052k45074k580574l951742j911981L221185P459602O321947O08851
44682G401162l316431j826990L27177k713425p653612n870684L060393R348744
$$ y = [4174318, 7108047, 10592029, 12168487, 11022439, 10050979, 11139063, 11358566, 7146348, 485408, -2546830, 907677, 7166790, 10243349, 7755447, 2257244, -2378762, -5332217, -9037804, -14385853, -17106926, -12055892, -1372217, 5535690, 2361078, -6964775, -14361850, -17462037, -18981806, -19041956, -14613795, -6431300, 88484, 2725619, 5615732, 11596900, 16657950, 16444633, 13954646, 14772307, 17155353, 13698047, 2809480, -7736203, -10529301, -6934945, -3222200, -2191226, -2088223, -1521052, -1766126, -4346700, -8298442, -10210423, -6989238, 470364, 6792311, 7401162, 4084731, 2257741, 2584918, -128507, -7782119, -13652803, -10592410, -1243666]
44674a243666O490567j88093k297476L5019M82759l361472p555868p794367l724814
44665a9157411J745792M766542L488678N86688P65064M230790N896870L111294
44657E434307p3653L37930J756242M3926k873096k491615N491k70413l181409
44648a312290l721542o72535J468565p340k427924k854023j581472O84892M112954
44639f310715O788842N410472O81285k550868k195339j288778j790742j342919
44631b598762J069559J600390k168801n788667l813680J760768M052548Q57962
44623e028683k925687k151700K895311P942837R306069O593829K397304m25633
44615A8603647j594384k910377m876583n583185l681956n64020J539601J943955
$$ y = [-1243666, 5246901, 5058808, 2761332, 2796351, 3279110, -82362, -7638230, -15432597, -19157411, -17411619, -12645077, -9156399, -8569711, -7804647, -3573857, 2323013, 5434307, 5360654, 5698584, 7454826, 7498752, 4625656, 2134041, 2139532, 1869119, -1312290, -5033832, -5706367, -4237802, -4245142, -6673066, -9527089, -11108561, -10423669, -6310715, 478127, 5888599, 6569884, 4019016, 1823677, 534899, -1255843, -2598762, -1529203, 71187, -2097614, -7886281, -11699961, -9939193, -5886645, -5028683, -7954370, -10106070, -7210759, 732078, 10038147, 16631976, 19029280, 18603647, 17009263, 14098886, 9222303, 3639118, -42838, -606858, 932743, 2876698]
44607B876698J000637r55800k965051l444807k080273l93745L09101J48267m10906
44598e915879r29757j63303K763887O072225O722317M299672R75916j962812m209764
44589G652502l909208J45638M009171K139491l857803o579504m311797l467728
44581h179238o640287o960709P086P063755O215247J890761L304188Q488076P533288
44572A2722167k71426m535757q0981N722014N240087R96459r42231n96770j402528
44563A6851034l165216l391334k259349j274152O68170N338609J0616519J1716965
44555C5101246O713718j534974q488571j1188971r248335m652027p28068o9649
44547E904369k700914n959648o302215k339868L187973N640228L603843K65133
$$ y = [2876698, 3877335, 2921535, -43516, -3488323, -5568596, -5962341, -5653240, -5504973, -5915879, -6845636, -7008939, -4245052, 1827173, 8549490, 12849162, 13825078, 11862266, 7652502, 3743294, 3888932, 7898103, 10037594, 6179791, -399713, -4711510, -8179238, -14819525, -21780234, -21773148, -14709393, -8494146, -6603385, -3299197, 5188879, 12722167, 12450741, 7914984, 7834003, 13556017, 18796104, 19792563, 18850332, 18253562, 16851034, 13685818, 10294484, 8035135, 6760983, 7429153, 12767762, 23384281, 35101246, 41814964, 40279990, 31791419, 20602448, 11354113, 6702086, 5974018, 5904369, 3203455, -2756193, -9058408, -11398276, -8210303, -2570075, 1033768, 1298901]
44539A298901j391600k262628l916773m637805k290646J062751J754510L09999
44531a0073291J49608J540139J757333Q09069J677132M307295M475890K04661
44523D847836m784884n708348j804088M025484P790769O622850J699155j421646
44515A1267128Q91749M574372L024133k977863o369351m438253j544147o17100
44507C810668N89391K747853J967182k916092o576881m833053m95946K241378
44499c465500L790036N528265N569877K621064o36201j981876k735871l146167
44491E543627o94602L283955K529403l506229n866928J27556N376567N86467p771108
44482c91292o753678K645864P258455J810018n425983p008223m392154k84918
$$ y = [1298901, -92699, -2355327, -6272100, -10909905, -13200551, -12137800, -10383290, -10073291, -9923683, -8383544, -6626211, -5817142, -4140010, 167285, 4643175, 4847836, 62952, -5645396, -7449484, -3424000, 4366769, 10989619, 12688774, 11267128, 12158877, 16733249, 19757382, 16779519, 10410168, 5971915, 4427768, 3810668, 4400059, 7147912, 9115094, 6199002, -377879, -5210932, -5706878, -3465500, 324536, 5852801, 11422678, 14043742, 13407541, 11425665, 8689794, 5543627, 4849025, 8132980, 10662383, 7156154, 1289226, 1416782, 6793349, 7379816, -391292, -7144970, -4499106, 2759349, 4569367, -856616, -7864839, -12256993, -12541911]
44474a2541911N595425J0343012Q036261j3897m578967k207681m53254m477662
44466b98674p600259k318079O576863Q351060J486138n229691m636180J688275
44458a980547O885270N182076l543358j2314021j2315188k396607R080881J3858765
44450B457271J1647345O426151J92057n661827p761068n026950k021179k747284
44442b495484m253725j769953K883046M170118J886887Q23448K541742L827062
44434G613141L074591K259338K120925Q46085j539026k378556j212340j028677
44426I755481l265755n313877m436590j087789K616229M749154L452638j560604
44418D908887o665748p027401k632445J659166K768272K294779J840740n763l731762
$$ y = [-12541911, -6946486, 3396526, 11432787, 11418890, 6839923, 4632242, 4178988, -298674, -7898933, -10217012, -3640149, 4710911, 6197049, 967358, -3668822, -1980547, 4904723, 10086799, 6543441, -5770580, -18085768, -20482375, -11401494, 2457271, 14104616, 20530767, 20722824, 15060997, 7299929, 2272979, 251800, -2495484, -6749209, -8519162, -5636116, -1465998, 420889, 1244337, 3786079, 7613141, 10687732, 12947070, 15067995, 15914080, 14375054, 11996498, 10784158, 9755481, 6489726, 1175849, -3260741, -4348530, -1732301, 3016853, 6469491, 4908887, -1756861, -8784262, -11416707, -9757541, -6989269, -4694490, -2853750, -2859513, -6591275]
44409f591275o025108m120466j96600J676533P72671q72277k091186k714206j981085
44400b2142999J57931J754824J778592K540163N791789Q125985M844835k030301
44392H20819m664212L24355O865452P350750K239851j810411j423634K03012m98132
44383I407850k020758o93334L298479N780169M079919R6139k816649l976660m821135
44374H334020n530778m479350j109659K506311L809026K413348p3610k039737
44366C829571k851496k442695r38582J151604K767097K684300N53340k153232
44358B599907k885932o71656K307974K915183O03933k520279m802053o138551
44350h591474n878341k444582L414348P388929O146991J776464q62668l96889
$$ y = [-6591275, -12616383, -16736849, -16933449, -15256916, -14484245, -15356522, -17447708, -20161914, -22142999, -21985068, -20230244, -18451652, -15911489, -10119700, -1993715, 2851120, 820819, -3843393, -3519038, 3346414, 10697164, 12937015, 11126604, 9702970, 9905982, 9407850, 7387092, 6693758, 9992237, 15772406, 19852325, 19948464, 17131815, 13155155, 8334020, 2803242, -1676108, -2785767, -279456, 3529570, 5942918, 5869308, 3829571, 978075, -1464620, -2403202, -1251598, 1515499, 4199799, 4753139, 2599907, -286025, -957681, 1350293, 4265476, 4869409, 2349130, -2452923, -8591474, -14469815, -16914397, -13500049, -6111120, 35871, 1812335, 949667, 552778]
44342E52778J53418j567221m154827n004432l554899r38659J733641L604182M119846
44333e056173L978253M655677N898543N215882J460397k414981k451469Q82017
44325A2168146K697405l01781n678791q334100o456776k698551Q0782J940765
44317f582901L737707L920479K42202n569467p997068m102045K619767O819442
44309f911884P593739P350052O447122L440012J1430L43623M287781O076516K348133
44300C0986524k929298m839823m655618o100803p945160o053875r14879K808197
44292C55265L493135L597296L712767J677314j659370k077730O92276J358151
44284A1149104k320855n144438k793290P61883l88423m380779m534601K79471
$$ y = [552778, 706196, -861025, -5015852, -10020284, -13575183, -14513842, -12780201, -9176019, -5056173, -1077920, 3577757, 9476300, 14692182, 16152579, 13737598, 11286129, 12168146, 14865551, 14563770, 8884979, 550879, -5905897, -8604448, -8523666, -6582901, -2845194, 1075285, 1317487, -4251980, -12249048, -16351093, -13731326, -6911884, 681855, 8031907, 14479029, 17919041, 17930471, 18274094, 22561875, 28638391, 30986524, 28057226, 23217403, 18561785, 12460982, 4515822, -1538053, -2452932, 355265, 3848400, 7445696, 11158463, 12835777, 11176407, 9098677, 9790953, 11149104, 8828249, 3683811, 890521, 1652404, 1263981, -3116798, -7651399, -7371928]
44276g371928M465398M069061Q56799j798348k304528j01754L957940O220316
44268G992956L465372k110637n200959m760220m439720n272217l473490K533923
44260a1264992Q143217Q757101N711988K580812m59312m284646o233879l323278
44252c72989J603344K491762j269302l899392j936617Q05349n53551m399245m950385
44243a2481026m75169M589363N762546L541759J075886n38572k122114l036447
44235c683774j352495K313082M310875K770126K56915l32805J01134l76547m74394
44226C532117J725638L821318K029100j596288r61313M101795O033717N24628
44218A9210712o553652p568816l606348r52210p94611Q57547M710451O468772
$$ y = [-7371928, -2906530, 1162531, 2019330, 220982, -2083546, -2185300, 1772640, 7992956, 11458328, 9347691, 4146732, -613488, -5053208, -10325425, -13798915, -11264992, -3121775, 5635326, 11347314, 13928126, 13468814, 9184168, 2950289, -372989, 1230355, 3722117, 2452815, -1446577, -3383194, -2577845, -3131396, -7530641, -12481026, -12956195, -8366832, -2604286, 937473, 2013359, 1474787, -647327, -3683774, -5036269, -2723187, 1587688, 4357814, 4614729, 4281924, 4383058, 4006511, 3532117, 5257755, 9079073, 11108173, 9511885, 8550572, 12652367, 18686084, 19210712, 12657060, 5088244, 1481896, 529686, -264925, 592622, 5303073, 11771845]
44210A1771845L802260o72696m149440o239037n906628j309372N170232O922591
44202I389755J651946m076603k937024L415718P147619M866995N72703j493468
44194A8537641k001155l207938m408513l428999o35795J302668J037784k40925
44186F954768j183174j942701k820602k896916j511484k19427j216311l621158
44178h457005l431289J437025P478821R041670N061041L09762n03544J819315
44170A2755796K437090j602418p972823j1324022q478035j740460K892634J643775
44162a1388463k756654l920689M77117N478947M995916j41289l145983l22962
44154a0724060M197516M684595J982469J699112N179805O939097K678640m011205
$$ y = [11771845, 15574105, 14901409, 10751969, 4512932, -1393696, -2703068, 2467164, 9389755, 11041701, 6965098, 4028074, 7443792, 14591411, 19458406, 20031109, 18537641, 16536486, 13328548, 8920035, 5491036, 4855241, 6157909, 7195693, 6954768, 5771594, 3828893, 1008291, -1888625, -3400109, -3619536, -4835847, -8457005, -11888294, -10451269, -2972448, 6069222, 11130263, 11440025, 10936481, 12755796, 15192886, 13590468, 5617645, -5706377, -14184412, -15924872, -13032238, -11388463, -14145117, -18065806, -17588689, -12109742, -7113826, -7255115, -10401098, -10724060, -6526544, -1841949, 140520, 1839632, 7019437, 13958534, 16637174, 12625969]
44146A2625969o317917l224006K68959R74546R08150K009311K001712j525390
44138G721334n728134n058907J339206P750352Q040835K214341l704056l755109
44130H819862J973149P281529O378506M41527l793871k382368J114523Q21900
44122B0654757l587756o937448n549190j309911J558730J561052P75454J700551
44114H866239M016274M513537P57427n043428p354383l675016J935205L607226
44106G623081P57472k013516j462859P64917J576929P93405N91592J942002L148570
44097A3721593J922532j666695m737341m540558j628640R41003J402190N88650
44089F002734m96547j720684j820709J031951M862470M191605j977848o510560
$$ y = [12625969, 6308052, 3084046, 3353005, 4327551, 5235701, 7245012, 9246724, 7721334, 1993200, -3065707, -1726501, 6023851, 14064686, 16279027, 12574971, 8819862, 10793011, 18074540, 24453046, 24894573, 21100702, 18718334, 19832857, 20654757, 17067001, 10129553, 4580363, 3270452, 4829182, 6390234, 7165688, 8866239, 12882513, 17396050, 18153477, 13110049, 5755666, 2080650, 4015855, 7623081, 8380553, 6367037, 4904178, 5669095, 7246024, 8039429, 8631021, 10573023, 13721593, 15644125, 13977430, 9240089, 4699531, 3070891, 4011894, 5414084, 6002734, 5506187, 3785503, 1964794, 2996745, 7859215, 12050820, 10072972, 3562412]
44081C562412l353245L038868L770494j464650m976786l635340k174825k961201
44073h194273j585325L764952O922174L418239j326898n08525K718562N57130
44065E766036o147307q722535l816741K516861M729410M362740M427293L672702
44057F788459M04474k587129j645911J583207K001783j599559m680756l123535
44049b858967J226138K841009n75322n251505n913536j860701K869092M542171
44041d981621K887008m23474l649958m788677k565239Q99269J338689j767005
44033a3051008l539576m90483M213935N752741M774053M780968M959465J732681
44025I132776l591111n500135l303545k762650o343925q091678k452010O482651
$$ y = [3562412, 209167, 3248035, 7018529, 5553879, 577093, -3058247, -5233072, -8194273, -9779598, -6014646, 907528, 4325767, 2998869, 2490344, 5208906, 5766036, -381271, -9103806, -12920547, -10403686, -5674276, -1311536, 3115757, 6788459, 7192933, 4605804, 2959893, 4543100, 6544883, 4945324, 264568, -2858967, -1632829, 1208180, 632858, -4618647, -10532183, -12392884, -9523792, -4981621, -2094613, -2518087, -6168045, -10956722, -13521961, -12622692, -11284003, -13051008, -16590584, -17081067, -12867132, -7114391, -2340338, 2440630, 7400095, 9132776, 5541665, 41530, -3262015, -6024665, -12368590, -20460268, -22912278, -16429627]
44017a6429627R790492N127525j621580m652507l594214j043767R06931R17175
44009a0599572j491473m593679n192659j950564L052492O618248P271448N550886
44001a334873K764616K32254r83508m81726J237696L047485L744420K641528m8317
43992A0819575l439999o524715q176630p015818k589113K832026N076476K223154
43984f795044k587086m063636o70323L637337M122694P52170j973509l08755M606758
43975c279394Q143598O978364J870616l899156p706328q768554p239528l682584
43967a7582966K40706J882411o3340l279079l347483J224651O311638O459364
43959h154098J954638r35101J774898N915563M776715j061968m213760j175651
$$ y = [-16429627, -6639135, -1511610, -3133190, -7785697, -11379911, -12423678, -11516747, -10599572, -12091045, -16684724, -21877383, -23827947, -20775455, -14157207, -6885759, -1334873, 1429743, 1661997, 678489, 196763, 1434459, 4481944, 8226364, 10867892, 10819575, 7379576, 854861, -7321769, -14337587, -16926700, -14094674, -9018198, -6795044, -9382130, -13445766, -14116089, -10478752, -6356058, -5603888, -7577397, -7886152, -3279394, 4864204, 11842568, 13713184, 9814028, 2107700, -6660854, -13900382, -17582966, -17342260, -15459849, -15523189, -18802268, -22149751, -20925100, -14613462, -8154098, -6199460, -7134561, -5359663, 555900, 5332615, 4270647, 56887, -1118764]
43951a118764K476810K50119n816035q046005l584458K286132L124339j561521
43943a1989383o699218p122339k226869L741526O141915M944026L887309M421588
43935d901445L653202M5854k727086j309723J325437M60531k290403j702875J587364
43926e859144J548920k742506m435193N56636O657299O418748N97030l995794
43918a254004l522214J16109L297703L881794J978464K23459J637689N161782
43910A1520782N641828N81507n627668p077433l873560j352279l163165p511096
43902a0861084r272466m667769M421753J0404691P486171k01851k644080K539916
43894b794719O710103L363618k243956k118880K185252L806448K106212J258811
$$ y = [-1118764, 1358046, 1608165, -4207870, -12253875, -15838333, -13552201, -10427862, -11989383, -18688601, -25810940, -28037809, -24296283, -18154368, -13210342, -9323033, -4901445, -1248243, -1202389, -3929475, -5239198, -3913761, -3453230, -5743633, -7446508, -5859144, -4310224, -7052730, -11487923, -10931287, -4273988, 2144760, 2741790, -1254004, -4776218, -4660109, -1362406, 2519388, 4497852, 4721311, 6359000, 11520782, 17162610, 17744117, 12116449, 5039016, 1165456, -186823, -3349988, -10861084, -20133550, -24801319, -20379566, -9974875, -2488704, -2690555, -5334635, -2794719, 3915384, 7279002, 5035046, 2916166, 5101418, 8907866, 11014078, 12272889]
43886A2272889R28197k091701n145074k832886J886777M29295o661282q693093
43878i906878j517495N453133L908635j453803k423841j15120J21929j40092L775852
43869b297680Q689555O605729k291345q583903o494548o81163J699770N8718j180241
43860d475108N33919L341351L828734R26926k807832m096769l172855l162247
43852i083881m583681l779021J058086N921317O536772M631552M306705M922793
43844I930642K818310j708256m620698m408872k992948j203709J355712K680669
43836A850850M33396k600172j379792K749834L175860r31733k233322K992368
43828D057289Q017051N776121k74084k071848N51044R27764k760738m589519o18788
$$ y = [12272889, 13201086, 11109385, 5964311, 3131425, 5018202, 5447497, -1213785, -9906878, -11424373, -5971240, -2062605, -3516408, -5940249, -6055369, -5933440, -6073532, -2297680, 6391875, 12997604, 10706259, 2122356, -4372192, -5053355, -3353585, -3294867, -4475108, -3941189, -599838, 3228896, 4155822, 1347990, -2748779, -5921634, -9083881, -13667562, -17446583, -16388497, -10467180, -3930408, 701144, 5007849, 9930642, 12748952, 11040696, 6419998, 2011126, -981822, -2185531, -829819, 1850850, 2284246, -315926, -1695718, 1054116, 4229976, 3298243, 1064921, 4057289, 12074340, 17850461, 17576377, 15504529, 16055573, 16983337, 14222599, 9633080, 9014292]
43819I014292M669503M576833p50756m763852k946401J636647K077923l793231
43811I720958j0314078j0774810n640461q66250J005846L021016O199172N956148
43803a692459N3756n132246k466178M915478P323367K174281k936671j532788
43795G06540L593802N762600L048996j455133m645317n567567m408075j668608
43787d632762K252241P089321J1199214J1002288M935696k554300n063903k704042
43779B1523753j998747o077145r971229q300476k893051J038490K266830K577721
43771a833854J885559l32671j217442J962687N885162M878743P9172j588987J666502
43762A1384871L323356j153505o915460o861896j540940L101367M563743M758044
$$ y = [9014292, 13683795, 18260628, 17509872, 12746020, 9799619, 11436266, 13514189, 9720958, -593120, -11367930, -17008391, -17874641, -16868795, -13847779, -7648607, -1692459, -1638703, -6770949, -9237127, -4321649, 3001718, 5175999, 2239328, 706540, 4300342, 10062942, 13111938, 11656805, 7011488, 1443921, -2964154, -4632762, -2380521, 4708800, 15908014, 26910302, 31845998, 29291698, 24227795, 21523753, 19525006, 13447861, 3476632, -4823844, -7716895, -6678405, -4411575, -1833854, 51705, -280966, -1498408, 464279, 6349441, 11228184, 11307356, 9718369, 11384871, 14708227, 13554722, 6639262, -222634, -1763574, 1337793, 5901536, 10659580]
43754A0659580L993287J36550n810255q544757m928790J743452N933186N816978
43746H999231L240572J00073k601831l353285p39787M012625O794140M171987
43738B0623725k737607q402225p670779j074243N237778N870101J840984j702291
43730A1985443k552601l151208m938546n055359j239368L236450L526750L33378
43722B144939j312560L35718J923414J060491l97285l91765K90863Q45973K170403
43713F670191L418721J168396m685470q428217o228696k366462k326422l425345
43705a6203304L42707O535720O464651n72250m716644j89218O145399N847471
43697C654532R81795j592486j789742l678419n364537j177388P055291J0208770
$$ y = [10659580, 14652867, 14789417, 8979162, 434405, -4494385, -2750933, 3182253, 8999231, 12239803, 12339876, 9738045, 6384760, 5644973, 9657598, 16451738, 20623725, 17886118, 9483893, 1813114, 738871, 5976649, 11846750, 13687734, 11985443, 9432842, 6281634, 1343088, -3712271, -4951639, -1715189, 1811561, 2144939, 832379, 1168097, 3091511, 4152002, 3754717, 3362952, 3653815, 4499788, 6670191, 10088912, 11257308, 6571838, -1856379, -8085075, -10451537, -12777959, -16203304, -15860597, -9324877, -2860226, -3432476, -8149120, -8338338, -2192939, 3654532, 4636327, 3043841, 1254099, -2424320, -7788857, -8966245, -1910954, 8297816]
43689H297816M916986j345748j261939K535786K732755k121829o822563o780492
43681A50772k407790K452256L978482J356999k024224j671301K539034N726172
43673A0100400M073613m69567l110586k038218L40366O00304k524731o796497
43665A75084p625815k635588M248495O141677J909315j888459K0019M389181M869474
43656I603383J493213l29492J291139K392375n7046m031449o529270p655864q414030
43647a2237041p535901l299676L115763Q368492J0288384R103594O184221K805413
43639A6793249l42646l176379n365593n515059k515246J964844M049961J866093
43631G759224j993486l454431j628069O96667P20080j350921k872069j622930
$$ y = [8297816, 13214802, 11869054, 10607115, 13142901, 15875656, 13753827, 6931264, 150772, -2257018, 195238, 4173720, 5530719, 3506495, 1835194, 4374228, 10100400, 14174013, 13704446, 10593860, 8555642, 8896008, 9496312, 6971581, 175084, -7450731, -10086319, -5837824, 303853, 2213168, 324709, 344728, 4733909, 9603383, 11096596, 10767104, 12058243, 14450618, 14393572, 10362123, 3832853, -3823011, -12237041, -19772942, -23072618, -19956855, -11588363, -1299979, 7803615, 13987836, 16793249, 16450603, 13274224, 7908631, 2393572, -121674, 1843170, 5893131, 7759224, 5765738, 2311307, 683238, 1379905, 2099985, 749064, -2123005, -3745935]
43623c745935J956374N168999N837856M496213L203524K545937J202517j387414
43615A9278071l742579m592129m645348m656643l412887O0136L434676L254883
43607D978180R8597j573703M11952K983988K766634R97660N29929L04766k794019
43598H703984p349650p682870j984452M167296M965520J612143q19363r12346
43590G00262j176451k526354l086872k174843j303216q60009M60597K283820K246297
43581e436769L8124j649028j256448m5229J254639L433680N081410K667732l083722
43572A004389n767709k018882K873131K819036Q9354M71668K823235J248204l884532
43563c42106n522540j215978K968113K054711j072104j565918N31866K736110
$$ y = [-3745935, -1789561, 3379438, 9217294, 13713507, 16917031, 19462968, 20665485, 19278071, 15535492, 10943363, 6298015, 1641372, -1771515, -1711379, 1723297, 4978180, 5076777, 3503074, 3915026, 6899014, 9665648, 10663308, 11193237, 11498003, 8703984, 1354334, -6328536, -8312988, -4145692, 819828, 2431971, 1612608, 700262, -476189, -3002543, -6089415, -8264258, -9567474, -10427483, -9966886, -7683066, -5436769, -5398645, -7047673, -8304121, -8349350, -7094711, -3661031, 1420379, 4088111, 1004389, -4763320, -6782202, -3909071, -1090035, -1000681, -529013, 2294222, 3542426, -342106, -5864646, -7080624, -4112511, -2057800, -3129904, -4695822, -4163956, -1427846]
43555a427846M244184M127916L94597n359225p356102l961126j364165l781251
43547a4483018n635324o92359O125975N721817M87602J370258R164196J1137480
43539A3196627M83830j1987719j2919443m446118J846477K313316J927616J858483
43531g726931j404563n289888j850386Q064234J2426867M987982m971106o742665
43523b506456l498699m277163p526303m615603L440676N792412p83216o206446
43515b0180798k781231L771568M896793K148547J873055L543092K278419j061551
43507e512106j276993J633872K621747N39675p72597l46835j364039l611635k322877
43498a0411788L098184O342817L821166P36071K834652P290426P460556L009545
$$ y = [-1427846, 2816338, 6944254, 7338851, 1979626, -5376476, -9337602, -10701767, -14483018, -20118342, -20810701, -14684726, -8962909, -8475307, -7105049, 2059147, 13196627, 13680457, 1692738, -11226705, -15672823, -13826346, -11513030, -9585414, -7726931, -9131494, -14421382, -16271768, -8207534, 4219333, 9207315, 4236209, -2506456, -6005155, -10282318, -17808621, -22424224, -18983548, -13191136, -13974352, -20180798, -22962029, -19190461, -14293668, -12145121, -10272066, -6728974, -4450555, -5512106, -6789099, -5155227, -2533480, -1993805, -2766402, -3113237, -4477276, -8088911, -10411788, -7313604, -970787, 2850379, 3586450, 6421102, 13711528, 21172084, 24181629]
43490B4181629q44044k027744l301272n647048n810398j943217K587172L427672
43482A0622750P01763k044424k711345k052150r22413J128176L573145L469028
43474A1764530j112368o977252q437624m748444j406786k083224l104995J70243
43466a5935920M795128L891062k516848o750413m042488K056958O117494O975822
43458e409205N529654K060335j447278j541736R65888N78541m180627p133587
43450a0578015l852760R67585J205394j005922m03071J283819q79281m239645
43442a7501896j642307N500959P698830K541467q17730L595496Q575827N083409
43434A3034055l445366o459540j898323K303810J086680j671839j410024j60668
$$ y = [24181629, 23337585, 21309841, 18008569, 12361521, 6551123, 4607906, 7195078, 10622750, 11324513, 9280089, 6568744, 4516594, 3594181, 4722357, 8295502, 11764530, 10652162, 3674910, -4762714, -9511158, -10917944, -13001168, -16106163, -15935920, -11140792, -7249730, -9766578, -16516991, -20559479, -18502521, -12385027, -5409205, 120449, 2180784, 733506, -808230, 157658, 736199, -3444428, -10578015, -14430775, -13463190, -12257796, -13263718, -13666789, -12382970, -13262251, -17501896, -19144203, -13643244, -5944414, -3402947, -4220677, -625181, 7950646, 13034055, 9588689, 3129149, 1230826, 3534636, 4621316, 2949477, 1539453, 1378785]
43426A378785j775364m583023l806821Q06696M640505N131306M457837M289011
43418A0538932K398591k549180o545588n126179n35351J230759n12015r25206
43410b025237J442614K238572m52207k343843q55641q1542k838770m038555J168881
43401g785728P739707P443220J772219p23152J895375L213260J37162k947519
43393A0744544l169579l677395o210450o723585k442475K680438L709717J363818
43385c724967n50955l37571J783036N119430P289986N478268R90234j580215j322117
43376A3145129k031288m395280l436073K762776P884098N825512o43316m887672
43368A4223886n788580o499689p251090n372024o70699M139330P154880P847221
$$ y = [1378785, -396579, -4979602, -8786423, -7979727, -3339222, 1792084, 6249921, 10538932, 12937523, 10388343, 3842755, -1283424, -1818775, -588016, -1100031, -2025237, -582623, 1655949, 1203742, -1140101, -1995742, -2077284, -4916054, -8954609, -7785728, -46021, 7397199, 9169418, 8446266, 10341641, 13554901, 13692063, 10744544, 7574965, 3897570, -2312880, -9036465, -11478940, -8798502, -5088785, -3724967, -4275922, -4613493, -2830457, 2288973, 9578959, 15057227, 16047461, 14467246, 13145129, 11113841, 6718561, 3282488, 6045264, 13929362, 19754874, 19111558, 14223886, 8435306, 1935617, -5315473, -10687497, -11358196, -7218866, -63986, 7783235]
43360G783235N777273K010424l51567J4387Q49892P33995J535582L502705K562284
43351B4418210l286139r357104j0771727r041081p074024k881295M983289J0616610
43343b393261P865975Q58804j457123J110499J296959k207361k996564Q09898
43335B887826K821659l34908k982272O896M627533L759700k929642r296285r866244
43326a1305737m148706L458411O866113M198742L85094N56456K637462J765573
43318D413408k70924K027000O559837N049306k980696p732132l812218K268414
43310E521995L592808K353256K378235J487612j717100k179154K243128L810463
43302A7491243l117221j0392768p556005P92171J775450n108509p680581q46569
$$ y = [7783235, 13560508, 15570932, 15219365, 15233752, 16083644, 16817639, 18353221, 21855926, 24418210, 21132071, 11774967, 1003240, -8037841, -15111865, -17993160, -13009871, -2393261, 5472714, 6331518, 4874395, 5984894, 7281853, 5074492, 2077928, 2887826, 5709485, 5374577, 2392305, 2399201, 7026734, 10786434, 7856792, -1439493, -11305737, -15454443, -11996032, -5129919, -931177, -546083, 10373, 2647835, 4413408, 4142484, 6169484, 12729321, 17778627, 14797931, 7065799, 3253581, 5521995, 9114803, 11468059, 13846294, 15333906, 13616806, 11437652, 13680780, 17491243, 14374022, 3981254, -3574751, -2782580, -1007130, -6115639, -13796220, -14642789]
43294a4642789O471770O321841K101725J41620N23180Q38220J292237J677027
43286D724831r5919k721665j385496L419192L989713l020087r838360q099171
43278a3026962m06674M815904N070360L644810J894648q70743k524390p03748
43270b106795J199916k048247q130042q922433k293801M707956O103242L892732
43262g597472K005294l59427m681923p195698l174358M856537Q959139N775752
43254a412156k2556l032226l398568l606479k852324J072624N800790N451573
43246a999322q48230n692670k260538N970454R143330M074179k042127k418600
43238C926476M84147Q40833o54938P50653M101652L287314k263564n203059j473248
$$ y = [-14642789, -8171019, -1849178, 252547, 394167, 917347, 1755567, 3047804, 4724831, 4628912, 1907247, 521751, 3940943, 7930656, 4910569, -4927791, -13026962, -13433636, -8617732, -3547372, 97438, 1992086, 1121343, -1403047, -2106795, -906879, -2955126, -11085168, -20007601, -22301402, -17593446, -11490204, -7597472, -5592178, -5951605, -10633528, -17829226, -21003584, -16147047, -7187908, -1412156, -1434712, -4466938, -7865506, -11471985, -14324309, -13251685, -7450895, -1999322, -2847552, -8540222, -10800760, -4830306, 4313024, 8387203, 6345076, 3926476, 4410623, 5251456, 4596518, 5347171, 9448823, 12736137, 10472573, 5269514, 3796266]
43229C796266K895277R91594m402675n666493j934590J375206K521582M871707
43221D447874Q172286O571759j588749q642310p097624O6183L724108N21953m543288
43212A632192o027460l694710l31503K021173K671430J904197J184375K038654
43204A398348L912351M299089J625264k604798m889839l053737J110794L035865
43196D833337O29183k285814n33330M455673N377128p09166p460588p866910l546859
43187g107346o76927k03550J574123M641857M635433P70944k040992n63842K443009
43178C472709K990978O33930k891042n707321n514407j582617K225280J283776
43170e088714k270312j701403L416366N500148R94329l308374p93619M808607
$$ y = [3796266, 6691543, 7683137, 3280462, -2386031, -4320621, -2945415, -423833, 4447874, 12620160, 19191919, 17603170, 8960860, 1863236, 1929419, 5653527, 6175480, 1632192, -4395268, -8089978, -8421481, -6400308, -3728878, -1824681, -640306, 1398348, 5310699, 9609788, 11235052, 8630254, 3740415, 686678, 1797472, 4833337, 5462520, 3176706, 2643376, 7099049, 12476177, 11767011, 4306423, -3560487, -7107346, -7784273, -7987823, -6413700, -1771843, 2863590, 3634534, 1593542, 1029700, 3472709, 6463687, 7097617, 4206575, -1500746, -7015153, -8597770, -6372490, -5088714, -7359026, -9060429, -5644063, -143915, 850414, -2457960, -3251579, 1557028]
43162A557028O042448K989690P79198J84977j509165l249987j804525J061725
43154F051389O59503k186873k114942J607503M076043L199101J993660J556290
43146A4841674r54643n425065o982732m097350k043441m431529p017927m685363
43138b0796376J24944J496583n80831o95962L292776P088801O002739Q77710l121992
43129f311608k171257K447122N961046N396962K459349K88573r23663k505449
43121D641075l132823l93411L879088M794245J665352r81205r98162j556958l920627
43112C996574l331597L137264R478534P707804p33518o595596m797986M34823
43104I296302K266829j156103o069897p029528j726793N769711P824540J913257
$$ y = [1557028, 7599476, 10589166, 11368364, 11553341, 10044176, 6794189, 4989664, 6051389, 6710892, 4524019, 2409077, 4016580, 8092623, 11291724, 13285384, 14841674, 13887031, 8461966, 1479234, -2618116, -4661557, -9093086, -16111013, -20796376, -20671432, -19174849, -19755680, -20451642, -17158866, -10070065, -4067326, -3189616, -6311608, -8482865, -6035743, -74697, 5322265, 7781614, 8070187, 7146524, 4641075, 1508252, 1114841, 4993929, 9788174, 11453526, 10472321, 9474159, 7917201, 3996574, 664977, 3802241, 13280775, 20988579, 20255061, 13659465, 8861479, 9296302, 11563131, 10407028, 4337131, -2692397, -4419190, 1350521, 9175061, 11088318]
43096A1088318n386297o352116j804370J480872Q61567l95615l83312j006207
43088a897160k441387j529454K055005L487989k79681n684727p810734o563034
43080b0663183m230144o90545M672958R101940R148362N658983K112426m79374
43072D631423l015248m396461l173098k077127m932865q637088m997191O530844
43064b0066811J4255039Q075900o061433j2514220n398447N459954Q995887O240741
43056a013390N210766P777083Q051602K317259n285946q056514m055079L039094
43048G984875P740138O553152N15322m952056m918133o35286J902241l3310k374172
43039A1782771p17644K734979K286094k792585o977883n842085j292906J715658
$$ y = [11088318, 5702021, -650095, -2454465, -973593, -112026, -507641, -890953, -1897160, -4338547, -5868001, -3812996, -325007, -604688, -6289415, -14100149, -20663183, -24893327, -25583872, -20910914, -11808974, -2660612, 2998371, 5110797, 4631423, 1616175, -2780286, -5953384, -8030511, -12963376, -21600464, -26597655, -20066811, -5811772, 2264128, -3797305, -16311525, -21709972, -16250018, -7254131, -1013390, 4197376, 11974459, 20026061, 22343320, 17057374, 9000860, 4945781, 7984875, 15725013, 22278165, 22793487, 17841431, 12923298, 12288012, 14190253, 14156943, 11782771, 11065127, 13800106, 16086200, 13293615, 6315732, 473647, -819259, 896399]
43031H96399J256720n39541j104836l1957J816277L989745N909323N271754o05227
43022A6858657j0139986j5837541j0808410K441481J2891894J2495277M436821
43015A2338193k033532k488900m4391Q74001n42550k568603l500658k412826L19413
43006e9853K739422L284655K877223L078757K773978l99858n297781p261855m026642
42997b291954R75944K709164J38905l356917l670551N78139O641073R451762O832076
42988A8007641K789049K746649N507670M214639l335419j0208399r514825l936868
42980F270137j272920l327250m965767k973878J73854J751347K336752K368780
42972C61055L10366l102415l322889J546419O253319M849209o21058k726209J096363
$$ y = [896399, 2153119, 1613578, 508742, 476785, 2293062, 6282807, 12192130, 17463884, 16858657, 6718671, -9118870, -19927280, -17485799, -4593905, 7901372, 12338193, 10304661, 7815761, 7771370, 8645371, 8102821, 5534218, 2033560, -379266, -59853, 2679569, 5964224, 8841447, 11920204, 14694182, 14294324, 8996543, 1734688, -2291954, -1316010, 1393154, 1532059, -1824858, -5495409, -4917270, 1723803, 11175565, 18007641, 20796690, 23543339, 29051009, 33265648, 29930229, 19721830, 10207005, 6270137, 4997217, 1669967, -3295800, -6269678, -6095824, -4344477, -2007725, 361055, 671421, -2430994, -5753883, -4207464, 2045855, 6895064, 6274006, 3547797, 4644160]
42963D644160N796339O363132L539526O56544j059791j917190j934634k073445
42955A4014641m316761p769977p618015j581295N057010N428681O29002j820462
42947B022824J235508M742817L528139q69473l879787m208402l376597k201056
42939c006027r54551n79912q98836L4805K253918K501586l78648k009175J300367
42930a736473N780026M855994j355882o698324p783602o372340l802729N11976
42922a6601354M742134N227555K565153J078789J058494j688475o593798o448398
42914a6659900J059173P255688M121009l775667o149311j508949K935589L053227
42906i669141J499407Q59864O52952J172699L527702N328116K662591k795846
$$ y = [4644160, 10440499, 16803631, 20343157, 20999701, 19939910, 18022720, 16088086, 14014641, 9697880, 1927903, -5690112, -7271407, -2214397, 3214284, 3843286, 2022824, 3258332, 8001149, 11529288, 10659815, 6780028, 2571626, -804971, -3006027, -3960578, -4540490, -5439326, -5404521, -3150603, -649017, -1027665, -3036840, -1736473, 4043553, 8899547, 7543665, 845341, -6938261, -13310601, -17113330, -16601354, -11859220, -6631665, -4066512, -2987723, -1929229, -3617704, -10211502, -16659900, -15600727, -8345039, -4224030, -7999697, -14149008, -15657957, -12722368, -9669141, -8169734, -7309870, -6656918, -5484219, -1956517, 3371599, 6034190, 3238344]
42898C238344m839378k080559l6685k038506m321156k965737K18055K402374M787864
42889e635384Q280096Q934975L490801l854510o209027l528606j545110k314577
42881b381342j941715J903761N846045O024078L223921N51470q82053j662580
42873A0681585j796187j022794n0802J48720o93559k546689m710666m487080Q39857
42864c637615Q736070J1222765L868602o595543q469745O94769J0612825J0850474
42856B7282602K800787m135313m905640k454097p32800K3589K49440j340907m403834
42847A2383827n239974j906120J737767P49498m163477q293518r481518q801361
42839b3014876o133946l33250O116551Q059378M984188K686811M991988P821133
$$ y = [3238344, -1601034, -3681593, -3718278, -5756784, -10077940, -13043677, -12825622, -10423248, -5635384, 2644712, 11579687, 15070488, 11215978, 5006951, 1478345, -66765, -2381342, -4323057, -2419296, 3426749, 9450827, 12674748, 13226218, 12344165, 10681585, 8885398, 7862604, 7811802, 7960522, 7266963, 4720274, 9608, -4477472, -3637615, 5098455, 16321220, 20189822, 13594279, 5124534, 5819303, 16432128, 27282602, 30083389, 25948076, 21042436, 18588339, 17855539, 17879128, 18128568, 16787661, 12383827, 7143853, 5237733, 6975500, 7724998, 3561521, -4731997, -14213515, -23014876, -29148822, -29482072, -23365521, -15306143, -10321955, -7635144, -2643156, 5177977]
42831E177977N076527k398573p716367o392962n14630M714221N643253J974296
42823E563742l237316n293111j823510M525639Q623849P819313L330767k229689
42815A7279684o783245q866327p980643n108432j700880J592486M368031N793810
42807a405516N909593O299178P630818P882857N204162J060461k099152m541052
42799B5941349p028991o751362q30439O533170O886145o93208o810436m306124
42791A2940104J964546L104460o49746j818420J591579L298727o26744n534844
42783A4269662n481433j373332J844750K186034Q56087j476290m289894n039590
42775A495994j876028K276531K543771j125946l877094k804602O6258K206200
$$ y = [5177977, 10254504, 7855931, 139564, -6253398, -6768028, -2053807, 3589446, 5563742, 2326426, -2966685, -4790195, -264556, 8359293, 16178606, 19509373, 17279684, 10496439, 1630112, -6350531, -11458963, -13159843, -11567357, -7199326, -1405516, 4504077, 10803255, 18434073, 26316930, 31521092, 32581553, 30482401, 25941349, 18912358, 12160996, 11330557, 17863727, 24749872, 24056664, 17246228, 12940104, 14904650, 18009110, 17359364, 15540944, 17132523, 20431250, 19804506, 14269662, 8788229, 7414897, 9259647, 11445681, 12301768, 10825478, 6535584, 1495994, -380034, 1896497, 4440268, 3314322, -562772, -3367374, -3301116, -1094916]
42767a094916L518469L314520p60934p474255r987762m068917M569684O928502
42759e055609L069083J165664M340289O061908J335688m587965l949510K133331
42751D512879O377675O104582M315001J950805k945975q025243o792314R24967
42743F422377N625519L46736q760938j0145346k124759N909611O351091J270894
42735D895185k960302l411291j142192J639084K470875k20129m398119n187419
42727h314308o66337N108831P110708N404804L586060K926876J566190j043390
42719A5679434k445631p83758K330913L657627J634967k586682o021328n687758
42711E777784j401963L013028L286475j67005k854150k260181l26932J039613
$$ y = [-1094916, 2423553, 5738073, 4977139, -2497116, -12484878, -16553795, -11984111, -5055609, -1986526, -820862, 3519427, 9581335, 10917023, 6329058, 2379548, 4512879, 10890554, 16995136, 21310137, 23260942, 20314967, 12289724, 5497410, 6422377, 12047896, 12394632, 3633694, -6511652, -8636411, -2726800, 3624291, 4895185, 1934883, -1476408, -2618600, -979516, 1491359, 1271230, -3126889, -8314308, -8980645, -3871814, 3238894, 8643698, 12229758, 15156634, 16722824, 15679434, 13233803, 12450045, 14780958, 18438585, 20073552, 17486870, 11465542, 5777784, 4375821, 7388849, 10675324, 10508319, 7654169, 5393988, 5067056, 6106669]
42703F106669L032444N899219N688997k91212p125372p117473n12492M317623
42695I998403K324765k128971k873274m29330Q18706j25034j087286j491838k036431
42686B969710j248202K630665O843343O103227J06905n030945m284235M43900
42678H534368L522343K254189j204842l006956j489102J324985J908948m32505
42670A1411428k437926j426945R11829J759456J915534L295045L711788j38350
42662A9001859n358407n383094n23885J524621j927304l695308J105500N774572
42654A0518554K325732m844368m919057K800570Q045027M831791j399025l392398
42646A3966826j096191J634646L051287K934456Q52006j858060k190943j32064
$$ y = [6106669, 9139113, 15038332, 20727329, 20436117, 13310745, 6193272, 5680780, 9998403, 12323168, 10194197, 7320923, 6891593, 7710299, 7585265, 6497979, 5006141, 2969710, 1721508, 4352173, 11195516, 17298743, 17405648, 12374703, 8090468, 8534368, 12056711, 14310900, 13106058, 10099102, 8610000, 9934985, 11843933, 11411428, 8973502, 7546557, 8458386, 10217842, 12133376, 15428421, 19140209, 19001859, 13643452, 8260358, 7736473, 9261094, 7333790, 3638482, 4743982, 10518554, 12844286, 7999918, 3080861, 5881431, 13926458, 18758249, 17359224, 13966826, 12870635, 14505281, 17556568, 20491024, 21343030, 19484970, 17294027, 17161963]
42638A7161963L48656k772201o200927o182486l287441m5035K738486M708768
42630F469783M265261J047958k395769l816142l736669l071416j453626L39928
42622b350692K50644n89594K021484P585417Q640329J355129o504616n149297
42614E258804K966802O372066P93569n868279n471648O70048O104515P292595
42606A8118472M583628j51538l915888m048121j611391m56090j496579j350822
42598I671671J846102N130812N286123L070233N42124k188194m739268m605655
42590A4013948j220923R79809k202897q099406r776603m487861L804130R700522
42582B710719J1018003Q547720M336819P93959n72247j89001O12817J162477J133432
$$ y = [17161963, 17510619, 14738418, 8537491, 2355005, -932436, -977471, 1761015, 6469783, 10735044, 11783002, 9387233, 5571091, 1834422, -1236994, -2690620, -2350692, -2100048, -2689642, -668158, 6917259, 15557588, 16912717, 10408101, 5258804, 8225606, 14597672, 15391241, 9522962, 4051314, 4721362, 10825877, 18118472, 22702100, 22550562, 18634674, 14586553, 12975162, 12519072, 11022493, 9671671, 11517773, 16648585, 21934708, 25004941, 25547065, 23358871, 18619603, 14013948, 12793025, 13772834, 11569937, 3470531, -6306072, -10793933, -6989803, 2710719, 13728722, 22276442, 26613261, 27407220, 26834973, 26645972, 27258789, 28421266, 29554698]
42573B9554698m5594k024697l135127k837175l045615m972268o272886l991111
42565C230225Q81993M588481N290382L650645o2110n589422r721794p976183m42200
42556f149983P100231R152210N405077n98266m839050m487766K40988M654977
42548A0478418L467692k111329m559257L44631P403951Q698052L569180k007919
42540B5283419l952771l359804k171710n20589R30980L35971j830773j906480
42532A2808243K014812O621198P343699M246896J473025J571261K767594K016548
42524D0863276r92134l561168l013657L09594K946159J758485k047097l430474
42516C2832984N77136O356844P390530K495752k415302k122153J147716J675288
$$ y = [29554698, 29509104, 27484407, 24349280, 21512105, 18466490, 13494222, 7221336, 3230225, 4112218, 8700699, 13991081, 17641726, 17579616, 11990194, 2268400, -5707783, -6149983, 950248, 10102458, 15507535, 14909269, 10070219, 5582453, 5823441, 10478418, 13946110, 11834781, 7275524, 7620155, 15024106, 23722158, 27291338, 25283419, 21330648, 17970844, 15799134, 15278545, 16209525, 16545496, 14714723, 12808243, 14823055, 21444253, 28787952, 33034848, 34507873, 36079134, 38846728, 40863276, 39871142, 36309974, 33296317, 33605911, 36552070, 38310555, 36263458, 32832984, 33410120, 39766964, 47157494, 49653246, 47237944, 45115791, 46263507, 47938795]
42508D7938795j016133j985061M62111J206541l651846r403368q463543j487651
42500B3599845L185096J372098j716063m32513K609144J478070k992907m021384
42492B3081386J135865P460440R302301O913060M159200L008790K501218J181779
42484E8744039j320613l995937m835620k832039J35535J386510J487167L256720
42476E2025762O196393N955797J379556k178020l46035L046422J550774l335142
42468F4295507l721062K485652P518758M412271l413138p138462l829166J579034
42460F2189394L896823K987733J441920N07366j19867k49009J196475M502451
42452G6353286Q009520R380414Q031644N499556L140781R44941l67146J639415
$$ y = [47938795, 46922662, 44937601, 45399712, 46606253, 42954407, 33551039, 25087496, 23599845, 26784941, 28157039, 26440976, 26008463, 28617607, 30095677, 27102770, 23081386, 24217251, 31677691, 40979992, 47893052, 52052252, 55061042, 57562260, 58744039, 57423426, 53427489, 48591869, 45759830, 45895365, 47281875, 48769042, 52025762, 58222155, 64177952, 65557508, 63379488, 63033453, 66079875, 67630649, 64295507, 60574445, 63060097, 70578855, 74991126, 71577988, 64439526, 60610360, 62189394, 66086217, 69073950, 70515870, 71023236, 70903369, 70654360, 71850835, 76353286, 84362806, 93743220, 101774864, 107274420, 110415201, 111360142, 110992996, 112632411]
42444A12632411P070796J0437206O180815k470322n591883M60398P416513O349113
42436A42485047J40786j017051N952899J3614861J4718391J0148625M885272J509786
42428A92438616N69007L172862R207331J5047899J6747026J4901740J3653687
42421B65738168J5054095J6804256J6094038J3795156J3386085J6209280J9301456
42414C76382534J8827619J4957072J1715628J1784090J3330108J3135799J1083052
42407D71215902R560195R642735J0168946R893253Q269749M657395p89979n716454
42399E16901742p530289o741375o070565o576969p371124q846518j2707575j8158371
42391D42898956k1372868k0040694j5930191j2138222j0437223j1780163j5952371
$$ y = [112632411, 119703207, 130140413, 136321228, 133850906, 128259023, 128719421, 136135934, 142485047, 142625833, 141608782, 147561681, 161176542, 175894933, 186043558, 190928830, 192438616, 193007623, 196180485, 205387816, 220435715, 237182741, 252084481, 265738168, 280792263, 297596519, 313690557, 327485713, 340871798, 357081078, 376382534, 395210153, 410167225, 421882853, 433666943, 446997051, 460132850, 471215902, 480776097, 490418832, 500587778, 510481031, 518750780, 523408175, 522618196, 516901742, 509371453, 502630078, 496559513, 489982544, 482611420, 473764902, 461057327, 442898956, 421526088, 401485394, 385555203, 373416981, 362979758, 351199595, 335247224]
42384C35247224j9718092j9161582j5583101j5125988k0071270k4365785k1277906
42377A99943500j2431737n337394m128648o510504q170596o542484j516792M079565
42369A59384910N683899J720017l968767p046746q111249r869139j1254502r229936
42361A17308487n176576l922935o164618p136579m177280q44835j125776l350199
42353H5409689l018245N94828L729091L199206j03928k905577l573671l685874
42345G9645519n199587o746558m877653L90837M199385L136233L7914p08576J47671
42336G0025185p22562k233466m17527L732935M409184l4135m244587m051400k013707
42327F4449920k012972l304658l580882l694853m922641m599055O37370Q530479
$$ y = [335247224, 315529132, 296367550, 280784449, 265658461, 245587191, 221221406, 199943500, 187511763, 182174369, 178045721, 171535217, 163364621, 156822137, 155305345, 159384910, 165068809, 166788826, 162820059, 155773313, 147662064, 137792925, 126538423, 117308487, 112131911, 108208976, 102044358, 94907779, 90730499, 89885664, 88759888, 85409689, 82391444, 82986272, 86715363, 89914569, 89810641, 86905064, 83331393, 79645519, 74445932, 67699374, 62821721, 63212558, 67411943, 70548176, 70586090, 69877514, 70025185, 69302623, 67069157, 66651630, 70384565, 74793749, 74759614, 70515027, 66463627, 64449920, 62436948, 59132290, 55551408, 51856555, 46933914, 42334859, 42972229, 51502708]
42319E1502708J2321188Q367993K66984m889292l396142J630738L724550Q50970
42311G0379697j665575J312065O217875N278323r93322l261332K430521P740937
42303H7439189M441305k938865m220774J176113M491792J200302l720505m250708
42295H3617849l78697M409950P422855P327124M630535K473267L442206N465852
42287A18410941M429695N10978k080633j242447J490745N057683R495871J2499979
42279A48572812J0868481O204019L842779M994066N426019L436273L136529P204164
42271A93685142J2056354J3643038J2903964J1828541R362196N712653N455799
42264B64647687J0399922J3721795Q451200q96936k988550M726907J2522117J1456827
$$ y = [51502708, 63823896, 72191889, 72458873, 67569581, 64173439, 65804177, 69528727, 70379697, 68714122, 70026187, 76244062, 81522385, 80529063, 77267731, 79698252, 87439189, 91880494, 88941629, 84720855, 85896968, 90388760, 91589062, 87868557, 83617849, 83239152, 87649102, 95071957, 102399081, 107029616, 109502883, 112945089, 118410941, 122840636, 123351614, 121270981, 120028534, 121519279, 126576962, 136072833, 148572812, 159441293, 165645312, 169488091, 174482157, 179908176, 183344449, 186480978, 193685142, 205741496, 219384534, 232288498, 244117039, 253479235, 259191888, 264647687, 275047609, 288769404, 297220604, 296323668, 293335118, 298062025, 310584142, 322040969]
42256C22040969L407203m005656o901438o502829n239021n038402p068921j0320889
42248B80371016j1871778j0283416p334573n452708n341376o812818r331967j0709762
42240B13232618q368386l623361j510420l993021o623643n240354k799217m831884
42232A76242332j0229752j2331911q833245m712909m073665m692926l463773k313584
42224A25590567m370350p649929p681343m752123l458636n318781o595664m491167
42216H1272574j506391j595621m655337p052338o169143k764006L01836O83785
42208E8515359j357025l115935k595252j157564j319536k425214j441913J657998
42200D6760918K941131N01562k129001j269339J205265J103071j210156j493794
$$ y = [322040969, 325448172, 321442516, 314541078, 308038249, 302799228, 297760826, 290691905, 280371016, 268499238, 258215822, 250881249, 245428541, 240087165, 233274347, 223942380, 213232618, 204864232, 201240871, 199730451, 195737430, 189113787, 183873433, 181074216, 176242332, 166012580, 153680669, 144847424, 140134515, 136060850, 131367924, 127904151, 125590567, 121220217, 113570288, 105888945, 101136822, 97678186, 92359405, 85763741, 81272574, 79766183, 78170562, 73515225, 66462887, 60293744, 57529738, 57831574, 58515359, 57158334, 54042399, 51447147, 50289583, 48970047, 46544833, 45102920, 46760918, 49702049, 50203611, 48074610, 46805271, 48010536, 49113607, 47903451, 46409657]
42192D6409657J550548M407663M120170J791818m12432k429820m489163m769372
42184D6179069j724884K414527L321772o0940m006216m747257l072921k554649
42176C5748501m217410n441632m330138k352827j160255N28608M074009P073672
42168B9922528O160889K413970k63825j394956l550636n864616m054814J608890
42160B4977430M726419K135580j207689p59409J86072k883870o946792o155368
42152A4072373j383296K130017L611816N720011P119915M221345j025210l256151
42144C1210820k940417n110479q958928p776728n90997N141387N031360L384425
42136A9390443L916470L277272j256532n041022l082694J723613L215791O62767
$$ y = [46409657, 47960205, 52367868, 56488038, 58279856, 57867424, 55437604, 50948441, 46179069, 44454185, 46868712, 50190484, 50129544, 46123328, 41376071, 38303150, 35748501, 31531091, 26089459, 21759321, 19406494, 18246239, 18774847, 22848856, 29922528, 36083417, 38497387, 38233562, 36838606, 33287970, 27423354, 23368540, 24977430, 29703849, 31839429, 30631740, 29872331, 30058403, 27174533, 20227741, 14072373, 12689077, 14819094, 18430910, 24150921, 31270836, 35492181, 34466971, 31210820, 28270403, 23159924, 14200996, 6424268, 5833271, 10974658, 16006018, 19390443, 23306913, 26584185, 25327653, 20286631, 17203937, 18927550, 22143341, 22806108]
42128B2806108k118616k716772j097708J807169L234087L33263m643949n945103
42120A1658479l401362l192951o399693n217236L826139J1406895Q177482j153151
42112A5704602n647910l987483k478979k337021q7990K735464J699168o98770
42104D901081J582044O175015N109993r07470k919975P90562J961269k416945
42096A4275574m516729O1721M053677J114755l455577k452817J156488O66102
42088A0903194k385556j963961J098863O67318l876196o436431l467805J721677
42080c738897M163273K463150j003674k239124R00697N125412M086523k922392
42072F834968p904656l780955N680161J0176159N376116l256687p971531o044551
$$ y = [22806108, 20687492, 17970720, 16873012, 18680181, 21914268, 22247531, 17603582, 11658479, 8257117, 5064166, -1335527, -6552763, -2726624, 8680271, 16857753, 15704602, 10056692, 6069209, 3590230, 1253209, 1165219, 3900683, 5599851, 4901081, 6483125, 12658140, 17768133, 16860663, 13940688, 14731250, 16692519, 14275574, 9758845, 9820566, 13874243, 14988998, 11533421, 9080604, 10237092, 10903194, 8517638, 6553677, 7652540, 8319858, 4443662, -1992769, -5460574, -3738897, 424376, 2887526, 1883852, -355272, 545425, 5670837, 9757360, 6834968, -1069688, -4850643, 829518, 11005677, 16381793, 13125106, 5153575, -890976]
42064h90976l49496L799462K705919k110497m880560k032806L641208P012374
42056F894628O645304M506193K074721j93450j376052j104916p57193j326818
42048A5362417j788377j467935j597093k460892k072921j40624K09766k378753
42040C665588m572064m117038l891644n597703m646354K060023P975783N151301
42032c972108k538212m268188R64228L281345j264190m013374J800286R585365
42024d24848R342017K181943k836025k090968k0630m46946k127176k776296k241384
42015a440313r57852J051674K835652K724030N26348k019406l059185j903658
42007b242710P79759K945739K416820m52524k352358o91367L139411N345917L616279
$$ y = [-890976, -1240472, 2558990, 5264909, 3154412, -1726148, -3758954, -117746, 6894628, 13539932, 18046125, 20120846, 19927396, 18551344, 17446428, 16689235, 15362417, 13574040, 12106105, 10509012, 8048120, 5975199, 5834575, 6044341, 3665588, -906476, -5023514, -8915158, -14512861, -19159215, -17099192, -9123409, -3972108, -6510320, -10778508, -9814280, -6532935, -7797125, -11810499, -10010213, -424848, 8917169, 11099112, 8263087, 6172119, 6151489, 5704543, 3577367, 801071, -1440313, -2398165, -1346491, 1489161, 4213191, 4739539, 2720133, -339052, -2242710, -1462951, 1482788, 3899608, 3447084, 1094726, 403359, 3542770, 8888687, 12504966]
41998A2504966j434036p062038r304757n114825L928935J1207769J1090932N119360
41990B0936306q9733q95543l2049j507967m847934o340589m459963j458784L75010
41981A678754J568421L256192L996090J433995l215746n331977k634708J699961
41973B450982L496735K949109K877198L348898J721289k235562m865202l257412
41965F486035J209899N049278O434996N883738M821113M275805L850964J985955
41957C9997783j333432k906915o1960M314900M200829j283417n840488m171769
41949C2915531J272964M510307M019094K692649J607385j472780o863414j0134943
41941B8546793p071622J0823L655009k35869o982910q376260k906757K446930
$$ y = [12504966, 11070930, 4008892, -5295865, -10410690, -6481755, 4726014, 15816946, 20936306, 20846573, 19951030, 19918981, 18411014, 13563080, 7222491, 2762528, 1303744, 1678754, 3247175, 6503367, 10499457, 11933452, 8717706, 3385729, 751021, 2450982, 5947717, 8896826, 11774024, 15122922, 16844211, 14608649, 9743447, 6486035, 7695934, 12745212, 19180208, 25063946, 29885059, 34160864, 38011828, 39997783, 38664351, 35757436, 35695476, 40010376, 44211205, 42927788, 37087300, 32915531, 34188495, 38698802, 42717896, 45410545, 47017930, 45545150, 38681736, 28546793, 21475171, 21485994, 25141003, 24905134, 17922224, 9545964, 6639207, 9086137]
41933I086137J927040j361158j156751K031455K856366J356257L274391Q880211
41925B6893948R770587J224219r141868j1316338o362996k793260l231148k886297
41917B156847M20962L198757L637072M298905N745411M419279l89852l661904
41909A9825477k280868j44385j394607l282937j061566L476199M346870O30354
41901B0114537k401572j318456J318409J816803L30500o82863j43665J181967
41893B0215660K019918J252631j138302l092822k306178K34954P67522k006257
41885A5947126m568840l472992m53084K71414j493534j710403J520367M952149
41877A0992203M956236K423414O16173R8661j257225l908147n265800l408854
$$ y = [9086137, 11013177, 9652019, 8495268, 10526723, 13383089, 14739346, 18013737, 26893948, 36664535, 37888754, 28746886, 17430548, 11067552, 8274292, 5043144, 2156847, 2577809, 5776566, 9413638, 13712543, 19457954, 23877233, 23487381, 19825477, 17544609, 17400224, 16005617, 12722680, 11661114, 15137313, 19484183, 20114537, 17712965, 16394509, 17712918, 19529721, 19860221, 19177358, 19033693, 20215660, 22235578, 23488209, 22349907, 19257085, 16950907, 17185861, 17953383, 15947126, 11378286, 7905294, 7452210, 7723624, 6230090, 4519687, 6040054, 10992203, 15948439, 18371853, 18988026, 19086687, 17829462, 13921315, 8655515, 5246661]
41869E246661j42000R90824j118923m087269m954374l283387r18145R06289L017298
41860d343026O131774Q437491P376906L507071O9040j502612k535272k830873
41852A4310499K65835N883073P252382L36355q374214r020606j724503M070122
41844A2998943L176698J04539j58362J063939J552120K986363N750335N434636
41836C2909211J28640m396500l038511J86199q49558l591593j654765K911840
41828B2604963K279985l316522m902888O33725N212726K505830k468819k188462
41820B0360538J720400K348064j277873l596570j380201K285815K791635o29387
41812B2622421m442263m137441J203064O854587O720083M57031n859323o872308
$$ y = [5246661, 5104661, 6095485, 4976562, 889293, -4065081, -7348468, -8266613, -7360324, -4343026, 1788748, 10226239, 17603145, 21110216, 21179256, 19676644, 17141372, 14310499, 14576334, 20459407, 27711789, 28048144, 19673930, 10653324, 8928821, 12998943, 16175641, 16280180, 16121818, 17185757, 18737877, 21724240, 27474575, 32909211, 33037851, 28641351, 25602840, 25789039, 24939481, 21347888, 19693123, 22604963, 24884948, 21568426, 16665538, 17299263, 22511989, 25017819, 22549000, 20360538, 22080938, 24429002, 23151129, 19554559, 18174358, 20460173, 23251808, 22622421, 18180158, 14042717, 15245781, 22100368, 28820451, 29277482, 23418159, 16545851]
41804A6545851l076017J658818M101849K302407l456208q461297o666288J387364
41796D336479P650774O250174J09735m821741p247087q580752p954921m267591
41788a4524930J22559K581108M087190N646770M732137M51313k075974Q82570
41780A902743L892898K4216o815095o711736M75508M499654O73066l831378k560075
41771h450199P08163k49290m377841o672682n232735l15963P729166J4604630
41763b256751J2165108j169315j4573073j6013613o212344M370492R182735R673003
41755d833758Q304213M977420L63133l155023m677625n000532m017036j761484
41747i800692r83184m060459p902246o702144N3396O567695Q062150N452710K681049
$$ y = [16545851, 13469834, 15128652, 19230501, 21532908, 18076700, 9615403, 2949115, 4336479, 11987253, 18237427, 18347162, 13525421, 6278334, -2302418, -10257339, -14524930, -14402371, -11821263, -7734073, -2087303, 2644834, 3096147, 1020173, 1902743, 5795641, 5819857, -995238, -7706974, -7231466, -2731812, -2058746, -5890124, -8450199, -7742036, -7991326, -12369167, -19041849, -24274584, -24590547, -16861381, -2256751, 9908357, 8739042, -5834031, -21847644, -28059988, -23689496, -14506761, -4833758, 3470455, 8447875, 8811008, 5655985, 978360, -4022172, -8039208, -9800692, -10783876, -14844335, -22746581, -29448725, -29395329, -22827634, -14765484, -9312774, -6631725]
41738f631725K879065O803469J1388691J0632144K285319p066946q704702l200045
41730H385270O33143j584925m950673m720486l256284l658535l056836J790099
41722a0419227O821237N573724m66477l232754L11792L904868J095830n668242
41714b079249q108897k520708N697616Q426328M300874j31617P70812M310222
41706A0665381L804703j250994m339096j846818J480449j61229n151234p222075
41698d020913l898567J720223N525331N200823N44949n253632o539248j394763
41690h115797M616001M910073M46507k638734k235920j413932j148891J350323
41682d230370N727416O320239K81983o809881p449762j378802N168610P097598
$$ y = [-6631725, -3752660, 3050809, 14439500, 25071644, 27356963, 20290017, 11585315, 8385270, 9018413, 7433488, 2482815, -2237671, -5493955, -9152490, -12209326, -10419227, -3597990, 1975734, 1509257, -1723497, -1411705, 2493163, 3588993, -2079249, -10188146, -12708854, -7011238, 1415090, 5715964, 5584347, 6355159, 10665381, 14470084, 13219090, 8879994, 7033176, 8513625, 8352396, 3201162, -4020913, -7919480, -6199257, -673926, 4526897, 5071846, -181786, -6721034, -8115797, -3499796, 1410277, 1856784, -781950, -3017870, -4431802, -5580693, -4230370, 1497046, 7817285, 8099268, 1289387, -6160375, -7539177, -2370567, 4727031]
41674D727031M134888j204240n862723p243541m904059j386983K95606r0969k81640
41665a1816630J452673M359477N745477L189898k608967o976572n165877J922587
41657i897934P684557O766272O69995m683576n348509j906096K671806N561069
41649A517584N257427K255333j185917k790217j872849O67793L048258L279760
41641A0177172O12292l168185n089948m036780j360027J322239L184496L364952
41633E006211J582400l39277l76277J33089j654027m260479k641712L405658O736062
41624G591648K449368m467118o110198k823828j252556l188100l330177J310418
41616i820543O013106M944677q83917n186704l807320J636516O388583P341197
$$ y = [4727031, 8861919, 7657679, 1794956, -5448585, -10352644, -11739627, -11444021, -11534990, -11816630, -10363957, -6004480, -259003, 2930895, 321928, -6654644, -11820521, -9897934, -2213377, 4552895, 5222890, 539314, -4809195, -6715291, -4043485, 1517584, 6775011, 9030344, 7844427, 5054210, 3181361, 3849154, 6897412, 10177172, 10789464, 7621279, 2531331, -1505449, -2865476, -1543237, 1641259, 5006211, 6588611, 6249334, 5873057, 6006146, 4352119, 91640, -2550072, 855586, 7591648, 10041016, 5573898, -536300, -3360128, -4612684, -7800784, -11130961, -9820543, -3807437, 1137240, 253323, -4933381, -8740701, -7104185, -715602, 6625595]
41608F625595N420763L568450K661408Q42238k643871n427981n540576m306609
41600A199417l202026p74947L598935N764906J773650m928155p020468l290120
41592f878808P03757J666117J900956K906269K341546m48958j978839o03363M73277
41583H1954p21058j234548P95630J944559n605o31248L927067Q497066N104298
41574A7758115m336781r218249m388893L534639N779868K021446j522170j027071
41566H600904J414514K067245O62917L53837K985715N600770L435571l448158
41558B1673315r003627q098199k390414K588158M051750L051813P38624k982336
41550I629084p165233q826823n286362K724747J0065372J0360546K799396m638954
$$ y = [6625595, 12046358, 15614808, 18276216, 19118454, 16474583, 11046602, 5506026, 1199417, -2002609, -2777556, 821379, 6586285, 8359935, 3431780, -3588688, -6878808, -6175051, -4508934, -2607978, 298291, 2639837, 2190879, 212040, -391323, 81954, -639104, -1873652, -1078022, 866537, 860932, 229684, 4156751, 12653817, 17758115, 13421334, 4203085, -185808, 3348831, 9128699, 11150145, 9627975, 8600904, 10015418, 12082663, 12745580, 13099417, 16085132, 21685902, 25121473, 21673315, 12669688, 4571489, 2181075, 4769233, 8820983, 11872796, 12611420, 9629084, 2463851, -6362972, -11649334, -8924587, 1140785, 11501331, 14300727, 9661773]
41542I661773k973832N825391R737674K010575r735604j3755550q501109j299867
41534i030549K824312M178202L324636M83043j360918M41415K953151J892215
41526E705507l75216J501940N293540L073437n626969j1457645q454559j515551
41518a1855516K482691L364885L491332K180145o38715j265370J924907M494404
41510D178763K782328l9504L00213K145572K013456J301381L013208N414873M790551
41501B5900841J527557j783802m962909p696686o516232p99640K190515l716516
41493D143128j2317457j1634360q20898Q455822Q107360K494482q62340j442509
41485c876772k625300m406084l989285m70074M457180Q429231R267445O096424
$$ y = [9661773, 6687941, 12513332, 22251006, 24261581, 14525977, 770427, -7730682, -9030549, -6206237, -2028035, 1296601, 1779644, 418726, 860141, 3813292, 5705507, 5330291, 6832231, 12125771, 15199208, 9572239, -1885406, -10339965, -11855516, -9372825, -6007940, -2516608, -336463, -975178, -2240548, -315641, 4178763, 6961091, 6921587, 7221800, 9367372, 11380828, 12682209, 15695417, 21110290, 25900841, 27428398, 25644596, 20681687, 12985001, 6468769, 5669129, 7859644, 4143128, -8174329, -19808689, -20629587, -12173765, -4066405, -1571923, -2434263, -3876772, -6502072, -10908156, -14897441, -15367515, -10910335, -2481104, 6786341, 12882765]
41477A2882765Q83687k904886l482840j112652L155688O453476M448034k701630
41469A7621642p352848l534735L111388K412293m665042p186150j659199K920725
41461A668074Q71404r08514L652114P525030J822280q161733r823208k013277
41453e367830M664277M593127K905076L915896M351440J231174j949608j352827
41445A2990725Q20093K99894l071875o469968p969907o748421k700426J895169
41437a0954716L489694J946351P87605J176399q6231m053127n821476j483936
41429a4999437M796098O019250K505983R94594M030242O081507J988343n197375
41421F219205p997135l873052K262584M312118J477054j949840k048542L82120
$$ y = [12882765, 13766452, 10861566, 7378726, 6266074, 9421762, 15875238, 20323272, 17621642, 10268794, 6734059, 9845447, 12257740, 7592698, 406548, -1252651, 1668074, 2539478, 1630964, 5283078, 12808108, 14630388, 6468655, -3354553, -5367830, -703553, 3889574, 6794650, 10710546, 15061986, 16293160, 14343552, 12990725, 13810818, 14110712, 11038837, 4568869, -3401038, -10149459, -12849885, -10954716, -7465022, -5518671, -4731066, -3554667, -3640898, -7694025, -13515501, -14999437, -10203339, -4184089, -1678106, -683512, 3346730, 9428237, 11416580, 6219205, -1777930, -5650982, -3388398, 923720, 2400774, 450934, -1597608, -1215488]
41413a215488J120715k060125o139721o104709j314424L034786J974035k729144
41405a3434075m183441J108136Q277979R456524L308738l237521l470178J163979
41397a009859L718982J183034j791084O25199P624346J2529284J0389382K656834
41389C5926118n509359j0182526j0059672n507193R76341M405541J105670o114541
41381E040379r638888n911055k2755J388451p04007j90359L891832N677427K277370
41372A808395j065345L92418K270674k488906j1145007j2801246l428944P529246
41364a8928715R115834K625653j661662R86842M557560K317220l344965m933179
41356i265412j040973J652733j762216p102669o768272j7634O669267Q468490
$$ y = [-1215488, -94773, -2154898, -8294619, -14399328, -15713752, -12678966, -10704931, -13434075, -17617516, -16509380, -8231401, 1225123, 4533861, 1296340, -2173838, -1009859, 2709123, 3892157, 2101073, 2726272, 10350618, 22879902, 33269284, 35926118, 30416759, 20234233, 10174561, 4667368, 5643709, 10049250, 11154920, 5040379, -4598509, -10509564, -10532319, -9143868, -9847875, -10038234, -6146402, -468975, 1808395, 743050, 1135468, 3406142, 917236, -10227771, -23029017, -26457961, -18928715, -9812881, -7187228, -8848890, -7862048, -3304488, -987268, -4332233, -9265412, -10306385, -8653652, -10415868, -17518537, -24286809, -24304443, -17635176, -9166686]
41348i166686O813149M706950K257986r60208l104131k805432j908791k326857
41340f494020k556575n06833K488368L918797M181078M645013L775637l55226
41332I096239n258057o479204l851424p19693J801718M590129N805746K791379
41324G776833j660767j840682J638084K550065J24291Q09966O086098P735274
41316B3219162P97849p207658p547833l540987l415561n798933l367670K543415
41308d318216L192667k186844m283521Q41757N401476L392985L72440L067978
41300E480722P468014N785848k64945k442746O09847K053157j416442m865887
41292A2407568l948377j467599j712218l419959k801830l04722M54590r08733
$$ y = [-9166686, -2353537, 2353413, 4611399, 3651191, 547060, -2258372, -4167163, -6494020, -9050595, -9557428, -7069060, -3150263, 1030815, 5675828, 9451465, 9096239, 3838182, -2641022, -6492446, -7212139, -5410421, -820292, 4985454, 7776833, 6116066, 4275384, 5913468, 8463533, 8587824, 9397790, 15483888, 23219162, 24017011, 16809353, 9261520, 5720533, 2304972, -3493961, -6861631, -4318216, -1125549, -3312393, -7595914, -6754157, -1352681, 2040304, 2412744, 5480722, 12948736, 18734584, 18469639, 16026893, 16636740, 18689897, 17273455, 12407568, 8459191, 6991592, 5279374, 1859415, -942415, -1247137, -792547, -1701280]
41284a701280r24255J634508L237030J140020j774864j042904K248414K608663
41276E425332j488533m914367l608687q28504j618195m037692j808939M981174
41268g898411Q456250M299543j348690o32065M639787O100886J188271l985125
41260A0820446m362327k522071l036784m941041l996304O178K734092J719212
41252c578599n03308m91506J694211L561898L579922J818755j229743m437147
41244D14483n573491l346699J79201J286301p85021k684687j303835K143916L700644
41235e969188J586388j762982k571826J44280L686617M859965L618094K560836
41227F152184K649957J424060k740203o528966n382135n93189J678748p49030
$$ y = [-1701280, -2625535, -991027, 2246003, 3386023, 1611159, 568255, 2816669, 5425332, 3936799, -977568, -4586255, -5414759, -7032954, -11070646, -12879585, -7898411, 557839, 4857382, 3508692, 2876627, 7516414, 13617300, 14805571, 10820446, 6458119, 3936048, 899264, -4041777, -8038081, -8031903, -5297811, -3578599, -4081907, -4573413, -2879202, 682696, 4262618, 6081373, 4851630, 414483, -5159008, -8505707, -8326506, -7040205, -7825226, -10509913, -11813748, -9669832, -5969188, -4382800, -6145782, -8717608, -8573328, -4886711, -26746, 3591348, 6152184, 8802141, 10226201, 7485998, 957032, -4425103, -5018292, -3339544, -4088574]
41219d088574k955096r26652J905802K54508m309079n457419j328235L498898
41211a3405847M951895L815185K634804K169892J951294J510586K88404j574727
41203B341486k522949j851777j596893l089471l135200J852373Q685090R786153
41195A0468812L287050m406739p128333m932089n33269M350790P031390M273490
41187A2411102k061878n209889k710084J84711o6534P47055N608911Q214274K280193
41178A9397861o207098o081907K268574P493597L916357k483319n540753o323343
41170F439969o445263l480607K440335N533289L193818R69443L016716M311979
41162A5979679n98611o938914o401646n68266J751121j256769k518316J146767
$$ y = [-4088574, -7043670, -7970322, -6064520, -5810012, -10119091, -15576510, -16904745, -13405847, -8453952, -4638767, -2003963, 165929, 2117223, 3627809, 3916213, 2341486, -181463, -2033240, -3630133, -6719604, -9854804, -8002431, 682659, 10468812, 13755862, 9349123, 2220790, -2711299, -3244568, 1106222, 8137612, 12411102, 10349224, 5139335, 2429251, 2613962, 2547428, 3294483, 8903394, 17117668, 19397861, 13190763, 7108856, 9377430, 16871027, 20787384, 18304065, 12763312, 6439969, -5294, -3485901, -1045566, 4487723, 7681541, 8650984, 11667700, 15979679, 15381068, 8442154, 2040508, 1472242, 3223363, 1966594, -551722, 595045]
41154E95045L719261M43646m229785l916894J49622K216702R17073l33446K16543
41145b22233Q03814J03342j021525j837818k790871l991447m878432n256869m708942
41136b3800981j736597L833313Q208971O941014J291717k369794r33497J307906
41128g257948n38470m214037l499801K331050O907882N146126o31027m621068
41120f377293m606741k621738n46892J728110L977109M349113J766692j738617
41112d070257k707002k20602K864597L139229M83177k115971k381685j261954
41104f270468j116694k364536l121190j991075p1542M40175o74452p59918K589517
41095a3340183P380793P960844J857097n443036o137861n32464K859680n48476
$$ y = [595045, 4314306, 4757952, 528167, -3388727, -3239105, -1022403, -105330, -438776, -222233, 581581, 684923, -336602, -2174420, -4965291, -8956738, -13835170, -19092039, -23800981, -25537578, -21704265, -13495294, -6554280, -5262563, -7632357, -8565854, -7257948, -7796418, -12010455, -15510256, -13179206, -6271324, -1125198, -1756225, -6377293, -10984034, -13605772, -14152664, -12424554, -8447445, -4098332, -2331640, -4070257, -6777259, -6997861, -4133264, -994035, -510858, -2626829, -5008514, -6270468, -7387162, -9751698, -12872888, -14863963, -14935505, -14495330, -15169782, -15929700, -13340183, -5959390, 2001454, 3858551, -1584485, -7722346, -8254810, -5395130, -5943606]
41087e943606m461421j246959O170711Q788007N253725K781721M409212M261952
41079B0013342j471609o791248m636307K186813N161600J709384l416489o230445
41071F525041p019039o516814m106777o13603J088983m62041l446927m805810
41063a9356987k756055K173381P131678Q811471O584269K666231j279083n089245
41055a114340o973429l742238L427491P940781O127544K361478J601070J630209
41047A1258566j412023m435533k238851K236273J506615m012476o495065l623010
41039g215504j426613k667966k056918L355011P767491N822279J127726j26400
41031D579106J654076K492563K206587K638630K254509j276967n494421n837386
$$ y = [-5943606, -10405027, -11651986, -5481275, 3306732, 8560457, 11342178, 15751390, 20013342, 18541733, 11750485, 7114178, 9300991, 14462591, 16171975, 12755486, 6525041, -493998, -7010812, -11117589, -11731192, -10642209, -11104250, -14551177, -19356987, -22113042, -19939661, -12807983, -3996512, 2587757, 5253988, 3974905, -1114340, -8087769, -11830007, -8402516, -461735, 5665809, 8027287, 9628357, 11258566, 9846543, 5411010, 3172159, 5408432, 6915047, 2902571, -3592494, -7215504, -8642117, -11310083, -13367001, -10011990, -2244499, 3577780, 4705506, 4579106, 6233182, 8725745, 10932332, 13570962, 15825471, 14548504, 9054083, 3216697]
41023C216697k537446J05740M52170J054357L532901N601076M165653m19982m104955
41014A1066211l277997O33690K173553q27654l391995n55753M512995N799425
41006A6132475N311376R277440J3860764O788052j2638671k6959003k1931711
40999a0159278n162800N884411O439001M147417K905147N8243l336043k462966
40991a686868J037254L0304n780210q469886m639895k92651l55450j695539J2553
40982b1840388L506301N622225O036161N159619K164124k276873n335637n637717
40974a2602185l753845O53418O975009R842032M414925m405149o334689m57899
40966e668383L445027O14243j913428J020875K765556l232863j0055051o400267
$$ y = [3216697, 679251, 784991, 1237161, 2291518, 5824419, 11425495, 15591148, 15171166, 11066211, 7788214, 8421904, 10595457, 9767803, 6375808, 5820055, 10333050, 16132475, 21443851, 30721291, 44582055, 51370107, 38731436, 11772433, -10159278, -15322078, -9437667, -2998666, 1148751, 4053898, 4112141, 776098, -1686868, -649614, -619310, -6399520, -14869406, -19509301, -19801952, -20157402, -21852941, -21840388, -18334087, -12711862, -6675701, -1516082, 648042, -1628831, -6964468, -12602185, -16356030, -15702612, -8727603, 1114429, 5529354, 1124205, -5210484, -5668383, -2223356, -1609113, -3522541, -2501666, 263890, -2968973, -13024024, -19424291]
40958a9424291N819648J3512523J0038376J580714l576724l934737k256164j127011
40950F32334k528530o409301q456775m189118L580232O337806R15805n483131
40942a5600678m241000L935856J0674476J0448254N722720J774682j28029k336141
40934A0250140n413124o458946l662353J49705Q66776j485265l387347k990447
40926a2130861j595341l40098J284126L243326M266666L960061L164643K087523
40918C940045N69493l06527L9676o66629m060856o427999l029219L269873M362826
40909b309317j218112n774289l687411J877781N992310Q055067P451079J508764
40901A1895872o927429q138350J079119R884225P498370j637239o131981n107410
$$ y = [-19424291, -13604643, -92120, 9946256, 11526970, 7950246, 4015509, 1759345, 632334, -1896196, -8305497, -16762272, -20951390, -17371158, -11033352, -10117547, -15600678, -19841678, -15905822, -5231346, 5216908, 10939628, 12714310, 12586281, 10250140, 4837016, -1621930, -5284283, -5134578, -4267802, -5753067, -9140414, -12130861, -13726202, -14066300, -12782174, -9538848, -5272182, -1312121, 1852522, 3940045, 4509538, 4203011, 4242687, 3576058, -484798, -6912797, -9942016, -6672143, -2309317, -3527429, -9301718, -12989129, -11111348, -5119038, 2936029, 10387108, 11895872, 4968443, -3169907, -2090788, 7793437, 15291807, 13654568, 7522587, 2415177]
40893B415177o008725q907178n918694L988045J1421424R942576L567233j498779
40885I001079m457136o786380q588512j0186553j1301950q092877J878977J1618645
40877b6914707J0501334m28629q220532n511208J403567N316644Q099516J1996357
40869c757658J1472413K773388o481627p426645l669582m287297p675579m257641
40861b3310228O382843J2965273Q693133O9138l689737k070303L3480P54245J404339
40852A232183K066307J595652J88539j071981j948769k483066k154860j051672
40844c627667m18282q66053j451648j462886j587524k338977k770591j807626
40836a6331254K44319K295914L567046L597549K332482O61530l22126r47532k382103
$$ y = [2415177, -3593548, -12500726, -18419420, -14431375, -3009951, 6932625, 10499858, 9001079, 4543943, -2242437, -10830949, -21017502, -32319452, -40412329, -38533352, -26914707, -16413373, -16842002, -25062534, -30573742, -29170175, -23853531, -15754015, -3757658, 7714755, 10488143, 4006516, -3420129, -7089711, -11377008, -19052587, -23310228, -16927385, -3962112, 4731021, 4800159, 1110422, -959881, -926401, -172156, 1232183, 3298490, 4894142, 5082681, 4010700, 2061931, -421135, -2575995, -3627667, -4045949, -4912002, -6363650, -7826536, -9414060, -11753037, -14523628, -16331254, -16086935, -13791021, -10223975, -6626426, -4293944, -3632414, -3954540, -4902072, -7284175]
40827g284175l926983k754994K293233P981834R525384N733698j2698l575794
40819G979505l512515r87217J927080L181791J586411j742550l571116k008618
40811B852771M72516l39486m272809n838950j244739N747502P875980L296467
40803H549252k771814n146109l954535j989663l06975J286868J836898K74661
40795b221417k162482k985202j602557L18414J294388J284919Q17054L69384N75401
40786d312098J704849K788716K364046M39099j078160m64738J572331K306495
40778E320540R4787l088852l263415P33708N144047N492141K046167j023751j453427
40769A0001945j003162j339093j000286J632164M678958M651889R59493l558640
$$ y = [-7284175, -11211158, -13966152, -11672919, -3691085, 5834299, 11567997, 11555299, 7979505, 4466990, 3479773, 5406853, 8588644, 10175055, 8432505, 4861389, 2852771, 3325287, 2985801, -1287008, -7125958, -8370697, -2623195, 5252785, 8549252, 5777438, 631329, -3323206, -5312869, -5619844, -4332976, -2496078, -2221417, -4383899, -7369101, -8971658, -8653244, -7358856, -6073937, -5256883, -4887499, -4312098, -2607249, 181467, 2545513, 2984612, 1906452, 1441714, 3014045, 5320540, 5415327, 2326475, -936940, -203232, 4940815, 10432956, 12479123, 11455372, 10001945, 8998783, 7659690, 6659404, 8291568, 12970526, 17622415, 18581908, 15023268]
40761A5023268o013003n755535l857969j875180r21838q43559m71525O17915J118301
40752b979125m65039l670717o027615m987655k32425N097726O206152J647179
40744e411519l743079l595026J879561N534808K311264m360298p189599l531753
40736a8105641L075614P657497P442424K602713l690416o944448n479542k180037
40728a5621836o56753j218970k124403k432505j528309J360741M379176L004721
40720a4838138l249210p216825k503877O668269J0220078N705015L37978m91733
40712e368443M83298o17707k393805k140547p84760O9699J551533M028101M292627
40703h80004O16131k898189j778052J735940J957065j910838n462548n580445
$$ y = [15023268, 9010265, 3254730, -603239, -2478419, -3400257, -4243816, -4715341, -4097426, -2979125, -3444164, -7114881, -13142496, -18130151, -18362576, -13264850, -7058698, -5411519, -9154598, -12749624, -10870063, -5335255, -3023991, -7384289, -14573888, -18105641, -15030027, -7372530, 69894, 2672607, -1017809, -7962257, -13441799, -15621836, -16278589, -17497559, -19621962, -22054467, -23582776, -22222035, -17842859, -14838138, -18087348, -25304173, -27808050, -21139781, -10919703, -5214688, -4876710, -5368443, -4885145, -5502852, -7896657, -10037204, -10821964, -10752265, -9200732, -5172631, -880004, -263873, -3162062, -4940114, -3204174, -1247109, -3157947, -8620495, -14200940]
40695a4200940k702300J850675N981230N727036k89623o046022l998583L892441
40687i786086P636757L226732j867198n89854L192931J918751l207381m677106
40679d152454j079790J035444k126996o170222n771720j724492K028065L852371
40671a4109794L851352J708469j304946j182533M047388J0382642J2232187R108452
40663B4733217M632661P84207k778485n130636m677284l046749l640092n878005
40655D998834n547619j806180R90747J78025j330442o42173M00094j01610Q82139
40646a978185O152523J0988869P496289m049839j3828255j3675271n545645K606159
40638a1833355N784271M739440K508420R35701Q060r58309j801260j389399N65117
$$ y = [-14200940, -16903240, -15052565, -9071335, -3344299, -3633922, -9679944, -13678527, -9786086, -2149329, 1077403, -789795, -1379649, 1813282, 3732033, 524652, -4152454, -5232244, -4196800, -6323796, -12494018, -18265738, -19990230, -17962165, -14109794, -10258442, -8549973, -9854919, -11037452, -6990064, 3392578, 15624765, 24733217, 29365878, 30150085, 27371600, 22240964, 17563680, 14516931, 10876839, 4998834, -548785, -2354965, -1364218, -1186193, -2516635, -3158808, -2758714, -2860324, -1978185, 4174338, 15163207, 22659496, 18609657, 4781402, -8893869, -14439514, -11833355, -6049084, -1309644, 1198776, 2134477, 2142537, 1184228, -617032, -2006431, -1441314]
40629a441314K377477K247285N21972j227064k405256k910824j611705K091801
40621b357628N675879N238531J53396n948752q748145o217810O76132P553404
40613c974993Q361835J627966n646762n090022J877646N404897R30983m633900
40605a142350l532407K133876N538112N915238P070305Q170188M489801k790315
40597B5852448n777925j328651L563742J872194l507978n224639k802985j896849
40589A0749357m076220m553814r47180K182743O35932k499351j676367K430505
40581B245605M132116J339222k014220k393701j041593o21734j226133j706811
40573a287249k064540k375042j724223k32441J58000j097137j675541l89765L08927
$$ y = [-1441314, 936163, 3183448, 3705420, 2478356, 73100, -2837724, -4449429, -2357628, 3318251, 8556782, 8710178, 2761426, -5986719, -12204529, -11528397, -3974993, 4386842, 6014808, 368046, -4721976, -2844330, 2560567, 3491550, -1142350, -4674757, -2540881, 2997231, 8912469, 15982774, 24152962, 28642763, 25852448, 20074523, 18745872, 22309614, 24181808, 20673830, 15449191, 12646206, 10749357, 6673137, 2119323, 1172143, 3354886, 3990818, 1491467, -184900, 2245605, 6377721, 7716943, 5702723, 3309022, 2267429, 1645695, 419562, -1287249, -3351789, -5726831, -7451054, -7683495, -7525495, -8622632, -10298173, -10687938, -10379011]
40564a0379011j111150j390102K379754O295927M066138l185379p614794n461423
40556a6400040j232758K50945K70280K133765N594858Q472424R846148Q631089
40548A7566711K965001n442822j0066305o892359j71998L204676K301125P10630
40540D174659n68542l095549n413418l803257J183619M487955L850334K458973
40532C274774K888465L131189J003715j507617j374841P36759J781726N67186
40524A0501356j646959l217383k893544j94201L145105L821111R75833k198919
40516H292399k862148k401998l186021l584762l30853N033614O726183K587507
40508A0273921k690590m089984k635746k487081m163727m250955r69664L277662
$$ y = [-10379011, -11490161, -12880263, -10500509, -4204582, -138444, -3323823, -10938617, -16400040, -17632798, -17381853, -17111573, -14977808, -9382950, -910526, 8935622, 17566711, 20531712, 15088890, 5022585, -1869774, -2041772, 1162904, 3464029, 4174659, 3606117, 510568, -4902850, -8706107, -7522488, -3034533, 815801, 3274774, 6163239, 9294428, 10298143, 8790526, 7415685, 8152444, 9934170, 10501356, 8854397, 5637014, 2743470, 2549269, 5694374, 9515485, 10491318, 8292399, 5430251, 3028253, -157768, -3742530, -4073383, 960231, 7686414, 10273921, 7583331, 3493347, 857601, -1629480, -5793207, -10044162, -11013826, -7736164]
40500g736164N270025M492645K597695J042838J51344l57905m67912O35751L480762
40491I109079O142549M856247j115303o703476o520720k495290j596954n252300
40483c576168o343413J35562Q169280P924840o22037p463072n750139O13404M083545
40474b828198L069910J240913P73896M96764m70547r68117j95572O04318J19917
40465A843284o79877J45947J985289J401681l148412p726711o926846j379912
40457a4485557K325708N40780k416069r38707L587754N399541K873706m59606
40449c572450k145472k961722l178219j567267J431789L777703N245031O666214
40441C695607O194054J481499m415399n308973j023863J887247J81898j800895
$$ y = [-7736164, -2466139, 2026506, 4624201, 5667039, 5818383, 5460478, 4992566, 5628317, 9109079, 15251628, 20107875, 18992572, 12289096, 5768376, 3273086, 1676132, -3576168, -9919581, -9784019, -1614739, 6310101, 5688064, -1775008, -7525147, -6911743, -2828198, 241712, 1482625, 2256521, 2753285, 2282738, 1314621, 1119049, 1723367, 1843284, 1163407, 1309354, 3294643, 4696324, 1547912, -6178799, -13105645, -14485557, -12159849, -11619069, -14035138, -14973845, -11386091, -5986550, -3112844, -3572450, -5717922, -8679644, -11857863, -13425130, -11993341, -8215638, -2970607, 3695607, 9889661, 11371160, 6955761, 1646788, 622925, 2510172, 2692070, 891175]
40433H91175l79615J678388J261834L78270Q84472k38339m777392p753015m296861
40424a2351083K175914N014307L840762K589720J569290j401127m542316m097027
40416g201560j151529J93821j13850O04031J284610p49634k772330J39249N588744
40407d178448O146930J454465r29346J678250K725069j640647m968330n41662
40399b53719P454432R321313K598588o083588r518585o076222P58763N673184
40391C874166N668986K757186R17434K28381k367109o161156o041736q57571L232460
40382A251041J477630k236260j424932L582736P190354O647733L778941O77653
40374B0944896j719296k259370j067251j246488m972629q798557p192489o79512
$$ y = [891175, 511560, 2189948, 3451782, 3830052, 4714524, 4476185, -301207, -8054222, -12351083, -10175169, -5160862, -1320100, 1269620, 2838910, 1437783, -3104533, -7201560, -8353089, -8159268, -8273118, -7669087, -6384477, -7134111, -9906441, -9767192, -4178448, 1968482, 3422947, 2493601, 4171851, 6896920, 5256273, 287943, -253719, 7200713, 16522026, 19120614, 13037026, 3518441, -2557781, -1799018, 3874166, 9543152, 12300338, 13217772, 13446153, 11079044, 4917888, -1123848, -1981419, 1251041, 2728671, 492411, -932521, 2650215, 9840569, 16488302, 20267243, 20944896, 19225600, 16966230, 15898979, 14652491, 9679862, 881305, -6311184, -6990696]
40366f990696L793559J761023k919652l338237J324700M854670K473226k317195
40358a358602k121424L684795O852959J171709q201522j0865539m505137L245941
40350a2096820N335075K055705k520667m884700k283119N211655J1499033R554417
40342A1870579J557859k437195J838844P304002O441897O15184n227291r620866
40334A2343013j1458900p348848J537458O698581L394887j693757j196916J146984
40326C422502j773200p044257o660326j414439J339910Q10019K271387N460521
40318c587883N165431K472553L452619O577946L895502l930494o638308j368170
40310F039196K389683m04438j676673M368858R418783M619019l854342m433473
$$ y = [-6990696, -3197137, -1436114, -4355766, -7694003, -6369303, -1514633, 958593, -1358602, -3480026, 204769, 7057728, 8229437, 27915, -10837624, -15342761, -12096820, -6761745, -4706040, -7226707, -12111407, -14394526, -9182871, 2316162, 11870579, 13428438, 10991243, 12830087, 20134089, 26575986, 27191170, 21963879, 12343013, 884113, -6464735, -4927277, 1771304, 5166191, 3472434, 2275518, 3422502, 1649302, -5394955, -12055281, -13469720, -12129810, -11319791, -9048404, -3587883, 1577548, 4050101, 7502720, 14080666, 17976168, 14045674, 7407366, 6039196, 8428879, 8024441, 6347768, 10716626, 20135409, 24754428, 20900086, 16466613]
40302A6466613J503676K930482l282820r465397r912828o601578k817297L35548
40294a0843601J269057p06065j615785K528589P912951P128758Q14850k938912
40286C549842j238714L53345p94576R39238Q483264J3809180Q080107m755384
40278B8426302j2303169r435824k609394P54594M01506k68800R7871J283125L440274
40269I786485N562151N090665J863060n22413m41709j969199q049665j2846807
40261a527432q098042L450797R355373M560050j299021J091248O321227L500618
40253A7354818n674329r218213l367899K729117K271819n5311J634299M263947
40245I938248K180251k993550n532172m038100r50370K301811M294255J896568
$$ y = [16466613, 17970289, 20900771, 17617951, 8152554, -1760274, -8361852, -11179149, -10843601, -9574544, -10280609, -11896394, -9367805, -1454854, 5673904, 6488754, 3549842, 2311128, 2664473, 1869897, 2809135, 11292399, 25101579, 33181686, 28426302, 16123133, 6687309, 4077915, 4832509, 5234015, 4965215, 5063086, 6346211, 9786485, 15348636, 20439301, 22302361, 21779948, 21338239, 19369040, 11319375, -1527432, -9625474, -6174677, 3180696, 7740746, 6441725, 7532973, 13854200, 17354818, 11680489, 2462276, -905623, 1823494, 4095313, 4040002, 5674301, 9938248, 12118499, 9124949, 3592777, -445323, -1395693, 906118, 5200373, 7096941]
40237G096941m578363q158128l428426M821348P338298K524045l104493m369798
40229a858576j362814L816863P785700N487209l672623j0865308o974083L955265
40221c688367Q803890L231983l470578l052284J404748L510455L350989L760302
40213A3851138L615484J070444j528518j796830k159547m966257o738492l338851
40205a991429K294176L888703J206047m32635J221377K860797J430776k285944
40197H191868n768402o793429m150078L62505K187887k61696k458174m86056K164594
40188g010981K56124l672578k925350J942688L969974J786330J336398M146590
40180a70805L868327j738414n146483j367197K906319L67942m191274j961016
$$ y = [7096941, 2518578, -5639550, -9067976, -4246628, 3091670, 5615715, 2511222, -1858576, -3221390, 595473, 8381173, 13868382, 10195759, -669549, -7643632, -3688367, 5115523, 8347506, 4876928, 1824644, 3229392, 6739847, 10090836, 13851138, 17466622, 18537066, 17008548, 15211718, 13052171, 8085914, 1347422, -1991429, 302747, 4191450, 5397497, 4964862, 6186239, 9047036, 10477812, 8191868, 2423466, -4369963, -8520041, -8157536, -5969649, -6231345, -8689519, -9175575, -7010981, -6754857, -10427435, -13352785, -11410097, -7440123, -5653793, -4317395, -170805, 3697522, 1959108, -3187375, -4554572, -1648253, -1280311, -5471585, -7432601]
40172g432601M653043N964763J188144q81329K940619N462418J685860l558464
40164A0022453m245398j514332P11068J759193J779615n59352l706218k470242
40156A776787L752368P737613M614770l72879m70260J646803o58184n709382n922775
40147F394861p08017K299912o60361m468943m013172q39780J723132L813569O020741
40138I561942O176647K871471j388222l502164l270073j544555J535663M278437
40130A4719146L281814j596831n562568n148923k814019k049345j426976K110323
40122A512621O650148P136215K894592j229517j462199P68968J959623R92276
40114A9222727o27885j393725j608190k741387m900375n489886k113545L239957
$$ y = [-7432601, -2779558, 3185205, 4373349, 3492020, 6432639, 11895057, 13580917, 10022453, 5777055, 4262723, 4973791, 6732984, 8512599, 7953247, 4247029, 1776787, 5529155, 13266768, 17881538, 17508659, 17038399, 18685202, 18027018, 12317636, 6394861, 5686844, 7986756, 7326395, 2857452, -1155720, -1995500, -272368, 3541201, 9561942, 15738589, 18610060, 17221838, 13719674, 10449601, 8905046, 10440709, 14719146, 18000960, 16404129, 10841561, 5692638, 2878619, 829274, -597702, 1512621, 8162769, 15298984, 18193576, 16964059, 15501860, 16270828, 18230451, 19222727, 18594842, 17201117, 15592927, 12851540, 7951165, 2461279, 347734, 3587691]
40106C587691N630502L537515N56768o90472k332448o054229q217044m916940
40098h898657Q60229K695449p8152k368484k017254k280356m448557m098301J868668
40089a8765415Q728953Q954042J892945n383816o564771k550640J107013J185334
40081a1396355m26309o04358L30288j89120j836751j010447K943861M878570R16735
40072f393886m344261k968687M906714J0538622Q224250J946121j745783k284674
40064G878416k801674l352044j432473K601240N306219M994432L212877J414875
40056A7821868o42317k732089l222064j408522J071511K164202J502312J6494
40048A4571395j316615j796976j305860r65340k349354n168890o745125m937659
$$ y = [3587691, 9218193, 12755708, 13312476, 12622004, 10289556, 4235327, -3981717, -8898657, -8038428, -5342979, -5421131, -7789615, -9806869, -12087225, -16535782, -20634083, -18765415, -10036462, -1082420, 810525, -4573291, -11138062, -13688702, -12581689, -11396355, -11822664, -12427022, -12096734, -12285854, -14122605, -15133052, -12189191, -7310621, -6393886, -10738147, -13706834, -8800120, 1738502, 9962752, 11908873, 10163090, 7878416, 5076742, 1724698, 292225, 2893465, 8199684, 13194116, 16406993, 17821868, 17179551, 14447462, 11225398, 9816876, 10888387, 13052589, 14554901, 14571395, 13254780, 11457804, 10151944, 9186604, 6837250, 1668360, -5076765, -10014424]
40040a0014424r48082K045057K678597K448287L006715L990907M072390K737310
40032A0016757J74721l129992n408396l889756J602986O425779N554549J48732
40024A1495380l529404k308314K79085J03533j427486m12376K825100L931528
40016A0957046Q04129l483818m501223j585926J135845j251017q207779j1915247
40008a8047990n264409P371199J2504258M165704p058044p610782P76127M913069
40000h250868M173m768000j858122L831671M573449J638517N23607P94898j006978
39991d517653k495252J418580Q082893Q865615K358229k348086J154780O788504
39983A9307610M637924m720152j0827538p339642K36573K481289k180446p020049
$$ y = [-10014424, -10962506, -8917449, -6238852, -3790565, -783850, 3207057, 7279447, 10016757, 10191478, 7061486, 1653090, -2236666, -633680, 5792099, 11346648, 11495380, 7965976, 5657662, 5936747, 6040280, 4612794, 4200418, 7025518, 10957046, 11761175, 8277357, 3776134, 2190208, 3326053, 2075036, -6132743, -18047990, -23312399, -15941200, -3436942, 728762, -6329282, -13940064, -13163937, -8250868, -8246695, -13014695, -14872817, -11041146, -6467697, -4829180, -4305573, -3510675, -4517653, -7012905, -5594325, 2488568, 11354183, 13712412, 11364326, 12519106, 19307610, 23945534, 19225382, 8397844, 1058202, 1294775, 3776064, 1595618, -5424431]
39975e424431o645198l006283q09595m46645J213765M542359N881696L236719
39967a457613m25469j553263q75265j162921k167288j246743J666403L232272
39959c989887J533477r40188o45940K226712M035136K313498j234141k779490
39951E19177q07516K195781K617061k96836l855331m948563k910251M57731K906300
39942d122447L735818M226367N717693O871758M145846l423081j0980260j2005849
$$ y = [-5424431, -12069629, -15075912, -15885507, -16332152, -15118387, -10576028, -4694332, -1457613, -1883082, -3436345, -4311610, -5474531, -7641819, -8888562, -7222159, -3989887, -2456410, -3396598, -4042538, -1815826, 2219310, 4532808, 3298667, 519177, -288339, 1907442, 4524503, 4227667, 372336, -4576227, -7486478, -7028747, -4122447, -386629, 3839738, 9557431, 16429189, 20575035, 17151954, 6171694, -5834155]
$$ [...]
##END NTUPLES=NMR SPECTRUM
##END=
