##TITLE=31Pdec_DE-139
, 24 sc
 2.4.2026
##JCAMPDX= 6.0         $$ Bruker NMR JCAMP-DX V2.0
##DATA TYPE= NMR SPECTRUM
##DATA CLASS= NTUPLES
##ORIGIN= UXNMR, Bruker Analytische Messtechnik GmbH
##OWNER= root
$$ XWIN-NMR		Version 3.5
$$ Thu Apr  2 13:25:23 2026 Russian Standard Time (UT+4h)  she@DPX200
##.OBSERVE FREQUENCY= 81.013821
##.OBSERVE NUCLEUS= ^31P
##.ACQUISITION MODE= SIMULTANEOUS
##.ACQUISITION SCHEME= undefined
##.AVERAGES= 24
##.DIGITISER RES= 17
##SPECTROMETER/DATA SYSTEM= spect
##.PULSE SEQUENCE= zgpg30
##.SOLVENT NAME= DMSO
##.SHIFT REFERENCE= (INTERNAL, DMSO, 0, 197.392)
##AUDIT TRAIL= $$ (NUMBER, WHEN, WHO, WHERE, WHAT)
$$ ##TITLE= Audit trail, XWIN-NMR		Version 3.5
$$ ##JCAMPDX= 5.01
$$ ##ORIGIN= Bruker BioSpin GmbH
$$ ##OWNER= she
$$ F:/spectra/data/she/nmr/P31/2/pdata/1/auditp.txt
$$ ##AUDIT TRAIL=  $$ (NUMBER, WHEN, WHO, WHERE, WHAT)
(   1,<2026-04-02 13:24:15.21 +0400>,<she>,<DPX200>,
      <created by zg, POWCHK disabled, PULCHK disabled
       configuration hash MD5:
       00 E9 B6 7A A2 85 ED C7 34 08 36 98 17 FE 4E 26
       data hash MD5: 32K
       74 52 72 43 A8 9D 97 B0 69 31 74 35 F0 B8 6B 3E>)
(   2,<2026-04-02 13:24:17.65 +0400>,<she>,<DPX200>,
      <Start of raw data processing
       efp BC_mod = 2 LB = 1.5 FT_mod = 6 PKNL = 1 PHC0 = 1388.583 PHC1 = 54.70077 SI = 64K 
       data hash MD5: 64K
       FA D9 04 7E 6D F0 E6 B5 BC 98 11 8E 30 CD 57 BA>)
(   3,<2026-04-02 13:24:38.81 +0400>,<she>,<DPX200>,
      <pk PHC0 = 19.44166 PHC1 = 0 
       data hash MD5: 64K
       2F 2B 8F 1B A4 5E B4 D7 61 B6 F2 04 20 58 E6 22>)
(   4,<2026-04-02 13:24:46.48 +0400>,<she>,<DPX200>,
      <abs ABSG = 5 
       data hash MD5: 64K
       27 A9 96 FF DF 62 AE E3 58 86 DE C2 A1 30 03 DF>)
$$ ##END=
$$ 
$$ hash MD5
$$ 19 01 0B 1E 6B 33 65 A3 DB 55 A9 00 41 A4 12 EF
##$RELAX= 
##$RELAX= 
##$RELAX= 
##$RELAX= 
##$RELAX= 
##$RELAX= 
##$RELAX= 
##$RELAX= 
$$ Bruker specific parameters
$$ --------------------------
##$DU= <F:/spectra>
##$EXPNO= 2
##$NAME= <P31>
##$PROCNO= 1
##$TYPE= <nmr>
##$USER= <she>
##$AMP= (0..31)
100 100 100 100 100 100 100 100 100 100 100 100 100 100 100 100 100 100 
100 100 100 100 100 100 100 100 100 100 100 100 100 100 
##$AQSEQ= 0
##$AQ_mod= 1
##$AUNM= <au_zg>
##$AUTOPOS= <>
##$BF1= 81.014009
##$BF2= 200.13
##$BF3= 200.13
##$BF4= 200.13
##$BF5= 200.13
##$BF6= 200.13
##$BF7= 200.13
##$BF8= 200.13
##$BYTORDA= 1
##$CFDGTYP= 0
##$CFRGTYP= 5
##$CHEMSTR= <none>
##$CNST= (0..31)
1 1 145 1 1 1 1 1 1 1 1 1 1 1 1 1 1 1 1 1 1 1 1 1 1 1 1 1 1 1 1 1 
##$CPDPRG= <waltz16>
##$CPDPRG1= <>
##$CPDPRG2= <waltz16>
##$CPDPRG3= <>
##$CPDPRG4= <mlev>
##$CPDPRG5= <mlev>
##$CPDPRG6= <mlev>
##$CPDPRG7= <mlev>
##$CPDPRG8= <mlev>
##$CPDPRGB= <>
##$CPDPRGT= <>
##$D= (0..31)
0 1 0 0 0 0 0 0 0 0.06 0 0.03 2e-05 3e-06 0 0 0.0002 0 0 0 0 0 0 0 0 0 
0 0 0 0 0 0 
##$DATE= 1775121854
##$DBL= (0..7)
120 120 120 11 120 120 24 19 
##$DBP= (0..7)
150 150 150 150 150 150 150 150 
##$DBP07= 0
##$DBPNAM0= <>
##$DBPNAM1= <>
##$DBPNAM2= <>
$$ [...]
##$SUBNAM3= <"">
##$SUBNAM4= <"">
##$SUBNAM5= <"">
##$SUBNAM6= <"">
##$SUBNAM7= <"">
##$SUBNAM8= <"">
##$SUBNAM9= <"">
##$SW= 400.765351723535
##$SWIBOX= (0..15)
0 1 3 0 0 0 0 0 0 0 0 0 0 0 0 0 
##$SW_h= 32467.5324675325
##$TD= 32768
##$TD0= 1
##$TE= 0
##$TE2= 300
##$TE3= 300
##$TEG= 300
##$TL= (0..7)
0 120 53 12 22 120 120 120 
##$TP= (0..7)
150 150 150 150 150 150 150 150 
##$TP07= 0
##$TPNAME0= <>
##$TPNAME1= <>
##$TPNAME2= <>
##$TPNAME3= <>
##$TPNAME4= <>
##$TPNAME5= <>
##$TPNAME6= <>
##$TPNAME7= <>
##$TPOAL= (0..7)
0.5 0.5 0.5 0.5 0.5 0.5 0.5 0.5 
##$TPOFFS= (0..7)
0 0 0 0 0 0 0 0 
##$TUNHIN= 0
##$TUNHOUT= 0
##$TUNXOUT= 0
##$USERA1= <user>
##$USERA2= <user>
##$USERA3= <user>
##$USERA4= <user>
##$USERA5= <user>
##$V9= 5
##$VALIST= <valist>
##$VCLIST= <CCCCCCCCCCCCCCC>
##$VD= 0
##$VDLIST= <DDDDDDDDDDDDDDD>
##$VPLIST= <PPPPPPPPPPPPPPP>
##$VTLIST= <TTTTTTTTTTTTTTT>
##$WBST= 1024
##$WBSW= 4
##$XGAIN= (0..3)
0 0 0 0 
##$XL= 0
##$YL= 0
##$YMAX_a= 20030
##$YMIN_a= -20696
##$ZGOPTNS= <>
##$ZL1= 120
##$ZL2= 120
##$ZL3= 120
##$ZL4= 120
##$ABSF1= 197.3918
##$ABSF2= -203.3724
##$ABSG= 5
##$ABSL= 3
##$ALPHA= 0
##$AQORDER= 0
##$ASSFAC= 0
##$ASSFACI= 0
##$ASSFACX= 0
##$ASSWID= 0
##$AUNMP= <proc_1d>
##$AZFE= 0.1
##$AZFW= 0.5
##$BCFW= 0
##$BC_mod= 2
##$BYTORDP= 0
##$COROFFS= 0
##$CY= -3
##$DATMOD= 1
##$DC= 0
##$DFILT= <>
##$DTYPP= 0
##$F1P= 0
##$F2P= 0
##$FCOR= 1
##$FTSIZE= 65536
##$FT_mod= 6
##$GAMMA= 0
##$GB= 0
##$INTBC= 1
##$INTSCL= 9.790993e-09
##$ISEN= 30
##$LB= 1.5
##$LEV0= 0
##$LPBIN= 0
##$MAXI= 10000
##$MC2= 0
##$MEAN= 0
##$ME_mod= 0
##$MI= 50
##$NCOEF= 0
##$NC_proc= -5
##$NLEV= 6
##$NOISF1= 182.463
##$NOISF2= 159.3651
##$NSP= 0
##$NTH_PI= 0
##$NZP= 0
##$OFFSET= 197.3918
##$PC= 4
##$PHC0= 1408.025
##$PHC1= 54.70077
##$PH_mod= 1
##$PKNL= yes
##$PPARMOD= 0
##$PSCAL= 0
##$PSIGN= 0
##$REVERSE= no
##$SF= 81.014063255964
##$SI= 65536
##$SIGF1= 159.3651
##$SIGF2= -187.1042
##$SINO= 113.3802
##$SIOLD= 16384
##$SREGLST= <1H.CDCl3>
##$SSB= 0
##$STSI= 65536
##$STSR= 0
##$SW_p= 32467.5324675325
##$SYMM= 0
##$S_DEV= 0
##$TDeff= 32768
##$TDoff= 0
##$TI= <>
##$TILT= no
##$TM1= 0
##$TM2= 0
##$TOPLEV= 0
##$USERP1= <user>
##$USERP2= <user>
##$USERP3= <user>
##$USERP4= <user>
##$USERP5= <user>
##$WDW= 1
##$XDIM= 65536
##$YMAX_p= 321776261
##$YMIN_p= -10015538
$$ End of Bruker specific parameters
$$ ---------------------------------
##NTUPLES= NMR SPECTRUM
##VAR_NAME=  FREQUENCY,     SPECTRUM/REAL,   SPECTRUM/IMAG
##SYMBOL=    X,             R,               I
##VAR_TYPE=  INDEPENDENT,   DEPENDENT,       DEPENDENT
##VAR_FORM=  AFFN,          ASDF,            ASDF
##VAR_DIM=   65536,         65536,           65536
##UNITS=     HZ,            ARBITRARY UNITS, ARBITRARY UNITS
##FACTOR=    0.49542278885378, 1,            1
##FIRST=     15991.5117654749, 0,            0
##LAST=      -16476.0207020576, 0,           0
##MIN=       -16476.0207020576, -10015538,   0
##MAX=       15991.5117654749, 321776261,    0
$$ Real data points
##PAGE= N=1
##DATA TABLE= (X++(R..R)), XYDATA
$$ [...]
44960B4910N7944j29484k15614n7615J86457K48000J09797k4404o1699q6388j13715
$$ 24910 82854 -46630 -262244 -319859 -133402 114598 224395 199991 138292 51904 -61811
44949f1811l4782J40924K19617R8148q1058j55224j54151j70011j70491r0765
$$ -61811 -96593 44331 263948 362096 281038 125814 -28337 -198348 -368839 -459604
44939d59604O557K1847j0948Q100O4942O0496j6473p2370m5318M2972J45346K06905
$$ -459604 -453047 -431200 -442148 -434048 -369106 -308610 -325083 -397453 -442771 -399799 -254453 -47548
44927d7548J63711K3605r1250q6646l5742n8555j14066o8516N4381P7285m8220
$$ -47548 116163 139768 48518 -38128 -73870 -132425 -246491 -315007 -260626 -183341 -231561
44916b31561j43240o2676R9151J72365J56383J63280J98842J57700J6502j09477
$$ -231561 -374801 -437477 -338326 -165961 -9578 153702 352544 510244 526746 417269
44906D17269j30066r6823j09008j75048k24637k13127j50372m6318J00278K42639
$$ 417269 287203 190380 81372 -93676 -318313 -531440 -681812 -728130 -627852 -385213
44896c85213K79029J60670j9350j06461n4947L4955N7488J9598n677J3873N2675
$$ -385213 -106184 54486 35136 -71325 -126272 -91317 -33829 -14231 -19908 -6035 46640
44885D6640P6074O1988N048o3805r2045o7180k3048L4668J38104K50908K41735
$$ 46640 122714 184702 189750 125945 33900 -33280 -56328 -21660 116444 367352 609087
44874F09087M9638j90900k89826k21242j10958n3129m1689l9997j0463Q1358J80948
$$ 609087 658725 467825 177999 -43243 -154201 -207330 -249019 -289016 -299479 -218121 -37173
44863c7173J25881j40396l94108l58198p6229J48701J82779J85469K64125K80558
$$ -37173 88708 -51688 -445796 -803994 -880223 -731522 -548743 -363274 -99149 181409
44853A81409J35144j959N0008J64696Q0897k03737m20866l66489q5205K30749
$$ 181409 316553 314594 364602 529298 610195 406458 -14408 -380897 -466102 -235353
44843b35353L80607K52245o3126k92204k53839o9424K3417j0818l3918m318j0841
$$ -235353 145254 397499 334373 42169 -211670 -281094 -257677 -268495 -302413 -306731 -317572
44832c17572o1923n1899M1177J03963O8285p459n9869q1050m9772M6250J17957
$$ -317572 -379495 -431394 -390217 -286254 -217969 -225428 -285297 -366347 -416119 -369869 -251912
44821b51912P1013r684L2545J32140N9037j80717k78307q2525J38473R6211p9279
$$ -251912 -180899 -190583 -158038 -25898 33139 -147578 -425885 -508410 -369937 -273726 -353005
44810c53005o0535J66131L01087J85906j2841q8902m4434K363m380l8669m8557
$$ -353005 -413540 -247409 53678 239584 226743 137841 93407 95770 91390 52721 4164
44799D164J0034J21701J84525J08675o0531j87202j93798r7257N7386J99162K09409
$$ 4164 14198 135899 320424 429099 368568 181366 -12432 -109689 -52303 146859 356268
44788C56268K7896k25813l53052k98486j69279n2230N4654J29387J02208o644
$$ 356268 384164 158351 -194701 -493187 -662466 -714696 -660042 -530655 -428447 -435091
44778d35091n9755J3092J07106R7136J4257j9972K4316O2195L0860k9188m3274
$$ -435091 -494846 -481754 -374648 -277512 -263255 -283227 -258911 -196716 -165856 -195044 -238318
44767b38318r010N58n3712r3538n159J87519L10250K45519P2847o4819j40195
$$ -238318 -247328 -246770 -300482 -394020 -399179 -211660 98590 344109 416956 352137 211942
44756B11942j83279j48589n613J10529M1534j28693j63422k4429R7975J28708
$$ 211942 28663 -119926 -125539 -15010 26524 -102169 -265591 -290020 -192045 -63337
44746f3337K09209L64771L57617N9785k64084k92687r7453R395m5352o1452M1494
$$ -63337 145872 510643 868260 928045 663961 371274 273821 283216 237864 176412 217906
44735B17906R6815o303j43409j64353r7391n2920o1650q8076r7584n4180M7275
$$ 217906 314721 308418 165009 656 -96735 -149655 -211305 -299381 -396965 -451145 -403870
44724d03870J11199K3932j51333j98815l9778J37400J39875M1053M5358J65109
$$ -403870 -292671 -268739 -420072 -618887 -658665 -521265 -381390 -340337 -294979 -129870
44714a29870K08421P8124q4059j06665j8623K3426l3127q9331o2592N616M0126
$$ -129870 78551 156675 72616 -34049 -52672 -29246 -62373 -151704 -214296 -208680 -168554
44703a68554M1019M1913L0492n882j0487O0741J25074O9038n8195r6068k3722
$$ -168554 -127535 -85622 -55130 -61012 -71499 -10758 114316 183354 125159 29091 5369
44692E369J1761m4279o0343K9574Q4944J0390m6394N5613J69389P1663j61365
$$ 5369 17130 -27149 -87492 -57918 27026 37416 -8978 46635 216024 287687 126322
44681A26322k53664j33542K3900J09273J61983J66402N3046q4063n7901Q3743
$$ 126322 -127342 -260884 -236984 -127711 34272 200674 253720 169657 111756 195499
44671A95499Q4244j09955k53150j96978q4252l7759L2181J59217J78257N1331
$$ 195499 279743 169788 -83362 -280340 -364592 -402351 -370170 -210953 -32696 18635
44661A8635K4786K10432L09488O7491k62382k84369p7505k9063j92365k61950
$$ 18635 43421 253853 563341 630832 368450 84081 6576 -22487 -214852 -476802
44651d76802j35118m3502q9712p9294P6021J64545M5556j00625p9252K1363L3675
$$ -476802 -611920 -655422 -745134 -824428 -748407 -583862 -538306 -638931 -718183 -696820 -663145
44640f63145r36N0045J63049K15815J78790J01240Q970o2110l7195P6601J41652
$$ -663145 -664081 -614036 -450987 -235172 -56382 44858 53828 -8282 -45477 31124 172776
44629A72776O9293m7737p7687k8014O598k1478j04887k03548k15345n5249J72492
$$ 172776 242069 194332 116645 88631 95229 73751 -31136 -234684 -450029 -505278 -332786
44618c32786K38806J08430J2716R0767J62461L4466j59501j63835q113O2853o572
$$ -332786 -93980 14450 27166 117933 280394 314860 155359 -8476 -16589 46264 39692
44607C9692k4145J08611K40648K02272Q400k09994l28790k66177m6617J46345
$$ 39692 15547 124158 364806 567078 575478 365484 36694 -229483 -276100 -129755
44597a29755J24372o8848j98968j31213M8195J97972K54660J89266P412j58395
$$ -129755 -5383 -74231 -273199 -404412 -356217 -158245 96415 285681 293093 134698
44587A34698j23801J02621K87468K59097R4313n2400j55183k43157k58072j37590
$$ 134698 10897 113518 400986 660083 754396 701996 546813 303656 45584 -92006
44577i2006L8317J24793R1810J7169m9499j03432j10502m1437L6496J8666q1099
$$ -92006 -53689 71104 162914 180083 130584 27152 -83350 -124787 -88291 -69625 -150724
44566a50724j34051p3441J7432K4489n2758j11970o8199O0901J73928J84132J07104
$$ -150724 -284775 -358216 -340784 -316295 -369053 -481023 -549222 -488321 -314393 -130261 -23157
44555b3157L5247J7014L384n5443j14169r8911l4071j5647n8554n5432P6780K62531
$$ -23157 12090 29104 32488 -22955 -137124 -236035 -270106 -285753 -344307 -399739 -322959 -60428
44543f0428L27475J80728q5647k78051k78152j38912j630O4579R9543J35504J25233
$$ -60428 267047 447775 362128 84077 -194075 -332987 -334617 -270038 -170495 -34991 90242
44532I0242L2668p7144j18242j04130r6403p4026K8750J65155J87446M8411j16973
$$ 90242 122910 45766 -72476 -176606 -273009 -347035 -318285 -153130 34316 82727 -34246
44521c4246j58842p2214N3570J51529J86909J39991M7114j6373m8727j21438k05928
$$ -34246 -193088 -265302 -211732 -60203 126706 266697 313811 297438 248711 127273 -78655
44510g8655j39473J12252K95295J66289j32851k30810l1129J86628J97378J01981
$$ -78655 -218128 -105876 189419 355708 222857 -7953 -39082 147546 344924 446905
44500D46905O8928N2694n0912j60089j43871p9717j33800k51778k17566j2983
$$ 446905 515833 568527 517615 357526 213655 133938 138 -251640 -469206 -482189
44490d82189J22426M4353r2478q1467M9111J20791O2277m6839j19401j27524o1494
$$ -482189 -359763 -315410 -407888 -489355 -440244 -319453 -257176 -304015 -423416 -550940 -612434
44479f12434P2290K11734K66390J98520N5058o9274r3602j5229P2455P3794J7135
$$ -612434 -540144 -328410 -62020 136500 191558 122284 28682 13453 85908 159702 176837
44468A76837K1849J13380J56415L5024j72505k82427k20459o3750Q8264J84040
$$ 176837 198686 312066 468481 503505 331000 48573 -171886 -235636 -147372 36668
44458C6668J85660Q2742m1758o3781J7567M9996p3024k42025k45892m1676J70082
$$ 36668 222328 305070 263312 199531 217098 267094 194070 -47955 -293847 -335523 -165441
44447a65441J67218m4624k45539k44170o4183J11594J39275L3141p8814p7255
$$ -165441 1777 -42847 -288386 -532556 -596739 -485145 -345870 -312729 -391543 -468798
44437d68798N5215K17239K63347J37925n1379j26979k6014J33702J89188J07838
$$ -468798 -413583 -196344 67003 204928 153549 26570 556 134258 323446 431284
44427D31284p36l4631j9498n1692j41936j79751r4435Q597k3897j47454j50653
$$ 431284 430548 395917 376419 324727 182791 3040 -91395 -82798 -106695 -254149 -404802
44416d04802K5111J65096R8658k4248K9078J83654J72899q809q6340K5802O6851
$$ -404802 -379691 -214595 -115937 -140185 -111107 72547 245446 236637 150297 176099 242950
44405B42950j15304k63833j10305J69694K08869O459j02898J9716J51087R7302
$$ 242950 127646 -136187 -246492 -76798 132071 138530 35632 55348 206435 303737
44395C03737m8391j29436j54698j70505j08468O9064K09726J37672q6903k27303
$$ 303737 255346 125910 -28788 -199293 -307761 -238697 -28971 108701 21798 -205505
44385b05505j63457j999J03906J33943J59077J91504J54851J2515j35984j57483
$$ -205505 -368962 -370961 -267055 -133112 25965 217469 372320 384835 248851 91368
44375I1368p2685m6046j51463k48844j76573K2033J78479K30787K34357J99791
$$ 91368 18683 -27363 -178826 -427670 -604243 -582210 -403731 -172944 61413 261204
44365B61204R4699j2962k697Q6181P3190q3328k02684j52736l1702K5238N8582
$$ 261204 355903 342941 340244 426425 499615 416287 213603 60867 29165 54403 112985
44354A12985J59795K62657K30635P7749o0795j36410k12485k96928k95841j63975
$$ 112985 272780 535437 766072 843821 783026 646616 434131 137203 -158638 -322613
44344c22613J272O0807j8921j34874j35377M2644K84691L75001K14191n9733k15609
$$ -322613 -321341 -260534 -279455 -414329 -549706 -507062 -222371 152630 366821 307088 91479
44333I1479j71325m3813J5504k5672q2437n7212O1554J79560J82941N8130r4096
$$ 91479 -79846 -123659 -108155 -133827 -216264 -273476 -211922 -32362 150579 208709 114613
44322A14613j68499j41768m8439O4986J40534J32018O4638J3727k146l6427r8859
$$ 114613 -53886 -195654 -244093 -179107 -38573 93445 158083 171810 169664 133237 34378
44311C4378j19866p4234l3467l0226J2303J21028J61844K4271j72750k14850p5367
$$ 34378 -85488 -159722 -193189 -223415 -211112 -90084 71760 96031 -76719 -291569 -366936
44300c66936Q4876J54064J51479J11744N3634M4456J25135J79775O0933j51021
$$ -366936 -282060 -127996 23483 135227 188861 233317 358452 538227 599160 448139
44290D48139k16485r8492l2617j47173k37689q1735J98053K94533J36291o2731
$$ 448139 231654 133162 100545 -46628 -284317 -366052 -167999 126534 262825 200094
44280B00094j26306r0359n3250k7331R800L5120J2244n3787j16161j04331K8459
$$ 200094 73788 -16571 -69821 -97152 -87352 -52232 -39988 -93775 -209936 -314267 -285808
44269b85808K10239K52307N8231j99247k51371q4378M2863k6890j31876n5286
$$ -285808 -75569 176738 234969 35722 -215649 -300027 -257164 -284054 -415930 -471216
44259d71216J44219K36580J68805J10074J56052J80486N4818j23571j47707P258
$$ -471216 -326997 -90417 78388 188462 344514 525000 579818 456247 308540 315798
44249C15798J27509K0442k31871l38247j29208K17979L50877J48600j28243j59392
$$ 315798 443307 463749 231878 -106369 -235577 -17598 333279 481879 353636 194244
44239A94244M2752J85039R5273r3432j85339j80118j90032k23990j93006p5072
$$ 194244 236996 422035 517308 423876 238537 58419 -131613 -355603 -548609 -623681
44229f23681M9256J10390J11445Q9625Q0187R5591R0655l137j50239j90440l9766
$$ -623681 -574425 -464035 -352590 -262965 -182778 -87187 3468 331 -149908 -340348 -380114
44218c80114J52790J71278J5541j10718p3788N8399J53362J53581O8349n2170
$$ -380114 -227324 -56046 -40505 -151223 -225011 -166612 -13250 140331 208680 156510
44208A56510j13121n2756N6646Q2540J0250n6577o2130l5225K9181J60348K66903
$$ 156510 43389 -9367 47279 129819 140069 83492 21362 -13863 15318 175666 442569
44197D42569J88420m6338j90549j02199O2648Q9445p772p1160n1552l0669o8889
$$ 442569 630989 584651 394102 291903 354551 443996 436224 365064 313512 282843 213954
44186B13954j54680k46602k74859j75115p14R1099M5083j0223K6784P5896M8737
$$ 213954 59274 -187328 -462187 -637302 -638016 -546917 -501834 -512057 -485273 -409377 -360640
44175c60640K5962R4405J42350K7936j42212j36858L9755J44740N9223o1938n2027
$$ -360640 -334678 -240273 -97923 -69987 -212199 -349057 -309302 -164562 -105339 -167277 -219304
44164b19304L9985P2325L4309M0936J47496K42345J52822j25522l44184k53197
$$ -219304 -179319 -106994 -72685 -31749 115747 358092 510914 385392 41208 -211989
44154b11989N6142K18300O3348j68954k03231j07496j00907j73071j64093r0468
$$ -211989 -155847 62453 125801 -43153 -246384 -353880 -454787 -627858 -791951 -882419
44144h82419r1659j33029o6589O1118P1526l835L1841J59509J59010L6992N7916
$$ -882419 -974078 -1107107 -1173696 -1112578 -1041052 -1044887 -1013046 -853537 -694527 -657535 -599619
44133e99619K48024K62757n6074l44462k10081K06451M58989L89000J98730O9954
$$ -599619 -351595 -88838 -144912 -489374 -699455 -493004 -34015 354985 553715 623669
44123F23669j003n2848q6117j19471j54427j27017k1955M7275M445m5822J0026
$$ 623669 622666 569818 483701 364230 209803 82786 60831 108106 112551 66729 76755
44112G6755Q5046K6887j26400k07059j68926j02763n0569K6574J25660J93171
$$ 76755 161801 188688 62288 -144771 -313697 -416460 -467029 -440455 -314795 -121624
44102a21624K14882J99319J20178j4861j08180j03208q6266j27678j25997K1212
$$ -121624 93258 292577 412755 397894 289714 186506 100240 -27438 -153435 -132223
44092a32223J86494J56072n0951k08126j94804r1895J2819J19017K09289K25789
$$ -132223 54271 210343 159392 -48734 -243538 -335433 -322614 -203597 5692 231481
44082B31481J68444Q0528m3066j90924k36499r8485M9324k9423k41420k38673
$$ 231481 399925 480453 437387 246463 9964 -88521 -39197 -68620 -310040 -548713
44072e48713O2738L18315K32488m5312j75506q2437N1779J06686J12800R3299
$$ -548713 -485975 -167660 64828 19516 -155990 -238427 -186648 -79962 32838 126137
44062A26137K8006l5957j1153P0497O0979r7875k70101k81496j21234O1184J30441
$$ 126137 154143 118186 107033 177530 238509 140634 -129467 -410963 -532197 -471013 -340572
44051c40572R4780O4908J13554J98679K26065J59873M2966p6974j95925l14008
$$ -340572 -245792 -180884 -67330 131349 357414 517287 560253 483279 287354 -26654
44041b6654l80383l14678r6809J72619L29779K94656J50168M1123J0509r151n6650
$$ -26654 -407037 -721715 -818524 -645905 -316126 -21470 128698 169821 180330 171179 114529
44030A14529q1080l5299N5445J43408J90338J33649n7296k49780k20939M6752
$$ 114529 33449 -1850 53595 197003 387341 520990 463694 213914 -7025 39727
44020C9727K79614K38669O966j75293k25625k04132j17116M4863J59051R6406
$$ 39727 319341 558010 564976 389683 164058 -40074 -157190 -112327 46724 143130
44010A43130m8274p8160j0822k7987j23951q3487J39267K92440J89432k8600j33084
$$ 143130 94856 16696 5874 -22113 -146064 -229551 -90284 202156 391588 362988 229904
43999B29904j18838j14155j33839j02628l2756j2261n6623r3458p2114o625O4943
$$ 229904 111066 -3089 -136928 -239556 -272312 -284573 -341196 -434654 -506768 -513393 -448450
43988d48450J05939R4778N2740L0202M8800Q7031J08124N8809j06122l13847l62581
$$ -448450 -342511 -247733 -194993 -164791 -115991 -28960 79164 137973 31851 -281996 -644577
43977f44577j60111R1638J32142J0238j1190J09789J40065q930j17535l2614Q6120
$$ -644577 -804688 -713050 -580908 -570670 -581860 -472071 -332006 -340936 -458471 -491085 -404965
43966d04965P0037K4776Q5432J26017j0010j72147j06431J16632J90702L7660
$$ -404965 -334928 -310152 -224720 -98703 -108713 -280860 -387291 -270659 -79957 -42297
43956d2297j14841j11935m4486p728M7481J33249J20195m9325j99193j20474J45392
$$ -42297 -157138 -269073 -313559 -321287 -273806 -140557 -20362 -69687 -268880 -389354 -243962
43945b43962L47292L15399J20916n0394j14693j38600j88344k01250p7347J35009
$$ -243962 103330 418729 539645 489251 374558 235958 47614 -153636 -230983 -95974
43935i5974K59958K15261R1930k0372j42476k69473k85416j41305J4518L4430
$$ -95974 163984 379245 471175 450803 308327 38854 -246562 -387867 -373349 -338919
43925c38919j0688K8973J29017J58780J15885R3493P5402k7104j71312k24652
$$ -338919 -349607 -320634 -191617 -32837 83048 176541 251943 224839 53527 -171125
43915a71125j87815j66111j36250K0324K36923K75309R6823k6754R2086K59638
$$ -171125 -358940 -525051 -661301 -640977 -404054 -128745 -31922 -58676 33410 293048
43905B93048J80566j12316l14159k65447j18214p9985j44754j47034r674J49376
$$ 293048 473614 361298 47139 -218308 -336522 -416507 -561261 -708295 -717969 -568593
43895e68593J72188O8561k503M5216J20383J15892O3974L5747n625j09967j86979
$$ -568593 -396405 -327844 -330347 -285131 -164748 -48856 15118 50865 45240 -64727 -251706
43884b51706j24947k052J7429m3643k8143M8600N414j58548k03039l2986J18554
$$ -251706 -376653 -378705 -361276 -404919 -433062 -384462 -379048 -537596 -740635 -773621 -655067
43873f55067N0791r3513p6040P0453J53625J52048J81950K27046J60439M115o9673
$$ -655067 -604276 -697789 -773829 -703376 -549751 -397703 -215753 11293 171732 175847 106174
43862A06174p455N3163O962r2804j60658j75634j19459L0010J95957K32956J19390
$$ 106174 98719 151882 158844 66040 -94618 -270252 -389711 -359701 -163744 69212 188602
43851A88602m625n0339r9317k23177l10743k10322K4585J72138J11683n2243j42082
$$ 188602 183977 133638 34321 -188856 -499599 -709921 -685336 -513198 -401515 -453758 -595840
43840e95840r5384K1001J15015J47554J38482J25505J16028Q7563M4489L5998
$$ -595840 -691224 -670223 -555208 -407654 -269172 -143667 -27639 59924 104413 140411
43830A40411P2450O4063o8647k34424k37866m3924J41774J37236J9221k8053l191
$$ 140411 212861 276924 208277 -26147 -264013 -307937 -166163 -28927 -9706 -37759 -40950
43819d0950m6603j55271j56806q69J29003Q0762o1664j41305j33675p3724N3519
$$ -40950 -87553 -242824 -399630 -400499 -271496 -190734 -252398 -393703 -527378 -601102 -547583
43808e47583J99976K00586K2134r2104M2559K20173J36174j05199j33299Q3496
$$ -547583 -347607 -147021 -124887 -216991 -174432 45741 181915 76716 -56583 26913
43798B6913J78047j5069k07999j63096o7118j56722k91988k18515j5830O0588
$$ 26913 204960 189891 -18108 -181204 -248322 -405044 -697032 -915547 -931377 -870789
43788h70789K1512P4563K10670K14324N8799l8997J8927Q9619P6798O5624R9740
$$ -870789 -849277 -774714 -564044 -349720 -290921 -329918 -310991 -221372 -144574 -78950 20790
43777B0790Q4223O575O376J01344Q5257j32376l02758j75589J03447J88535K8687
$$ 20790 105013 111588 117964 219308 304565 172189 -130569 -306158 -202711 -14176 14511
43766A4511j04726n7489J5476m4277j43794j26466m0776l9216j03897p2165P9848
$$ 14511 -90215 -147704 -132228 -176505 -320299 -446765 -487541 -526757 -630654 -702819 -622971
43755f22971J68859P6307o4805o2612O1753J33357R1698M0430M4356M5540J6017
$$ -622971 -454112 -377805 -442610 -505222 -443469 -310112 -218414 -177984 -133628 -88088 -72071
43744g2071K8589R5232Q7448n6311j69800p2714J34215J77191r812j93997j56485
$$ -72071 -43482 51750 139198 82887 -86913 -159627 -25412 151779 141967 -52030 -208515
43733b08515N8157K47064K70227J17664j16379k58477j69162Q2563K44012J61136
$$ -208515 -150358 96706 366933 484597 368218 109741 -59421 23142 267154 428290
43723D28290l9728j36130r8135q0264j69883k69653k42872q5683Q1370J48612
$$ 428290 388562 252432 154297 74033 -95850 -365503 -608375 -694058 -612688 -464076
43713d64076J16667P5460R2790J32308J10853L1662n872M2742Q3817J9945r6736
$$ -464076 -347409 -271949 -179159 -46851 64002 95664 89792 132534 216351 236296 139560
43702A39560j40137r6649o2486o9881m4274M1360R6258N8133N30O809L2127O325
$$ 139560 -577 -97226 -159712 -229593 -273867 -232507 -136249 -78116 -77586 -70777 -38650 -32325
43690c2325o938Q6739J90481R5943j78915l29971j58987J32177K03157K1652j47765
$$ -32325 -39263 47476 237957 333900 154985 -174986 -333973 -201796 1361 23013 -124752
43679a24752j41828o1507k8842q585M3224M5061n8201j44452p0322J04042J90883
$$ -124752 -266580 -328087 -356929 -365514 -322290 -277229 -335430 -479882 -550204 -446162 -255279
43668b55279J24713Q419n1538l6127L0465J01736J06227K5881m8821l8769n367
$$ -255279 -130566 -122147 -173685 -209812 -179347 -77611 28616 54497 5676 -33093 -38460
43657c8460l9847p6182K0499J96608K29606M0110j89500k74967k49854k30361
$$ -38460 -78307 -154489 -133990 62618 292224 332334 142834 -132133 -381987 -612348
43647f12348k01044o9631J46354L17387L56198K89146J97054J40383J15873N7920
$$ -612348 -813392 -883023 -736669 -419282 -63084 226062 423116 563499 679372 737292
43637G37292p3864k01088k02033r6135m1036j02400j51516o6731Q2599J50118
$$ 737292 663428 462340 260307 164172 123136 20736 -130780 -197511 -114912 35206
43627C5206J03748J754j12536j77321r3586J10510K05015L0278k38360k96935
$$ 35206 138954 140708 28172 -149149 -242735 -132225 72790 103068 -135292 -432227
43617d32227j21260N2126J11072J70559K69790K45072J7068k20483k55436j40670
$$ -432227 -553487 -501361 -390289 -219730 50060 295132 312200 91717 -163719 -304389
43607c04389o8094q2792p7945J0380J43392K56376K89011K04023O6227J5866O4515
$$ -304389 -372483 -455275 -533220 -522840 -379448 -123072 165939 369962 436189 452055 516570
43596E16570K7006k08256m50642m31719j84316J3319M1495N6758J75770K70784
$$ 516570 543576 335320 -115322 -547041 -731357 -718038 -676543 -619785 -444015 -173231
43586a73231J88533L30j10613j03362p7391p9250n0435M2816J35528J41452M7835
$$ -173231 15302 15632 -94981 -198343 -275734 -354984 -405419 -362603 -227075 -85623 -37788
43575c7788p7727j41937r4258K6221J18255J15821M5068l0493q6721j24851j16420
$$ -37788 -115515 -257452 -351710 -325489 -207234 -91413 -46345 -76838 -163559 -288410 -404830
43564d04830k9345Q9897J27557L7727p0013l8139J41695K96663K71242J09013
$$ -404830 -434175 -344278 -216721 -178994 -249007 -287146 -145451 151212 422454 531467
43554E31467k5841p2028j14941k03949k50088j70019k8066O3036J03046J49862
$$ 531467 505626 433598 318657 114708 -135380 -305399 -333465 -270429 -167383 -17521
43544a7521J70252R0184l6975o9213Q827N4561j8403j27659j66415j37718r0528
$$ -17521 152731 242915 205940 136727 145554 200115 181712 54053 -112362 -250080 -340608
43533c40608l2792L0567O3819N4148J9974m9069j52467j80799k0575K16226K66945
$$ -340608 -373400 -342833 -279014 -224866 -204892 -253961 -406428 -587227 -607802 -391576 -124631
43522a24631R4210k9848O5362J83358R2882q6875r1242N2763Q7848n5060j85552
$$ -124631 -30421 -60269 5093 188451 281333 194458 103216 155979 243827 188767 3215
43511C215j72543p7479K0294R3890P4765p5522k06738j34004N6253J09876P325
$$ 3215 -169328 -246807 -226513 -132623 -57858 -133380 -340118 -474122 -417869 -307993 -300668
43500c00668k9765M9887M4115j00669j54602j0948J10078N5629J7667J72616L34678
$$ -300668 -330433 -280546 -236431 -337100 -491702 -502650 -392572 -336943 -319276 -146660 188018
43489A88018K60126N2285n2645r1171k19399l32190k17508K4437J06377L3151
$$ 188018 448144 500429 447784 356613 137214 -194976 -412484 -388047 -281670 -248519
43479b48519O2632K11128K08429m628j32619k115J67881J35322k3793j22766j49774
$$ -248519 -185887 25241 233670 229042 96423 94308 262189 397511 373718 250952 101178
43468A01178j54960q6858N2900R4671m7517j86830j37955j2841j2642p7319p716
$$ 101178 -53782 -140640 -87740 6931 -40586 -227416 -365371 -378212 -390854 -468173 -475889
43457d75889J68382K28959J06835m6956j21251j27310m5921J52044L21241K40302
$$ -475889 -307507 -78548 28287 -18669 -139920 -267230 -313151 -161107 160134 400436
43447D00436n0341k53913k35001j81058k37094k46287m5557K09879K71571J80677
$$ 400436 350095 96182 -138819 -319877 -556971 -803258 -848815 -638936 -367365 -186688
43437a86688J41939J34183k3591k59866k65845J0907K25182J37653l7201o604
$$ -186688 -44749 89434 65843 -194023 -459868 -448961 -223779 -86126 -123327 -129931
43427a29931J29444P9317j38616k38914j41460n1560n5555J8309K32192L45002
$$ -129931 -487 78830 -59786 -298700 -440160 -491720 -547275 -528966 -296774 48228
43417D8228J77159o7802q2162R9401J76192K1526j84831k40908j40667N761J08218
$$ 48228 225387 157585 75423 174824 351016 372542 187711 -53197 -193864 -188103 -79885
43406g9885J17412L1668p6403j21883j15418j39097k10178k42394j54630L5756
$$ -79885 37527 69195 -7208 -129091 -244509 -383606 -593784 -836178 -990808 -955052
43396i55052K28060L07011K23363N6758l8509r324K1063p2504k18919k29569n1445
$$ -955052 -726992 -419981 -196618 -139860 -178369 -187693 -166630 -239134 -458053 -687622 -739067
43385g39067J60347K24747J12352o0359j51719j07106J1516J12150J80679K40632
$$ -739067 -578720 -353973 -241621 -301980 -453699 -560805 -549289 -437139 -256460 -15828
43375a5828K26918N0334j75606j73581J04782L17618J61636j95266l51096k14959
$$ -15828 211090 261424 85818 -87763 17019 334637 496273 301007 -50089 -265048
43365b65048l4972L4849P6002J29812J05561J6398J2572R3958O0617j41512k79418
$$ -265048 -300020 -265171 -189169 -59357 46204 62602 75174 169132 229749 88237 -191181
43354a91181j72073N2752J81573J90594J54536P8826j6508k3679P4786J14273
$$ -191181 -363254 -310502 -128929 61665 216201 295027 278519 254840 329626 443899
43344D43899l452j28562j02570k4035p6744k19844k58570j35041M3099J89982
$$ 443899 440447 311885 209315 185280 108536 -111308 -369878 -504919 -461820 -271838
43334b71838K79136K61992J22059l9958j19135j38874j42408o1575J34018K66225
$$ -271838 7298 269290 391349 351391 232256 93382 -49026 -110601 23417 289642
43324B89642J49154j01251j88685m5681J02301R1294J8789L3874J12357J32921
$$ 289642 438796 337545 148860 103179 205480 296774 315563 349437 461794 594715
43314E94715N5185o2465j49787j76558j65896j72323k02249j74828l0798J39913
$$ 594715 649900 587435 437648 261090 95194 -77129 -279378 -454206 -485004 -345091
43304c45091J65614o134k34888l17155j59386J46190L81202L82056K00572L4980
$$ -345091 -179477 -185611 -420499 -737654 -897040 -750850 -369648 12408 212980 247960
43294B47960j3656k0868n2896n0818K1509O9596L2489J3597R6397J58916N3601
$$ 247960 234304 213436 160540 109722 131231 200827 233316 246913 343310 502226 555827
43283E55827j28080j66023k1992J39325J85659J09923m7659k00661k05934k9941
$$ 555827 427747 261724 239732 379057 564716 674639 626980 426319 220385 190444
43273A90444J35379R8482o2008j37795j09248r9816j00546j3705P6532j9565k38582
$$ 190444 325823 424305 362297 224502 115254 15438 -85108 -98813 -22281 -41846 -280428
43262b80428k79697m3754K09316K33227Q9580l6782j05411j73125k36011k39055
$$ -280428 -560125 -603879 -394563 -161336 -71756 -108538 -213949 -387074 -623085 -862140
43252h62140j47806M0155K53767L24775J59090p6093j20774K5769J30355J01583
$$ -862140 -1009946 -969791 -716024 -391249 -232159 -308252 -429026 -403257 -272902 -171319
43242a71319Q6123J52970J60952M0775m8053K0441J35547J47074P4431m955q3295
$$ -171319 -85196 67774 228726 269501 221448 241889 377436 524510 598941 593986 510691
43231E10691j18124p378J90247K17289l1601l08804l44817k07569j35729j67914
$$ 510691 392567 385189 575436 792725 761124 452320 107503 -100066 -235795 -403709
43221d03709j56637m4159Q5926J68640J98069J61528P2814J6208M2597Q3066N6936
$$ -403709 -560346 -604505 -518579 -349939 -151870 9658 82472 98680 141277 224343 281279
43210B81279j2661o7113r7214r0807j3471R4711J39992J44296K16628K99087J76916
$$ 281279 268618 201505 104291 13484 13 94724 234716 379012 595640 894727 1071643
43199A071643j48857l57242k46689l3268k30q5649p4027J1926P903o3416o4126
$$ 1071643 922786 565544 318855 285587 285357 199708 125681 137607 145510 82094 17968
43188A7968k2704n2779r4064k3150P4593M5975l801J42899L91461M08059J36969
$$ 17968 -4736 -57515 -151579 -174729 -100136 -54161 -57962 84937 476398 884457 1021426
43177A021426q7616k7195J44795J29392j05411l39154l72572k06564k6181j7357
$$ 1021426 933810 906615 1051410 1180802 1075391 736237 363665 157101 130920 113563
43167A13563j41062j63057N775J45140N9009j01021q4533M8010O7398n146K3210
$$ 113563 -27499 -190556 -184781 -39641 19368 -81653 -166186 -118176 -50778 -55924 -32714
43156c2714J08117L3716j47494j56503J1644N5059r8721j59259l371R6949k5272
$$ -32714 75403 109119 -38375 -194878 -183234 -128175 -226896 -386155 -389526 -292577 -317849
43145c17849j16809M2847K36788J78699j4269o5842j8776r4262k36850j82740
$$ -317849 -434658 -391811 -155023 23676 9407 -56435 -75211 -169473 -406323 -589063
43135e89063Q4445K83663K40414P3995l6639n9576n2383n6052p3366o1012L1783
$$ -589063 -504618 -220955 19459 93454 56815 -2761 -55144 -111196 -184562 -245574 -213791
43124b13791J47013J25521o9161k37337j83861J9396J50863J34428P0726M4138
$$ -213791 -66778 58743 -10418 -247755 -431616 -412220 -261357 -126929 -56203 -12065
43114a2065M7622N6335N4779K8868J1341O2718J41069J09979l8658j20471l3686
$$ -12065 35557 91892 146671 175539 186880 249598 390667 500646 461988 341517 307831
43103C07831O9858M1327j6612L8625R5164l9849k86140l76800k32001m831J78697
$$ 307831 377689 419016 402404 441029 536193 496344 210204 -166596 -398597 -403428 -224731
43092b24731K84692K52481P5274o4461j4954O4441m2872j61880O0966N27784P74538
$$ -224731 59961 312442 387716 323255 308301 372742 329870 167990 228956 756740 1531278
43081A531278P64634J007770J595062J695081N90318j120183k036399j615689
$$ 1531278 2295912 3303682 4898744 6593825 7184143 6063960 4027561 2411872
43073B411872p02210l09715m60047n23248k43691O1208J30520R6598J45870J98711
$$ 2411872 1709662 1399947 939900 416652 172961 234169 364689 461287 607157 805868
43063H05868R0809j27277k50637j94662o9403q858l0575o8507p4260o0727p0697
$$ 805868 896677 769400 518763 324101 254698 245840 215265 146758 72498 11771 -58926
43052e8926j14920j46379j16371m8576o646J7277J01112K38263K77594J14957
$$ -58926 -173846 -320225 -436596 -485172 -491818 -474541 -373429 -135166 142428 257385
43042B57385j17413j79419k3678J54074J72300N5378n9130r6587p7294n1749n5052
$$ 257385 139972 -39447 -63125 90949 263249 318627 259497 162910 85616 33867 -21185
43031b1185p7999o6045L389O1366M8542M0733J37612K45526J58281j14824l09602
$$ -21185 -99184 -165229 -161840 -100474 -51932 -11199 126413 371939 530220 415396 105794
43020A05794k76867j78231j79930j69155J3346K33303K31208L8866n8981L9510
$$ 105794 -171073 -349304 -529234 -698389 -685043 -451740 -220532 -181666 -240647 -201137
43010b01137J31261O5460k9624J2704J23649J17896k2529j28740p5327O9366J30489
$$ -201137 -69876 -4416 -34040 -21336 102313 220209 197680 68940 -6387 62979 193468
42999A93468K4067j45075j92326o5305R3476J24081L1505o1627q0148m0530Q321
$$ 193468 217535 72460 -119866 -185171 -91695 32386 63891 2264 -77884 -118414 -110093
42988a10093N260r7045k33885k31578k2812K15245K68405J56849N3021J1222l5977
$$ -110093 -104833 -201878 -435763 -667341 -690153 -474908 -206503 -49654 3367 14589 -21388
42977b1388p8292m3279J9927j903n5721J4038J63002J66259j1555j27433l2024
$$ -21388 -99680 -142959 -123032 -124935 -180656 -166618 -3616 162643 151088 23655 -8369
42966h369J16708J32495O2533K4850n297p9516j29083j03779r3283j43007j16197
$$ -8369 108339 240834 303367 328217 322920 243404 114321 10542 -82741 -225748 -341945
42955c41945P4541K56860K28465O3291k8261k6698o0428j28292j07653J0182J11688
$$ -341945 -267404 -10544 217921 281212 252951 226253 165825 37533 -70120 -59938 51750
42944E1750J52191J58614R0963q7414k38521j73037N7069J92403J03785q0314
$$ 51750 203941 362555 453518 366104 127583 -45454 11615 204018 307803 227489
42934B27489j84908j59159m0885R2247J52167J54690K35269M10440M84780M32704
$$ 227489 42581 -116578 -157463 -65216 86951 241641 476910 887350 1372130 1804834
42924A804834O47811J368353J981255J514232m9475j520402j854079j272631o85357
$$ 1804834 2452645 3820998 5802253 7316485 7267010 5746608 3892529 2619898 1934541
42915A934541m70655l71341k53922k78930l87058k56041J12010K69919j4141l83156
$$ 1934541 1463886 1092545 838623 559693 172635 -83406 28604 298523 284382 -98774
42905i8774m11915j71519p321j0589j3009N4307J01174J12801J76382K65981K18118
$$ -98774 -510689 -682208 -689529 -700118 -713127 -658820 -557646 -444845 -268463 -2482 215636
42894B15636j2973k23503j80833Q4641K88984K00426j01949l07354k08740Q9553
$$ 215636 202663 -20840 -201673 -117032 171952 372378 270429 -36925 -245665 -156112
42884a56112L23305L51925K12918k5597l10131n15308m90132k51024k3J12367
$$ -156112 167193 519118 732036 706439 396308 -119000 -609132 -860156 -860179 -747812
42874g47812J30551J47070J44341P2398k2940n1709J1881J40813K87743L48432
$$ -747812 -617261 -470191 -325850 -253452 -276392 -328101 -316220 -175407 112336 460768
42864D60768K13829n2779k12558j33730L8322J04610O7025J3581r3290k92892
$$ 460768 674597 621818 409260 275530 313852 418462 485487 499068 405778 112886
42854A12886m08890k32130J18531K93018J82393L4700N0869J24009Q2486l9009
$$ 112886 -296004 -528134 -409603 -116585 65808 100508 151377 275386 357872 318863
42844C18863j13810j26176j13344n5746L5539O2109M910N00J02524J32654l1721
$$ 318863 205053 78877 -34467 -90213 -54674 7435 12345 12845 115369 248023 216302
42833B16302j81005n6623J94104J77703j38817l30282j28440J82739J98381k2105
$$ 216302 35297 -21326 172778 350481 211664 -118618 -247058 -64319 134062 111957
42823A11957r4583R0591K36369J18270r6696j34563p207O6067J0923l9509o826
$$ 111957 17374 107965 344334 462604 365908 231345 224138 290205 301128 261619 254793
42812B54793J1830n8891j15432k8819J40116K04192Q5432j20236k83324l36227
$$ 254793 266623 207732 92300 63481 203597 407789 493221 372985 89661 -246566
42802b46566k49389m3948J52134J85353O4831l3693o538M4479j900p7214l2883
$$ -246566 -495955 -539903 -387769 -202416 -137585 -171278 -177816 -133337 -135237 -212451 -245334
42791b45334J07010J60153M8404r7169j29697o6706j4410n947l631m454l9711
$$ -245334 -138324 21829 70233 -26936 -156633 -223339 -237749 -243696 -247327 -251781 -291492
42780b91492q2485n4739M4273R6507J5353j10214j07939M7460J87105J64871L8266
$$ -291492 -373977 -428716 -384443 -287936 -272583 -382797 -490736 -443276 -256171 -91300 -53034
42769e3034l9104l9704o1949j26700j13504M0756J85971J18245j34651l04166
$$ -53034 -92138 -131842 -193791 -320491 -433995 -393239 -207268 -89023 -223674 -527840
42759e27840j96237O4643J90607R9587R692J13491K78168K26175l5164j87552
$$ -527840 -724077 -659434 -468827 -369240 -359548 -246057 32111 258286 223122 35570
42749C5570o5403Q5335j5452k35608k31379N692J27089l1311k04511j15933J22233
$$ 35570 -29833 55502 40050 -195558 -426937 -421245 -294156 -325467 -529978 -645911 -523678
42738e23678K12577R3799m4627n8474K3965J06706J14491K6962p0763m2215J05111
$$ -523678 -311101 -217302 -261929 -320403 -296438 -189732 -75241 -48279 -119042 -161257 -56146
42727e6146J80788P4817o2773m7821N4815N7432l7728o5265J5977Q0567P1203
$$ -56146 124642 199459 136686 88865 143680 201112 163384 98119 114096 194663 265866
42716B65866O9793J10537J04563J95j25130j79636j50752o0556N9966J36797J06034
$$ 265866 335659 446196 550759 550954 425824 246188 95436 34880 94846 231643 337677
42705C37677J5990k8467k2654m8862j15250j42596j14969r7862q6530J0349J86154
$$ 337677 353667 325200 302546 253684 138434 -4162 -119131 -216993 -303523 -293174 -107020
42694a07020K76462J63106n9931j98783j74027p1455k2899o4403r4147L238J69144
$$ -107020 169442 332548 272617 73834 -100193 -171648 -194547 -258950 -353097 -349859 -180715
42683a80715K01377M7760o2422O1996K45091J67549j50962l66382k97077j12303
$$ -180715 20662 68422 6000 67996 313087 480636 329674 -36708 -333785 -446088
42673d46088M434R0099K01532K48000J71559P8784M6036j1878j35260j79292m7650
$$ -446088 -441654 -351555 -150023 97977 269536 348320 394356 382478 247218 67926 20276
42662B0276J11143J22739N0270N5101J26889J36671N0593p6038k13006l12922
$$ 20276 131419 254158 304428 359529 486418 623089 673682 597644 384638 71716
42652G1716k75828j13924k2502j14315k14216j08582J27204K58246K30233J59184
$$ 71716 -204112 -318036 -340538 -454853 -669069 -777651 -650447 -392201 -161968 -2784
42642b784R1046J2814Q384J40397K46558J29596r6063j37947J2554O2129j06770
$$ -2784 88262 101076 109460 249857 496415 626011 529948 392001 404555 466684 359914
42631C59914k50628j59263L1711P1352n7277j65166j08960Q6865K63340K40822
$$ 359914 109286 -49977 -18266 53086 -4191 -169357 -278317 -191452 71888 312710
42621C12710R357j96979j64293q864j3602j77342k11315k4645J10522L769j57554
$$ 312710 322067 125088 -39205 -48069 -61671 -239013 -450328 -474973 -364451 -360682 -518236
42610e18236j49405o1375n8569m6836J19023K87564K14441p457p0309N6991J05495
$$ -518236 -667641 -729016 -787585 -834421 -715398 -427834 -213393 -220850 -291159 -234168 -128673
42599a28673k9976j41498q0730K4344L0143n183Q156K6603J3886M7934J41926
$$ -128673 -158649 -300147 -380877 -356533 -326390 -331573 -323417 -296814 -282928 -234994 -93068
42588i3068J42755k4801j74333j08263P6864J40375N6862N970N6432Q8131L2804
$$ -93068 49687 24886 -149447 -257710 -180846 -40471 16391 22361 78793 166924 199728
42577A99728j6908Q544L1110l6305j45242j82948j11268J6609J14506J12768K0172
$$ 199728 182820 191364 222474 186169 40927 -142021 -253289 -236680 -122174 -9406 10766
42566A0766n0227J862J16737J44915O6884J1306L2784L3324l2068m7048N0336
$$ 10766 -39461 -37599 79138 224053 290937 302243 335027 368351 336283 289235 339571
42555C39571J04896l1426k32948k59698j10609m226l6161p2254o34J12744J73484
$$ 339571 444467 413041 180093 -79605 -190214 -194440 -230601 -302855 -303489 -190745 -17261
42544a7261J83851J45807N646k04659l13260k16310l2442O7586Q7535J30182J79131
$$ -17261 166590 312397 318043 113384 -199876 -416186 -448628 -381042 -293507 -163325 15806
42533A5806J20969m2169j60810j41911o0651k5503l1141r113M5078P5040O4390
$$ 15806 136775 94606 -66204 -208115 -268766 -294269 -325410 -334523 -289445 -214405 -150015
42522a50015N9775Q8280J09722P7112O562m5286m6431O18Q0326J45610J15753
$$ -150015 -90240 -1960 107762 184874 191436 146150 99719 100337 180663 326273 442026
42511D42026k4931j48988j15791J8842N3271o8888j64753p8063J08590K26873
$$ 442026 417095 268107 152316 171158 224429 155541 -9212 -87275 21315 248188
42501B48188K42266J95717P8274p0221p7673J46744M35448O00606P01703Q18764
$$ 248188 490454 686171 764445 694224 616551 763295 1198743 1799349 2501052 3319816
42491C319816P27812J84538n46983q89216p08905m53643m40309m54665k48946
$$ 3319816 4047628 4232166 3685183 2795967 2087062 1633419 1193110 738445 489499
42482D89499k699J8112q5910q6479m6024j24616j85864j053K87250L10484L0099
$$ 489499 486800 504912 419002 332523 286499 161883 -23981 -25034 262216 572700 602799
42471F02799k18220k26143j19703m1777M7397J70944K12004J11877n723j8203
$$ 602799 384579 158436 38733 -3044 44353 215297 427301 539178 533455 515252
42461E15252L6543O7529O5652N3654J1622o9745j36975j36930q7069m6877m6537
$$ 515252 551795 619324 684976 738630 750252 680507 543532 406602 319533 272656 226119
42450B26119n9339l9074N790k297r4680j63470r7530J8167J0345q3542n5724R4247
$$ 226119 166780 127706 133496 131199 36519 -126951 -224481 -206314 -195969 -279511 -335235 -240988
42438b40988J07336r2488k05889j1908K62595K90867J23931J8195m994q1122j43729
$$ -240988 -133652 -226140 -432029 -443937 -181342 109525 233456 251651 246657 165535 21806
42427B1806k2913J81390J88341k8276k09887k02814r3711K1031J25001J59639
$$ 21806 -1107 180283 368624 340348 130461 -72353 -166064 -145033 -20032 139607
42417A39607P1363l8168l5747K5010K9611L8145J36145J87481M9209j03363k5729
$$ 139607 210970 172802 137055 162065 191676 229821 365966 553447 602656 499293 473564
42406D73564J48937J14993o6329q7152K7834l3106k66022l22665j23756K6476
$$ 473564 622501 737494 671165 584013 611847 578741 312719 -9946 -133702 -107226
42396a07226J5680P3813K28685J73611j23672k30242N9384L41787K34723o4783
$$ -107226 -91546 -17733 210952 384563 260891 30649 90033 431820 666543 601760
42386F01760j97818k00846k62792k87165j06762J41015K31378K16595K46051K49819
$$ 601760 403942 203096 -59696 -346861 -453623 -312608 -81230 135365 381416 631235
42376F31235J13335m9737r0522p7831r7859m3438J31115K06900M2104j38730r4302
$$ 631235 744570 694833 604311 526480 428621 385183 516298 723198 765302 626572 532270
42365E32270M8909O4310J2884L6769K7880j38176k72483j49207R0674J69025J06971
$$ 532270 581179 645489 658373 695142 723022 584846 312363 163156 253830 422855 529826
42354E29826Q2995O2703o2484j64458q3153M0884Q749n3238O5433K31132J86513
$$ 529826 612821 675524 613040 448582 365429 406313 415062 361824 427257 658389 844902
42343H44902J6100k9277L884p6630j64988l6744J72262J55474j3222j7751J08214
$$ 844902 861002 831725 835609 758979 593991 557247 729509 884983 871761 854010 962224
42332I62224N0221j83929k61784j16586k5365p9584p4941L5422N8609k5734l6374
$$ 962224 1012445 828516 566732 450146 424781 345197 270256 305678 364287 338553 302179
42321C02179N53j04245k32630o4606K91708L44663J2404k03431k0823K09388J41957
$$ 302179 302732 198487 -34143 -98749 192959 537622 550026 346595 325772 535160 677117
42310F77117m3560p0993l7472j07871j49697k9141P7950Q471p1826J0175J09286
$$ 677117 633557 562564 525092 417221 267524 238383 316333 324804 252978 263153 372439
42299C72439P0291M6755J76978K46169M3135k12775j94260M580O0704l3856k9263
$$ 372439 442730 489485 666463 912632 955767 742992 548732 553312 614016 580160 550897
42288E50897R9259J24517k7894j95724k78145l16011k93231j39217O8825J52337
$$ 550897 650156 774673 746779 551055 272910 -43101 -336332 -475549 -406724 -254387
42278b54387Q7836J0888j7395l9170k3064J05995K51573J97825o1084k46585j51161
$$ -254387 -166551 -155663 -173058 -212228 -235292 -129297 122276 320101 259017 12432 -138729
42267a38729Q5226J75691O2584m5874J5167J53503J66361J9350j21314j19986
$$ -138729 -53503 122188 184772 138898 154065 307568 473929 493279 371965 251979
42257B51979k1378O6477J23260J68933J68596R9967M1656Q2526K11411L83981
$$ 251979 230601 297078 420338 589271 757867 857834 899490 982016 1193427 1577408
42247A577408N78152O68864M26804j48830o51699o90726l84070j54908j40270
$$ 1577408 2155560 2824424 3251228 3102398 2450699 1759973 1375903 1220995 1080725
42238A080725j28422j2355O4575J9623n4524j13744j91857k02903m0651J32933
$$ 1080725 952303 939948 1004523 1024146 969622 855878 664021 461118 420467 553400
42228E53400O2447j42071j32236P7076J07919j02841j51636J26308L24198J22257
$$ 553400 615847 473776 341540 418616 526535 423694 272058 398366 722564 844821
42218H44821j89614j98743K1261J68468K27974L15380K97376J5376l10619l28142
$$ 844821 655207 456464 477725 646193 874167 1189547 1486923 1502299 1191680 863538
42208H63538p8543R2905N3975k4505j8347K0964M2628M4490j6040j53720k57068
$$ 863538 784995 877900 931875 907370 889023 909987 952615 997105 981065 827345 570277
42197E70277k28619j37823q8677n9138j5075k5437j05857j22394j9848M3436l2211
$$ 570277 341658 203835 115158 56020 40945 15508 -90349 -212743 -232591 -189155 -221366
42186b21366q9557Q917J24892R9107M8372J40045K59525J93909M22r3208m4489
$$ -221366 -310923 -302006 -177114 -78007 -29635 110410 369935 563844 564266 471058 426569
42175D26569L515j9013o9078j09548q9034N9063K35643J85842j23557l57395k59527
$$ 426569 430084 411071 341993 232445 143411 202474 438117 623959 500402 143007 -116520
42164a16520r830J09899J42555K44252L05189J56204m7425m5286P5826M4936r7612
$$ -116520 -126350 -16451 126104 370356 675545 831749 784324 739038 814864 859800 762188
42153G62188p6096J19367K09857R3449k8553j2379N3182O4717L4467k3897j23422
$$ 762188 686092 805459 1015316 1108765 1080212 1067833 1121015 1185732 1220199 1196302 1072880
42142A072880k12190k26998k01013j68961o4856J19328K13857J08395m6232q6571
$$ 1072880 860690 633692 432679 263718 198862 318190 532047 640442 594210 507639
42132E07639j02101k03302k32154k0391K41884K52101P6813K3633J31331J58380
$$ 507639 405538 202236 -29918 -50309 191575 443676 520489 544122 675453 833833
42122H33833K5617q5212o4813l156J5949l309o6747j56117j61793m3258N8900
$$ 833833 859450 774238 709425 706269 722218 718909 652162 496045 334252 290994 349894
42111C49894O3624J20699L06002L68470R0992l01449m42420l48723k79161k48869
$$ 349894 413518 534217 840219 1208689 1299681 998232 555812 207089 -72072 -320941
42101c20941r0340J38676K19270J47201P5671L97j34066j65530M5338K54527J47976
$$ -320941 -411281 -272605 -53335 93866 169537 169934 35868 -129662 -84324 170203 318179
42090C18179j18764j48704M8758J20447j0066q5985l9038p2605k16084k48323
$$ 318179 199415 50711 99469 219916 209850 123865 84827 12222 -203862 -452185
42080d52185r3824R4083K38337L64176L78397J97089J1633N1766K04118K49124
$$ -452185 -546009 -451926 -213589 150587 528984 726073 737706 789472 993590 1242714
42070A242714K82809M45701M65814M5162m88913n61092k43553j01088k41209k46053
$$ 1242714 1525523 1971224 2437038 2482200 1993287 1432195 1188642 1087554 846345 600292
42060F00292j8222O8613p9325j18758K6243K3466j63523j47235J31333K35948
$$ 600292 582070 650683 571358 452600 478843 502309 338786 191551 322884 558832
42050E58832L8789k2198K38229L84662J66504K7972L63342Q03803P28801J08745
$$ 558832 597621 575423 813652 1198314 1364818 1392790 1756132 2559935 3288736 3397481
42040C397481n56737q42869o62413k19907Q7366J481k56643k82825j03934o6381
$$ 3397481 2840744 1997875 1335462 1115555 1202921 1204402 947759 664934 561000 494619
42030D94619j72304j05559Q9026K4477k61990k78606M6442K03908J9897l5818
$$ 494619 322315 216756 305782 330259 68269 -210337 -163895 40013 59910 24092
42020B4092K54810M22582J54575j43941p9996P9105l2539k37039k12255m7137
$$ 24092 278902 701484 856059 712118 632122 711227 678688 441649 229394 182257
42010A82257L8575R2882J79274J51697q722o4882K8434K5113q2333K742K43811
$$ 182257 220832 313714 492988 644685 635963 571081 599515 624628 542295 545037 788848
41999G88848K17836r9440k04754M3576J74715J2554K232K98642M16359K05953
$$ 788848 1006684 907244 702490 746066 920781 933335 935567 1234209 1650568 1856521
41989A856521K50905P57877R76557L83234m08751o31998m66840m26353m06607
$$ 1856521 2107426 2865303 3841860 4225094 3816343 3184345 2717505 2291152 1884545
41980A884545j46572N5787r8378k45305k2191K03658J5854k50612j48304N0437
$$ 1884545 1737973 1793760 1695382 1450077 1427886 1631544 1647398 1396786 1248482 1298919
41970A298919o5176k26369l7901K22500J42840l9853M6713J88912J26574J87699
$$ 1298919 1233743 1007374 969473 1191973 1334813 1294960 1341673 1530585 1657159 1844858
41960A844858N99285Q13364L60773k55788l76503k44381l67236m96959k13352
$$ 1844858 2444143 3257507 3618280 3362492 2985989 2741608 2374372 1877413 1664061
41951A664061J10542n7532l86465k96430k9832j02895k62206k9069K70243Q4695
$$ 1664061 1774603 1717071 1330606 1034176 1004344 901449 639243 610174 880417 965112
41941I65112k71563j70644J86156K14798L2539P2682J41545j20269l77239j99624
$$ 965112 693549 522905 709061 923859 956398 1029080 1170625 1050356 673117 473493
41931D73493N9128m1056j29519J83547M00052P8506j81124J58726M33613Q69m11472
$$ 473493 532621 491565 362046 545593 945645 1024151 843027 1001753 1435366 1436235 1024763
41920A024763J2870N80425L22065j99920M445M46724J54239l95399k20681K19485
$$ 1024763 1037633 1618058 1940123 1740203 1744648 2191372 2345611 1950212 1729531 1949016
41910A949016j6509l94409N0756O66127L25506l44124j25456M09511N9774n23058
$$ 1949016 1932507 1538098 1588854 2254981 2580487 2236363 2110907 2520418 2580192 2057134
41900B057134o1563P20808M14247k56059J85605R57439N23014j86333N14532J498170
$$ 2057134 1995571 2716379 3130626 2874567 3060172 4017611 4540625 4354292 4868824 6366994
41890F366994P88635l27588N80968K294766K027450Q62873J754606L549474L125064
$$ 6366994 7155629 6828041 7409009 9703775 11731225 12594098 14348704 17898178 21023242
41881B1023242K069320M138426P369736P099309N781508R732236J6772080K0038231
$$ 21023242 23092562 27230988 34600724 41700033 47481541 57213777 73985857 94024088
41873I4024088K4869636M4186027O9886402O8213035K0597073m3591241p5574814
$$ 94024088 118893724 163079751 232966153 301179188 321776261 278185020 202610206
41866B02610206o2500487l4611147k0644527j8638626j4571381p819746n724209
$$ 202610206 140109719 105498572 84854045 66215419 51644038 43824292 38100083
41859C8100083p180384n824937k242689j525134l202559k943138r67517p75390
$$ 38100083 30919699 25094762 22852073 21326939 18124380 15181242 14213725 13438335
41851A3438335k009651j589784K6649n6207j425149j310819O0192J78334q33193
$$ 13438335 11428684 9838900 9865549 9809342 8384193 7073374 7133566 7311900 6478707
41842F478707p51518K67788J72984q20186o91337M04006M93945m09796n23844
$$ 6478707 5727189 5994977 6167961 5347775 4656438 5060444 5554389 5144593 4620749
41833D620749J58262J9065q42256p62566K23748M26900l37308n86638o4112K1241
$$ 4620749 4779011 4798076 3955820 3193254 3417002 3843902 3506594 2919956 2855844 2877085
41823B877085m35614l20592K91430K01260m64488l71866M46141N76364j54867
$$ 2877085 2441471 2120879 2412309 2613569 2149081 1777215 2223356 2799720 2644853
41814B644853m26202Q9328K81624j46643j93836L87399O06959J35762j92787n9698
$$ 2644853 2218651 2307979 2589603 2442960 2249124 2636523 3243482 3379244 3186457 3126759
41804C126759p8122l31862k00186K09155J14306l64909l31620J62677J96601k19774
$$ 3126759 3048637 2716775 2516589 2725744 2840050 2475141 2143521 2306198 2502799 2283025
41794B283025j63971L47698L16670l16021m84250O7006L77824N2084k00594n3096
$$ 2283025 2119054 2466752 2783422 2467401 1983151 2050157 2427981 2480065 2279471 2226375
41784B226375j4305j60551N7129N32385N17949O4235l7520J92728j4146n36753
$$ 2226375 2212070 2051519 2108648 2641033 3158982 3223217 3185697 3378425 3364279 2827526
41774B827526m48913J79965K89943k32450l70084R8833K72774m7177m383N54981
$$ 2827526 2378613 2558578 2848521 2616071 2245987 2344820 2617594 2570417 2566034 3121015
41764C121015P58748M43253M20814P38046N20752j63274k23761L78469N10573
$$ 3121015 3879763 4323016 4743830 5481876 6002628 5839354 5615593 5994062 6504635
41755F504635J11965L58648J238306J369514P18681Q93244K104167K690369K480413
$$ 6504635 6616600 6975248 8213554 9583068 10301749 11194993 13299160 15989529 18469942
41746A8469942L422531N760740P334798Q417710J2681897J9826071K1557645J0708190
$$ 18469942 21892473 27653213 34988011 43405721 56087618 75913689 97471334 108179524
41738A08179524p627953k0041138j9768036j2548309p129997n422388m269785
$$ 108179524 100551571 80510433 60742397 48194088 41064091 35641703 31371918
41731C1371918k274126q09896m92801l79102j45672n20989j629508k639478l031027
$$ 31371918 29097792 28287896 27795095 27415993 27270321 26749332 25119824 22480346 19449319
41722A9449319k988118k659363k044130j463063j266568j209581q48404l67876
$$ 19449319 16461201 13801838 11757708 10294645 9028077 7818496 6970092 6602216
41714F602216k93350n54438n80261k50515k7037j09314j53980J2779M8800k47528
$$ 6602216 6308866 5754428 5174167 4923652 4896615 4787301 4633321 4646100 4694900 4447372
41704D447372m84571k91270M6396N6118j35895o4561K43305L51135K28140K62965
$$ 4447372 3962801 3671531 3717927 3774045 3638150 3573589 3816894 4168029 4396169 4659134
41694D659134M60488M30634K71165N24940J076199J278717J555680L251205N889104
$$ 4659134 5119622 5550256 5821421 6346361 7422560 8701277 10256957 13508162 19397266
41685A9397266O394698L006199j421364k648422q66193k44377k642535n097607
$$ 19397266 25791964 28798163 27376799 24728377 23862184 23617807 20975272 15877665
41677A5877665m642549k510275j523941j758380j393509k74315J42608l90968
$$ 15877665 11235116 8724841 7200900 5442520 4049011 3774696 3917304 3526336
41669C526336o60546k86736j34340m57234n00459o4621J53999n2200j08898J02686
$$ 3526336 2865790 2579054 2444714 1987480 1487021 1422400 1576399 1524199 1415301 1517987
41659A517987M6076k85759k54605J86136L47362P7018L299L00668L67155j168
$$ 1517987 1564063 1278304 1023699 1209835 1557197 1634215 1637514 1938182 2305337 2304169
41649B304169k17094L932J92903J01070J35072M62333O25176M32386L45587N72935
$$ 2304169 2087075 2091007 2283910 2384980 2520052 2982385 3607561 4039947 4385534 4958469
41639D958469O20058J72614l48965n38791n83621o84712o07305k40453L7848j3921
$$ 4958469 5578527 5751141 5402176 4863385 4279764 3595052 2987747 2747294 2785142 2771221
41629B771221q8723O4203J78674N07k33863k13165q16K19193M18505N51072N70431
$$ 2771221 2682498 2746701 2925375 2925882 2692019 2478854 2478038 2697231 3115736 3666808 4237239
41618D237239P34843J313486J863128J498133J33442j219813j700639j486258
$$ 4237239 4972082 6285568 8148696 9646829 9780271 8560458 6859819 5373561
41610E373561j136358p75344l67218j42505k05349k15934M3409K31261K5131k97991
$$ 5373561 4237203 3461859 3094641 2952136 2746787 2530853 2574262 2805523 2830654 2532663
41600B532663l12347q9693L5057L275m8329r2785j08258J6105K05224J90476R422
$$ 2532663 2220316 2130623 2165680 2168955 2120626 2027841 1919583 1935688 2140912 2331388 2340810
41589B340810Q1609N26465Q73520P50202L82888R6890j77827n31459p07037n41046
$$ 2340810 2422419 2948884 3822404 4572606 4955494 5052384 4874557 4343098 3636061 3095015
41579C095015l31457l41816l58240j53596M2211k3524j43814n8457O4436Q329
$$ 3095015 2763558 2421742 2063502 1909906 1952117 1928593 1784779 1726322 1790758 1799087
41569A799087m6441P0099R5940j63751l47160j08034K41839K72115J99908M29442
$$ 1799087 1752646 1822745 1918685 1754934 1407774 1299740 1541579 1813694 2013602 2443044
41559B443044P25107O56767N55479J062908J827183J665900K34237j328377j791574
$$ 2443044 3168151 3824918 4380397 5443305 7270488 8936388 9170625 7842248 6050674
41550F050674j224760n81819m14218m97228m43383j95172O1348J76962J68227
$$ 6050674 4825914 4244095 3829877 3332649 2889266 2694094 2755442 2932404 3100631
41541C100631J54885J89998J77761J7056k23843l73540l54312k21664o7326L1585
$$ 3100631 3255516 3445514 3623275 3640331 3416488 3042948 2688636 2466972 2399646 2431231
41531B431231M1941K5092O4187J06523L9825m2485R7088M17467N28700K17729
$$ 2431231 2473172 2498264 2562451 2668974 2708799 2666314 2763402 3180869 3709569 3927298
41521C927298k31861m52478m47685l94879k85207p6692M0851j01492l03819k51071
$$ 3927298 3695437 3242959 2795274 2400395 2115188 2038496 2079347 1977855 1674036 1422965
41511A422965J2552J84075J61443R0063M8886k459l2166K6140R2889L9102q9561
$$ 1422965 1435517 1619592 1781035 1871098 1919984 1917525 1885359 1911499 2004388 2043490 1953929
41500A953929j46203j04397l0738N6295J33290J15415J8484J2912J50813K38576
$$ 1953929 1807726 1703329 1672591 1728886 1862176 1977591 1996075 2008987 2159800 2398376
41490B398376J56161O2464P7411L7756j66971k99397j39038J11733J38740O948
$$ 2398376 2554537 2617001 2694412 2732168 2565197 2265800 2126762 2238495 2377235 2384183
41480B384183k5006L2033J0811k1248J07420K91860K91914J34430J4654o0509
$$ 2384183 2359177 2391210 2402021 2380773 2488193 2780053 3071967 3206397 3221051 3160542
41470C160542j63673j50293J14230L78675L04370K9901j7265K10193L68146L29488
$$ 3160542 2996869 2846576 2960806 3339481 3643851 3673752 3656487 3866680 4234826 4564314
41460D564314L18768M27783M66390L68189L27769M37445N51089O02996P32206
$$ 4564314 4883082 5310865 5777255 6145444 6473213 6910658 7461747 8064743 8796949
41451H796949R97746J265371J456328J641558J837497J978932K145873K548815
$$ 8796949 9794695 11060066 12516394 14157952 15995449 17974381 20120254 22669069
41443B2669069L221992L977999M743520N720133P125371Q968268J1198753J3900636
$$ 22669069 25891061 29869060 34612580 40332713 47458084 56426352 67625105 81525741
41435H1525741J7004143J9545350J9326933J4049454L654222q439094j7306526
$$ 81525741 98529884 118075234 137402167 151451621 155105843 146666749 129360223
41428A29360223k0316850j8741320j5590341j2669463j0147172p939629o265056
$$ 129360223 109043373 90302053 74711712 62042249 51895077 43955448 37690392
41421C7690392n087646m072116l182649k660613k442150k209956j937146j778840
$$ 37690392 32602746 28530630 25347981 22687368 20245218 18035262 16098116 14319276
41413A4319276j561121j029945m75012m05964p02663p97286o12791n69556p21050
$$ 14319276 12758155 11728210 11253198 10847234 10144571 9347285 8734494 8164938 7443888
41404G443888o84580m35342l57476m50624k98896P9649J76974q0407j82428J5532
$$ 7443888 6759308 6323966 5966490 5515866 5216970 5296619 5473593 5393186 5210758 5226290
41394E226290M1099k62508m01956j48545K5111j96120m25863l05672r3653j04641
$$ 5226290 5267389 5004881 4602925 4454380 4479491 4283371 3857508 3551836 3458183 3353542
41384C353542j87745j61891j84929l16544k77089J8010K27586J70030Q2289P8686
$$ 3353542 3165797 3003906 2818977 2502433 2225344 2243354 2470940 2640970 2723259 2801945
41374B801945k8378j82193n6293K36651J80106k04786l03403j4385L9909k97479
$$ 2801945 2773567 2591374 2535081 2771732 2951838 2747052 2443649 2429264 2469173 2171694
41364B171694l57051J20347M51378K23613k1494J11228J68011j22527k17629J36834
$$ 2171694 1814643 1934990 2386368 2609981 2588487 2699715 2867726 2745199 2527570 2664404
41354B664404K87752q8624k87714Q0442K81913j10927l00797J90253M58681q7243
$$ 2664404 2952156 2863532 2575818 2656260 2938173 2827246 2526449 2716702 3175383 3088140
41344C088140m27429K54233R24967N11537j12000K07025P20561L64905L4486Q74566
$$ 3088140 2660711 2914944 3839911 4351448 4239448 4446473 5167034 5531939 5566425 6440991
41334F440991J796917J454088J161615K599840M235621M213380N310269J1184310
$$ 6440991 8237908 9691996 10853611 13453451 17689072 21902452 27212721 38397031
41326C8397031J7691738J4899185N34829j4491204j8424074j2159529n530635
$$ 38397031 56088769 70987954 71522783 57031579 38607505 26447976 20917341
41319B0917341l794484l984624k837659j516210j603518j814189q45351J04452
$$ 20917341 17122857 13138233 10300574 8784364 7180846 5366657 4521306 4625758
41311D625758k44484r21303o27952N6275M7956l16205k34101J7062j55949m25673
$$ 4625758 4381274 3459971 2832019 2888294 2936250 2620045 2385944 2403006 2247057 1821384
41301A821384k39650J34240K21937J94264L09858L13464Q5321P8386M93651Q69900
$$ 1821384 1581734 1715974 1937911 2132175 2442033 2755497 2840818 2919204 3412855 4282755
41291D282755J029206J422328J918965J418580m24273k144914k251664j225127
$$ 4282755 5311961 6734289 8653254 10071834 9647561 7502647 5250983 4025856
41283D025856n77783o41355n86376j48952N8062j69610k80886k8740J35214o0904
$$ 4025856 3448073 2806718 2220342 2071390 2129452 1959842 1678956 1650216 1785430 1724526
41273A724526k58350j50268M3756M7151m5201m4280K4891P8096J23675J39912
$$ 1724526 1466176 1315908 1359664 1406815 1361614 1317334 1342225 1420321 1543996 1683908
41263A683908O4368l6610l2472L1484R279n5594J0799J82935K46094J38096J7485
$$ 1683908 1748276 1711666 1679194 1710678 1719957 1664363 1675162 1858097 2104191 2242287 2259772
41252B259772j9486m0913p5578l4425J20868L05103M31960M75494M22521K94785
$$ 2259772 2240286 2199373 2123795 2089370 2210238 2515341 2947301 3422795 3845316 4140101
41242D140101J96114K27122L90963O53611R91687J297908J408000J367125J492366
$$ 4140101 4336215 4563337 4954300 5607911 6599598 7897506 9305506 10672631 12164997
41233A2164997J966953K512847K675021K299213J520587M52495q03330j929567
$$ 12164997 14131950 16644797 19319818 21619031 23139618 23592113 22788783 20859216
41225B0859216k526282k523007k230558j946212j697244j401279j085778q58562
$$ 20859216 18332934 15809927 13579369 11633157 9935913 8534634 7448856 6590294
41217F590294p57786o99684n63886l44213k01885k77648m56264m77748l10114
$$ 6590294 5832508 5132824 4568938 4224725 4022840 3745192 3288928 2811180 2501066
41208B501066j98336k67045l24345k00236k3045L6994N2410J28983J48158R5j38817
$$ 2501066 2302730 2035685 1711340 1511104 1488059 1525053 1577463 1706446 1854604 1854699 1715882
41197A715882p3573N4949J6857q9200m0309N5489o0210k79712k68554o3529k5874
$$ 1715882 1642309 1697258 1714115 1624915 1584606 1640095 1579885 1300173 1031619 968090 942216
41186I42216j85869j68344J20455K67455L5325k14863r9827J87415K30658L5929
$$ 942216 756347 588003 708458 975913 1011238 796375 696548 883963 1114621 1150550
41176A150550q3727n9638q5910j91320j85394k2497J07987R5598M7360N1817L2962
$$ 1150550 1066823 1007185 921275 729955 544561 522064 630051 725649 773009 824826 857788
41165H57788o7039j38627n8741J15495K15715J64826L0878p5865q7305O515J43694
$$ 857788 790749 652122 593381 708876 924591 1089417 1120295 1044430 957125 963640 1107334
41154A107334J98781Q9963r5217j61519m7979P2563K6593j10036j41344o3880
$$ 1107334 1306115 1396078 1300861 1139342 1091363 1163926 1190519 1080483 939139 875259
41144H75259l7346o2073M3401K90000M50359M73543O23196R52118R82457L18763
$$ 875259 837913 775840 819241 1109241 1559600 2033143 2656339 3608457 4590914 4909677
41134D909677o49559j135731r33323n30183l10590j79513k6070K846j11547r0821
$$ 4909677 4260118 3124387 2191064 1660881 1350291 1170778 1144708 1147554 1036007 945186
41124I45186J50184K58844J021l04641k61659L520R9823j6747r2246m8255M018
$$ 945186 1095370 1354214 1355235 1050594 788935 792455 892278 875531 783285 735030 739048
41113G39048R1766L08578M84693L32687q4088l89559m14967l40733k96031j77625
$$ 739048 830814 1139392 1624085 1956772 1872684 1483125 1068158 727425 431394 253769
41103B53769M1637J60125O0901q2897q0853N898K4726k2412n2963p2176j08208
$$ 253769 295406 455531 516432 433535 352682 358580 383306 360894 307931 235755 127547
41092A27547j00286m112Q6922O7221j3498m1073k6332o6350j61473k05169j41058
$$ 127547 27261 23149 110071 177292 163794 122721 96389 30039 -131434 -336603 -477661
41081d77661j7945J04386K02272K45061K13520J76835K35133L34153K57324q0076
$$ -477661 -495606 -391220 -188948 56113 269633 446468 681601 1015754 1273078 1193002
41071A193002m10115l65052M3244L87092L51351J15172M2881J61879K21605J82247
$$ 1193002 782887 417835 461079 848171 1199522 1314694 1357575 1519454 1741059 1923306
41061A923306K75090N11423N06572K0246o03515q33662o14307l22602j87572r7033
$$ 1923306 2198396 2709819 3216391 3236637 2633122 1799460 1185153 862551 674979 577946
41051E77946M8177J39318R7098K6828K0760J6320l8082o2049p422J8129p6009
$$ 577946 626123 765441 862539 889367 910127 926447 888365 826316 818894 837023 761014
41040G61014j93706j86227o1331N7977J06143J02249P0662K9298L837k0419r8135
$$ 761014 567308 381081 319750 377727 483870 586119 656781 686079 689916 669497 571362
41029E71362k06087k08265l9563J43823J29387n6666j52825L517K49274K88689
$$ 571362 365275 157010 117447 261270 390657 333991 181166 184683 433957 722646
41019G22646O9398j44243j09271Q0670J33279l0792j76309j09689M5643O5351
$$ 722646 792044 647801 538530 619200 752479 721687 545378 435689 481332 546683
41009E46683l3989o8928q873J5100j6227K0187J27680J47900M8719J2450J18885
$$ 546683 512694 443766 434893 449993 433766 453953 581633 729533 778252 790702 909587
40998I09587J62513l9261l22858l67541j15582J77458K64447J34042n1796j30478
$$ 909587 1072100 1032839 709981 342440 226858 404316 668763 802805 751009 620531
40988F20531o5695K5937O782r2970j07196P213Q3536M834j02095p0589M4372Q3352
$$ 620531 554836 580773 587555 494585 387389 394602 478138 482972 380877 310288 354660 438012
40976D38012N1141O5431J09145M9777j20033k59436k89786k46556j33505P4562
$$ 438012 489153 554584 663729 713506 593473 334037 44251 -202305 -335810 -261248
40966b61248K73528K88840J42184N5367J13735J31842k7875j97927j47128N6901
$$ -261248 12280 301120 443304 498671 612406 744248 716373 518446 371318 428219
40956D28219J35437j0781j91012j98488l7800J41625K13584J45586L591p6900
$$ 428219 563656 552875 361863 163375 125575 267200 480784 626370 629961 553061
40946E53061n577J45339K12427J53951J02658J62665K52000K35072J40659J30782
$$ 553061 547484 692823 905250 1059201 1161859 1324524 1576524 1811596 1952255 2083037
40936B083037K76471M78109O18892P01488Q08475J008483J317187J647132J755990
$$ 2083037 2359508 2837617 3456509 4157997 4966472 5974955 7292142 8939274 10695264
40927A0695264J369874M72133n85407j353674j639659j546497j266642r57805
$$ 10695264 12065138 12537271 11951864 10598190 8958531 7412034 6145392 5187587
40919E187587p45011o67307o16178m60258k40455j23135j63259k49982k93211
$$ 5187587 4442576 3775269 3159091 2698833 2458378 2335243 2171984 1922002 1628791
40910A628791l11188l04595k07507k8933J02645J17029R6635J13354J03138L324
$$ 1628791 1317603 1013008 805501 776568 879213 996242 1092877 1206231 1309369 1312693
40900A312693j06298j18905o4455m4744q0412j21484j37673j13656l7456K9324
$$ 1312693 1206395 1087490 1023035 978291 897879 776395 638722 525066 487610 516934
40890E16934k4781j78200k39309j05015O9872R7867K7199K0673Q0828Q8803L2095
$$ 516934 492153 313953 74644 -30371 39501 137368 164567 185240 266068 354871 386966
40879C86966n587j7130m0611k2306P9693J22672m3433k66755k40524L1058K03153
$$ 386966 381379 364249 323638 301332 381025 503697 460264 193509 -47015 -15957 187196
40868A87196Q9496r2384r1793K4342O5736M1815O9182J10691M7962o4028m3646
$$ 187196 276692 184308 92515 116857 182593 224408 293590 404281 452243 388215 344569
40857C44569J27033K48186J73187n779j00512o3562j1514n0635j47262j89813
$$ 344569 471602 719788 892975 887196 786684 723122 711608 660973 513711 323898
40847C23898j42125p7698n3205k0752P6817J82843J87648Q0377m6894j19827j20749
$$ 323898 181773 104075 50870 30118 106935 289778 477426 557803 510909 391082 270333
40836B70333m5733P0821J23765N0908n0479n2773q791o9879k10121k22624j5990
$$ 270333 224600 295421 419186 470094 419615 366842 358051 288172 78051 -144573 -160563
40825a60563K62901M37524M62529L49158J27043o4868m4166J90023M75106P46657
$$ -160563 102338 539862 1002391 1351549 1478592 1413724 1369558 1559581 2034687 2781344
40815B781344J023824J096387O07131l51394j082977j066401o22507m20722n43594
$$ 2781344 3805168 4901555 5508686 5157292 4074315 3007914 2385407 1964685 1421091
40806A421091n29047k32976p0524k86249n03203k91379J74616L84869K12575J29
$$ 1421091 892044 659068 588544 302295 -200908 -492287 -317671 67198 279773 279902
40796B79902R375J24446J39364O8231L8961M4552l1569j91618k67884j29247J31791
$$ 279902 289277 413723 553087 621318 660279 704831 673262 481644 213760 84513 216304
40785B16304K84814K16351L9500o0166l0697K7982O780r9215j94310j63972J2697
$$ 216304 501118 717469 756969 696803 666106 694088 700868 601653 407343 243371 256068
40774B56068J98430K01941O639j63430r6479J32046K50753J38288n4198j42016
$$ 256068 454498 656439 663078 499648 403169 535215 785968 924256 870058 728042
40764G28042j27737j15422j22361q9099j3213M6287P7369J18883J52846J05243
$$ 728042 600305 484883 362522 273423 260210 306497 383866 502749 655595 760838
40754G60838m908k8363J05261K20757R1417k12523l46802j36903J62012J95053
$$ 760838 755930 727567 832828 1053585 1145002 932479 585677 448774 610786 805839
40744H05839k2847j75301j24883o5336j46324k05030l7574K38964L17485J22205
$$ 805839 782992 607691 482808 417472 271148 66118 28544 267508 584993 707198
40734G07198j06326j44767l6838K9455l1097j40140j68962n5407J53706L31128
$$ 707198 600872 456105 419267 448722 417625 277485 108523 53116 206822 537950
40724E37950L52448J87726o4024k30553j96459k0748J04080P0951J678P6544K51946
$$ 537950 890398 1078124 1014100 783547 587088 566340 670420 741371 743049 819593 1071539
40713A071539K97219J29906n5897o9012K6478M6015n8940j99662k92865k84879
$$ 1071539 1368758 1498664 1442767 1373755 1400233 1446248 1387308 1187646 894781 609902
40703F09902j46446K9785M7859j29088k62596j60601J6858N58j49794j35578R7098
$$ 609902 463456 493241 541100 412012 149416 -11185 5673 6231 -143563 -279141 -182043
40692a82043K73452K25148J14600J20427J55097N9532j07237j58945n6134P0712
$$ -182043 91409 316557 431157 551584 706681 766213 658976 500031 443897 514609
40682E14609J14299Q3207L3819O20j7404m6686r9280j35943j09269l5547L4262
$$ 514609 628908 712115 745934 746554 729150 682464 583184 447241 337972 302425 336687
40671C36687R3813J53387J64929Q2855k5584n6570l5487o2384j11937o6406M9321
$$ 336687 430500 583887 748816 831671 806087 749517 714030 651646 539709 473303 522624
40660E22624P3589r021j2942J28933K09577N8163j77943k42552j23661m402L9052
$$ 522624 596213 587192 574250 703183 912760 970923 792980 550428 426767 422365 461417
40649D61417Q7885J75911K20435J60376L2691r1718j57157j32708o0614n6015
$$ 461417 549302 725213 945648 1106024 1138715 1046997 889840 757132 696518 640503
40639F40503j62767k52663j76097K0837J43827R6662k7997r4469n7255M9812J57906
$$ 640503 477736 225073 48976 69813 213640 310302 282305 187836 130581 180393 338299
40628C38299J86348J07564O88l3492q816j6800n4228p414J48038K54793J84260
$$ 338299 524647 632211 632899 599407 590591 573791 519563 512149 660187 914980 1099240
40617A099240N2490P8997K68761M26473N23405Q03671J320192J557499R06828
$$ 1099240 1151730 1230727 1499488 1925961 2449366 3253037 4573229 6130728 7037556
40608G037556m50097j520246j572350r35093m45900l82134l68222j79385p3609
$$ 7037556 6587459 5067213 3494863 2559770 2113870 1731736 1363514 1184129 1110520
40599A110520k40242m20654l27070q0572M7856N7143Q8560J07029K1305m9611
$$ 1110520 870278 449624 122554 41982 89838 146981 235541 342570 363875 314264
40589C14264M8851J86780J26275o2391r1081P0452J44134L983j31411p1829N1372
$$ 314264 363115 549895 676170 613779 522698 593150 737284 741267 609856 538027 589399
40578E89399K7872r4211j06051L4464J50095R0176r4983k35198k24227r7182M5482
$$ 589399 617271 523060 417009 451473 601568 691744 596761 361563 137336 40154 85636
40567H5636J48515K08680K04264J01353n8214j71441k12090k49185k84141k08632
$$ 85636 234151 442831 647095 748448 690234 518793 306703 57518 -226623 -435255
40557d35255q746J43303J34566J01108J97636L10041K19244l7109k07566j88332
$$ -435255 -444001 -300698 -166132 -65024 132612 442653 661897 624788 417222 228890
40547B28890j08607p4021n5733m0014o4387q0656P122J36964J26548m7979k12049
$$ 228890 120283 46262 -9471 -49485 -113872 -194528 -187406 -50442 76106 28127 -183922
40536a83922k61410k53655j98505j4952K18336K38171k4709k69968k15351K7219
$$ -183922 -445332 -698987 -897492 -912444 -694108 -455937 -480646 -750614 -965965 -938746
40526i38746J62829J39645J31548K00400K23398J34386K9730M386L0157M1637
$$ -938746 -775917 -636272 -504724 -304324 -80926 53460 83190 87576 117733 159370
40516A59370M4333Q3092J44581J36896p772k03877k49510o9586J39157J41503
$$ 159370 203703 286795 431376 568272 560500 356623 107113 37527 176684 318187
40506C18187k380k7839J16464J86246M2966j23088j17505n0296j05340j95118
$$ 318187 315807 287968 404432 590678 633644 510556 393051 342755 237415 42297
40496D2297j12990R0710J66714N1591o5973n8886m770J2499L0623P7226Q5195
$$ 42297 -70693 20017 186731 238322 172349 113463 108693 121192 151815 229041 314236
40485C14236J7309n2902n1396K968N7305Q5974O8568L902l6409K2247J09173N1785
$$ 314236 331545 278643 227247 230215 287520 373494 442062 445964 409555 431802 540975 592760
40473E92760j78025l68376l00001j1078K40163K44065L0792j75276j67791M5016
$$ 592760 414735 46359 -253642 -264720 -24557 219508 250300 75024 -92767 -47751
40463d7751K46859K43318O7012r2693j26045q0221k4484L7995R9748J05785L7675
$$ -47751 199108 442426 509438 416745 290700 210479 185995 223990 323738 429523 467198
40452D67198m2668q7170j23946j70140j59894l8018J24988J91667J09924m7472
$$ 467198 424530 337360 213414 43274 -116620 -154638 -29650 162017 271941 224469
40442B24469j67611j71942m4112J45595K58184J98666K3455j06830r1529J8493
$$ 224469 56858 -115084 -159196 -13601 244583 443249 466704 359874 268345 286838
40432B86838Q8200L0487j17782k21300j64295J8781J49623R4976o7669j44102
$$ 286838 375038 405525 287743 66443 -97852 -79071 70552 165528 97859 -46243
40422d6243p7034o777m7239j11566n0450J14404K14626J56006k900j70334k89357
$$ -46243 -123277 -130054 -177293 -288859 -339309 -224905 -10279 145727 142827 -27507 -316864
40411c16864k92854j42898N4447J26640P9082R8887K38865K91746J21845p0664
$$ -316864 -609718 -752616 -698169 -571529 -492447 -393560 -154695 137051 258896 188232
40401A88232l8486J08336O7539j65567k84793j47364M7209J13792J23874J73868
$$ 188232 149746 258082 325621 160054 -124739 -272103 -224894 -111102 12772 186640
40391A86640J77541N9085n9749n0567J2868J1773j0348K0328K1917q9668j89580
$$ 186640 364181 423266 363517 312950 325818 337591 327243 347571 369488 279820 90240
40380I0240j12781N9903J14664L8875Q917P4220Q3312n6969k38507l04085k04970
$$ 90240 -22541 37362 152026 190901 199818 274038 357350 300381 61874 -242211 -447181
40369d47181L962K06371K76460K06074J43126J84959K09425P0736j25892j62037
$$ -447181 -443219 -236848 39612 245686 388812 573771 783196 853932 728040 566003
40359E66003n6398k3693j03780j07079L7233J51262J10265L2796O0253J53201
$$ 566003 509605 485912 382132 275053 312286 463548 573813 606609 666862 820063
40349H20063K16404K40605K24820J48760J09362K61484N10407N15199J70208j64281
$$ 820063 1036467 1277072 1501892 1650652 1760014 2021498 2531905 3047104 3217312 3053031
40339C053031j47618L9709k4764l73748o28463n49963k95536j11353m8552n0549
$$ 3053031 2905413 2945122 2920358 2546610 1918147 1368184 1072648 961295 912743 862194
40329H62194r3875j44053j33003o7371m1038q3299j04855l8767O9313J43206J43891
$$ 862194 768319 624266 491263 423892 382854 299555 194700 155933 225246 368452 512343
40318E12343L9866j59625l12835k39389K1675J86091O1369j98440k93650j49582
$$ 512343 552209 392584 79749 -159640 -137965 48126 109495 -88945 -382595 -532177
40308e32177N0117J47511J68602J87315J76572P4337p8785j61004j15383j0618
$$ -532177 -482060 -334549 -165947 21368 197940 272277 193492 32488 -82895 -93513
40298i3513N2649N1024L4831N1275J02809J58804J70795R2133o8993k18899k53329
$$ -93513 -40864 10160 44991 96266 199075 357879 528674 620807 551814 332915 79586
40287G9586j73482p8389l1526L494O9037J24420J04644J9574o5609j16096j36554
$$ 79586 -93896 -172285 -203811 -200317 -131280 -6860 97784 117358 51749 -64347 -200901
40276b00901j19544m3469Q2546K05005K49332J55641n3180k20925j66451Q8303
$$ -200901 -320445 -363914 -281368 -76363 172969 328610 275430 54505 -111946 -23643
40266b3643K80975K05630j2468p2545R5274K33102J01606k06021l79591k52163
$$ -23643 257332 462962 450494 377949 473223 706325 807931 601910 222319 -29844
40256b9844L3633J93980Q8652j52527k65058j18500J52755L04354K44167R5804
$$ -29844 3789 197769 286421 133894 -131164 -249664 -96909 207445 451612 547416
40246E47416K4610P3612J76620K56973K75593K26845J27941P038r6951j16722
$$ 547416 572026 645638 822258 1079231 1354824 1581669 1709610 1716648 1619697 1502975
40236A502975J3900K60231M64945N14486M91034N39004N97863M31240k9884n28378
$$ 1502975 1516875 1777106 2242051 2756537 3247571 3786575 4384438 4815678 4785794 4257416
40226D257416p64791p20137n80340m50831l08725j72645j23993j41765q1323J14401
$$ 4257416 3492625 2772488 2192148 1741317 1432592 1259947 1135954 994189 912866 1027267
40216A027267K96623K85764R6022q9155j26659m1363L0472j5877j47479k09327
$$ 1027267 1323890 1609654 1705676 1616521 1489862 1448499 1478971 1463094 1315615 1106288
40206A106288q2425J51542K59577J21981j01019j44642L6733K06230J25265j66723
$$ 1106288 1023863 1175405 1434982 1556963 1455944 1311302 1348035 1554265 1679530 1512807
40196A512807l97604l59879j22430N7898J8396j39646j89491p1941L1821l3523
$$ 1512807 1115203 755324 632894 690792 709188 569542 380051 308110 339931 306408
40186C06408j56549j18478N8580J20227k8991j57389n8003J21513J13773l5538
$$ 306408 149859 31381 89961 210188 181197 23808 -34195 87318 201091 165553
40176A65553m6863J26749K17492P8169r0768p9091K1511K8815j7468J7286Q4079
$$ 165553 118690 245439 462931 541100 450332 371241 392752 421567 404099 421385 505464
40165E05464N2222k3318j373N6575k2215j81411j83757p736J03479L8822l6755
$$ 505464 557686 534368 532995 589570 567355 385944 202187 194451 297930 336752 299997
40154B99997k3511n6708j82760j75248R2979L55098L13068R3406K9007J39171
$$ 299997 276486 219778 37018 -138230 -45251 309847 622915 716321 745328 884499
40144H84499J66222L2466r7306j70251k95435m16618l03698L0333K42926J48807
$$ 884499 1050721 1083187 985881 815630 520195 103577 -200121 -169788 73138 221945
40134B21945n479M9257J88094J36113p4781j80334r8361M613J0645k1839j7562
$$ 221945 216466 265723 453817 589930 515149 334815 236454 241067 251712 229873 212311
40123B12311J7911O4323J07766J06033M5997p853l0817j17187k98239l88580k17861
$$ 212311 230222 294545 402311 508344 554341 546488 515671 398484 100245 -288335 -506196
40112e06196O7370J75458R2809O5364J71208K13211Q5331n9321j09466j66502
$$ -506196 -438826 -263368 -170559 -105195 66013 279224 364555 305234 195768 29266
40102B9266k61152j93884J13867L64682K73188J9611j2627J72323K17294J874
$$ 29266 -231886 -425770 -311903 52779 325967 345578 332951 505274 722568 724442
40092G24442j73151o5886J61564K29866J31557M1491L064q4284k37431l36099
$$ 724442 551291 485405 646969 876835 1008392 1049883 1052947 968663 731232 395133
40082C95133k96164j70053n4638J2458L2253j2029j22062k08530j34466J01748
$$ 395133 98969 -71084 -125722 -113264 -81011 -93040 -215102 -423632 -558098 -456350
40072d56350K86218K16085o319p3466Q6881J78087j8249k68415k11349Q4066K14055
$$ -456350 -170132 45953 39634 -33832 53049 231136 212887 -55528 -266877 -182811 31244
40061C1244M8915j10335m3340P3467K5554o6813J7088J98392K10135J726k12340
$$ 31244 80159 -30176 -73516 -49 25505 -41308 -24220 174172 384307 386033 173693
40050A73693k55042j39722L6404J73294J76002M4185p2226m7610L1090l199j29661
$$ 173693 -81349 -221071 -184667 -11373 164629 208814 136588 88978 120068 116869 -12792
40039a2792j77929j01514k2377j065M7276J64748K40461J56380o3923k90110l76355
$$ -12792 -190721 -292235 -314612 -315677 -268401 -103653 136808 293188 229265 -60845 -437200
40028d37200k20736J35660M56266M97852K86518P8014K2483K2891l4341q9996
$$ -437200 -657936 -522276 -66010 431842 718360 796374 818857 841748 807407 717411
40018G17411n1052L4513O9052N7916M6653M885r4674j63848j10450o630Q03q2269
$$ 717411 666359 700872 769924 827840 874493 879378 784704 620856 510406 503776 504579 422310
40006D22310j08376k7769K8193n0786j78806j76586M679K27523L19582K39544
$$ 422310 313934 286165 314358 263572 84766 -91820 -87141 140382 459964 699508
39996F99508R2229K624p357j2265p2865j63865k10123j60807k6103J19281J69123
$$ 699508 791737 794361 787004 774739 701874 538009 327886 167079 140976 260257 429380
39985D29380Q0216n3883r0628k1259J7660m1817p7658L0924J74147J27802j13118
$$ 429380 509596 455713 365085 343826 361486 319669 242011 272935 447082 574884 461766
39974D61766k76090j50094J30604K47196Q9260j27869j50113Q421J16294L7215
$$ 461766 185676 35582 166186 413382 502642 374773 224660 233081 349375 386590
39964C86590j10746j35779k3727P6891P7803M5812O4943J13710J32455J25436
$$ 386590 275844 140065 116338 193229 271032 316844 381787 495497 627952 753388
39954G53388J19545Q4660j5642j31392j74767j44921j20426j31914j24929o1035
$$ 753388 872933 957593 941951 810559 635792 490871 370445 238531 113602 52567
39944E2567J9082O0180O3752O7826R6508J45544J78444J32591j5588j80344k27877
$$ 52567 71649 131829 195581 263407 359915 505459 683903 816494 800906 620562 392685
39933C92685j36653l2060k1201o0198m5173K9525Q9731J09999J15666P8721o0351
$$ 392685 256032 223972 202771 142573 97400 126925 216656 326655 442321 521042 460691
39922D60691k46027l09866j83496r327M2704j5202n6728l9800j2867J9609Q8587
$$ 460691 214664 -95202 -278698 -288025 -245321 -260523 -317251 -357051 -369918 -350309 -261722
39911b61722J41440R2914J503K2811J46125J59720l2542k34694k34623j05064
$$ -261722 -120282 -27368 -25865 -3054 143071 302791 270249 35555 -199068 -304132
39901c04132n2258q3906m5109Q0357J42062R5706P8994J62062K16612J24085l7654
$$ -304132 -356390 -440296 -485405 -405048 -262986 -167280 -88286 73776 290388 414473 376819
39890C76819j19436r9665n7875l4965j5179Q411K7291M2347N3706O0788Q2015
$$ 376819 257383 157718 99843 64878 49699 58110 85401 127748 181454 242242 324257
39879C24257J19298J14432K7845n6290k6470O1172L9393j00803j74992q8233L5391
$$ 324257 443555 557987 585832 529542 503072 564244 603637 502834 327842 239609 275000
39868B75000Q0536R3765J02080K582k01465k74087q2856J28977Q0610r6931p7795
$$ 275000 355536 449301 551381 553963 352498 78411 -4445 124532 205142 108211 30416
39857C0416J05561J15236j10264k42213j10641L4868r553m4971J43256L38043
$$ 30416 135977 251213 140949 -101264 -211905 -177037 -186590 -231561 -88305 249738
39847B49738J99342j52064k60138k260K44445J69064p2372j74504j32623j40900
$$ 249738 449080 297016 36878 34618 279063 448127 375755 201251 68628 -72272
39837g2272k08858j60594K2805J23792J9465j07909k4169K16149L38889K06498
$$ -72272 -281130 -441724 -418919 -295127 -275662 -383571 -407740 -191591 147298 353796
39827C53796m2822k01083j97820q1480P4561J88940J95941J20939N9783L5076
$$ 353796 310974 109891 -87929 -169409 -94848 94092 290033 410972 470755 505831
39817E05831l5919j70799k31296j08864Q6306J51823N7724m1437k9232N6322J14394
$$ 505831 469912 299113 67817 -41047 45259 197082 254806 213369 184137 240459 354853
39806C54853Q6063k0440j21607j01864M8191J78947J64045P4992M8294M8082o0178
$$ 354853 440916 420476 298869 197005 245196 424143 588188 663180 711474 759556 699378
39795F99378k35142k72013j16539L3592J3220r0229r1210M8857K16992K86497
$$ 699378 464236 192223 75684 109276 122496 32267 -58943 -10086 206906 493403
39785D93403J93803k4051k17525k49069j62349j13649j22880n8689R0216J35471
$$ 493403 687206 663155 445630 196561 34212 -79437 -202317 -261006 -170790 -35319
39775c5319j4723j72645j36773J7397Q6404N0481M1674Q6428P9302j9053j22729
$$ -35319 -50042 -222687 -359460 -342063 -255659 -205178 -163504 -77076 2226 -16827 -139556
39764a39556j49874r1861K2200J31541J59578J14509J04786J61972J54995R462
$$ -139556 -289430 -381291 -359091 -227550 -67972 46537 151323 313295 468290 477752
39754D77752j12832l9704J12236R7411o6708j35935n4802m1972j92353k75389
$$ 477752 364920 325216 437452 534863 468155 332220 277418 235446 43093 -232296
39744b32296q6768K13688L19201J97747Q5224J17019J68653Q4417q9123j77693
$$ -232296 -319064 -105376 213825 411572 496796 613815 782468 866885 777762 600069
39734F00069j15073j4971n863o4353p6141l4595o9252k33797l74476l12900q6202
$$ 600069 484996 470025 464162 399809 323668 289073 219821 -13976 -388452 -701352 -787554
39723g87554J17520K06655K27405K02509J04972j0282l4273Q89o2961k33734k92843
$$ -787554 -670034 -463379 -235974 -33465 71507 61225 26952 27841 -35120 -268854 -561697
39712e61697j11704J14967J13875r2781k29571j31999R1861K49341K68678J94870
$$ -561697 -673401 -558434 -444559 -537340 -766911 -898910 -807049 -557708 -289030 -94160
39702i4160R4764J6708j8854l1436n4244p9691o0559J8588R5068Q2303k1737j01656
$$ -94160 604 17312 -1542 -32978 -87222 -166913 -227472 -208884 -113816 -31513 -53250 -154906
39690a54906m2668J09913J72722N4808j02505j11266o637J2752j00797j64557
$$ -154906 -197574 -87661 85061 139869 37364 -73902 -80539 -67787 -168584 -333141
39680c33141m9364J22779J64730P6353p279j4142M2041J39875K10785J12727j79795
$$ -333141 -382505 -259726 -94996 -18643 -25922 -40064 1977 141852 352637 465364 285569
39669B85569m18530l22626K3928K26932Q9436j36470j23852P3620J34820m2825
$$ 285569 -132961 -455587 -431659 -204727 -115291 -251761 -375613 -301993 -167173 -209998
39659b09998j98432q7807J73557K72635J11208r5649j25290j0623O4559L0503
$$ -209998 -408430 -496237 -322680 -50045 61163 -34486 -159776 -170399 -105840 -75337
39649g5337j9307k338M9061P1658O5994O9488R6305J34838J56947J15441q546
$$ -75337 -94644 -96982 -47921 23737 89731 159219 255524 390362 547309 662750 654204
39638F54204j43960j89041j50424j36684j82594j82009n5259J14291J92446J57988
$$ 654204 510244 321203 170779 34095 -148499 -330508 -385767 -271476 -79030 78958
39628G8958O5519o7379k18011k75011j43686Q7727K18052J69762N1384p718K1636
$$ 78958 144477 77098 -140913 -415924 -559610 -471883 -253831 -84069 -32685 -40403 -18767
39617a8767J05615J91869K07517J14994j9742j05083j56537k36046k77490j40876
$$ -18767 86848 278717 486234 601228 581486 476403 319866 83820 -193670 -334546
39607c34546J26514K64653J32685q6283j43863o3584m6832j23413j12095N7428
$$ -334546 -208032 56621 189306 103023 -40840 -104424 -151256 -274669 -386764 -329336
39597c29336J86301P8496j57159k33000p3250Q4442L1244j08371o1361J68413
$$ -329336 -143035 -64539 -221698 -454698 -527948 -443506 -412262 -520633 -581994 -413581
39587d13581K70589P9698j52508j06294J35206K17005N2187p0107L2247J42888
$$ -413581 -142992 -63294 -215802 -322096 -186890 30115 82302 12195 44442 187330
39577A87330P665k47941l06938j27204M2017M9464m180j383L3139N7189J01910
$$ 187330 194995 -52946 -359884 -487088 -445071 -395607 -399787 -401170 -368031 -310842 -208932
39566b08932J62511J53293N2896l5455m5401m4054q4847r4003j6587L9532m6748
$$ -208932 -46421 106872 159768 124313 78912 34858 -49989 -143992 -160579 -121047 -167795
39555a67795j89145j82610J0013K03173K32154J34085N3796N8355R0786N9268
$$ -167795 -356940 -539550 -529537 -326364 -94210 39875 93671 152026 242812 302080
39545C02080n9661j88056k20790j49913p6533o3852m7639K7970O4221n8569k37689
$$ 302080 242419 54363 -166427 -316340 -392873 -456725 -504364 -476394 -412173 -470742 -708431
39534g08431k21797L9337K92928L12737J79588J16006J64909J83615Q3797p4892
$$ -708431 -930228 -890891 -597963 -285226 -105638 10368 175277 358892 442689 367797
39524C67797j99429k45300k04082j15158o2796o5107j7061J38400K50687J41135
$$ 367797 168368 -76932 -281014 -396172 -458968 -524075 -541136 -402736 -152049 -10914
39514a0914j01723k10551j16226r151P833O7192K32249L08022J52348l6133N210
$$ -10914 -112637 -323188 -439414 -448565 -440732 -373540 -141291 166731 319079 282946 288156
39503B88156J84080J94531l690j45309q8791M484k5685j15368j56723j75464j99541
$$ 288156 472236 666767 663077 517768 428977 433461 407776 292408 135685 -39779 -239320
39492b39320j45295J0777J09650L3660p8635l5045R1745O8187j20308k21005p3569
$$ -239320 -384615 -373838 -264188 -230528 -309163 -344208 -252463 -184276 -304584 -525589 -599158
39481e99158J75197K88460K20683Q8668k0488r2765j06847l9347N6238P5359n000
$$ -599158 -423961 -135501 85182 173850 153362 60597 -46250 -85597 -29359 46000 41000
39470D1000q3426o2177K3216N4724j699m4321K0931J37175J64088P2138j4616
$$ 41000 -42426 -104603 -81387 -26663 -28362 -72683 -51752 85423 249511 321649 307033
39459C07033O716Q1818R8147N4932M0787P0643N4122n5321j74065j98061j27729
$$ 307033 313749 395567 493714 548646 589433 660076 714198 658877 484812 286751 159022
39448A59022k7619P1026J45028J11471q7406l27493l65998j32123J45814K07794
$$ 159022 131403 202429 347457 458928 371522 44029 -321969 -454092 -308278 -100484
39438a00484Q5831K6319J24981K10549J28806k4053o1185J7437M9677m1671j63215
$$ -100484 -14653 11666 136647 347196 476002 451949 390764 408201 457878 416207 252992
39427B52992k00357j42187n2246M891R222J5384J04070K39690K46242L5018k14457
$$ 252992 52635 -89552 -141798 -136907 -127685 -112301 -8231 231459 477701 512719 298262
39416B98262k57006j16960l1056p6074q1402M8223J61766J21799K8111L2101R3070
$$ 298262 41256 -75704 -106760 -182834 -264236 -216013 -54247 67552 95663 127764 220834
39405B20834Q4723J5317k5329l5644o0772p1431l4517j5735o3218q4194L078R4609
$$ 220834 305557 320874 295545 259901 199129 127698 93181 77446 14228 -69966 -66888 27721
39393B7721N8495k8240n726Q6549Q0881k3353p8490o8488j11267j84985j25411
$$ 27721 86216 57976 52250 138799 219680 196327 117837 49349 -61918 -246903 -372314
39382c72314N9541J37336N16j63060j54882j6759J10565J88416K22192J75665
$$ -372314 -312773 -175437 -174921 -337981 -492863 -509622 -399057 -210641 11551 187216
39372A87216O6860K968J4996J708p6520j15755p2341o0842j34341j62912o9958
$$ 187216 254076 257044 272040 273748 197228 81473 9132 -51710 -186051 -348963 -418921
39361d18921R805k4564l7584R3463K10625J07219j08357j47116M3064K38244K60905
$$ -418921 -409116 -433680 -471264 -377801 -167176 -59957 -168314 -315430 -272366 -34122 226783
39350B26783J25711p6423k29558j95596J5897J50163J0453k16299k00993K5070
$$ 226783 352494 276071 46513 -149083 -133186 16977 27430 -188869 -389862 -364792
39340c64792J22552j5156j17782j103J55214J33918J0950k0910M7128J00163J09740
$$ -364792 -242240 -257396 -375178 -376281 -221067 -87149 -76199 -97109 -49981 50182 159922
39329A59922J13151R1624J4582p1821j07947j06158j05552j17037j48185j83190
$$ 159922 273073 364697 379279 307458 199511 93353 -12199 -129236 -277421 -460611
39319d60611j28247P8652K92602K87530R5343m776Q8183J37173k7104j99516j22087
$$ -460611 -588858 -510206 -217604 69926 165269 160493 248676 385849 358745 159229 37142
39308C7142R8974J72342P2724J6819O7033O1342o2510j44434o5389P3022J13053
$$ 37142 136116 308458 381182 398001 465034 526376 463866 319432 254043 327065 440118
39297D40118L8048o4263j24623j22102p2344k1109P976N4196J40183J82379Q3749
$$ 440118 478166 413903 289280 167178 94834 73725 81701 135897 276080 458459 542208
39286E42208r8442j90341j16680J8173P7242L2434n5541j19198j22237p1499r074
$$ 542208 443766 253425 136745 154918 232160 264594 209053 89855 -32382 -103881 -112955
39275a12955L5701P3912J11955J19414P9825K3763k7829q7296j28457q7865M497
$$ -112955 -77254 -3342 108613 228027 307852 331615 303786 216490 88033 168 4665
39264D665J9557n6706m8898J30687K81412J87580l4958j12275m4986p7913k61945
$$ 4665 24222 -32484 -81382 49305 330717 518297 483339 371064 326078 248165 -13780
39253a3780l54551k11456N517J16355J68645K55835L04817K18523P2781j152j5501
$$ -13780 -368331 -579787 -574270 -457915 -289270 -33435 271382 489905 562686 561534 546033
39242E46033n4185j01510r3577o4238r3654j60148j71917j15637o4211n3781m2421
$$ 546033 491848 390338 296761 232523 138869 -21279 -193196 -308833 -373044 -426825 -469246
39231d69246J2470R5438J52228J43943R1858N8250N1668k400j21817j68823l4070
$$ -469246 -456776 -361338 -209110 -65167 26691 84941 136609 134209 12392 -156431 -190501
39220a90501J35341R7751j02616j64012J4454J70281R1316p1414r0935l0296p3929
$$ -190501 -55160 42591 -60025 -224037 -209583 -39302 52014 -19400 -110335 -140631 -214560
39209b14560j68213j11732R2329K36519K12699R3250m2771j52937j49764N312
$$ -214560 -382773 -494505 -402176 -165657 47042 140292 97521 -55416 -205180 -199868
39199a99868J56841J14046p0235j78680j47039q4290k0631J05438K22525J73039
$$ -199868 -43027 71019 784 -177896 -324935 -409225 -429856 -324418 -101893 71146
39189G1146J5062q606J30716J69734j6323j91728j32603L7095Q8540M6143O0641
$$ 71146 86208 77602 208318 378052 361729 170001 37398 74493 163033 209176 269817
39178B69817R7013J7814j29034j68301q7806l1115k7540L9653J86888K65458J88431
$$ 269817 366830 384644 255610 87309 -497 -31612 -59152 -19499 167389 432847 621278
39167F21278M6213o0232j45014k25133k23582q9508P4748J14435J1406j07171
$$ 621278 667491 607259 462245 237112 13530 -75978 -1230 113205 124611 17440
39157A7440j30604p5497l9088q4009j76685k18275j29083Q1384L05042L93806
$$ 17440 -113164 -188661 -227749 -311758 -488443 -706718 -835801 -754417 -449375 -55569
39147e5569K67957J0535j68463j28816L6901J07345Q997j00029n7147R2906J86992
$$ -55569 212388 222923 54460 -74356 -37455 69890 78887 -21142 -78289 14617 201609
39136B01609J62431Q7124K1387m3365j21205j90360k14478j55833L862K00449
$$ 201609 364040 451164 472551 429186 307981 117621 -96857 -252690 -248828 -48379
39126d8379K89697J90865l195j33801j57269j36254r8670k0523P2775J12282R8157
$$ -48379 241318 432183 428988 295187 137918 1664 -97006 -117529 -44754 67528 165685
39115A65685R4730J02941N2018n7598j16973n8572N1922J18310J20235P3051k7123
$$ 165685 260415 363356 415374 357776 240803 182231 234153 352463 472698 545749 518626
39104E18626j57824k42519k27957j36671j1338J20825K00440J51475n69j19312
$$ 518626 360802 118283 -109674 -246345 -257683 -136858 63582 215057 214488 95176
39094I5176j30774j13007j41515j50841n2699R9804J86832J88475J56262R1924
$$ 95176 -35598 -148605 -290120 -440961 -493660 -393856 -207024 -18549 137713 229637
39084B29637p794n4951J7689J01438N1060o0720m4187O5298L0206j68985k26393
$$ 229637 221843 166892 184581 286019 337079 276359 232172 297470 327676 158691 -67702
39073f7702J8429K63049J49641j92478l23845j28741O3448J0265j13848m9044
$$ -67702 -49273 213776 363417 170939 -152906 -281647 -218199 -207934 -321782 -370826
39063c70826J46246K28918J51448Q4566J24603J78812J43793M3155m4942q8301
$$ -370826 -224580 4338 155786 240352 364955 543767 687560 730715 685773 597472
39053E97472r5553r4004j37262k53358l53839k78279R150L21549M18527K57066
$$ 597472 501919 407915 270653 17295 -336544 -614823 -605673 -284124 134403 391469
39043C91469K2677q2507l8201J4560m2747j74010k44763j87989p2222J1272P5338
$$ 391469 414146 331639 293438 307998 265251 91241 -153522 -341511 -413733 -402461 -327123
39032c27123J82330K91083K69339R2953p3273p9675q17k2915j61647k33944j25415
$$ -327123 -144793 146290 415629 508582 435309 355634 354817 331902 170255 -63689 -189104
39021a89104N0197J16986M9353o2727j62232k27670j99757m2862J46781K23508
$$ -189104 -138907 -21921 27432 -35295 -197527 -425197 -624954 -667816 -521035 -297527
39011b97527J77156J14208O3522m3351j71660j47726P4433K69572K20992L0774
$$ -297527 -120371 -6163 57359 14008 -157652 -305378 -230945 38627 259619 290393
39001B90393l7408M4980N4069j07920k46909j73164K3907J32723J19299J05980
$$ 290393 252985 297965 352034 244114 -2795 -175959 -152052 -19329 99970 205950
38991B05950J24200O8331r8673k40922k12117m2147J01636J05692J7385l0610
$$ 205950 330150 398481 299808 58886 -153231 -195378 -93742 11950 29335 -1275
38981a275K5192J13341J17989J8915r0383j22832q6616l4658J5578O1151O0940
$$ -1275 23917 137258 255247 274162 183779 60947 -25669 -60327 -44749 16402 77342
38970G7342j8231j18031j30295l6548N6303M7373l7092q8669n2139K4879O6904
$$ 77342 59111 -58920 -189215 -225763 -169460 -122087 -159179 -247848 -299987 -275108 -208204
38959b08204N3591J2572l8980j01141j39038q1707Q0936K38752K69662J90941
$$ -208204 -154613 -142041 -181021 -282162 -421200 -502907 -421971 -183219 86443 277384
38949B77384J19614Q5622n024j84856l20823k81341j17562K5966J07668J72197
$$ 277384 396998 482620 477596 292740 -28083 -309424 -426986 -401020 -293352 -121155
38939a21155J96501J10535l9588j09017o4846l2939p8752q5717M4824J86613J27989
$$ -121155 75346 185881 146293 37276 -27570 -60509 -139261 -224978 -180154 6459 134448
38928A34448j26431l33913l03023r6256R1521J68180J87688K05437J85174P6331
$$ 134448 8017 -325896 -628919 -725175 -633654 -465474 -277786 -72349 112825 189156
38918A89156p8268j77920j92359j83414j82869j25773L7667K23848K95592K32845
$$ 189156 110888 -67032 -259391 -442805 -625674 -751447 -713780 -489932 -194340 38505
38908C8505J35440O8891P839n5731n7867K8694J13770R3082j5301j08025j36570
$$ 38505 173945 242836 250675 194944 137077 165771 279541 372623 357322 249297 112727
38897A12727j34175j13040j8418J73425L56756L64217J51558j26609k69488k40412
$$ 112727 -21448 -134488 -152906 20519 377275 741492 893050 766441 496953 256541
38887B56541j70029j60990j77472j53663j06510o5906J2124J49407K37160J66980
$$ 256541 86512 -74478 -251950 -405613 -512123 -578029 -565905 -416498 -179338 -12358
38877a2358K6180N00R5785J32642L7595m9159k3434Q355p6159j92979j78607m5515
$$ -12358 13822 14322 110107 242749 280344 231185 207751 216106 139947 -53032 -231639 -277154
38865b77154M7562L2586n298J2366N8001O9863L3993k4021p2747r1272q5317q0002
$$ -277154 -229592 -197006 -202304 -189938 -131937 -62074 -28081 -52102 -124849 -216121 -301438 -381440
38853c81440p8182n5331j1005K5306N9885J35529K30006K36437J07494n4030j22677
$$ -381440 -459622 -514953 -525958 -500652 -440767 -305238 -75232 161205 268699 214669 91992
$$ [...]
##END NTUPLES=NMR SPECTRUM
##END=
