##TITLE=31Pdec_DE-138rm_3h
, 24 sc
 30.3.2026
##JCAMPDX= 6.0         $$ Bruker NMR JCAMP-DX V2.0
##DATA TYPE= NMR SPECTRUM
##DATA CLASS= NTUPLES
##ORIGIN= UXNMR, Bruker Analytische Messtechnik GmbH
##OWNER= root
$$ XWIN-NMR		Version 3.5
$$ Mon Mar 30 14:18:46 2026 Russian Standard Time (UT+4h)  she@DPX200
##.OBSERVE FREQUENCY= 81.013821
##.OBSERVE NUCLEUS= ^31P
##.ACQUISITION MODE= SIMULTANEOUS
##.ACQUISITION SCHEME= undefined
##.AVERAGES= 24
##.DIGITISER RES= 17
##SPECTROMETER/DATA SYSTEM= spect
##.PULSE SEQUENCE= zgpg30
##.SOLVENT NAME= MeOD
##.SHIFT REFERENCE= (INTERNAL, MeOD, 0, 197.392)
##AUDIT TRAIL= $$ (NUMBER, WHEN, WHO, WHERE, WHAT)
$$ ##TITLE= Audit trail, XWIN-NMR		Version 3.5
$$ ##JCAMPDX= 5.01
$$ ##ORIGIN= Bruker BioSpin GmbH
$$ ##OWNER= she
$$ F:/spectra/data/she/nmr/P31/2/pdata/1/auditp.txt
$$ ##AUDIT TRAIL=  $$ (NUMBER, WHEN, WHO, WHERE, WHAT)
(   1,<2026-03-30 14:16:37.26 +0400>,<she>,<DPX200>,
      <created by zg, POWCHK disabled, PULCHK disabled
       configuration hash MD5:
       00 E9 B6 7A A2 85 ED C7 34 08 36 98 17 FE 4E 26
       data hash MD5: 32K
       49 7B E7 E4 4D 99 35 BA 27 A1 DE DF 74 78 1D 13>)
(   2,<2026-03-30 14:16:47.82 +0400>,<she>,<DPX200>,
      <Start of raw data processing
       efp BC_mod = 2 LB = 1.5 FT_mod = 6 PKNL = 1 PHC0 = 1450.738 PHC1 = -72.69934 SI = 64K 
       data hash MD5: 64K
       CF 32 3A 76 72 24 F2 32 47 D0 C6 B1 A4 E4 73 6F>)
(   3,<2026-03-30 14:17:14.12 +0400>,<she>,<DPX200>,
      <pk PHC0 = -18.72935 PHC1 = 0 
       data hash MD5: 64K
       29 8C 60 6E 43 78 79 3F 1D 17 7C 61 01 DE EB AB>)
(   4,<2026-03-30 14:17:39.32 +0400>,<she>,<DPX200>,
      <pk PHC0 = 9.200003 PHC1 = 0 
       data hash MD5: 64K
       33 6F BE 44 F5 5E D6 CF 70 1B B1 C0 AB DE D8 66>)
(   5,<2026-03-30 14:18:06.06 +0400>,<she>,<DPX200>,
      <pk PHC0 = -2.000002 PHC1 = 0 
       data hash MD5: 64K
       45 7A C6 E8 5F E1 6C FF EA 3B B6 E3 0D 19 47 A0>)
(   6,<2026-03-30 14:18:10.04 +0400>,<she>,<DPX200>,
      <abs ABSG = 5 
       data hash MD5: 64K
       92 2D B7 10 21 74 7D A0 0B 0F 91 F9 27 8F 29 2E>)
$$ ##END=
$$ 
$$ hash MD5
$$ F1 0C 0F BF 64 C4 65 21 8A 1F F9 8A 72 9D 2C 7E
##$RELAX= 
##$RELAX= 
##$RELAX= 
##$RELAX= 
##$RELAX= 
##$RELAX= 
##$RELAX= 
##$RELAX= 
$$ Bruker specific parameters
$$ --------------------------
##$DU= <F:/spectra>
##$EXPNO= 2
##$NAME= <P31>
##$PROCNO= 1
##$TYPE= <nmr>
##$USER= <she>
##$AMP= (0..31)
100 100 100 100 100 100 100 100 100 100 100 100 100 100 100 100 100 100 
100 100 100 100 100 100 100 100 100 100 100 100 100 100 
##$AQSEQ= 0
##$AQ_mod= 1
##$AUNM= <au_zg>
##$AUTOPOS= <>
##$BF1= 81.014009
##$BF2= 200.13
##$BF3= 200.13
##$BF4= 200.13
##$BF5= 200.13
##$BF6= 200.13
##$BF7= 200.13
##$BF8= 200.13
##$BYTORDA= 1
##$CFDGTYP= 0
##$CFRGTYP= 5
##$CHEMSTR= <none>
##$CNST= (0..31)
1 1 145 1 1 1 1 1 1 1 1 1 1 1 1 1 1 1 1 1 1 1 1 1 1 1 1 1 1 1 1 1 
##$CPDPRG= <waltz16>
##$CPDPRG1= <>
##$CPDPRG2= <waltz16>
##$CPDPRG3= <>
##$CPDPRG4= <mlev>
##$CPDPRG5= <mlev>
$$ [...]
##$SUBNAM3= <"">
##$SUBNAM4= <"">
##$SUBNAM5= <"">
##$SUBNAM6= <"">
##$SUBNAM7= <"">
##$SUBNAM8= <"">
##$SUBNAM9= <"">
##$SW= 400.765351723535
##$SWIBOX= (0..15)
0 1 3 0 0 0 0 0 0 0 0 0 0 0 0 0 
##$SW_h= 32467.5324675325
##$TD= 32768
##$TD0= 1
##$TE= 0
##$TE2= 300
##$TE3= 300
##$TEG= 300
##$TL= (0..7)
0 120 53 12 22 120 120 120 
##$TP= (0..7)
150 150 150 150 150 150 150 150 
##$TP07= 0
##$TPNAME0= <>
##$TPNAME1= <>
##$TPNAME2= <>
##$TPNAME3= <>
##$TPNAME4= <>
##$TPNAME5= <>
##$TPNAME6= <>
##$TPNAME7= <>
##$TPOAL= (0..7)
0.5 0.5 0.5 0.5 0.5 0.5 0.5 0.5 
##$TPOFFS= (0..7)
0 0 0 0 0 0 0 0 
##$TUNHIN= 0
##$TUNHOUT= 0
##$TUNXOUT= 0
##$USERA1= <user>
##$USERA2= <user>
##$USERA3= <user>
##$USERA4= <user>
##$USERA5= <user>
##$V9= 5
##$VALIST= <valist>
##$VCLIST= <CCCCCCCCCCCCCCC>
##$VD= 0
##$VDLIST= <DDDDDDDDDDDDDDD>
##$VPLIST= <PPPPPPPPPPPPPPP>
##$VTLIST= <TTTTTTTTTTTTTTT>
##$WBST= 1024
##$WBSW= 4
##$XGAIN= (0..3)
0 0 0 0 
##$XL= 0
##$YL= 0
##$YMAX_a= 24300
##$YMIN_a= -28028
##$ZGOPTNS= <>
##$ZL1= 120
##$ZL2= 120
##$ZL3= 120
##$ZL4= 120
##$ABSF1= 197.3918
##$ABSF2= -203.3724
##$ABSG= 5
##$ABSL= 3
##$ALPHA= 0
##$AQORDER= 0
##$ASSFAC= 0
##$ASSFACI= 0
##$ASSFACX= 0
##$ASSWID= 0
##$AUNMP= <proc_1d>
##$AZFE= 0.1
##$AZFW= 0.5
##$BCFW= 0
##$BC_mod= 2
##$BYTORDP= 0
##$COROFFS= 0
##$CY= -3
##$DATMOD= 1
##$DC= 0
##$DFILT= <>
##$DTYPP= 0
##$F1P= 0
##$F2P= 0
##$FCOR= 1
##$FTSIZE= 65536
##$FT_mod= 6
##$GAMMA= 0
##$GB= 0
##$INTBC= 1
##$INTSCL= 9.790993e-09
##$ISEN= 30
##$LB= 1.5
##$LEV0= 0
##$LPBIN= 0
##$MAXI= 10000
##$MC2= 0
##$MEAN= 0
##$ME_mod= 0
##$MI= 50
##$NCOEF= 0
##$NC_proc= -7
##$NLEV= 6
##$NOISF1= 182.463
##$NOISF2= 159.3651
##$NSP= 0
##$NTH_PI= 0
##$NZP= 0
##$OFFSET= 197.3918
##$PC= 4
##$PHC0= 1439.209
##$PHC1= -72.69934
##$PH_mod= 1
##$PKNL= yes
##$PPARMOD= 0
##$PSCAL= 0
##$PSIGN= 0
##$REVERSE= no
##$SF= 81.014063255964
##$SI= 65536
##$SIGF1= 159.3651
##$SIGF2= -187.1042
##$SINO= 113.3802
##$SIOLD= 16384
##$SREGLST= <1H.CDCl3>
##$SSB= 0
##$STSI= 65536
##$STSR= 0
##$SW_p= 32467.5324675325
##$SYMM= 0
##$S_DEV= 0
##$TDeff= 32768
##$TDoff= 0
##$TI= <>
##$TILT= no
##$TM1= 0
##$TM2= 0
##$TOPLEV= 0
##$USERP1= <user>
##$USERP2= <user>
##$USERP3= <user>
##$USERP4= <user>
##$USERP5= <user>
##$WDW= 1
##$XDIM= 65536
##$YMAX_p= 363679169
##$YMIN_p= -14549546
$$ End of Bruker specific parameters
$$ ---------------------------------
##NTUPLES= NMR SPECTRUM
##VAR_NAME=  FREQUENCY,     SPECTRUM/REAL,   SPECTRUM/IMAG
##SYMBOL=    X,             R,               I
##VAR_TYPE=  INDEPENDENT,   DEPENDENT,       DEPENDENT
##VAR_FORM=  AFFN,          ASDF,            ASDF
##VAR_DIM=   65536,         65536,           65536
##UNITS=     HZ,            ARBITRARY UNITS, ARBITRARY UNITS
##FACTOR=    0.49542278885378, 1,            1
##FIRST=     15991.5117654749, 0,            0
##LAST=      -16476.0207020576, 0,           0
##MIN=       -16476.0207020576, -14549546,   0
##MAX=       15991.5117654749, 363679169,    0
$$ Real data points
##PAGE= N=1
##DATA TABLE= (X++(R..R)), XYDATA
$$ [...]
46768b635439l1904Q22703J300745J192501N66416r6340l83216m63758o41858
46759c70150o89288k50753L80606O05857L99694J44645j23190n02958n59981J62241
46749h03277J103221J178731L28761m02904m09390j39759j5353K06799O05150
46740A651979O19910k525n69674l96308J84841L84375P6853k19559j55682J44161
46730A718371L35253O7972p23061j447886j227611l9722R61828Q01331n1331m15336
46720b0192p3050J24175k42590m70116J10306R90435J116896L27503m80385n44309
46710H38673j6456N44487Q74018Q66671K68437q88386j841350j819422j113706
46701b287034o43808m54906L35074J756099K310119R65863j050509j681033p51460
$$ plain form
46768 -2635439 -2667343 -1844640 -543895 648606 1215022 1118682 735466 271708 -370150
46759 -370150 -1059438 -1310191 -929585 -323728 75966 220611 97421 -405537 -965518 -803277
46749 -803277 299944 1478675 1807436 1404532 995142 855383 840030 1046829 1651979
46740 1651979 2271889 2269364 1699690 1303382 1488223 1872598 1949451 1729892 1574210 1718371
46730 1718371 2053624 2121596 1398535 -49351 -1276962 -1316684 -354856 446475 395144 -20192
46720 -20192 -93242 30933 -211657 -681773 -571467 418968 1535864 1863367 1382982 838673
46710 838673 822217 1366704 2240722 3107393 3375830 2487444 646094 -1173328 -2287034
46701 -2287034 -2930842 -3385748 -3050674 -1294575 1015544 1981407 930898 -750135 -1501595
46692a501595P7284j26598n17869k26189K54245J25697l31507l57580j2643N0317
46682b566438k71285m62706l07218j43122k05609k79402j04617K63518O12132
46673c464747Q34581R38579R22919P22267L00522j49612k13834K89278R04852
46664A084805R38440L10777l39566n01118l44792k73184l24744l00842j73187
46655G6589q0070j22568l19956n13889k74542O28249J526326J277555k01130j442634
46645E53930j116090K60096J067424P29801J71369J81738L37097p4779q38561
46636A272025j153132p83560k60152p4990j82602k91898k47501l9095K44075L34536
46626a182294m5637p07507r19230j73751J037259J619135J116296J61490m72167
$$ plain form
46692 -1501595 -1424311 -1550909 -2068778 -2294967 -2040722 -1915025 -2246532 -2604112 -2616755 -2566438
46682 -2566438 -2837723 -3300429 -3607647 -3750769 -3956378 -4235780 -4340397 -4076879 -3464747
46673 -3464747 -2630166 -1691587 -768668 -46401 254121 104509 -109325 179953 1084805
46664 1084805 2023245 2334022 1994456 1493338 1148546 875362 550618 249776 76589
46655 76589 -3481 -126049 -446005 -959894 -1234436 -606187 920139 2197694 1996564 553930
46645 553930 -562160 -302064 765360 1495161 1666530 1848268 2185365 2110586 1272025
46636 1272025 118893 -664667 -924819 -999809 -1182411 -1474309 -1721810 -1760905 -1516830 -1182294
46626 -1182294 -1227931 -1935438 -2854668 -3028419 -1991160 -372025 744271 905761 433594
46617D33594p79384j087364j176023n54160N44859J240535J191414R57943R06821
46608A678235N29489n51157j497813j085617N20490J657847J092849m84662j293356
46599E66305n48956O89978Q33520l52065j491413j282456n9877P12276K98409
46590f34279n78427r27117p03640m41686k64945P0587M65420N20549K22843k4236
46580b294931p1978j67346l51029k81670J51303N54990O42444O41883P47508O31123
46570B02297M3583m45863o6484Q49277J008269p2142j152479p95841O32404J363133
46560A566154N47484p39978j098243n33974J9478K29008M79596P91254O47959
46551A908738k3751n85577o44876n40336n59144l86491J94733O67450M57110j51979
$$ plain form
46617 433594 -345790 -1433154 -2609177 -3163337 -2618478 -1377943 -186529 771414 1678235
46608 1678235 2207724 1656567 158754 -926863 -406373 1251474 2344323 1859661 566305
46599 566305 17349 707327 1540847 1188782 -302631 -1585087 -1644964 -932688 -634279
46590 -634279 -1212706 -2139823 -2843463 -3285149 -3550094 -3479507 -3014087 -2493538 -2270695 -2294931
46580 -2294931 -2366909 -2534255 -2885284 -3166954 -3015651 -2460661 -1818217 -1176334 -428826 202297
46570 202297 245880 -199983 -266467 582810 1591079 1518937 366458 -429383 203021 1566154
46560 1566154 2113638 1373660 275417 -258557 -239079 -10071 469525 1260779 1908738
46551 1908738 1884987 1299410 654534 114198 -444946 -831437 -636704 30746 487856 335877
46541C35877l81050n927M68761N18882O2893o24659j098062j012188n13660j37742
46531b386875q0180L1117L32332K81529m00274r35330n01050L92451N84532Q4578
46521b597170j287O04346Q19209K2152q21078o32581J38995L32785j33146l38403
46511b606178J40627Q15495J209318J276081R44935J47056n90420m24972O25601
46502A537543J458409J198473K22190m67977m43126p9738L3188l99051j148478
46493A911433j517389r95850m8855K81364j81780m05631K64292R78326P08418
46484I94328j3759N4640O94625M70610p83924j403898m38291P66452N95092m65754
46474D70121q63173m53515k92540m70277J5546J198952J707220Q72714j90237
$$ plain form
46541 335877 -45173 -51100 417661 936543 999436 374777 -723285 -1735473 -2249133 -2386875
46531 -2386875 -2467055 -2435938 -2103606 -1822077 -2222351 -3157681 -3658731 -3266280 -2681748 -2597170
46521 -2597170 -2598457 -1994111 -1174902 -1152750 -1973828 -2606409 -2467414 -2134629 -2267775 -2606178
46511 -2606178 -2465551 -1650056 -440738 835343 1780278 1927334 1336914 911942 1537543
46502 1537543 2995952 4194425 4416615 3948638 3505512 3425774 3458962 3059911 1911433
46493 1911433 394044 -601806 -650661 -369297 -551077 -956708 -692416 285910 994328
46484 994328 980569 1035209 1729834 2200444 1416520 12622 -425669 340783 935875 470121
46474 470121 -393052 -846567 -1139107 -1609384 -1593838 -394886 1312334 2185048 1994811
46465A994811l55392q0904k90351o79743l26012O25285J075661N44306l70335
46456B137326j003458j217784r91953k71950N72619Q39999L53324k55485l81955
46447b19317j50132m003n474M9818Q7016j47109m60778k37924O48367J354508
46437I14972J001999q9949p30260m34901N4787R1762R8917N57363Q18083M2619
46427B325392j123280j164380N7982J018020P23576r5011m33816l60516k34618
46418G13349J59926P41640N04597j015037k481946k288963p63034M40384O67652
46409c321432O27915P48924O44249K18197m2894n7440k62840n69386l32660M04411
46399a942956P66215M47996J59373K77606J90791m37341q18967k73985N18801
$$ plain form
46465 1994811 1639419 1558515 1268164 588421 262409 887694 1963355 2507661 2137326
46456 2137326 1133868 -83916 -1075869 -1347819 -775200 64799 418123 162638 -219317
46447 -219317 -369449 -373452 -378926 -329108 -242092 -389201 -849979 -1087903 -439536 914972
46437 914972 1916971 1827022 1096762 661861 716648 808410 907327 1464690 2282773 2325392
46427 2325392 1202112 37732 95714 1113734 1837310 1742299 1308483 947967 713349
46418 713349 873275 1614915 2119512 1104475 -1377471 -3666434 -4429468 -3989084 -3321432
46409 -3321432 -2693517 -1944593 -1300344 -1082147 -1125041 -1182481 -1445321 -2014707 -2347367 -1942956
46399 -1942956 -1176741 -728745 -569372 -291766 -100975 -538316 -1357283 -1631268 -1112467
46390a112467M21720n32720j248373r88634k1686R22816J295322J014488N40808
46381B91274M86743Q68533J012200M44336m73644j050994j016379n18882J45512
46372A88699N04167J34906o51962q61461p0124P99580N80896n56906j278934p21253
46362a932392N96023J482885J285044L44718m53535n49876k14315j06207l82535
46353F9810n98089n13374m36143n24463l76089K25630P17714N38473O6519M9628
46343g80384M02578L94463r1577l40998N5799O22234P97960O58689M86680K05757
46333B411201k69449n62060l11169J23345Q5170l06216k21333N32184R56014K50133
46323B687820p80512o61110N43782J095944M9806j224597q87284P56884J713924
$$ plain form
46390 -1112467 -690747 -1223467 -2471840 -3460474 -3482160 -2559344 -1264022 -249534 291274
46381 291274 778017 1646550 2658750 3103086 2629442 1578448 562069 43187 188699
46372 188699 692866 827772 175810 -685651 -755775 43805 624701 67795 -1211139 -1932392
46362 -1932392 -1336369 146516 1431560 1776278 1322743 772867 558552 452345 69810
46353 69810 -528279 -1041653 -1477796 -2002259 -2378348 -2152718 -1435004 -896531 -830012 -780384
46343 -780384 -377806 16657 -74920 -415918 -360119 262115 1060075 1718764 2205444 2411201
46333 2411201 2141752 1579692 1268523 1391868 1477038 1170822 949489 1481673 2437687 2687820
46323 2687820 1907308 1246198 1789980 2885924 2935730 1711133 823849 1580733 3294657
46314C294657J060942p4322m15881j53532j18035l51907l24382J023J07670k87323
46304B738910r19946j323243j196403o46442k27806l92941p72531n09212M84941
46295b764673J220109R33331Q0345m55609n44453n79323n87236l31150J6121N7088
46285b955450j13105l1056L57419O17867N20871L30923L48109N03029M65437K532
46275D6576o97590j023438n52144K68167N05838k5081m96979k98288J54342K83692
46265a834905L02894O10080Q59964N03475j69412m02193j04746K00922L14557
46256B80636M19041M25198J02325k70751k02192J58131K36015p720j37046j46698
46246H56939m29975q69908q70809l86596o2213j96441l52547j70938J76660N10659
$$ plain form
46314 3294657 4355599 4281277 3865396 3711864 3593829 3241922 2917540 2918563 3026233 2738910
46304 2738910 1818964 495721 -700682 -1347124 -1574930 -1967871 -2740402 -3249614 -2764673
46295 -2764673 -1544564 -611233 -530888 -986497 -1530950 -2110273 -2697509 -3028659 -3012538 -2955450
46285 -2955450 -3068555 -3099611 -2742192 -2124325 -1603454 -1272531 -924422 -421393 44044 46576
46275 46576 -651014 -1674452 -2226596 -1958429 -1452591 -1477672 -1974651 -2272939 -2118597 -1834905
46265 -1834905 -1532011 -921931 -61967 441508 272096 -130097 -234843 -33921 280636
46256 280636 699677 1124875 1227200 956449 754257 912388 1148403 1140683 1003637 856939
46246 856939 426964 -442944 -1313753 -1700349 -1762562 -1959003 -2311550 -2482488 -2305828 -1795169
46236a795169Q93235J181948J038313N54226K06750R1702p8932j79997K33527
46227B145603Q94798Q84023N1387n89488l59462J08997l4424o39911j101779j330098
46217B9646j392650q80565M21808J670181J709297N24875p78238j299486j018326
46208a013458l39705L47515P02450O10580L63895K56733J01333m03274r56015
46199c29946q99660k22425K60824l3595o34493n97247K88233J221016J332078
46190C84785O34735j32986m45180m48552m82830n44886m55096k03865J96387Q48433
46180f49055J512979J411824J88272j186320j326089k19419P62657P22894J64540
46171A382283j69778l55080o29353n91232J22006R38286R79095K74077l51038
$$ plain form
46236 -1795169 -901934 280014 1318327 1872553 2079303 2171005 2092073 1912076 2145603
46227 2145603 3040401 3924424 3975811 3386323 3026861 3135858 3101434 2461523 1359744 29646
46217 29646 -1363004 -2243569 -1821761 -151580 1557717 2082592 1304354 4868 -1013458
46208 -1013458 -1353163 -1005648 -303198 307382 671277 928010 1029343 626069 -329946
46199 -329946 -1229606 -1452031 -1191207 -1224802 -1859295 -2456542 -2168309 -947293 384785
46190 384785 1019520 886534 441354 -7198 -490028 -1034914 -1490010 -1693875 -1497488 -649055
46180 -649055 863924 2275748 2464020 1277700 -48389 -267808 494849 1217743 1382283
46171 1382283 1212505 857425 228072 -363160 -241154 697132 1676227 1950304 1599266
46162A599266l81495k1258K98605K67615k74299j123731j634389j316489m69163
46153c055338J31583R9727k76787m80156k25113L84306R27712J012096O63244
46144h18726K17225j42524l89409k92426L08094Q14909L07711j025933j773624
46135b794703j143435o1827K98723K24979O56257J354865J219532J82471n37410
46126f00548k18969M38650N10502N8833k94520l18715j90431j2952J94439K44491
46116a89220r9047p55039j237772j035692j90778N51021M82960j22963k87945
46107b884475L12141R02485Q66917O49254P38955N85291m11781j439294j147726
46098a828233K55922J172582Q73530K19745n7273l12983p17566m90957O50506
$$ plain form
46162 1599266 1217771 1196513 1495118 1762733 1488434 364703 -1269686 -2586175 -3055338
46153 -3055338 -2923755 -2824028 -3100815 -3580971 -3806084 -3421778 -2494066 -1481970 -818726
46144 -818726 -601501 -744025 -1133434 -1425860 -1117766 -302857 4854 -1021079 -2794703
46135 -2794703 -3938138 -3999965 -3701242 -3476263 -2820006 -1465141 -245609 -63138 -600548
46126 -600548 -819517 -380867 129635 188468 -106052 -424767 -615198 -628150 -433711 -189220
46116 -189220 -288267 -1043306 -2281078 -3316770 -3507548 -2956527 -2473567 -2596530 -2884475
46107 -2884475 -2572334 -1669849 -802932 -153678 585277 1170568 758787 -680507 -1828233
46098 -1828233 -1572311 -399729 473801 693546 636273 323290 -394276 -885233 -234727
46089b34727J465567Q02367n80382j069208n13944j46288m38994m68419L64374
46080h19654J196367R00142l49367j373172j431561p91788q6727L59816N69726
46071a826218O31909N11885O4203p17531j414407j365589l99921P34686J040439
46062b740544M26545j49860J14827Q47931J030986L59921m02032m73931k4418
46053a010575J57195k82596q27669p14243J44412R60628R26317K35063j09473
46044e20941L00342N92378o8607r59760o51296P15281J287693P8533j510620j590547
46034b327544k89022P33411O59995J96220J23186L43244M57485L76850J47329
46025D21154j78409l51193j32142K61412L84029J85770n4873k61615m76097m41032
$$ plain form
46089 -234727 1230840 2033207 1452825 383617 -130327 -276615 -715609 -1184028 -819654
46080 -819654 376713 1276855 927488 -445684 -1877245 -2669033 -2755760 -2395944 -1826218
46071 -1826218 -1194309 -682424 -618221 -1335752 -2750159 -4115748 -4515669 -3780983 -2740544
46062 -2740544 -2313999 -2463859 -2349032 -1501101 -470115 -110194 -512226 -986157 -1010575
46053 -1010575 -853380 -1135976 -1963645 -2677888 -2533476 -1572848 -646531 -411468 -520941
46044 -520941 -220599 371779 303172 -656588 -1307884 -592603 695090 773623 -736997 -2327544
46034 -2327544 -2616566 -1883155 -1223160 -1026940 -903754 -560510 -103025 273825 421154
46025 421154 242745 -108448 -240590 20822 404851 590621 535748 274133 -201964 -642996
46015f42996P6345O90719Q17191N61140M79642N86173L88619j46085m96734m63636
46005A850378l34269j75355J90033M75318J17710p09378j161776r40571n58031
45996a245941k80774K04458Q75661J148296Q50024M59279J45897l67285p83169
45987A006446l53042O12251P75280r3177n19157K75367R32174J56646j051683
45978A741105r51068K44024R32685O11176O9837k83075n51719k85023Q94007J887097
45968D309046J240360m34357j092226l74091k2883q31417j388200p29371j07638
45959E69223p03545j370402n17325J033194J171377j76658r65543k06406P11682
45950d54403L48412p07398r52801j34325P00806Q10830N07525L79865M51391L38094
$$ plain form
46015 -642996 -566651 124068 941259 1502399 1982041 2568214 2956833 2810748 2314014 1850378
46005 1850378 1516109 1340754 1530787 2006105 2123815 1414437 252661 -687910 -1245941
45996 -1245941 -1526715 -1322257 -446596 701700 1551724 2011003 2156900 1789615 1006446
45987 1006446 653404 1265655 2040935 1947758 1428601 1703968 2636142 2792788 1741105
45978 1741105 790037 1034061 1966746 2577922 2647759 2364684 1812965 1527942 2421949 4309046
45968 4309046 5549406 5115049 4022823 3648732 3625849 2794432 1406232 676861 569223
45959 569223 -134322 -1504724 -2022049 -988855 182522 5864 -959679 -1166085 -454403
45950 -454403 -105991 -813389 -1766190 -1900515 -1199709 -388879 118646 498511 949902 1287996
45940A287996q9633n33601p36789q16159q94411o55971K04687J140345J103132
45931I596N1351o51973O819J174193J278684K47225n80472n76460n18878r37319
45921d97234j139687n58713J20092J28686p1361K03020L80404l90423j357276
45912c182492r60415O16917J457667P40525j71958r0816K52207j49774p05856
45903b193995m24012K03791J59443j13903N28873J718720J980427J137723M34223
45894C431290K35298m13477j555086j670053j56238J292030J031080j90064o30308
45885A374472j93670r2962n99512p80504k59535K03478J4207m44815n13376k5773
45875a317990P22457J219761R91060J23008n95751n64637j76640j77882n06694
$$ plain form
45940 1287996 1198363 664762 -72027 -888186 -1782597 -2438568 -2233881 -1093536 9596
45931 9596 60947 -591026 -584207 589986 1868670 2115895 1535423 958963 440085 -497234
45921 -497234 -1636921 -2195634 -2075542 -1946856 -2018217 -1815197 -1434793 -1825216 -3182492
45912 -3182492 -4142907 -3525990 -2068323 -1327798 -1499756 -1590572 -1338365 -1488139 -2193995
45903 -2193995 -2618007 -2414216 -2254773 -2368676 -1839803 -121083 1859344 2997067 3431290
45894 3431290 3666588 3253111 1698025 27972 -128266 1163764 2194844 2004780 1374472
45885 1374472 1180802 1087840 488328 -292176 -551711 -348233 -334026 -778841 -1292217 -1317990
45875 -1317990 -595533 624228 1615288 1738296 1142545 577908 401268 223386 -283308
45866b83308m69627R5259N54472L67384l26410r87578j109857n09140L95004P94068
45856a479733M00307j59260k76344k15737m47254o57089k53125N41361J000794
45847a546080J003449R10338O40166r1044q05918o91147L0891K96787j29381l31377
45837g13316J67076O24401L55762k02195k91222O9159L61837L58795J30286k37916
45827F22667n29255m35688k3151K49639J67219l0447j46262j78199N2569P00742
45817D49834J221816P35327o66896j760603j662420p37099K36655R65894J330105
45808A12613J054532K73544l01928l49187m12944q96453j278083r58897k54866
45799c011669J38135J50770J75446L60798O45648J028474J264925Q10129l58692
$$ plain form
45866 -283308 -752935 -657676 -103204 264180 -62230 -1049808 -2159665 -2668805 -2273801 -1479733
45856 -1479733 -1079426 -1238686 -1515030 -1730767 -2178021 -2835110 -3088235 -2546874 -1546080
45847 -1546080 -542631 367707 1007873 916829 110911 -580236 -549345 -252558 -381939 -713316
45837 -713316 -546240 78161 433923 231728 -59494 9665 371502 730297 860583 622667
45827 622667 93412 -342276 -365427 -115788 51431 20984 -125278 -303477 -250908 449834
45817 449834 1671650 2406977 1740081 -20522 -1682942 -2420041 -2183386 -1217492 112613
45808 112613 1167145 1440689 1138761 789574 376630 -519823 -1797906 -2756803 -3011669
45799 -3011669 -2873534 -2722764 -2547318 -2186520 -1540872 -512398 752527 1562656 1203964
45790A203964j348662j353628n96091K17501Q00956J091335Q11902j6728o49990
45781A60559m73185J11132K93386q2233o47787j142113j279014o37989N67960
45772c129284J290483J030142O75923J016593J279189M31178q27195r69529p1309
45763G26191L90458l2770l19360m1961n2421o82251r59246l19963L74539L62114
45753e54670K07038N78979R72939O78750L8959l18483o08853j125683j185234
45744a316258j73596R56209P33767n23492r57852J57569J408037J379534N95616
45735B259534M60729J092765J302443M61781o49350j067029r09536q91703j083893
45726I75741r31658l92631j78199n55358p00009Q4167J077321J000206j05082
$$ plain form
45790 1203964 -144698 -1498326 -2094417 -1876916 -1075960 15375 827277 810549 160559
45781 160559 -312626 -201494 91892 9659 -638128 -1780241 -3059255 -3697244 -3129284
45772 -3129284 -1838801 -808659 -132736 883857 2163046 2594224 1767029 797500 726191
45763 726191 1116649 1083879 764519 722558 670137 -12114 -971360 -1291323 -916784 -554670
45753 -554670 -347632 231347 1204286 1883036 1921995 1603512 994659 -131024 -1316258
45744 -1316258 -1489854 -533645 200122 -323370 -1281222 -1123653 284384 1663918 2259534
45735 2259534 2720263 3813028 5115471 5577252 4927902 3860873 2951337 2059634 975741
45726 975741 44083 -348548 -526747 -1082105 -1782114 -1697947 -620626 379580 274498
45717B74498q67452m84528L60816P13727N33519K43142n6487l32816k64236K21563
45707C41746N73592L51217j72313o39032j173856j670200j286430L20311J842830
45698a512135J682338K03812o98250k85379J93576k84957q96779m36186O69318
45689a364642J018410L70238j04154L64611J116281J118418L35683l79236l94785
45680B080824O7188K83447j89098j040668j462394r50246J27405Q52052O52817
45671D21327j69976p66770n20312L93409J120136R16900m6444q10199o91683k9970
45661a83582L57101K03035j16284l24349n12433o72717n53917j44889K13144L89973
45651a344918O12955Q28969N60366k10696o89723l95918J042k43024o34828k60886
$$ plain form
45717 274498 -592954 -1077482 -716666 -2939 530580 773722 717235 384419 120183 341746
45707 341746 915338 1266555 1094242 455210 -718646 -2388846 -3675276 -3354965 -1512135
45698 -1512135 170203 374015 -324235 -609614 -416038 -700995 -1597774 -2033960 -1364642
45689 -1364642 -346232 24006 -80148 284463 1400744 2519162 2854845 2475609 2080824
45680 2080824 2148012 2431459 2242361 1201693 -260701 -1210947 -1083542 -231490 421327
45671 421327 251351 -515419 -1035731 -642322 477814 1394714 1348270 538071 -153612 -183582
45661 -183582 173519 376554 260270 -64079 -576512 -1249229 -1803146 -1948035 -1734891 -1344918
45651 -1344918 -731963 97006 657372 446676 -243047 -638965 -637923 -880947 -1515775 -1776661
45641a776661N22499N28029k68592o13493m4136M12404J28786k5107O18381J091329
45631E73439L50682q00160q99281j93436r8435o87189n74212O15639J467715R93441
45621G48203P3866j22511J08867j50236p99994j027018o52870j64743K17701N99483
45611a169252P95911N07864p276j77003P151j7098m90805r73884r50531l96563
45601b871486K94336O44898M03277j77194m52172r1128M43943M59242n6054m62339
45591a864677l34830J11943M49656N06061L76782K80081M11498O68375N89563
45582A194452o2829p22683n35925M11276R03404K2673j546272k140709j034759
45573c511372O79092J304954L83514r77994j498653r97690j03431Q16033J800157
$$ plain form
45641 -1776661 -1254162 -726133 -994725 -1608218 -1652354 -1239950 -1111164 -1136271 -517890 573439
45631 573439 924121 123961 -775320 -968756 -1067191 -1754380 -2328592 -1712953 -245238 748203
45621 748203 822069 699558 808425 658189 -141805 -1168823 -1821693 -1986436 -1768735 -1169252
45611 -1169252 -373341 134523 127247 -49756 -42605 -59703 -550508 -1524392 -2474923 -2871486
45601 -2871486 -2577150 -1932252 -1528975 -1706169 -2158341 -2249469 -1805526 -1346284 -1402338 -1864677
45591 -1864677 -2199507 -2087564 -1637908 -1131847 -755065 -474984 -63486 604889 1194452
45582 1194452 1131623 408940 -126985 284291 1187695 1210368 -335904 -2476613 -3511372
45573 -3511372 -2832280 -1527326 -1143812 -2121806 -3620459 -4618149 -4721580 -3905547 -2105390
45564b105390K519012K190511O66052r88065j592097j208373p82368o71074l19233
45555b291025N43835J205250R16147P758n32555l63687p9277k04075m59808k88154
45545a545591K69665O36358N24396K64657K08837J81329j70992p00163q34482
45536a165986l34520L68849O95940N22374J32978k11049m73377p09938q74876
45527b049605p70431k42524M98247R13719P35745L67041L17905M02393O9452n02910
45517b60968m25725N16242J278124R21483n7027n06685k76387j93957o01691q69253
45507d75844m79982K09491N95277O07687N13941L66341q32o45550j368310j709055
45497b386836j134009L81176J941669K414366J670120O79198K24368R1410j96158
$$ plain form
45564 -2105390 413622 2604133 3270185 2282120 690023 -518350 -1300718 -1971792 -2291025
45555 -2291025 -1747190 -541940 374207 381965 -150590 -514277 -593554 -797629 -1257437 -1545591
45545 -1545591 -1275926 -639568 -115172 149485 358322 539651 368659 -331504 -1165986
45536 -1165986 -1500506 -1131657 -435717 86657 219635 8586 -464791 -1174729 -2049605
45527 -2049605 -2820036 -3062560 -2564313 -1650594 -914849 -547808 -229903 172490 241942 -260968
45517 -260968 -686693 -170451 1107673 2029156 1972129 1465444 1189057 995100 393409 -475844
45507 -475844 -955826 -746335 -151058 456629 970570 1336911 1336079 690529 -677781 -2386836
45497 -2386836 -3520845 -3139669 -1198000 1216366 2886486 3565684 3790052 3881462 3685304
45488C685304n04330m98125l96386n91594q24008n20440J56122M04865L0245j89802
45478G51851L13369J016679J083379N08376j02693n30053j009333j461214j415278
45469h44917q22688k89324k24026k89470l8852L91270O54965Q16930J050757J089675
45459A494320O42520Q1926n7939r0516p37788j663041j558019j04326J211188
45450g81675J008337q5921m22649L62773J146342J124444O44872J94333l18623
45441B872233r07942j039375l79688N41353R18970N66880j09910o57001p74141
45432A031379l75677J80426K58216k77464p35590m55761K58293N31608J14126
45423E29556l16991j16170M73225O48946N1659q10873j154131p53079m0852N16206
$$ plain form
45488 3685304 3180974 2682849 2286463 1694869 870861 350421 506543 911408 941653 751851
45478 751851 1065220 2081899 3165278 3673654 3570961 3040908 2031575 570361 -844917
45469 -844917 -1667605 -1956929 -2180955 -2470425 -2509277 -2118007 -1463042 -646112 404645 1494320
45459 1494320 2136840 2218766 2160827 2070311 1332523 -330518 -1888537 -1992863 -781675
45450 -781675 226662 140741 -281908 80865 1227207 2351651 2996523 3190856 2872233
45441 2872233 1964291 924916 545228 1086581 2005551 2572431 2462521 1805520 1031379
45432 1031379 655702 836128 1094344 816880 81290 -374471 -116178 415430 529556
45423 529556 212565 96395 569620 1218566 1270225 459352 -694779 -1447858 -1488710 -972504
45413i72504Q24400Q82194N24214k11155p93085p72863m30237l08403l31943r6916
45403a686298J39457k55807r22791n65388J116352K587611K383815J024038N2210
45394C873199j33557k95560o62746o36577j60691r166l74172l72528M59873J199593
45384B887668Q50248j21790m55978J45625P74924O05161k97774j317358j808670
45375A262056j384325k96925N10470L37532k96791k43336O50434J229442O36016
45366B404573m64367q16548k48190L12345K82414R8065K94417N82658L01631n46107
45356B200891j213269j107192l92730L33163O39897M41283r0357n50427m92001
45347b30742Q2817N70369M67835J08361J97026O26764M54830o21509j476893r62202
$$ plain form
45413 -972504 -148104 734090 1258304 1047149 254064 -518799 -949036 -1257439 -1589382 -1686298
45403 -1686298 -1546841 -1802648 -2725439 -3290827 -2174475 413136 2796951 3820989 3873199
45394 3873199 3739642 3444082 2781336 2144759 1984068 1974902 1600730 1228202 1688075 2887668
45384 2887668 3737916 3616126 3160148 3305773 4080697 4685858 4388084 3070726 1262056
45375 1262056 -122269 -419194 91276 428808 132017 -111319 539115 1768557 2404573
45366 2404573 1940206 1123658 875468 1187813 1470227 1568292 1862709 2445367 2746998 2200891
45356 2200891 987622 -119570 -512300 -179137 460760 902043 811686 261259 -230742
45347 -230742 -147925 422444 890279 998640 1195666 1822430 2277260 1655751 178858 -783344
45337g83344L67995Q86821J00432q49187j040166r56849j224477j253067k42800
45328d994642J156682J544254Q83537N36253J051488J303427L84477q63235j127665
45319a25424n35200j62572k29751m2389M64589M14739n29368j415551j238617
45310c399544k15049P00616J033953R78909P69548M66108J92035P0960k6089k88989
45300B82458n80461o06413m29829l93179m70975j66055O84488J388090J163759
45291H71883K75707j81207K47435P01462K42228o78123p35716L49956J263386
45282B357011Q00659n51328j357272j115873o21890n78632o70533k74574M98898
45273a513534R50061P45726L25193L27227Q21474J222558R48018O4442q24003
$$ plain form
45337 -783344 -415349 471472 571904 -277283 -1317449 -2274298 -3498775 -4751842 -4994642
45328 -4994642 -3837960 -2293706 -1410169 -873916 177572 1480999 1865476 1002241 -125424
45319 -125424 -660624 -823196 -1052947 -1095336 -630747 -216008 -745376 -2160927 -3399544
45310 -3399544 -3614593 -2913977 -1880024 -901115 -131567 334541 526576 597536 571447 282458
45300 282458 -298003 -904416 -1334245 -1727424 -2198399 -2364454 -1679966 -291876 871883
45291 871883 1147590 966383 1213818 1915280 2157508 1479385 743669 1093625 2357011
45282 2357011 3157670 2606342 1249070 133197 -488693 -1067325 -1737858 -2012432 -1513534
45273 -1513534 -563473 182253 507446 834673 1656147 2878705 3826723 3891165 3067162
45264C067162j246142j178250p28293M7926Q31137J035707N54484J18382L57054
45255B859167Q04033N21763m50849j061920p03799M9595L81870K51464J33955
45246B785279K59442M76978N39314K68138k60132n70926k48223L49611L63895
45237C963376l60590r29596o08379J76550N14949K18500k14096m78249o65751
45228A616714p40925m23434L28077J082735J290683P36141l00693j218392j542547
45219H28359j285129p54489j06065N98286J007931P44167J04104j51929R5327
45210A080562J42743l13831n84658j42226M05738K56387l01280m20793n3866J83627
45200B52403K00658M72559R55765R15975L7725r75535j156470k62285J015926
$$ plain form
45264 3067162 1821020 642770 -85523 -37597 793540 1829247 2383731 2502113 2859167
45255 2859167 3663200 4184963 3734114 2672194 1968395 2017990 2399860 2651324 2785279
45246 2785279 3044721 3521699 4061013 4329151 4069019 3498093 3249870 3599481 3963376
45237 3963376 3602786 2673190 2064811 2241361 2756310 2974810 2760714 2282465 1616714
45228 1616714 875789 452355 780432 1863167 3153850 3889991 3589298 2370906 828359
45219 828359 -456770 -1211259 -1317324 -719038 288893 1033060 1137164 985235 1080562
45210 1080562 1223305 909474 324816 182590 588328 844715 543435 122642 68776 252403
45200 252403 453061 925620 1881385 2797360 2835085 1859550 703080 440795 1456721
45191A456721J559158P65957o39388j122499j68645Q96423O39720m58878p70297
45182B158272M8150O76951K24118n93018p35979k61531R7193O006l28892n62702
45172G28568m11450R9936M49714J93676k93029l38459j48832n01212j224421j153515
45162b599024P6092J334870J593912J123159N28178k41716j112955j236086k06835
45153g40405R16260R54985K85561L5806K52136J42963l17218m00028l5161J02519
45143A197418j03779m5188L74361M77059J3371m01298l33820q8880O9549L34982
45133A493775O38702M21015l64539q00294j83977R08441J332632P33446k92550
45124C886651r97428r89566l21473M50999N95174J3166n57511n37076l28666o36140
$$ plain form
45191 1456721 3015879 3781836 3142448 2019949 1851304 2747727 3387447 2928569 2158272
45182 2158272 2206422 2883373 3107491 2514473 1778494 1516963 1614156 1620162 1291270 728568
45172 728568 317118 417054 866768 1060444 767415 428956 280124 -221088 -1445509 -2599024
45162 -2599024 -2522932 -1188062 405850 1529009 2057187 1815471 702516 -533570 -740405
45153 -740405 175855 1130840 1416401 1452207 1704343 1847306 1530088 1130060 1094899 1197418
45143 1197418 1093639 1048451 1422812 1899871 1913242 1511944 1178124 1089244 1158793 1493775
45133 1493775 2132477 2553492 2188953 1388659 1204682 2113123 3445755 4179201 3886651
45124 3886651 2889223 1899657 1578184 2029183 2624357 2637523 2080012 1542936 1214270 578130
45114E78130j278693j373686o24250K56787N64646M87311O45275J111407J322050
45105A688977Q70610K6350o16670p67596n72313k93861q6446j5831m1315M0482
45095B32387L61836O28366L31745m92886j061853p29645J73166P84335P89779
45086A017230N83758M78306L35074M9513j55976j56678k13776n38338q68564p82018
45076b51469k35550M40025R03738R57701N51713p8286m17173j49466L76737M55665
45066B553635j17782p32035o93490j32897J37261k70994p09918l27782O93783
45057C99781J264111P91769r8074n14031m15871l12898l13568j43731J62985L29677
45047A150150M67254Q80015J264272R41983M3003m22337k3525M14402J55599k41170
$$ plain form
45114 578130 -700563 -2074249 -2698499 -2441712 -1877066 -1389755 -744480 366927 1688977
45105 1688977 2559587 2585937 1969267 1201671 629358 335497 249051 233220 191905 232387
45095 232387 594223 1222589 1554334 1061448 -405 -730050 -556884 227451 1017230
45086 1017230 1600988 2079294 2414368 2463881 2307905 2151227 1937451 1399113 530549 -251469
45076 -251469 -487019 -46994 856744 1814445 2366158 2287872 1870699 1721233 2097970 2553635
45066 2553635 2435853 1703818 1010328 877431 1014692 743698 33780 -294002 399781
45057 399781 1663892 2455661 2357587 1843556 1427685 1114787 801219 657488 820473 1150150
45047 1150150 1617404 2497419 3761691 4703674 4746677 4324340 4300815 4715217 4870816 4629646
45037D629646R2911P80948P51389P6668K3636J095744K180416K216826J781394
45028A3629578K127114L237830L913612L585921K899221K290753J138044r73932
45020C1848141k992899l468184k507494j609004j647004k083738k259511k286943
45012A2993364k238688j598980l28978M43281j78968j412022j794488j144781
45004D739740m26387j07850O2520p9119r93957k107330k059329o90147N11315
44995a150544M75930j03669j21002L77779P41893Q32778P54703L56231j53257
44986B010842L4576J027863J571935P46353m98051p14074j33842o2592o48372
44977C334638q30306k78818J70358M8526j98846l22805n79971p51145k17374O84340
$$ plain form
45037 4629646 4722557 5503505 6254894 6331562 6355198 7450942 9631358 11848184 13629578
45028 13629578 15756692 18994522 22908134 26494055 29393276 31684029 32822073 31848141
45020 31848141 28855242 25387058 22879564 21270560 19623556 17539818 15280307 12993364
45012 12993364 10754676 9155696 8826718 9269999 9091031 7679009 5884521 4739740
45004 4739740 4313353 4205503 4268023 4188904 3194947 1087617 -971712 -1661859 -1150544
44995 -1150544 -674614 -778283 -899285 -521506 220387 1053165 1807868 2164099 2010842
44986 2010842 2045418 3073281 4645216 5391569 4893518 4179444 4045602 3983010 3334638
44977 3334638 2504332 2225514 2395872 2444398 2245552 1922747 1342776 591631 374257 1058597
44967A058597P56820j56320p26521k11372L76616K5743n92774l23462N61216R12520
44957A681063N26300J53598O0350k21591p87491j024434n31952K90267P07108
44948H53218L36194n37710j067057n76999M89293Q47671K9096q52778o23504L11065
44938g91511P33547M79140M11189Q23208J068980P98881M65081M00253L32166
44929D720934P0337j33007j50400j78526j87669Q5325M34485K83905l02799n64586
44919D077999k70632j12625m95650q54429o80519l38411k46988j21250K48549
44910A206044L31906j40198l30980M50653J339348J038124j10878n92263n1941
44901C139815L14171j89569p73357o48797k01294k2935J29105O04209R75933P81679
$$ plain form
44967 1058597 1815417 1659097 932576 721204 1097820 1123563 530789 207327 768543 1681063
44957 1681063 2207363 2360961 2421311 2199720 1412229 387795 -144157 146110 853218
44948 853218 1189412 651702 -415355 -992354 -503061 344610 373706 -479072 -1102576 -791511
44938 -791511 -57964 421176 832365 1655573 2724553 3523434 3988515 4388768 4720934
44929 4720934 4791271 4658264 4507864 4329338 4141669 4226994 4661479 4945384 4642585 4077999
44919 4077999 3807367 3694742 3199092 2344663 1664144 1325733 1078745 957495 1206044
44910 1206044 1537950 1397752 1066772 1517425 2856773 3894897 3784019 3191756 3139815
44901 3139815 3453986 3264417 2491060 1842263 1640969 1618034 1747139 2351348 3327281 4108960
44891D108960M73400P19586J254344J308885Q06460K54870k19479p74383j003709
44882F928934k70336J032333J587097Q82341L803K13158J396666K497622K977781
44873A7249399L168223L438049L696786L713988L402575K666812J359916l91201
44865C8304547k018767k892977k880180k470751k327836k678382l141738l169381
44857A6724535k587003j644748p02781j00994j77032r58701j804484j859845j088477
44848E800470l81750l45098m90336j10984N46464P12921L59046J36901J74024
44839F401658j00095p88716j164093q30597l41180j34650K27514R93293J251036
44830E514170J67094j347083j538207k52158Q33654N88455k10204l57025O2831
$$ plain form
44891 4108960 4582360 5301946 6556290 7865175 8671635 8926505 8707026 7932643 6928934
44882 6928934 6658598 7690931 9278028 10160369 10164172 10377330 11773996 14271618 17249399
44873 17249399 20417622 23855671 27552457 31266445 34669020 37335832 38695748 38304547
44865 38304547 36285780 33392803 30512623 28041872 25714036 23035654 19893916 16724535
44857 16724535 14137532 12492784 11790003 11689009 11511977 10553276 8748792 6888947 5800470
44848 5800470 5418720 5073622 4583286 4472302 5018766 5731687 6090733 6227634 6401658
44839 6401658 6301563 5512847 4348754 3518157 3176977 3042327 3269841 4263134 5514170
44830 5514170 5681264 4334181 2795974 2543816 3377470 3965925 3755721 3398696 3461527
44821C461527K10178o7034k29389k5605L06036N26136M56820j37628j109268j648213
44811A743560j094829J68161J203266J624254J594374J085165K3648r87626j082471
44802D277502l47105K54496K91493K78556M67485K82542n11926j046432n53107
44793C393504L72783O18153J59966j19188Q8255K18351l0590k09158K7028L04122
44783D823226J10154m87564r93386j025440n22153K91662R81107J186677R52397
44774E316680N92139K54534r9189l36602j92517K55588N56280M95857M00197O28387
44764G871354J052401J251095R91886L41998m59112j033079r93361l11993N43972
44755I255161J037528J061455R06752Q48634Q92687Q52433N86650K08916L9406
$$ plain form
44821 3461527 3671705 3604671 3375282 3349677 3655713 4181849 4638669 4501041 3391773 1743560
44811 1743560 648731 816892 2020158 3644412 5238786 6323951 6347599 5359973 4277502
44802 4277502 3930397 4184893 4476386 4754942 5222427 5504969 4993043 3946611 3393504
44793 3393504 3766287 4384440 4544406 4425218 4513473 4731824 4701234 4492076 4519104 4823226
44783 4823226 4933380 4445816 3452430 2426990 1904837 2196499 3177606 4364283 5316680
44774 5316680 5908819 6163353 6064164 5727562 5535045 5790633 6346913 6842770 7242967 7871354
44764 7871354 8923755 10174850 11166736 11508734 11049622 10016543 9023182 8711189 9255161
44755 9255161 10292689 11354144 12260896 13109530 14002217 14854650 15441300 15650216 15689622
44746A5689622J99672L15351p0651p47789r07131k06629N83841M30985o25488
44737A4661783j463586j259357m44689l3545k98168n71452l45052l3941k78113
44728I933880q37318q55995k33895M3984o57162j545231j482863o62085k33770
44719C469545m70425m34512L39033R61349N69437l20124o43908l38206j51714
44710B980475l17460l62598r6657J12470J20786K80011O87272P90281J28303q81350
44700C441533j263111n20687P83555J503230J046211M8582l52126K4515J87364
44691D899066m76482j112771o08336O10249J041990K36807o50748n93414O3639
44682C410000M68637M43526K52509l2907l03339j63673M51367R33538Q50984N86067
$$ plain form
44746 15689622 15889294 16204645 16133994 15386205 14479074 14272445 14856286 15287271 14661783
44737 14661783 13198197 11938840 11494151 11460606 11162438 10590986 10245934 10211993 9933880
44728 9933880 9096562 8240567 8006672 8050656 7393494 5848263 4365400 3703315 3469545
44719 3469545 2999120 2564608 2903641 3864990 4434427 4114303 3470395 3132189 2980475
44710 2980475 2663015 2300417 2203760 2316230 2437016 2717027 3404299 4194580 4322883 3441533
44700 3441533 2178422 1657735 2441290 3944520 4990731 5039313 4687187 4711702 4899066
44691 4899066 4422584 3309813 2701477 3311726 4353716 4590523 3939775 3346361 3410000
44682 3410000 3878637 4322163 4574672 4541765 4238426 4074753 4526120 5459658 6310642 6896709
44672F896709N11598J91864p37969j490674j066283L1212K61604p51702j694189
44663B152170j490718o15558L3801N11564J238738J806446J410016J95863p31568
44654D510754o61043K492M14799J96847l97178q12950o28306M6084N87262N39205
44644C797966J88065J40019M55760O63527N74941N07122N70249L35091m44079
44635F788661j244471j375284q63540k76069J19597M97392Q73009R07700M12302
44626E839297l40146r07710r86798m34713N81843J386985J262356L66439k76180
44617F491373m7686M53473L53969j74251k57609K32483M61516L241l97251R5077
44607G214335J126974J574630R70537n3191o57573o45855l92939l29218o21945
$$ plain form
44672 6896709 7408307 7600171 6862202 5371528 4305245 4336457 4598061 3846359 2152170
44663 2152170 661452 45894 79695 591259 1829997 3636443 5046459 5242322 4510754
44654 4510754 3849711 3852203 4267002 4463849 4066671 3253721 2625415 2671499 3258761 3797966
44644 3797966 3986031 4126050 4581810 5245337 5820278 6327400 6897649 7232740 6788661
44635 6788661 5544190 4168906 3305366 3029297 3148894 3646286 4519295 5426995 5839297
44626 5839297 5499151 4591441 3604643 3169930 3751773 5138758 6401114 6767553 6491373
44617 6491373 6443687 6897160 7251129 7076878 6819269 7051752 7513268 7516509 7119258 7214335
44607 7214335 8341309 9915939 10886476 10833285 10175712 9529857 9136918 8807700 8185755
44598H185755j105995j394643j211500o95720k70054j78920k79429l11383k35385
44589B502726k32479m45260p87048j005836r35808o60977l59963k3156M93912
44580a453889J090356J340640R84395L16096j45765k48854k32489k95501m18312
44571I36677n15075m58007l7475P45262J393369J337035O82302J26973L7825M8174
44561D297060k43860o13395n61700j9982O23355R76071Q58669L09623l46834o65951
44551D613056n80579m80822n47796l98117J91439O30497K69184m35099l48962
44542B912801O71067J352521O04659j037502k030812j553847k05998Q41201J028193
44533B582283P26505N33833M04444k30936j348211j868156r62264N44909J071187
$$ plain form
44598 8185755 7079760 5685117 4473617 3777897 3507843 3328923 3049494 2738111 2502726
44589 2502726 2270247 1824987 1037939 32103 -903705 -1564682 -1924645 -1947801 -1453889
44580 -1453889 -363533 977107 1961502 2277598 2131833 1882979 1650490 1354989 936677
44571 936677 421602 -36405 -73880 671382 2064751 3401786 4084088 4211061 4248886 4297060
44561 4297060 4053200 3439805 2878105 2858123 3481478 4457549 5316218 5625841 5279007 4613056
44551 4613056 4032477 3551655 3003859 2605742 2797181 3427678 3696862 3261763 2912801
44542 2912801 3583868 4936389 5541048 4503546 2472734 918887 712889 1554090 2582283
44533 2582283 3308788 3842621 4247065 4016129 2667918 799762 -162502 382407 1453594
44524A453594N02129L13781J182848J820258R99105m47295q81387k44990K65205
44515D963248L36169O95256J292460J059347k00938j232239j228814r62141j228004
44506C494344j400781n83019P37081J333640R41833K53832k94554o88310o61392
44497C132674N6167R71984J253383Q39796L46548K9915l21509o45793o67456n77850
44487D417859p29265p75386j54473O52445N68526k73038n20129K36888P04676
44478D128103p563q61620n33348N11640Q86384M38503J20502K10046J52804k5806
44468E019645L19404R54273P01129o45703j631915j138194l6610J13924o95392
44459B960561j094407l96213O09417R54810O53694K63613k407k39241l37430m5641
$$ plain form
44524 1453594 1955723 2269504 3452352 5272610 6271715 5824420 4943033 4698043 4963248
44515 4963248 5299417 5994673 7287133 8346480 8145542 6913303 5684489 4722348 3494344
44506 3494344 2093563 1510544 2247625 3581265 4523098 4776930 4482376 3794066 3132674
44497 3132674 3188841 4160825 5414208 6254004 6600552 6630467 6308958 5663165 4995709 4417859
44487 4417859 3688594 2913208 2758735 3411180 3979706 3706668 3186539 3423427 4128103
44478 4128103 4120540 3258920 2725572 3237212 4123596 4562099 4682601 4892647 5045451 5019645
44468 5019645 5339049 6293322 6994451 6348748 4716833 3578639 3542029 3655953 2960561
44459 2960561 1866154 1469941 2079358 3034168 3687862 3951475 3949068 3709827 3372397 3326756
44449C326756N60124J059370J146306Q51683L36436k38395o03283m88993k8338
44440E921666K36420J8343k72940r2515M40824P60642P39873P74882R46258P58902
44430A0232355q354p88876r87855p66105n75589l69764R8652N48231M79434L3374
44420G895503k10288k20932n16142j105440j240195n01327N27607J040374R39299
44411F608459O43964M49576M33962N73673O09392K20278l46994l41322L64913
44402I215901P59102o5621j558741k320765j785255n77185N52592J295719J397799
44393F913546O78988l58407p89872m57523j59292l27798l69631J28017M10176
44384E668204k83673j189808q76948N54531J412003P86224k07292j91162M59419
$$ plain form
44449 3326756 3886880 4946250 6092556 6944239 7280675 7042280 6438997 5950004 5921666
44440 5921666 6158086 6176429 5903489 5810974 6251798 7012440 7752313 8527195 9473453 10232355
44430 10232355 10224001 9435125 8447270 7681165 7105576 6735812 6834464 7382695 7862129 7895503
44420 7895503 7685215 7464283 6948141 5842701 4602506 4101179 4628786 5669160 6608459
44411 6608459 7252423 7701999 8135961 8709634 9319026 9539304 9192310 8850988 9215901
44402 9215901 9975003 9909382 8350641 6029876 4244621 3667436 4220028 5515747 6913546
44393 6913546 7592534 7234127 6444255 5986732 5827440 5499642 5130011 5258028 5668204
44384 5668204 5384531 4194723 3317775 3872306 5284309 6070533 5863241 5672079 6131498
44375F131498L65004o80777j468089j215882n51041l47250m93835l85259J4337
44366A368706L15488N30720R71417J425028J208318K18658o86641p07788q1913
44357D561993L38374J90624j51737k97285l30477m91264o78245n08818J58385
44348B791550Q82500R49882J51283q13177r93814l49331J10277l75870j219472
44339A133828j201459j10818J001309J260684R42223O89229M71049k3225m41620
44330C721200j34135O35254P66754j27157j032479q92358o0738K93183j11705
44321C057819l88341P5186O70280M64743m26487r34301m23235M83645O79072n5941
44311C202440p95379o53592Q4335L76785j36932o51899l66980L84590P02526M72736
$$ plain form
44375 6131498 6496502 5815725 4347636 3131754 2580713 2233463 1739628 1354369 1368706
44366 1368706 1684194 2214914 3186331 4611359 5819677 6038335 5351694 4643906 4561993
44357 4561993 4900367 5090991 4939254 4641969 4311492 3820228 3141983 2633165 2791550
44348 2791550 3674050 4623932 4775215 3962038 2968224 2618893 2729170 2353300 1133828
44339 1133828 -67631 -178449 822860 2083544 3025767 3714996 4186045 4162820 3721200
44330 3721200 3587065 4222319 4989073 4861916 3829437 2937079 2876341 3169524 3057819
44321 3057819 2669478 2744664 3414944 3879687 3453200 2518899 2095664 2579309 3258381 3202440
44311 3202440 2407061 1753469 1837804 2214589 2077657 1425758 1058778 1443368 2145894 2618630
44301B618630M00745P42318Q44183K72051l32574j53688M85082M89255m06693
44292D959309j145599p00847N79108J387756J001383o221n86206l84153J30755
44283E235285M62820N82206N80990L22947k09847n63799l35312J21132R4672m31411
44273E859683p89700p15834o24282n82473N0506J377855K214714J511171k8560
44264H273080p86573l79902J11221m8146l63397k41411M6460K1364j62838j05582
44254F364276J39944K59554J96120P3253p6632j85910p0869K38925M00109K35049
44244G573819Q623K0312K41444N16167P39113O91353J84077m28344m26411K60219
44234I380372P35751K42799q43715j513220j221895j88088R41338J385612P35800
$$ plain form
44301 2618630 3019375 3761693 4605876 4877927 4545353 4391665 4876747 5366002 4959309
44292 4959309 3813710 3112863 3691971 5079727 6081110 6074889 5488683 5104530 5235285
44283 5235285 5698105 6280311 6861301 7184248 6974401 6410602 6075290 6196422 6291094 5859683
44273 5859683 5069983 4354149 3729867 3147394 3197900 4575755 6790469 8301640 8273080
44264 8273080 7486507 7106605 7217826 7169680 6806283 6564872 6611332 6632696 6469858 6364276
44254 6364276 6504220 6763774 6959894 7033147 6956515 6770605 6699736 6938661 7338770 7573819
44244 7573819 7582442 7602754 7844198 8360365 9099478 9790831 9974908 9546564 9120153 9380372
44234 9380372 10116123 10358922 9515207 8001987 6780092 6592004 7533342 8918954 9654754
44225I654754m18358r05176m20086P7882j32329m63399j56966L79123L88051J69905
44215H173401M15862P09984J62353p73873p22784L61207R64249L37217m88319
44206I139297n35146k49463k49039p8205O93068J231232O00568n51450p47929
44197I252933K82759J436195J801242J389585N53799k99003n43113J32141J036898
44188A5043436J211679Q32887R72420J872140K428885J742965L87618l44945N5444
44179B4202529R62479J370314P32797n81092j472773j154845j54993K08063m80733
44170B3631746j193228r64935k54825j22902n45295m91513L86947J073947N49260
44161B2069202q07408j719876j591230r85991o26188n30505l84263k58565m40885
$$ plain form
44225 9654754 9236396 8331220 7911134 7989016 7856687 7393288 7236322 7615445 8003496 8173401
44215 8173401 8589263 9299247 9461600 8687727 7964943 8326150 9290399 9627616 9139297
44206 9139297 8604151 8354688 8105649 8027444 8720512 9951744 10552312 10000862 9252933
44197 9252933 9535692 10971887 12773129 14162714 14716513 14417510 13874397 14006538 15043436
44188 15043436 16255115 17088002 18060422 19932562 22361447 24104412 24492030 24147085 24202529
44179 24202529 25165008 26535322 27268119 26687027 25214254 24059409 23904416 24112479 23631746
44170 23631746 22438518 21473583 21218758 21095856 20550561 20059048 20445995 21519942 22069202
44161 22069202 21261794 19541918 17950688 16964697 16338509 15808004 15423741 15165176 14724291
44152A4724291p58989o70637r0176M01702L71448O5426j70519m86937j034654
44143A2350955j310252p32821L30172R16638Q36166Q39012J237829J259979L03208
44134A6030886q89794j109133l56477J78183k45078j013870j065464j89395Q40054
44125A2179912J177213P24837J08661o6888J30236J83669n2219j43250J60375
44116A4402546M44236L28442J71177M08169N72730o7216j014387q66151N45138
44107A4924684J519128P82629n51107m87386R84187J953251J414891N36738O29504
44098B1706519J152235P45478n30818j209909m88778P53151J196248O06553j85477
44089B3745202l14105M44463J630974K363392J909343M36592q78540q67996M36026
$$ plain form
44152 14724291 13965302 13294665 13204489 13606191 13977639 14043065 13872546 13385609 12350955
44143 12350955 11040703 10307882 10638054 11554692 12390858 13229870 14467699 15727678 16030886
44134 16030886 15141092 14031959 13675482 13853665 13608587 12594717 11529253 11339858 12179912
44125 12179912 13357125 14081962 14190623 14123735 14253971 14437640 14385421 14242171 14402546
44116 14402546 14846782 15175224 15346401 15754570 16327300 16260084 15245697 14379546 14924684
44107 14924684 16443812 17226441 16675334 16187948 17172135 19125386 20540277 21077015 21706519
44098 21706519 22858754 23604232 23073414 21863505 21374727 22127878 23324126 23930679 23745202
44089 23745202 23431097 23875560 25506534 27869926 29779269 30215861 29337321 28469325 28905351
44080B8905351J874698K475196K391972K380055K681281K899892K864041K962224
44072D9434710L368441L537990L070103K659726L332040M836693N801152N727345
44064H1768200N812603P153714R042656J0061426J0268010J1032064J2883819
44057A48022492J4840919J6100705J7203706J8938448K1003865K2476299K2938538
44050B81524972K2392048K0557451J7117688J2450781P383309K252920l195034
44043C60484135q945888j4241731j8113252k0139843k0643200k0290997j9497910
44036B38611314j8175746j6205486j4066075j2548753j1781505j1124163j0241461
44029A44468125r558180r232055q522679o983262n559579n389403n936897n567499
$$ plain form
44080 28905351 30780049 33255245 35647217 38027272 40708553 43608445 46472486 49434710
44072 49434710 52803151 56341141 59411244 62070970 65403010 70239703 76040855 81768200
44064 81768200 87580803 94734517 103777173 113838599 124106609 135138673 148022492
44057 148022492 162863411 178964116 196167822 215106270 236110135 258586434 281524972
44050 281524972 303917020 324474471 341592159 354042940 361426249 363679169 360484135
44043 360484135 351538247 337296516 319183264 299043421 278400221 258109224 238611314
44036 238611314 220435568 204230082 190164007 177615254 165833749 154709586 144468125
44029 144468125 134909945 125677890 117155211 110171949 104612370 99222967 93286070 87718571
44021H7718571l848295k026778j126995q11278m65879k35670l85441o02110o36538
44012G7579587q74102j560706k115029j944500j423142j350133j858919k493281
44004F3959775k932487l016263k516044j577531r44858r82612r14409O6593J300851
43995E2443015J379949K64500m59932L22946J881697K766937K552926J929845
43987F3081883J571183J429763R53899k47236j799319k676286k326505j607832
43979E8379550j942190l429785m543435m020451k359480r58309m19405m03415
43971D0303080o62227j282820j980260k003699j063308J00759M09382m21289j557146
43962C1842472j808714p79558O28660R82861k18941j964342k803828k345959j392788
$$ plain form
44021 87718571 83870276 81843498 80716503 79905225 79439346 79203676 78818235 78216125 77579587
44012 77579587 76705485 75144779 73029750 71085250 69662108 68311975 66453056 63959775
44004 63959775 61027288 58011025 55494981 53917450 52972592 51989980 51075571 51142164 52443015
43995 52443015 53822964 54087464 53627532 53950478 55832175 58599112 61152038 63081883
43987 63081883 64653066 66082829 67036728 66789492 64990173 62313887 59987382 58379550
43979 58379550 56437360 53007575 48464140 44443689 42084209 41125900 40706495 40303080
43971 40303080 39640853 38358033 36377773 34374074 33310766 33411525 33820907 33399618 31842472
43962 31842472 30033758 29254200 29882860 30865721 30646780 28682438 25878610 23532651 22139863
43953B2139863p78845n78740n00197n09677p12908r18523p63386k43639J99045
43944A7332993K00694j13359l37165k73722j05121j38311m70660q82850j023572
43935A4188927p50962l18671j33678k96753n35316o56028p93157r82319q07544
43926H914499L7534J005320J154923M00252l71433n90317o42246q48776o79256
43917H380500K59650J148836R19270q6739n26183L651N42215L45628j95819m61018
43907A0329991m06480j18586M81855J039643P93384k45284j004534q48332m84976
43898I536681o67434q99810m10331L63282M40682o3020j93201K33232M72105K12264
43888I024450l4213M8925J83208K31006M20204P02035P20229N26642N12128N62581
$$ plain form
43953 22139863 21361018 20782278 20282081 19772404 19059496 18140973 17377587 17133948 17332993
43944 17332993 17533687 17420328 17083163 16809441 16704320 16566009 16095349 15212499 14188927
43935 14188927 13437965 13119294 12985616 12688863 12153547 11497519 10704362 9722043 8914499
43926 8914499 8952033 9957353 11112276 11512528 11141095 10550778 9908532 9059756 8380500
43917 8380500 8640150 9788986 10708256 10621517 10095334 10098985 10641200 10986828 10791009 10329991
43907 10329991 9923511 9804925 10286780 11326423 12119807 11874523 10869989 10021657 9536681
43898 9536681 8869247 7969437 7559106 7922388 8363070 8300050 8106849 8340081 8812186 9024450
43888 9024450 8990237 9039162 9222370 9453376 9873580 10575615 11295844 11822486 12334614 12897195
43878A2897195J63159n66675q75858n60613j76747Q0291O12759J259408J115628
43869A3948547N7766p23482m52991O0368j13056m46484k6924O43810L60028p00740
43859A2606842j044126J3968J509046K283936K270016K038840J897147J797532
43851B3373201J611836J224011P11226N07359J007447J987227K752400K805494
43843C5980201K097996R15125o5839j8695J048354J886168J396481J64358l48503
43834D3055646N9341J85207n16674j047061n26687M08377O61750K56213l5857
43825D2500255j9157r2594l10295l34814k05395l84497j000478j618618j848953
43816C6685454j767516j662736j652194j586704j180204l37639N13900O67702
$$ plain form
43878 12897195 13060354 12493679 11617821 11057208 10880461 10960752 11573511 12832919 13948547
43869 13948547 14006313 13282831 12829840 12890208 12777152 12330668 12303744 12947554 13307582 12606842
43859 12606842 11562716 11576684 13085730 15369666 17639682 19678522 21575669 23373201
43851 23373201 24985037 26209048 26920274 27427633 28435080 30422307 33174707 35980201
43843 35980201 38078197 38993322 38927483 38908788 39957142 41843310 43239791 43404149 43055646
43834 43055646 43114987 43300194 42783520 41736459 41209772 41618149 42279899 42536112 42500255
43825 42500255 42481098 42388504 42078209 41743395 41538000 41153503 40153025 38534407 36685454
43816 36685454 34917938 33255202 31603008 30016304 28836100 28498461 29012361 29680063
43808B9680063n1906r80053j402142j373452j373497j415475j034429r6218Q68976
43799B2821867J228492Q49307J23893l47571j25073P45317J741071K360350K551685
43790C1949338K516849K292601J808376J181139N91945j3857p17478j212623j069702
43781C7326588m45381o3530l21071p74264p27299o5351P12174J097646J023858
43772C7763370Q38510R74215J541703K163904K330003J968870J518198J367561
43764E0466334J429955J378460J107582P64906M42121L7825o03005j534153k620461
43755E0869564l468685l558063k712650j488296q33146j171780j945176k249440
43747C3442328j854467j355818j334318j679333j898887j824533j692355j642956
$$ plain form
43808 29680063 29628157 28648104 27245962 25872510 24499013 23083538 22049109 21952891 22821867
43799 22821867 24050359 24899666 25023559 24675988 24550915 25296232 27037303 29397653 31949338
43790 31949338 34466187 36758788 38567164 39748303 40340248 40326391 39608913 38396290 37326588
43781 37326588 36881207 36817677 36496606 35722342 34995043 34929692 35641866 36739512 37763370
43772 37763370 38601880 39576095 41117798 43281702 45611705 47580575 49098773 50466334
43764 50466334 51896289 53274749 54382331 55147237 55589358 55627183 55024178 53490025 50869564
43755 50869564 47400879 43842816 41130166 39641870 38808724 37636944 35691768 33442328
43747 33442328 31587861 30232043 28897725 27218392 25319505 23494972 21802617 20159661
43739B0159661j497639j080433m97168L474K62389K27296r4701o10291j163135
43730A5709453j606368j777757j515193r00356l60267k10907k05423M6177K99785
43721I479144p0941r66151j421402r14231j41697K0289k72199l49953k41127m44400
43711D677332p65012m24192N91571J253346R00233J56882k2595L66514N93040
43702G327119K73704k95348o49841n34541O5254Q37511J177650P16991j53435
43693H765064n88623k07332M60547N07415m30597j758099k382844j696532j98679
43684B470320R23793R20488J28883n06977m16996J69609O15861N38300J31299
43675D974580q5659J29498M39032L83915Q8765J75860Q57398J469098J227494
$$ plain form
43739 20159661 18662022 17581589 17084421 17087895 17350284 17577580 17482879 16872588 15709453
43730 15709453 14103085 12325328 10810135 9909779 9549512 9338605 9133182 9179359 9479144
43721 9479144 9408203 8442052 7020650 6106419 5964722 5985011 5712812 5362859 5121732 4677332
43711 4677332 3912320 3488128 4079699 5333045 6233278 6390160 6367565 6734079 7327119
43702 7327119 7600823 7305475 6655634 6121093 6186347 7023858 8201508 8918499 8765064
43693 8765064 8176441 7969109 8429656 8937071 8506474 6748375 4365531 2668999 2470320
43684 2470320 3394113 4314601 4443484 3936507 3519511 3689120 4304981 4843281 4974580
43675 4974580 4888921 5018419 5457451 5841366 5930131 6105991 6963389 8432487 9659981
43666I659981K43699n93538o73588k32798J62069L20522M02308M34593K20838
43657I944086k22649m14214J34955J204940J861310J383660J18435q37751q06400
43648A2366372j10357N66988J026316J454912J779368J653766J114038P44872
43640B0596275R48435J387707J469039J122992P20850L90067q9883p06581j053200
43631B4785701r52543q10845j027888j377535j346035q46893k20269K62204M74837
43622A8940734K41509m07211r15185p36123j54334L9398l10417o06721o02178
43613A5489472p80694j330925j585818j045136k56971n964j89187k20834o3048
43604A0010895n2766q6976J62220M69906L39578r8815k84270j91037k69052m92641
$$ plain form
43666 9659981 9903680 9310142 8636554 8403756 8565825 8886347 9288655 9723248 9944086
43657 9944086 9721437 9307223 9442178 10647118 12508428 13892088 14010523 13172772 12366372
43648 12366372 12256015 12823003 13849319 15304231 17083599 18737365 19851403 20596275
43640 20596275 21544710 22932417 24401456 25524448 26245298 26635365 26545482 25838901 24785701
43631 24785701 23833158 23022313 21994425 20616890 19270855 18423962 18203693 18465897 18940734
43622 18940734 19182243 18775032 17859847 17123724 16969390 17008788 16698371 16091650 15489472
43613 15489472 14708778 13377853 11792035 10746899 10489928 10483964 10294777 10073943 10010895
43604 10010895 9958129 9871153 10033373 10503279 10842857 10744042 10459772 10268735 9999683 9507042
43594I507042l36746K55367O99619O64764L90868N0530m31574q43822p86860m22155
43584H747033k86103k45035L98399J505925J858605Q34362n47715q90968o7313
43575A1307190R45572J273807P12129l36266j040233q04948o2116K39511R0806
43566A2325452M07489J279299J504421N50931l14936P8162R22374P68535j57748
43557A7363979m95071N251L44509Q4233j99375j54385J076L08593R62835J436131
43547A9657776J026809K75655M48249J491317J960962J303294P51872J378207
43539B8294141K544390L029428K617695J830908J052732O73059J192530K359262
43531D3594145K995401K532026K016435K712108M306520N450461N617512N460202
$$ plain form
43594 9507042 9170296 9425663 10125282 10790046 11180914 11231444 10799870 9956048 9169188 8747033
43584 8747033 8460930 8215895 8614294 10120219 11978824 12813186 12265471 11374503 11307190
43575 11307190 12252762 13526569 14238698 13902432 12862199 12057251 11995135 12234646 12325452
43566 12325452 12732941 14012240 15516661 16067592 15752656 15830818 16753192 17521727 17363979
43557 17363979 16868908 16874159 17218668 17302901 17103526 16949141 16950217 17258810 18221645 19657776
43547 19657776 20684585 20960240 21408489 22899806 24860768 26164062 26915934 28294141
43539 28294141 30838531 33867959 36485654 38316562 39369294 40042353 41234883 43594145
43531 43594145 46589546 49121572 51138007 53850115 58156635 63607096 69224608 74684810
43523G4684810N580717N866617O021516O059796O201367O662419P462190Q164793
43515A26704225Q089170P092345N795424M703419L567391K060820N73662k69901
43507A58316555m59865l36003R8329Q62584J382204J076283L62663J50291L67971
43498A61821012n4675j586042l389000m589102n440621o625673p963833q596367
43490A23575699q263800p672773p460154p347820o699730n609106m891830m960234
43482G0670252n214134m872890m037936l434345l331908l348244l242780l179883
43474D0008132l094845k567721j643387j055180j169826j371748j070955o91734
43466B7342736r15264j459925j506614j004020o03485m62707j06522M82675O17302
$$ plain form
43523 74684810 80265527 86132144 92153660 98213456 104414823 111077242 118539432 126704225
43515 126704225 134793395 141885740 147681164 152384583 155951974 158012794 158586456 158316555
43507 158316555 157856690 157520687 157619016 158481600 159863804 160940087 161302750 161453041 161821012
43498 161821012 161766337 160180295 156791295 152202193 146761572 140135899 132172066 123575699
43490 123575699 115311899 107639126 100178972 92831152 86131422 80522316 75630486 70670252
43482 70670252 65456118 60583228 56545292 53110947 49779039 46430795 43188015 40008132
43474 40008132 36913287 34345566 32702179 31646999 30477173 29105425 28034470 27342736
43466 27342736 26427472 24967547 23460933 22456913 21853428 21390721 21284199 21766874 22384176
43457B2384176L3729n52276m54602L2923J68224j99801n93265o26323l52849m1425
43447A9798511Q9264j9781k32294l25668j91377J37880N89943R88252R69019K84612
43437B2088361p70184j504723j464920p32904L27372J306876J784846J552118
43429B2586842R14377M52110L76492L99569K77482J24671R0611P8111o0591l21540
43419B4918134o41946r19607r06805m47524J28714K71565o3109m43024p78022
43410B1118376j399402k051970j674985J02719J923625K143265R56527K7196J35750
43401B1281101L94851K3710l44175J38371R59486R34662K3642n80296r3926R93142
43391B3730568J767314J852262J368631O14921L8022m8210L6263l45784j107819
$$ plain form
43457 22384176 22417905 21865629 21411027 21443950 21612174 21412373 20819108 20192785 19839936 19798511
43447 19798511 19887775 19867994 19635700 19310032 19118655 19256535 19846478 20834730 21803749 22088361
43437 22088361 21318177 19813454 18348534 17615630 17943002 19249878 21034724 22586842
43429 22586842 23501219 23953329 24329821 24729390 25006872 25131543 25222154 25300265 25239674 24918134
43419 24918134 24276188 23356581 22449776 22002252 22130966 22402531 22339422 21896398 21118376
43410 21118376 19718974 17667004 15992019 16094738 18018363 20161628 21118155 21145351 21281101
43401 21281101 21675952 21699662 21355487 21493858 22453344 23388006 23411648 22831352 22737426 23730568
43391 23730568 25497882 27350144 28718775 29333696 29371718 29323508 29359771 29013987 27906168
43382B7906168j340529n98689L42289M84252k09090j113732j791453j918680j092599
43373B0667937L86943J157790L51545r18877q90850L23908R99689M83970o2288
43364B2499767J09954J81579l72691m50686Q64842K442340K548577J302599K33833
43355B9360114N4241L42182R33031K029740L111311L245288K562805K136401K313513
43346D6088626K407348K116165J909314J753044Q21668r98585k517323k816556
43338D8763701k426566k262331k318524k189520k057664k242954k350381j815590
43330C1100171r89595q16991j498409k138449j826550o93712K19887N2995r20446
43321B2488901j540451j158186n03011o52631j423100j630562q91345j28181n7155
$$ plain form
43382 27906168 26565639 25966950 26309239 26793491 26584401 25470669 23679216 21760536 20667937
43373 20667937 21054880 22212670 22564215 21645338 20754488 21078396 22078085 22562055 22499767
43364 22499767 22609721 22791300 22418609 21967923 22832765 25275105 27823682 29126281 29360114
43355 29360114 29414355 29756537 30689568 32719308 35830619 39075907 41638712 43775113 46088626
43346 46088626 48495974 50612139 52521453 54274497 55096165 54097580 51580257 48763701
43338 48763701 46337135 44074804 41756280 39566760 37509096 35266142 32915761 31100171
43330 31100171 30110576 29293585 27795176 25656727 23830177 23136465 23356352 23409347 22488901
43321 22488901 20948450 19790264 19287253 18634622 17211522 15580960 14689615 14561434 14504279
43312A4504279k23506k0818L04262L15837J99015J66381j61469r36759j348256
43303A2798966o85054L90196O55604N2837m20069k93778p7089j95359m38248n34959
43293A1253047m69393j43872N26509J103656R44789J68419l82155l06245j06526
43284A2588229k49845m21867j14680N06461P54386K12323q82944j861033k076442
43275H454588j382252l08844L93184M75849L14879L20403M71108M83961K15218
43266I438094k15389n69885o88239n89853l88181j40872R1574J18067j36537k78273
43256F640506J69666R05835R96683K11695m53959j41262O26608Q18988M52156
43247A0226916K85226L73064J23059l32817j39646O75313Q66252j84984j344924
$$ plain form
43312 14504279 14280773 14259955 14564217 14880054 15079069 15245450 15083981 14147222 12798966
43303 12798966 12113912 12504108 13159712 13212549 12792480 12498702 12421613 12226254 11788006 11253047
43293 11253047 10783654 10639782 11166291 12269947 13214736 13383155 13001000 12694755 12588229
43284 12588229 12338384 11916517 11801837 12308298 13062684 13275007 12392063 10531030 8454588
43275 8454588 7072336 6763492 7156676 7632525 7947404 8267807 8738915 9222876 9438094
43266 9438094 9222705 8652820 7964581 7374728 6986547 6845675 6937249 7055316 6918779 6640506
43256 6640506 6810172 7716007 8712690 8924385 8470426 8329164 8955772 9774760 10226916
43247 10226916 10512142 10885206 11008265 10675448 10535802 11211115 12077367 11892383 10547459
43238A0547459j258026k16587M14636J30592l19266k64287M5782L4424l81818
43229H732909p75929o93240n0769P49574J116649Q40350K84751j14177l30816
43220I759302n20585n97956m28353k33185l21872n17775l81663n771K6033l57840
43210F420335m10077L02295J029275P92631j61138p24673n97497n62197r33082
43201E155872q78389Q8258R84206P59889N4975K43551J173511J358728L60269
43192I300870n67338m83770O0724L52571N56558P00160Q0072j261204j798795
43183F939848n88949J055061J402352P84419N84802P20295J59000p11623n53478
43174I791727L01282J21755j118765j384412m621R67353M9166j186016o17654
$$ plain form
43238 10547459 9289433 9072846 9487482 9618074 9298808 9034521 9080303 9114727 8732909
43229 8732909 7956980 7263740 7212971 7962545 9079194 9919544 10204295 10090118 9759302
43220 9759302 9238717 8640761 8212408 7979223 7657351 7139576 6757913 6752142 6778175 6420335
43210 6420335 6010258 6312553 7341828 8134459 7973321 7248648 6651151 6088954 5155872
43201 5155872 4277483 4365741 5349947 6109836 6164811 6408362 7581873 8940601 9300870
43192 9300870 8733532 8249762 8310486 8663057 9219615 9919775 9999847 8738643 6939848
43183 6939848 6350899 7405960 8808312 9592731 10177533 10897828 11056828 10345205 9791727
43174 9791727 10093009 10214764 9095999 7711587 7706966 8674319 8723485 7537469 6919815
43165F919815J137843J903292J191515K78591j66684n32555p66696l34054L82460
43156A0013527L05562n61432j001416m33536L81534P32650Q25679Q93644N96786
43147A1752998j35211o13170l76208O2123O8600j18256J07240O84137J028931
43138A2461184R56152Q17858P75012M87413k75891j056061j099076l36057L62397
43129A3092931K03317m48721n07100L16102J065525Q85116J41769l07422l66378
43120A4075139m79288o23973m39873j11231j46652l44873Q151P92827R41527L6846
43110A3708600r14523q76935j76037K18609J85054L44769P89804Q43872J53929
43101A4277142p03632r68615n87979q2988J55449J21262p9172l84522o16050m52056
$$ plain form
43165 6919815 8057658 9960950 11152465 11431056 11264372 10731817 9965121 9631067 10013527
43156 10013527 10319089 9757657 8756241 8322705 8704239 9436889 10262568 11156212 11752998
43147 11752998 11617787 11004617 10628409 10690532 10759132 10640876 10748116 11432253 12461184
43138 12461184 13417336 14235194 15010206 15497619 15221728 14165667 13066591 12730534 13092931
43129 13092931 13296248 12847527 12340427 12656529 13722054 14607170 14748939 14441517 14075139
43120 14075139 13595851 12971878 12532005 12420774 12274122 11929249 11937400 12730227 13671754 13708600
43110 13708600 12794077 11917142 11741105 11959714 12144768 12489537 13279341 14123213 14277142
43101 14277142 13573510 12604895 12016916 11933928 12089377 12210639 12131467 11746945 11130895 10678839
43091A0678839J95283Q72078R21488K04798o91851j065710p77118k52986K2307
43082A0107128p1064k11012Q6252Q97089J569905J324695K89340n06419m04830
43073A3081084J23078L58324L58682M56635L08701n55945j521952j399710k42015
43064A0966882N03796M9545o04310k74029O00575P53144J01546k19133L09081
43055A2187097Q54182N94466j04908m05164k53575k51300n87053q31133p71445
43046A0431167p62088r68690q39293J10244J271426J418762L00535q76620r09819
43037I175624q7526L11924k37106r18243q21779k12838j06548p82774j283404
43028E037330o62854O00196J054627K26836o01371j40732R72907J032742j72800
$$ plain form
43091 10678839 10874122 11746200 12667688 12872486 12180635 11114925 10337807 10084821 10107128
43082 10107128 10036064 9825052 9911304 10808393 12378298 13702993 13992333 13485914 13081084
43073 13081084 13204162 13562486 13921168 14377803 14686504 14130559 12608607 11208897 10966882
43064 10966882 11470678 11520223 10915913 10641884 11242459 11995603 12097149 11878016 12187097
43055 12187097 13041279 13635745 13530837 13125673 12872098 12620798 12033745 11202612 10431167
43046 10431167 9669079 8700389 7861096 7971340 9242766 10661528 10962063 10085443 9175624
43037 9175624 9088098 9400022 9162916 8244673 7422894 7210056 7103508 6320734 5037330
43028 5037330 4374476 4974672 6029299 6256135 5654764 5514032 6486939 7519681 7346881
43019G346881r84242l78586N15099K68957o24958o83247J61499N93155R0042m13097
43009E891503j74033L37677M34290J62110j89192o41096j097936j100847n14320
43000C108156J11982K82291J57832J11850J99047L42028N23587N62520K47367
42991E646660j29816j2792M71660N61264R6952j43062K65300O56896L91555j26189
42981G678428k20594j0285L4559l3512M4400J03054m8361j50387q3292k68713
42971G045297p35663n84824N98010J548222Q53072q31198j536285p12969K69562
42962E913224L42761k4791o2486K09187N69105J050849J272339M81169j043582
42953H707775j717167o51559R53016J378755O19917k0864M331O7256k10657l60169
$$ plain form
43019 7346881 6362639 5984053 6499152 6768109 6143151 5459904 5621403 6214558 6304600 5891503
43009 5891503 5717470 6055147 6489437 6651547 6462355 5821259 4723323 3622476 3108156
43000 3108156 3220138 3502429 3660261 3772111 3971158 4313186 4836773 5399293 5646660
42991 5646660 5516844 5504052 5975712 6536976 6633928 6490866 6756166 7413062 7804617 7678428
42981 7678428 7457834 7447549 7482108 7448596 7492996 7596050 7547689 7397302 7314010 7045297
42971 7045297 6309634 5724810 6322820 7871042 8724114 7892916 6356631 5643662 5913224
42962 5913224 6255985 6231194 6168708 6377895 6947000 7997849 9270188 9751357 8707775
42953 8707775 6990608 6339049 7292065 8670820 9290737 9269873 9274204 9341460 9130803 8770634
42943H770634r0320R7870k43850p68630r25901p75232o81880n69491r0686N94155
42933E316669Q32000L91201j43099j60883J74741L03799J38649K6610l904l02888
42923F572895q08197q41855k6384J080266J643267J449315P94732o7947q81400
42914H914692j177894p27171L3987N33508P83379J080389J330596J281685J084791
42905A3137962R10195L67565p88651j688511j242434N3805M89990m50632j341369
42896I447920r81160p6741P0484m81297p43613m46774r2196K15053Q10620J455408
42886I177704J325209J94439j099210j578231j039148J2750Q94456J179859R96168
42877A0063996Q97277J160454J371659J064062N03978L17946N45673O72560M64772
$$ plain form
42943 8770634 8680314 8778184 8534334 7765704 6839803 6064571 5382691 4813200 4722514 5316669
42933 5316669 6148669 6539870 6396771 6235888 6410629 6714428 6853077 6879687 6875783 6572895
42923 6572895 5764698 4922843 4896459 5976725 7619992 9069307 9864039 9796092 8914692
42914 8914692 7736798 7009627 7043614 7577122 8360501 9440890 10771486 12053171 13137962
42905 13137962 14048157 14415722 13627071 11938560 10696126 10749931 11239921 10789289 9447920
42896 9447920 8466760 8390019 8460503 7979206 7235593 6788819 6696623 6911676 7722296 9177704
42886 9177704 10502913 10697352 9598142 8019911 6980763 6993513 7887969 9067828 10063996
42877 10063996 10961273 12121727 13493386 14557448 15061426 15379372 15925045 16597605 17062377
42868A7062377J15364l36967r73307j379267r29810J05396O02327J23890l93467
42859A3996536p8825M91330J93891q60186j450295j000104k49729o1747l83146
42850A0597725o78115p07379m93949o8911L25323K55451k25174l75398K15602
42841H845175Q40203N94724k52005o70773m68480m44992q65435q97597n2254Q13872
42831G442438P23032O7944n5134M71179P54279L21636l41918o56897n71817k90211
42821G864531j3255M7126p3181J8273L71987K93938n28310r98406n69J469101
42811H451235J246223p37454j979249r43324O98535O53377o52016j070584j01283
42802E565460P39922N75802K73962O72035J259334J169239L99827m64599r64460
$$ plain form
42868 17062377 17177741 16840774 15867467 14488200 13558390 13663786 14266113 14390003 13996536
42859 13996536 13917711 14409041 14602932 13742746 12292451 11292347 11042618 10980871 10597725
42850 10597725 9919610 9212231 8718282 8649371 8974694 9230145 9004971 8629573 8845175
42841 8845175 9685378 10280102 10028097 9357324 8888844 8443852 7578417 6680820 6628566 7442438
42831 7442438 8165470 8233414 8178280 8649459 9403738 9725374 9383456 8726559 8154742 7864531
42821 7864531 7851276 7898402 7825221 7843494 8215481 8509419 7981109 6982703 6982134 8451235
42811 8451235 9697458 8960004 6980755 6037431 6735966 7389343 6737327 5666743 5565460
42802 5565460 6305382 6881184 7155146 7827181 9086515 10255754 10655581 10190982 9226522
42793I226522q55075j92205M19356L31093k23261m03581p8611k4208n60547q87717
42783F751766k82075P53498J139628N75347k61309n68954j26622O10024R13626
42774I504929N31216K9461J1537J44287l31811j199954j368305n79438Q3816q5977
42764F739761l08217K29282P92560K10372j062295j400153l62653P50210Q78114
42755F466981N21568N75122Q28203M62297m78441r96210m75592N24483R95891
42746H424302O04150j87843q72145j331820j490220j036235N8634J029726R68279
42737F166828K213p82590p45718l74320k87488k85166M8166M17134K99589k9391
42727D429257J38770P02403P84288J04649n16205l25446L59923P15430M74211
$$ plain form
42793 9226522 8371447 8179242 8598598 8929691 8706430 8302849 8224238 8200030 7639483 6751766
42783 6751766 6469691 7223189 8362817 8938164 8676855 8107901 7981279 8591303 9504929
42774 9504929 10036145 10065606 10077143 10221430 9889619 8689665 7321360 6741922 6825738 6739761
42764 6739761 6431544 6660826 7453386 7663758 6601463 5201310 4838657 5588867 6466981
42755 6466981 6988549 7563671 8391874 8854171 8375730 7379520 6903928 7428411 8424302
42746 8424302 9028452 8840609 7968464 6636644 5146424 4110189 4168823 5198549 6166828
42737 6166828 6169041 5386451 4640733 4266413 3978925 3693759 3741925 4159059 4458648 4429257
42727 4429257 4568027 5270430 6054718 6159367 5643162 5317716 5677639 6393069 6867280
42718F867280k390l67291n54609n79825m45925k15891K5485K44562L95897L86695
42708E753988J96970n8516k48934l19092k55911q3377J28536L84459Q06424J334763
42698G639310J505247R11703j01830o54955l87530J18854K25960J20980L75976
42689I753715R24700J083604N76928l2819j51410N5290L9230k54122l76319j73176
42679A1445621p8809m37255r27014r75798n01088J01203N30188P64858P83989
42670A0705895N20239J02725k03345l08483k54651K7600N01136P18406L44671
42661A2154193j02826J79121R37132J040661K64447j74954N74931J695651J993034
42652A8561390J523704R39476J82000q65640j283546l25589Q40587M85685q40650
$$ plain form
42718 6867280 6864890 6497599 5942990 5363165 4917240 4701349 4726834 4971396 5367293 5753988
42708 5753988 5950958 5892442 5643508 5324416 5068505 4985128 5113664 5498123 6304547 7639310
42698 7639310 9144557 10056260 9954430 9299475 8911945 9030799 9256759 9377739 9753715
42689 9753715 10678415 11762019 12338947 12306128 12154718 12210008 12249238 11995116 11618797 11445621
42679 11445621 11366812 10929557 10002543 9026745 8525657 8626860 9157048 9921906 10705895
42670 10705895 11226134 11328859 11125514 10817031 10562380 10589980 11091116 11809522 12154193
42661 12154193 12051367 12230488 13167620 14208281 14472728 14297774 14872705 16568356 18561390
42652 18561390 20085094 21024570 21206570 20340930 19057384 18731795 19572382 20058067 19217417
42643A9217417r13801N62185J219353l21865k190938k029663l24327P23272M54787
42634A6396420M9344K46913N33299L72659j39673p42704j062153n03219Q44113
42625A5994999J627427P94978o60375r17530R865M23361l07823q95699l81979
42616A5687224M28739M84146K6126k40503l41206m60379j85351O68994J295558
42607A7363348R78569K85382J84756N72766P32010P41881J214297J881914J718297
42598B5673220N53398n42717p95395p21070j119245j774058j777582q08447M33124
42589A9121228R88597N53665l37336q87917q01784m72766l82249m61897k84407
42580A7035134K10270N28804K43228m80963j131761j438256j513805j490280j227906
$$ plain form
42643 19217417 18303616 18865801 20085154 19763289 17572351 15542688 15218361 15941633 16396420
42634 16396420 16445764 16692677 17225976 17598635 17458962 16716258 15654105 15150886 15994999
42625 15994999 17622426 18417404 17757029 16839499 16849364 17272725 16964902 16069203 15687224
42616 15687224 16115963 16600109 16626235 16385732 16044526 15584147 15398796 16067790 17363348
42607 17363348 18341917 18627299 18812055 19384821 20116831 20858712 22073009 23954923 25673220
42598 25673220 26226618 25683901 24888506 24167436 23048191 21274133 19496551 18688104 19121228
42589 19121228 20109825 20663490 20326154 19438237 18636453 18163687 17781438 17319541 17035134
42580 17035134 17245404 17774208 18017436 17536473 16404712 14966456 13452651 11962371 10734465
42571A0734465n05863N44946J346665J348148O07650j88241l52273J50195O71965
42562A4357657N49338j21858m66018J51495J123707J135726p8392j142716p94780
42553A4714159L13210N06881n02522j272882p92339K18357O37951N05570M80584
42544A4808969N62326K79419l32479q00649r62442r41477o80104j65316J72287
42535A1940534l8698m50553m60305o9353L21928O44692J008048J153930Q31722
42526A4881945M33584M61223O28709L38944k22525m21703l74398p33545j378309
42517A3613925j455114p79129p6726K82679O41155R65384O76284o5784k04893
42508A3597781M89366P96028n7170j026585q27232P7060K81565l94736q16472
$$ plain form
42571 10734465 10228602 10773548 12120213 13468361 14076011 13887770 13535497 13685692 14357657
42562 14357657 14906995 14785137 14319119 14470614 15594321 16730047 16651655 15508939 14714159
42553 14714159 15027369 15534250 15031728 13758846 12966507 13184864 13822815 14328385 14808969
42544 14808969 15371295 15650714 15318235 14517586 13555144 12613667 11933563 11768247 11940534
42535 11940534 11901836 11451283 10990978 10921625 11243553 11888245 12896293 14050223 14881945
42526 14881945 15315529 15776752 16405461 16744405 16521880 16100177 15725779 14992234 13613925
42517 13613925 12158811 11379682 11302956 11585635 12226790 13192174 13868458 13802674 13597781
42508 13597781 14087147 14883175 14826005 13799420 12972188 13049248 13330813 12936077 12119605
42499A2119605l30834M41359N98430m8025r90613j522097j304485p63076o09894
42490G590370p50423l03968Q99863J724277J351643O17706O75036J098895O80420
42481A3583819l87216o68719K41438J089216Q50854k3161o46022q57422q37246
42472A2345541n04926Q6828M51687K99027o2533l07091n06390o51988m11440K33976
42462A0972691P14834O93161O00983Q52615J022599M33806p33848j527005j330489
42453A1699347m74502K45564L68050O7268j88057k11592k47872m89670o93090
42444A0075446n36173j12264L06332P20386J138312J189840O72279J72352K94868
42435A3921378N37769Q621q86681q10697L03968Q97837J46256p82822o84799j61968
$$ plain form
42499 12119605 11788771 12230130 12828560 12780535 11789922 10267825 8963340 8200264 7590370
42490 7590370 6839947 6535979 7435842 9160119 10511762 11129468 11804504 12903399 13583819
42481 13583819 13196603 12527884 12769322 13858538 14709392 14686231 14040209 13182787 12345541
42472 12345541 11840615 11927443 12379130 12678157 12615624 12308533 11802143 11150155 10738715 10972691
42462 10972691 11687525 12380686 12981669 13834284 14856883 15290689 14556841 13029836 11699347
42453 11699347 11224845 11470409 11838459 11905727 11717670 11506078 11258206 10768536 10075446
42444 10075446 9539273 9427009 9733341 10453727 11592039 12781879 13454158 13626510 13921378
42435 13921378 14459147 14467768 13581087 12770390 13074358 13972195 14118451 13335629 12650830 12488862
42425A2488862l25947q39400p54485m40969r46199j865598j652618r5443J167467
42416F735670J005868K58414J83068O01219M86400l28798r81328q39414k15446
42407F905653J73198M0355k38053r2095N38049J015111P00784k06429p95283m39696
42397G601594N25055J129340O37887p93980k147681k390785j526783o02412m44830
42388A987405p12701n57576J46203P84771R47617P40322K89731l91954j026825
42379B206993j133789n80449L04819J124854J548651J267091L65631m14808m04558
42370D284435J05096L05023N7879p2714J11610J76338q2856l09638k88410k60851
42360D025912l54384l49916j94754j40248k43762l12170l54502m52981k85519
$$ plain form
42425 12488862 12162915 11323515 10569030 10128061 9181862 7316264 5663646 5568203 6735670
42416 6735670 7741538 7999952 8183020 8784239 9270639 8941841 7960513 7121099 6905653
42407 6905653 7078851 7119206 6881153 6789058 7327107 8342218 9043002 8836573 8041290 7601594
42397 7601594 8126649 9255989 9893876 9099896 6952215 4561430 3034647 2432235 1987405
42388 1987405 1274704 717128 863331 1648102 2595719 3336041 3625772 3233818 2206993
42379 2206993 1073204 492755 797574 1922428 3471079 4738170 5103801 4688993 4284435
42370 4284435 4389531 4694554 4752433 4679719 4791329 4967667 4884811 4575173 4286763 4025912
42360 4025912 3671528 3321612 3126858 2986610 2742848 2430678 2076176 1623195 1337676
42351A337676M18243J077851R17624L21125L24306P77252M93669n44410q37527
42342D285809J55305R28015L41111m92994j15762Q75846R84696L04018O3891M07635
42332G737570M03800j38398n04816m62276l53507j13974L94554M73171m57355
42323F978769j411069j065234n5674o8934q64107n12555J185720K001933P71977
42314F960826p41810p20311L9352q2340p61926o48449J35435L29169l01678q20644
42304C387624p27773k99838L09411J024412J233350M34193p49772j259724j012451
42295B339432o49827l16120K27420O98395O83629N61768Q31233R24164O5008j026621
42285D338481q82466L64472J051798N48807J6346J87726J46137q49953j869063
$$ plain form
42351 1337676 1755919 2833770 3751394 4072519 4396825 5174077 5667746 5123336 4285809
42342 4285809 4441114 5369129 5710240 5217246 5101484 5977330 6962026 7266044 7329935 7737570
42332 7737570 8141370 8002972 7498156 7035880 6682373 6568399 6962953 7436124 6978769
42323 6978769 5567700 4502466 4446792 4377858 3513751 3001196 4186916 6188849 6960826
42314 6960826 6219016 5498705 5538057 5455717 4693791 4045342 4180777 4509946 4208268 3387624
42304 3387624 2659851 2360013 2669424 3693836 4927186 5361379 4611607 3351883 2339432
42295 2339432 1689605 1373485 1600905 2299300 2982929 3544697 4375930 5300094 5365102 4338481
42285 4338481 3456015 3820487 4872285 5421092 5437438 5625164 5771301 4921348 3052285
42276C052285j779078j016239o30293n00051J34054R88789J031011K37581k39550
42267A278509K16906Q63652P90390J56858k00544O4964M76144M19911j11504n35042
42257C420244l92386P4165K40891p5596m42183m76549k77721m9753K65163P06402
42247B992677J016169R58717O37782K39054k24040o40030o56125j85183K69415
42238D408436K31577n9292l6175L15407M68606J79642j77684j88422L0986M578
42228E177659m86255j077716j177022o79475j73335k00188m99567m34563k7210
42219D22328J12153p7993J01985Q68931J364546Q89413j8789m60898m60569n28390
42209B212717n54426j67169K55547Q8592l00303l2427O79542P26298j0352l59480
$$ plain form
42276 3052285 1273207 256968 -373325 -873376 -739322 249467 1280478 1518059 1278509
42267 1278509 1495415 2359067 3149457 3306315 3105771 3170735 3646879 4066790 3955286 3420244
42257 3420244 3027858 3102023 3342914 3267318 2825135 2348586 2070865 2021112 2286275 2992677
42247 2992677 4008846 4967563 5605345 5844399 5620359 4980329 4324204 4139021 4408436
42238 4408436 4640013 4580721 4544546 4859953 5328559 5508201 5330517 5142095 5173081 5177659
42228 5177659 4691404 3613688 2436666 1757191 1583856 1383668 884101 449538 422328
42219 422328 534481 456488 558473 1427404 2791950 3681363 3662574 3201676 2741107 2212717
42209 2212717 1658291 1491122 1746669 1835261 1534958 1502531 2182073 2908371 2898019 2538539
42199B538539J60036M44447l61587j328725j086657J34727R40912P31320J32207
42190B305219k33675l64245l26349n778M51341O09285L05873j90643n67719n99077
42180A384232p1903Q44784J334373P68094k36753m03654M51507J116225P22580
42171E909485r2594l31963j44127l14697p68021o43012K29618R30290P62494J49947
42161E687420j75222k11779l53658n03864k45558K88835M36256j9039m58250k66653
42151D178488L35492O02215J67923o19849j119821r35415j81521N60996O76877
42142C665385J47263l24981p0371P06217J123387P08795o513j71978L03979O74755
42132F755938L51376l55120p12751n64179m20794n65707n89212j24955L98742
$$ plain form
42199 2538539 2698575 3143022 2781435 1452710 366053 500780 1441692 2173012 2305219
42190 2305219 2071544 1707299 1380950 1375172 1826513 2435798 2741671 2551028 1983309 1384232
42180 1384232 1312329 2157113 3491486 4259580 4022827 3619173 4070680 5186905 5909485
42171 5909485 5816891 5484928 5340801 5026104 4258083 3615071 3844689 4774979 5537473 5687420
42161 5687420 5512198 5300419 4946761 4442897 4197339 4486174 4922430 4903391 4445141 4178488
42151 4178488 4513980 5116195 5284118 4664269 3544448 2609033 2427512 2988508 3665385
42142 3665385 3812648 3487667 3417296 4123513 5246900 5955695 5949182 5777204 6081183 6755938
42132 6755938 7107314 6752194 6039443 5475264 5054470 4488763 3899551 3774596 4173338
42123D173338K98437l21734p23835o48760n49064o41824n34391q7776J40652j71458
42113I33585m31827m6779N66154O51958L40730L24871O37438O95388M09160K94755
42103D375433M72459M72904J86543J61981O99523J349423J573895J319072P61984
42094A1373217J00592k69273k4730M81126N28436L8261m23708o54101r23852j043954
42084I182014m71287L89473K82198r43736j762489j168896j99658j97323p19783
42075D390513n38080K18937M73598J18266o0612M2066o7521j18839N34141J262918
42065F255387O72616j024485j867655q91765N50541Q99239L72730l7763k43231
42056D685614n81784o71143j4452Q33059Q59678N5309o48540o79367l03026K2647
$$ plain form
42123 4173338 4471775 4150041 3426206 2777446 2228382 1586558 1052167 964391 1105043 933585
42113 933585 501758 454979 1021133 1673091 2013821 2338692 2976130 3671518 4080678 4375433
42103 4375433 4847892 5320796 5507339 5669320 6368843 7718266 9292161 10611233 11373217
42094 11373217 11473809 11204536 11179806 11660932 12189368 12227629 11803921 11149820 10225968 9182014
42084 9182014 8710727 9100200 9382398 8438662 6676173 5507277 5307619 5110296 4390513
42075 4390513 3852433 4071370 4544968 4663234 4602622 4644688 4577167 4458328 4992469 6255387
42065 6255387 6928003 5903518 4035863 3144098 3694639 4593878 4966608 4928845 4685614
42056 4685614 4103830 3432687 3418235 4251294 5110972 5166281 4517741 3838374 3535348 3557995
42046C557995J35774J27584K39217O09091Q87604N49175j69645l48516J74536
42037E762815L11349n84732j407456p87121P40520J386744O41028k22622j83229
42028E657296L17304N11375M60330N10022N25602L40274K95592O79669J114658
42019A0412122J098837P77243O16413O15170L94374j00106m74215m06619M6070
42010A2979289N86243Q54159N99359o3180o96097j061631j392271j855464k025439
42001G924968j390011k74479L25023m9512p83612j104360j050759j101388j200540
41992A295330q26210p2M70572R9052m34682j10786R71776J602091J004122j90416
41982C880777q14810n72437r8993J14182K36209M85867N87102J94026m61011p82520
$$ plain form
42046 3557995 3693769 3821353 4060570 4669661 5557265 6106440 5936795 5588279 5762815
42037 5762815 6074164 5489432 4081976 3294855 4035375 5422119 6063147 5840525 5657296
42028 5657296 5974600 6485975 6946305 7456327 7981929 8322203 8617795 9297464 10412122
42019 10412122 11510959 12288202 12904615 13519785 13914159 13814053 13339838 12933219 12979289
42010 12979289 13565532 14419691 15019050 14955870 14259773 13198142 11805871 9950407 7924968
42001 7924968 6534957 6260478 6585501 6535989 5752377 4648017 3597258 2495870 1295330
41992 1295330 469120 469048 939620 1038672 603990 493204 1464980 3067071 4071193 3880777
41982 3880777 3065967 2493530 2394537 2508719 2744928 3230795 3817897 4011923 3550912 2768392
41972B768392n81422k42034j10737j00274k3794N2700M5289J13988L29095L54541
41962B605744n3708m53333k56027K46679K03384l73465m71000K59787P50252J86913
41952B645226n44945k50488N21382L51187n37400m57973R28698J872573J268572
41943E796832L74763O31869J252278O21469q74294j317707k23979P73830L86229
41934G421290p17732j256138j060296p34327m81539j11342K70147L38159J47695
41925C815917J01329L31459M76763J57883m94990r17163p44795k79138j07900
41916B339365k90722l09066M4408K42467j30450n84137l56454M72357J115847
41907B543615J118905O71612J06005k88767j59630M96295R71535O50655L9837
$$ plain form
41972 2768392 2186970 1944936 1834199 1733925 1710131 1762831 1808120 1922108 2251203 2605744
41962 2605744 2552036 2098703 1842676 2089355 2292739 1919274 1448274 1708061 2458313 2645226
41952 2645226 2100281 1849793 2371175 2722362 2184962 1726989 2655687 4528260 5796832
41943 5796832 6171595 6803464 8055742 8677211 7802917 6485210 6261231 7035061 7421290
41934 7421290 6703558 5447420 4387124 3652797 3171258 3059916 3330063 3668222 3815917
41925 3815917 3917246 4248705 4725468 4883351 4388361 3471198 2726403 2447265 2339365
41916 2339365 2048643 1739577 1783985 2026452 1896002 1311865 955411 1427768 2543615
41907 2543615 3662520 4334132 4440137 4151370 3991740 4488035 5459570 6110225 6150062
41898F150062J72689J067772J694511J510025J057033Q59677P15549M15083K17678
41889A3860079J55758k59013j079428j466589q44183J36898M56013L1142m41149
41880A0549528m99090k04786J68551K52286j78535o64226l19451Q82992J727046
41871A1714315J274522J55103l76343o8036M62996Q96490J217477J003224j15974
41862A6163774j433742j741454r87244l65589o24192j231238j446352j295596
41854G038367j097219q08009l45220J3215L3129p6518n2704j9391k04576n07076
41844C973998o33154m40870K7889N90814Q63681N03841k62520o71075k73196M40070
41834D119478N62428j47478r38746q85415L6404Q22228N65373l47111n69719M78926
$$ plain form
41898 6150062 6322751 7390523 9085034 10595059 11652092 12511769 13227318 13642401 13860079
41889 13860079 14015837 13756824 12677396 11210807 10366624 10503522 10959535 10990677 10549528
41880 10549528 10050438 9845652 10014203 10266489 10087954 9423728 9104277 9987269 11714315
41871 11714315 12988837 13143940 12767597 12699561 13162557 14059047 15276524 16279748 16163774
41862 16163774 14730032 12988578 12001334 11635745 11011553 9780315 8333963 7038367
41854 7038367 5941148 5133139 4787919 4801134 4834263 4757745 4705041 4685650 4481074 3973998
41844 3973998 3340844 2899974 2927863 3518677 4382358 4886199 4623679 3952604 3679408 4119478
41834 4119478 4681906 4534428 3595682 2710267 2746671 3568899 4134272 3787161 3217442 3696368
41824C696368J700502J607957J95969j128263j341675q22728n00943o60394q96729
41815A850064q24973m55186j5155L65422P44436J105170J113257N21317j36435
41806D267917P8964J076443J472256M93707o52530m55227N06477M01430q91347
41797F298090j495965m96930O43487M20276n49863q39127m16114k05443l57536
41788C000875l37678j29868o2151J07329P07056J153035O74384k64533n44018
41779D304431j96145k76062r23606r72041J39679J284749J106787k72750j590242
41770B604800j902475j261832l84904K556k05241l99290q2968L68437K98906j27347
41760a089358k05296R2811J34484j73555k62911o5489j37182l86921M7106J167756
$$ plain form
41824 3696368 5396870 7004827 7200796 6072533 4730858 3908130 3407187 2746793 1850064
41815 1850064 1025091 569905 554750 920172 1664608 2769778 3883035 4404352 4267917
41806 4267917 4346881 5423324 6895580 7389287 6736757 6281530 6788007 7189437 6298090
41797 6298090 4802125 4305195 4948682 5368958 4819095 3979968 3563854 3358411 3000875
41788 3000875 2663197 2533329 2471178 2578507 3285563 4438598 5112982 4848449 4304431
41779 4304431 4108286 3832224 2908618 1936577 2076256 3361005 4467792 4195042 2604800
41770 2604800 702325 -559507 -944411 -941855 -1147096 -1546386 -1629354 -1260917 -962011 -1089358
41760 -1089358 -1294654 -1201843 -1067359 -1240914 -1503825 -1569314 -1706496 -2093417 -2046311 -878555
41750h78555J636774O75768o66095j016011m52321J42256N11468P40241M66206
41741A159731l76896p99279p0012Q67963P06522j05576j31409O29291Q66234K94431
41731C041000m2337J28993j05032p74486n66640P78037J526450N50490q41454
41722C695021j056372o53933r32649j374609n70509J066700J666942P51503k55291
41713B336803m28123m10138p41509q26977k35625L47479K48154j76525l49749
41704b36210l88619n40569n33826j41781L24758O36890J005003J320826R46963
41695B393435r2701o63712j02647O46726M66924k24211l95298k49679o47315j186686
41685e5164o11894R11596J672829R33124k0196J5485M53945K90388p6233K96147
$$ plain form
41750 -878555 758219 1433987 767892 -248119 -700440 -558184 -46716 693525 1159731
41741 1159731 782835 -16444 -86456 781507 1488029 1382453 1251044 1880335 2746569 3041000
41731 3041000 2998663 3127656 3022624 2248138 1681498 2459535 3985985 4536475 3695021
41722 3695021 2638649 1984716 1052067 -322542 -893051 173649 1840591 2592094 2336803
41713 2336803 1908680 1498542 757033 -69944 -305569 41910 290064 113539 -236210
41704 -236210 -624829 -1165398 -1699224 -1841005 -1516247 -879357 125646 1446472 2393435
41695 2393435 2300734 1637022 1534375 2181101 2648025 2423814 2028516 1778837 1131522 -55164
41685 -55164 -667058 244538 1917367 2850491 2830295 2845780 3299725 3590113 3513880 3810027
41675C810027J032394R01975j91740j046621r88341o32478n58620l50774M23512
41666B399334J118956P86913l29677r59484m73663L55011N53399L09291N41404
41657D301484J395457J939965J511645O68159L13067L79496J15355n69626r26584
41648I128418o19482k75870m00258m98194Q1975R76159J229981N95103l30994
41639I886838j064994j571907j728168j303493o22276m42193q52459r92875k89384
41630A019089O77630J069276R35735P59684M01184m98340j311399q25340R03288
41621C130807K153959J617974J18337n06465K58996J234681J277177N07948k57276
41612I536138n48319m01892K465M65180P36723O39286J99815l27088m91719N5137
$$ plain form
41675 3810027 4842421 5744396 5552656 4506035 3517694 2885216 2326596 1975822 2399334
41666 2399334 3518290 4305203 3975526 3016042 2542379 2897390 3450789 3760080 4301484
41657 4301484 5696941 7636906 9148551 9816710 10129777 10509273 10624628 10055002 9128418
41648 9128418 8508936 8233066 7832808 7334614 7416589 8392748 9622729 10217832 9886838
41639 9886838 8821844 7249937 5521769 4218276 3596000 3153807 2301348 1308473 1019089
41630 1019089 1696719 2765995 3701730 4461414 4862598 4364258 3052859 2227519 3130807
41621 3130807 5284766 6902740 7021077 6514612 6773608 8008289 9285466 9793414 9536138
41612 9536138 8987819 8585927 8588392 9053572 9790295 10429581 10629396 10302308 9810589 9865726
41602I865726R82984J285177M26013p28042q89712j58959J50187m00497p12559
41593I820318j32150K26304p40959k069148j983748o35306J28588m07670r59587
41584C246642n00663K57163L55192J64323M54088R24436Q01149K02702j83035
41575E721997l18884o82712j214078j361693j034935o72335m57381k13586J0409
41566b23198j8718j34020R1165O10569R12950P45755K84215l20369r52344j212991
41556b16986p92367j07919J45612M3374K41912P54495Q40383K83940j70876j6848
41546A004720K82764K25639P3596J25906K3356m27267m66408N39134J680733J350832
41536D413005n21121k105215j818007r2946J350680J478677P58936K71987M11310
$$ plain form
41602 9865726 10848710 12133887 12559900 11831858 10942146 10783187 10933374 10532877 9820318
41593 9820318 9688168 9914472 9173513 7104365 5120617 4485311 4613899 4206229 3246642
41584 3246642 2745979 3003142 3358334 3522657 3976745 4901181 5702330 5905032 5721997
41575 5721997 5403113 4720401 3506323 2144630 1109695 437360 -20021 -233607 -223198
41566 -223198 -241916 -375936 -284771 325798 1238748 1984503 2268718 1948349 996005 -216986
41556 -216986 -1009353 -1117272 -971660 -928286 -686374 68121 908504 1192444 1021568 1004720
41546 1004720 1287484 1513123 1586719 1712625 1735981 1308714 842306 1381440 3062173 4413005
41536 4413005 3891884 1786669 -31338 -124284 1226396 2705073 3464009 3735996 4147306
41527D147306N81027J34243o20521p79860k50551q7392r24078j746201j181630
41518g27657L75427J155677N32486j88459P2017N52395J37881o28029m19895N64621
41508A426464P69423k68410j160252q10994L340K5813n42808n93870L1905M36870
41498f82519J91833j45162r7784R9585J71568K86966N31530N57322J53282l41733
41488G24888n39118m62089k32312J97671O88344Q21596N30254K93813L37403K47330
41478B607780j58238k90253K04656N85953N5095r05177j227517q40693m49605
41469d17999j26930N72012J283545J072871Q9114m37885j15049J23341j71967
41460A871053j96692L96453N66763l29776j231162j082186n75407p11482p97684
$$ plain form
41527 4147306 4728333 4862576 4242055 3462195 3211644 3124252 2200174 453973 -727657
41518 -727657 -352230 803447 1335933 1147474 1219491 1771886 1909767 1281738 861843 1426464
41508 1426464 2195887 1927477 767225 -43769 -40429 -14616 -557424 -1151294 -1119389 -682519
41498 -682519 -490686 -635848 -733632 -634047 -462479 -175513 356017 913339 1066621 724888
41488 724888 185770 -276319 -508631 -310960 377384 1198980 1729234 2023047 2360450 2607780
41478 2607780 2449542 2159289 2363945 2949898 3004993 2099816 872299 31606 -417999
41469 -417999 -544929 27083 1310628 2383499 2472613 2034728 1919679 2043020 1871053
41460 1871053 1674361 2070814 2637577 2307801 1076639 -5547 -580954 -1292436 -2090120
41451b090120K74484J607551J300206m50513j420431o82776K07135q7322p07424
41442b049210l35668O09112Q18006J68901l14881o5063N15568Q65808Q11457M64078
41432A488108J07145J3069P0337j01463m84330o20684m50146n13647r74867j173081
41422b639559o57330L1131K15948Q9017J97429N15830P26434Q61902R37457N23529
41412H01788m69331j124333o19093M30065P71392L43152J66267N99123R23537
41403A822567P30728N25877O49017O36290J15673m94523o83253o00732o53193
41394B048451q44806r13941p39329l53245R4607K76329J8442k71835m4303N18273
41384b11357P00059L59209Q1757J21458L8068l50012n20514j62368K54019K90894
$$ plain form
41451 -2090120 -1815636 -208085 1092121 641608 -778823 -1461599 -1254464 -1341786 -2049210
41442 -2049210 -2384878 -1775766 -957760 -788859 -1103740 -1168803 -653235 212573 1024030 1488108
41432 1488108 1595253 1608322 1678659 1577196 1092866 472182 22036 -491611 -1466478 -2639559
41422 -2639559 -3296889 -3265758 -3049810 -2960793 -2763364 -2247534 -1521100 -659198 278259 801788
41412 801788 332457 -791876 -1410969 -980904 -209512 133640 299907 899030 1822567
41403 1822567 2553295 3079172 3728189 4364479 4480152 3985629 3302376 2701644 2048451
41394 2048451 1203645 289704 -449625 -802870 -708263 -431934 -413492 -685327 -729630 -211357
41384 -211357 488702 847911 929668 1051126 1089194 739182 218668 56300 310319 601213
41374F01213J99929K75554K62573m8494k87848j10695K69371O05376R69985J135364
41364C872328M86234q22631j555256j027465j22690J96145L24116Q21812R35786
41355C108379o8274j021851l14078J279826J435526j41650j264255p38541J5508
41346B290590l21364q00196j46620Q79746P93587j61035o14579l14435q6021j06241
$$ plain form
41374 601213 801142 1076696 1339269 1290775 1002927 892232 1161603 1766979 2736964 3872328
41364 3872328 4358562 3535931 1980675 953210 830520 1026665 1350781 2172593 3108379
41355 3108379 3040105 2018254 1704176 2984002 4419528 4277878 3013623 2275082 2290590
41346 2290590 1969226 1169030 1022410 1902156 2695743 2534708 1920129 1605694 1519673 1413432
$$ [...]
##END NTUPLES=NMR SPECTRUM
##END=
