##TITLE=31Pdec_DE-138m2_TFA
 CCl4,64 sc
 15.4.2026
##JCAMPDX= 6.0         $$ Bruker NMR JCAMP-DX V2.0
##DATA TYPE= NMR SPECTRUM
##DATA CLASS= NTUPLES
##ORIGIN= UXNMR, Bruker Analytische Messtechnik GmbH
##OWNER= root
$$ XWIN-NMR		Version 3.5
$$ Wed Apr 15 16:15:39 2026 Russian Standard Time (UT+4h)  she@DPX200
##.OBSERVE FREQUENCY= 81.013821
##.OBSERVE NUCLEUS= ^31P
##.ACQUISITION MODE= SIMULTANEOUS
##.ACQUISITION SCHEME= undefined
##.AVERAGES= 64
##.DIGITISER RES= 17
##SPECTROMETER/DATA SYSTEM= spect
##.PULSE SEQUENCE= zgpg30
##.SOLVENT NAME= DMSO
##.SHIFT REFERENCE= (INTERNAL, DMSO, 0, 197.392)
##AUDIT TRAIL= $$ (NUMBER, WHEN, WHO, WHERE, WHAT)
$$ ##TITLE= Audit trail, XWIN-NMR		Version 3.5
$$ ##JCAMPDX= 5.01
$$ ##ORIGIN= Bruker BioSpin GmbH
$$ ##OWNER= she
$$ F:/spectra/data/she/nmr/P31/2/pdata/1/auditp.txt
$$ ##AUDIT TRAIL=  $$ (NUMBER, WHEN, WHO, WHERE, WHAT)
(   1,<2026-04-15 16:13:10.25 +0400>,<she>,<DPX200>,
      <continue with go, POWCHK disabled, PULCHK disabled
       configuration hash MD5:
       00 E9 B6 7A A2 85 ED C7 34 08 36 98 17 FE 4E 26
       data hash MD5: 32K
       71 56 02 75 FD FE 9E C5 FF F5 60 A6 19 26 63 EE>)
(   2,<2026-04-15 16:14:27.89 +0400>,<she>,<DPX200>,
      <Start of raw data processing
       efp BC_mod = 2 LB = 1.5 FT_mod = 6 PKNL = 1 PHC0 = 1150.413 PHC1 = 815.3004 SI = 64K 
       data hash MD5: 64K
       1E DB 6D 4D 6A AF C8 04 F4 00 2C 4D DF 29 18 22>)
(   3,<2026-04-15 16:14:56.32 +0400>,<she>,<DPX200>,
      <pk PHC0 = 1.527138 PHC1 = 0 
       data hash MD5: 64K
       2A AE F0 98 DC A1 26 AD EE 68 DF 9C 0A E9 62 32>)
(   4,<2026-04-15 16:14:59.95 +0400>,<she>,<DPX200>,
      <abs ABSG = 5 
       data hash MD5: 64K
       71 50 DB 9D 26 CC 2D E4 BE 4B 60 88 EF 6B AC 29>)
$$ ##END=
$$ 
$$ hash MD5
$$ 20 E6 AB 40 9C 1B 88 4D 32 6E 83 83 BA 33 2E FD
##$RELAX= 
##$RELAX= 
##$RELAX= 
##$RELAX= 
##$RELAX= 
##$RELAX= 
##$RELAX= 
##$RELAX= 
$$ Bruker specific parameters
$$ --------------------------
##$DU= <F:/spectra>
##$EXPNO= 2
##$NAME= <P31>
##$PROCNO= 1
##$TYPE= <nmr>
##$USER= <she>
##$AMP= (0..31)
100 100 100 100 100 100 100 100 100 100 100 100 100 100 100 100 100 100 
100 100 100 100 100 100 100 100 100 100 100 100 100 100 
##$AQSEQ= 0
##$AQ_mod= 1
##$AUNM= <au_zg>
##$AUTOPOS= <>
##$BF1= 81.014009
##$BF2= 200.13
##$BF3= 200.13
##$BF4= 200.13
##$BF5= 200.13
##$BF6= 200.13
##$BF7= 200.13
##$BF8= 200.13
##$BYTORDA= 1
##$CFDGTYP= 0
##$CFRGTYP= 5
##$CHEMSTR= <none>
##$CNST= (0..31)
1 1 145 1 1 1 1 1 1 1 1 1 1 1 1 1 1 1 1 1 1 1 1 1 1 1 1 1 1 1 1 1 
##$CPDPRG= <waltz16>
##$CPDPRG1= <>
##$CPDPRG2= <waltz16>
##$CPDPRG3= <>
##$CPDPRG4= <mlev>
##$CPDPRG5= <mlev>
##$CPDPRG6= <mlev>
##$CPDPRG7= <mlev>
##$CPDPRG8= <mlev>
##$CPDPRGB= <>
##$CPDPRGT= <>
##$D= (0..31)
0 1 0 0 0 0 0 0 0 0.06 0 0.03 2e-05 3e-06 0 0 0.0002 0 0 0 0 0 0 0 0 0 
0 0 0 0 0 0 
##$DATE= 1776255105
##$DBL= (0..7)
120 120 120 11 120 120 24 19 
##$DBP= (0..7)
150 150 150 150 150 150 150 150 
##$DBP07= 0
##$DBPNAM0= <>
##$DBPNAM1= <>
$$ [...]
##$SUBNAM3= <"">
##$SUBNAM4= <"">
##$SUBNAM5= <"">
##$SUBNAM6= <"">
##$SUBNAM7= <"">
##$SUBNAM8= <"">
##$SUBNAM9= <"">
##$SW= 400.765351723535
##$SWIBOX= (0..15)
0 1 3 0 0 0 0 0 0 0 0 0 0 0 0 0 
##$SW_h= 32467.5324675325
##$TD= 32768
##$TD0= 1
##$TE= 0
##$TE2= 300
##$TE3= 300
##$TEG= 300
##$TL= (0..7)
0 120 53 12 22 120 120 120 
##$TP= (0..7)
150 150 150 150 150 150 150 150 
##$TP07= 0
##$TPNAME0= <>
##$TPNAME1= <>
##$TPNAME2= <>
##$TPNAME3= <>
##$TPNAME4= <>
##$TPNAME5= <>
##$TPNAME6= <>
##$TPNAME7= <>
##$TPOAL= (0..7)
0.5 0.5 0.5 0.5 0.5 0.5 0.5 0.5 
##$TPOFFS= (0..7)
0 0 0 0 0 0 0 0 
##$TUNHIN= 0
##$TUNHOUT= 0
##$TUNXOUT= 0
##$USERA1= <user>
##$USERA2= <user>
##$USERA3= <user>
##$USERA4= <user>
##$USERA5= <user>
##$V9= 5
##$VALIST= <valist>
##$VCLIST= <CCCCCCCCCCCCCCC>
##$VD= 0
##$VDLIST= <DDDDDDDDDDDDDDD>
##$VPLIST= <PPPPPPPPPPPPPPP>
##$VTLIST= <TTTTTTTTTTTTTTT>
##$WBST= 1024
##$WBSW= 4
##$XGAIN= (0..3)
0 0 0 0 
##$XL= 0
##$YL= 0
##$YMAX_a= 5538
##$YMIN_a= -21934
##$ZGOPTNS= <>
##$ZL1= 120
##$ZL2= 120
##$ZL3= 120
##$ZL4= 120
##$ABSF1= 197.3918
##$ABSF2= -203.3724
##$ABSG= 5
##$ABSL= 3
##$ALPHA= 0
##$AQORDER= 0
##$ASSFAC= 0
##$ASSFACI= 0
##$ASSFACX= 0
##$ASSWID= 0
##$AUNMP= <proc_1d>
##$AZFE= 0.1
##$AZFW= 0.5
##$BCFW= 0
##$BC_mod= 2
##$BYTORDP= 0
##$COROFFS= 0
##$CY= -3
##$DATMOD= 1
##$DC= 0
##$DFILT= <>
##$DTYPP= 0
##$F1P= 0
##$F2P= 0
##$FCOR= 1
##$FTSIZE= 65536
##$FT_mod= 6
##$GAMMA= 0
##$GB= 0
##$INTBC= 1
##$INTSCL= 9.790993e-09
##$ISEN= 30
##$LB= 1.5
##$LEV0= 0
##$LPBIN= 0
##$MAXI= 10000
##$MC2= 0
##$MEAN= 0
##$ME_mod= 0
##$MI= 50
##$NCOEF= 0
##$NC_proc= -9
##$NLEV= 6
##$NOISF1= 182.463
##$NOISF2= 159.3651
##$NSP= 0
##$NTH_PI= 0
##$NZP= 0
##$OFFSET= 197.3918
##$PC= 4
##$PHC0= 1151.94
##$PHC1= 815.3004
##$PH_mod= 1
##$PKNL= yes
##$PPARMOD= 0
##$PSCAL= 0
##$PSIGN= 0
##$REVERSE= no
##$SF= 81.014063255964
##$SI= 65536
##$SIGF1= 159.3651
##$SIGF2= -187.1042
##$SINO= 113.3802
##$SIOLD= 16384
##$SREGLST= <1H.CDCl3>
##$SSB= 0
##$STSI= 65536
##$STSR= 0
##$SW_p= 32467.5324675325
##$SYMM= 0
##$S_DEV= 0
##$TDeff= 32768
##$TDoff= 0
##$TI= <>
##$TILT= no
##$TM1= 0
##$TM2= 0
##$TOPLEV= 0
##$USERP1= <user>
##$USERP2= <user>
##$USERP3= <user>
##$USERP4= <user>
##$USERP5= <user>
##$WDW= 1
##$XDIM= 65536
##$YMAX_p= 476473306
##$YMIN_p= -82902450
$$ End of Bruker specific parameters
$$ ---------------------------------
##NTUPLES= NMR SPECTRUM
##VAR_NAME=  FREQUENCY,     SPECTRUM/REAL,   SPECTRUM/IMAG
##SYMBOL=    X,             R,               I
##VAR_TYPE=  INDEPENDENT,   DEPENDENT,       DEPENDENT
##VAR_FORM=  AFFN,          ASDF,            ASDF
##VAR_DIM=   65536,         65536,           65536
##UNITS=     HZ,            ARBITRARY UNITS, ARBITRARY UNITS
##FACTOR=    0.49542278885378, 1,            1
##FIRST=     15991.5117654749, 0,            0
##LAST=      -16476.0207020576, 0,           0
##MIN=       -16476.0207020576, -82902450,   0
##MAX=       15991.5117654749, 476473306,    0
$$ Real data points
##PAGE= N=1
##DATA TABLE= (X++(R..R)), XYDATA
$$ [...]
##PAGE= N=2
##DATA TABLE= (X++(I..I)), XYDATA
7344G137819L968759l568233q753367o909829j431435J837976J318975r87161
7336g386496l040744l331320j393029J64860k021324n765499m386836K901632
7328b4258756P476791L070112m450096n549732o03357K821934K700276L451245
7320a5341583N730192M842450n0083l707701l388124k000894j019763J985454
7312a2950052O368936O851456K472310k99870K241671M706397J691417l237051
7304G845214l941267j690467j686970l691080l499132j149393n09939k110872
7296a0433906k811019j722963o43839O08990L516273O050356M446084j01380k196024
7287c287428l61641J010468j021053l824749m108422k340097k04312K233624M464075
$$ y = [7137819, 11106578, 7538345, -1215022, -8124851, -9556286, -7718310, -6399335, -7386496, -10427240, -13758560, -15151589, -14986729, -17008053, -22773552, -27160388, -24258756, -16781965, -13711853, -18161949, -23711681, -24315038, -21493104, -18792828, -15341583, -9611391, -4768941, -4819024, -8526725, -11914849, -13915743, -14935506, -12950052, -6581116, 270340, 2742650, 2442780, 4684451, 9390848, 11082265, 7845214, 3903947, 2213480, 526510, -3164570, -6663702, -7813095, -8323034, -10433906, -13244925, -14967888, -15611727, -15002737, -11486464, -5436108, -990024, -1091404, -3287428, -3649069, -2638601, -3659654, -7484403, -11592825, -13932922, -14137234, -11903610, -7439535]
7278g439535M207718P93410k807885l612000k126313n08138N58508J507054K370781
7269g056400K845064K041209j974726r239737j4207176r818897K520591J1757968
7261b3132104R757920J262259l182645q99041K059878J596074K36291Q70328K306620
7252i124420L214805N127839Q221530Q358219K608937n001854p818061n247183
7244C39812k700253l237212l855695j221678K937069M651879L258506J283809
7236A456237L88146K02651L02003O58866N49992n16661j109376K71238J931204
7227D134300Q58776j827399j248146L825191P819736N466742j172312o230878
7219A1626010p592925o573560k847476M149496R869382P859524l97974n529225
$$ y = [-7439535, -3231817, -2438407, -5246292, -8858292, -10984605, -11492743, -10934235, -9427181, -7056400, -4211336, -2170127, -4144853, -13384590, -27591766, -37410663, -34890072, -23132104, -13374184, -12111925, -15294570, -16193611, -14133733, -12537659, -12301368, -11431040, -9124420, -5909615, -781776, 7439754, 15797973, 18406910, 13405056, 5586995, 339812, -2360441, -5597653, -9453348, -10675026, -7737957, -3086078, 172428, 1456237, 1844383, 2047034, 2349037, 3007903, 3557895, 3041234, 1931858, 2203096, 4134300, 4993076, 3165677, 1917531, 5742722, 13562458, 19029200, 17856888, 11626010, 4033085, -2540475, -5387951, -1238455, 8630927, 16490451, 16092477, 10563252]
7211A0563252k922726R86561o00083l899775j074605O323544Q862114L213518
7203B1451800l585754n193162l785768l660252l632104j005973J607175j86371
7195B009591m583056n390427j241935K666166K625350J042299J410037L120753
7187A658778L726781K859251J276787r92755k885762j696087K493309M606294
7179A1046596R29453m564386n087337p28265K251573J233863Q5957J302911J869676
7170H340041l36384k029726m64905J284920k6519j460294P65067L335086N88969
7161I996255n072040n743052n64972K770563N15878j538601J514967N325454L812485
7152A1016937r61215l104122k712885l915159n695388k798605M297776P917859
$$ y = [10563252, 7640526, 8627087, 8027004, 4127229, 3052624, 9376168, 18238282, 21451800, 17866046, 12672884, 8887116, 5226864, 1594760, 588787, 2195962, 2009591, -2573465, -7963892, -9205827, -6539661, -3914311, -2872012, -1461975, 1658778, 5385559, 8244810, 9521597, 8528842, 5643080, 3946993, 6440302, 11046596, 11976049, 7411663, 2324326, 1596061, 3847634, 5081497, 5167454, 6470365, 8340041, 8003657, 5973931, 5509026, 6793946, 6767427, 5307133, 6072200, 9407286, 9996255, 4924215, -818837, -1383809, 1386754, 1902632, 364031, 1878998, 7204452, 11016937, 10055722, 6951600, 4238715, 323556, -5371832, -8170437, -3872661, 4045198]
7144D045198L887671k226280k939528J278371L791546R38870m366923p193952
7136b785027n701627j701634J725725K568430R51093j376525k592324j980209
7128a0892098j09809J500042J347873l10594r64760J414780N089810N814127K032140
7119D921511k935974n028858m069372k493567r31288K073259O038190P366410
7111D940311L877737j374060l094721R5548M477637N945214L933955O30193j527734
7102A7904080j069648J359045K109441k323717r351926j0767540k839488O674671
7094A694918O880522j948366q513902n614613J305457L334579k99733m360523
7086g521661o320528o856112m947724N55010N756079M919193p84462l781843n41393
$$ y = [4045198, 7932869, 5706589, 2767061, 4045432, 7836978, 8775848, 4408925, -2785027, -8486654, -10188288, -8462563, -5894133, -4943040, -6319565, -8911889, -10892098, -11001907, -9501865, -8153992, -8464586, -9429346, -8014566, -2924756, 2889371, 4921511, 1985537, -3043321, -7112693, -9606260, -10537548, -8464289, -2426099, 4940311, 8818048, 7443988, 4349267, 4444815, 8922452, 14867666, 18801621, 19431814, 17904080, 16834432, 18193477, 20302918, 17979201, 8627275, -2140265, -4979753, 1694918, 8575440, 6627074, -1886828, -7501441, -6195984, -2861405, -3161138, -7521661, -13842189, -20698301, -25646025, -25091015, -19334936, -14415743, -15200205, -18982048, -19523441]
7077a9523441M044260M567620K055324J16255j112653l135080m615172l216337
7069b0819224l7970J841098K201250L380168N567449N871801K615781j999291
7061a378938m415113l355969l64646K172163L021477K633835J811748O6832l489222
7052c297833p291123p551959l210265J228382R14961k120998r56969O182553J2016495
7043d086756R376864J351841k489830P65137L606848n18739p234206p559940j139484
7034g928265L517901J653293k024133k489010k395680n941234j0042293q497017
7026c4146438k009390L060069M447101N197737N646038K237235m134245o397443
7018b6099336j299650N329265P256255O012516N930319O439392M755049J886630
$$ y = [-19523441, -15479181, -10911561, -8856237, -8739982, -9852635, -12987715, -17602887, -20819224, -20857194, -19016096, -16814846, -13434678, -7867229, -1995428, 620353, -1378938, -5794051, -9150020, -9514666, -7342503, -4321026, -1687191, 124557, 191389, -3297833, -10588956, -18140915, -21351180, -20122798, -19207837, -21328835, -22285804, -16103251, -4086756, 5290108, 6641949, 4152119, 4917256, 8524104, 8005365, 771159, -6788781, -7928265, -4410364, -2757071, -4781204, -7270214, -9665894, -15607128, -25649421, -34146438, -36155828, -33095759, -28648658, -23450921, -17804883, -15567648, -19701893, -26099336, -27398986, -22069721, -14813466, -8800950, -2870631, 3568761, 8323810, 10210440]
7010A0210440K26788j311111m080162n053487j669507J632686j160669p505241
7002h710263r028028l732223J923696L476500L556772M857128M962797J429405
6994a264216l301998n605512n455884m588224l173782j011409O89623J042473
6986b2668929Q98901J087311J307365J393778J229198m37382l691352m555778
6978b5436888O68429Q051255R063615K334450m037913m334159k450651l352204
6970a9494066m430027j701140J245520j300394o243998m945476L499148J0191868
6962b3178565Q581487K156400j817266r90916K001327M255776M740423L894056
6954c57278K877007K166600O40779k630084o166543p403000n591932j743058K998851
$$ y = [10210440, 10437228, 9126117, 5045955, -7532, -1677039, -44353, -1205022, -8710263, -17738291, -21470514, -19546818, -16070318, -12513546, -7656418, -2693621, -1264216, -4566214, -10171726, -15627610, -20215834, -23389616, -24401025, -23711402, -22668929, -21770028, -20682717, -19375352, -17981574, -16752376, -17189758, -20881110, -25436888, -24768459, -16717204, -7653589, -5319139, -9357052, -13691211, -16141862, -19494066, -23924093, -25625233, -24379713, -25680107, -31924105, -36869581, -33370433, -23178565, -14597078, -12440678, -14257944, -15248860, -13247533, -8991757, -4251334, -357278, 2519729, 4686329, 5327108, 2697024, -3469519, -10872519, -16464451, -18207509, -15208658]
6945a5208658O774215O637452J939732l223271m318699k045036k60050M35811
6937i268504K764780P038588R870813Q869735M791023q93283o475466q309563
6929H388123l736793L310054M602997k385502j0680899j2046371n701040K827809
6921a5421622Q012063P561702K840604j529788j196790K728674M450520R28371
6913H373734m425547p030603o628117n282579l412741q84505P24042K94666l21591
6904a8593241J057282L342737L832970K142429K11306m50222J82039J031935K44186
6895f998579k964328n960030n057551j277575J16114k266309k946214J769264
6887b5585208O671991M576034k700277o462357k988195K643918M549848K528032
$$ y = [-15208658, -8434443, -1796991, 142741, -3080530, -7399229, -9444265, -9704315, -9268504, -6503724, 534864, 10405677, 19275412, 24066435, 23173152, 16697686, 8388123, 4651330, 7961384, 12564381, 10178879, -502020, -12548391, -18249431, -15421622, -7409559, 152143, 2992747, 1462959, 266169, 2994843, 7445363, 8373734, 3948187, -3082416, -9710533, -14993112, -18405853, -19290358, -18566316, -18271650, -18593241, -17535959, -14193222, -10360252, -8217823, -8006517, -8456739, -8274700, -7242765, -6998579, -9962907, -15922937, -20980488, -22258063, -22141949, -24408258, -27354472, -25585208, -18913217, -14337183, -17037460, -23499817, -26488012, -23844094, -19294246, -16766214]
6879a6766214m04006k427069l028746j758205J221671M703900P154934P061072
6871d242663L623116j215466l114508m29829K557359Q38135m191015o743094m962347
6862a7880312k671645k619716k606808J95920M720128P685903P336062M179332
6854a661136J99641j757194p5537L146178L655191n7653n018634p319896n837075
6845a4726115k405495O5992j0505p80161J657656P523918J0857808O371479k597726
6836E956851p606006n961753k875519k557420l002037j450619L87160j98021k142595
6827a9449959k577927q43509J910662M555480N563959L687853P66816N53017K951138
6818b882470L254466o21916m354522l764305j062294o10847k064957k331805j481257
$$ y = [-16766214, -17170220, -19597289, -22626035, -24384240, -23162569, -18458669, -11303735, -4242663, -619547, -1835013, -4949521, -5379350, -2821991, -1983856, -6174871, -12917965, -17880312, -20551957, -23171673, -25778481, -25582561, -20862433, -13176530, -5840468, -1661136, -1461495, -3218689, -3294226, -148048, 3507143, 3449490, -1569144, -8889040, -14726115, -17131610, -17065618, -17076123, -17856284, -16198628, -8674710, 2183098, 8554577, 5956851, -1649155, -7610908, -10486427, -13043847, -16045884, -17496503, -17109343, -17307364, -19449959, -22027886, -22871395, -20960733, -16405253, -10841294, -7153441, -6386625, -5833608, -2882470, 371996, -249920, -4604442, -8368747, -9431041, -10041888, -12106845, -14438650, -15919907]
6809a5919907j730111k516094j454827J092642K872180L955996N630776O127800
6801a941545K403619l947554p258956m942438k04944L009049M088617L879668
6793d914484K277847o80122l691157n385660n027937j905204L637120Q314939
6785g374658P847679J874860n055807q280273p103173l636675K53983L589935
6777a7884129N367522M620158J374966k769673n144961l928326j96675K872276
6769a5688842L593144L220160K886299J276837k528668n862572n194125j063151
6761a9360918K651120L756768L239145K332908J159908J47922o9314k86651j707057
6752h136169l236065k286632J515674N525076O954972M920327M96618l251460
$$ y = [-15919907, -17650018, -20166112, -21620939, -20528297, -17656117, -13700121, -8069345, -1941545, 462074, -3485480, -10744436, -15686874, -15891818, -12882769, -8794152, -4914484, -2636637, -3316759, -7007916, -12393576, -17421513, -19326717, -15689597, -7374658, 473021, 2347881, -2707926, -10988199, -18091372, -21728047, -21474064, -17884129, -12516607, -7896449, -6521483, -9291156, -14436117, -18364443, -18561118, -15688842, -12095698, -8875538, -5989239, -4712402, -7241070, -13103642, -18297767, -19360918, -16709798, -12953030, -9713885, -7380977, -6221069, -6073147, -6142461, -6429112, -8136169, -11372234, -13658866, -12143192, -6618116, 336856, 5257183, 5753801, 2502341]
6744B502341k809009J465488M232385J737174k533191l163975j597765l322839
6736c489391p317271o227986J337197O537486K363480o276538r699651n989744
6728b8762418p95316J981342L237126M102290M046545L564694M389622O340770
6720a895345O997164N176716K588610J413843J536736O43834l095906q110707
6712E254945r875205o050241m53247J202421p73868p91313K725056M436270J111051
6703c214131k263571j97133M147287L693826j639667n363971m276560j504830
6695a0618750M750J093542K779281M042580M286429M027060K633111p40713l906730
6686C600560l693980j389703j321552l612957l835998j028951L7921k843004m752300
$$ y = [2502341, -306668, 1158820, 5391205, 7128379, 4595188, 1431213, -166552, -3489391, -10806662, -17034648, -15697451, -9159965, -6796485, -13073023, -22772674, -28762418, -29557734, -27576392, -24339266, -20236976, -16190431, -12625737, -8236115, -1895345, 5101819, 10278535, 12867145, 14280988, 15817724, 16461558, 13365652, 5254945, -4620260, -10670501, -11123748, -9921327, -10695195, -11486508, -8761452, -4325182, -3214131, -5477702, -5674835, -1527548, 2166278, 526611, -4837360, -9113920, -10618750, -10614000, -9520458, -6741177, -2698597, 1587832, 5614892, 8248003, 7507290, 3600560, -93420, -1483123, -2804675, -6417632, -10253630, -11282581, -11244660, -14087664, -18839964]
6677a8839964j432279L542138M594968L091708M296895P879513Q084291K931091
6669A4148361k726257m349132l183117k951272m718964o857776p458024n304587
6661b3400768o89707L642909M609388K776621J780189K834106K924138J46761
6653e376363k592408k143539l33728o03230j751319j47851K981342K558470j409396
6644h818022k285462L029727Q214689O493553Q28198j092429J018279N01375m345000
6635C544908o833185k542290L453605M184748N67136j550642p82615q90615l340836
6626d189786m711743k383502J294992K468294R97879P1702J488145L232355K340396
6617F08732p95571k616325j292519O48668N21485K33606L107220P073887O258007
$$ y = [-18839964, -20272243, -16730105, -12135137, -9043429, -4746534, 3132979, 11217270, 14148361, 11422104, 7072972, 3889855, 938583, -3780381, -10638157, -18096181, -23400768, -24090475, -20447566, -15838178, -13061557, -11281368, -8447262, -5523124, -5376363, -7968771, -10112310, -10446038, -11049268, -12800587, -12948438, -9967096, -7408626, -8818022, -11103484, -8073757, 140932, 6634485, 7462683, 6370254, 7388533, 7889908, 3544908, -3288277, -5830567, -2376962, 1807786, 2374922, 824280, 41665, -848950, -4189786, -8901529, -11285031, -9990039, -7521745, -6523866, -6452164, -4964019, -1731664, 608732, -186839, -2803164, -4095683, -3447015, -2925530, -2691924, 415296, 7489183, 13747190]
6608A3747190O4881m895667m303665k081687l107387n199162l843866p22516o22807
6599a0964686k351093l48332N130859O969337J780748m820673o133474k584794
6591a3322108Q33217J395631n4069j665466j694056P97139M149130M781212J363822
6582c415548l219569n254006l920648q27772K294635M459378N517802O046872
6574A681144O042313M229876M87254k159426r05391K292722L021996N54896k281580
6565A2963804m526263p231214q466899m545138K477960N095362Q88524l384565
6557f728429j948663J586267Q59802l266242n306647m077202k750736k149669
6549b3781519L8070M066592O983332O671555L905709R22303p3366J270912J625908
$$ y = [13747190, 13812071, 8916404, 4612739, 2531052, -576335, -5775497, -9619363, -10341879, -10964686, -13315779, -13664111, -8533252, -1563915, 216833, -4603840, -10737314, -13322108, -12488891, -11093260, -11147329, -12812795, -14506851, -13709712, -9560582, -4779370, -3415548, -6635117, -11889123, -15809771, -16637543, -14342908, -9883530, -4365728, 1681144, 7723457, 11953333, 12440587, 10281161, 9375770, 11668492, 14690488, 15245384, 12963804, 8437541, 1206327, -7260572, -11805710, -9327750, -4232388, -3343864, -6728429, -8677092, -7090825, -6231023, -9497265, -14803912, -18881114, -21631850, -23781519, -23743449, -19676857, -12693525, -6021970, -2116261, -1193958, -1267324, 3588, 1629496]
6540A629496k680773q735415q662542j440958L429681k74497m926945q41817P312495
6531a5191275P353021o85112n004273j881567q66075o815963j0385071l520200
6523c6996515O750047R222133M811437K044464K624947K097903P66127K954565
6515e724892O930304N867938n88446m753588k639283O30325k42119l367948m774896
6506h662605m855234n244204l949052J152387O797450P548800L386376l93073
6498d219155o70531J92147n48979j251668J171157N357216N912869M20060o306399
6489E6717p132360j138200N063548N063582l64877n348538o174928m192743k303852
6480a6471651j274523j71539J382081K652387K900600K237229J357654O45868
$$ y = [1629496, -1051277, -9786692, -18449234, -19890192, -16460511, -16735008, -21661953, -22503770, -15191275, -7838254, -8523366, -13527639, -15409206, -16275281, -23091244, -33476315, -36996515, -30246468, -21024335, -16212898, -14168434, -11543487, -9445584, -8679457, -5724892, 1205412, 7073350, 6484904, 1731316, -907967, -277642, -519761, -3887709, -8662605, -13517839, -18762043, -22711095, -21558708, -14761258, -7212458, -3826082, -4219155, -4889686, -4697539, -5246518, -6498186, -5327029, 30187, 5943056, 6363116, 56717, -7075643, -8213843, -3150295, 1913287, 1548410, -3800128, -9975056, -14167799, -16471651, -17746174, -17917713, -16535632, -13883245, -10982645, -8745416, -7387762, -6741894]
6472f741894j63218j067047j038774N85748K186818J351354j236058j893875O84826
6463g332120K808901R37252k879470l934986j532504R84630J734379J800704J778287
6454e634927R91962J19988M19615L07195k619317n892912m171084J815592M688461
6445i975427J587680p30791L356109Q731568P408618J228959j373913J578531
6437A1811334M351857M071416L818069M631775K797567k752508p522901q493428
6429A2713181p609709n930459j331270M798145N958896K67797m969081l688768
6421B08732M79545K148088L463168P457633Q704798J169223q981918j0244030
6413D405239l481032n54819n201277p944577k794573L258304K844472l37035K14985
$$ y = [-6741894, -6905112, -7972159, -9010933, -8425185, -6238367, -4887013, -6123071, -8016946, -7332120, -4523219, -3585967, -6465437, -10400423, -11932927, -10948297, -9213918, -7413214, -5634927, -4642965, -4522977, -4103362, -3796167, -6415484, -12308396, -16479480, -14663888, -9975427, -8387747, -9118538, -5762429, 2969139, 10377757, 11606716, 10232803, 11811334, 16163191, 20234607, 24052676, 28684451, 31482018, 28729510, 21206609, 12713181, 5103472, -826987, -2158257, 2639888, 8598784, 8866581, 3897500, 208732, 688277, 2836365, 6299533, 13757166, 22461964, 23631187, 14649269, 4405239, 924207, 369388, -4831889, -12776466, -15571039, -12312735, -9468263, -9805298, -9590313]
6404i590313K850950L011066K187984L260788K961513k048748o570871l946721
6396g884352J932025J850859l691085n292059j51371L912983J764475j661865
6388i220390r83328J206345O60822p10236N62334K099423o75514o230675p997017
6379b1288236k759350N988800J2275428J2399696O715490n70942m306860l223506
6371E230520r42262r40004k509188l293797l219841l365986l129933j449304P34735
6362a2885060J895190K299247K535456J554935r73988k367668m81966K173328
6354f250526J920187J09808J006947M043638L727572j678311o691404o267245
6346a0079334k467347j91011L5685P67506J719277K39266k921650l219720J014879
$$ y = [-9590313, -6739363, -3728297, -1540313, 1720475, 4681988, 2633240, -3937631, -7884352, -5952327, -4101468, -7792553, -13084612, -13235983, -9323000, -7558525, -9220390, -10203718, -8997373, -8336551, -9046787, -8484453, -6385030, -7060544, -13291219, -21288236, -24047586, -18058786, -5783358, 6616338, 13331828, 12760886, 8454026, 5230520, 4288258, 3348254, 839066, -2454731, -5674572, -9040558, -12170491, -13619795, -12885060, -10989870, -8690623, -6155167, -4600232, -5574220, -7941888, -8423854, -6250526, -4330339, -4220531, -3213584, 830054, 4557626, 2879315, -3812089, -10079334, -12546681, -12737692, -12702007, -11934501, -10215224, -9975958, -12897608, -16117328, -15102449]
6337a5102449N151706L834640k018176o209471m577383O92117M307745L979436
6329i941835K194281K268087M049360M620082K545176m88489k580417l942210
6321a275965m922608l928514p6094L492950K638059j645193m132183l167820l021959
6312a6039327o133828p661021k427508N826739Q241080L011308k393253k112134
6304a9687944Q55156R21405j521395j994254P22126L635633M467072L557800J500677
6295g543724j512181l802386k763908J663720N971544O595157L691996R84612
6287C284830J996792O054363Q070746L628937n397834j2122963j2183766p713917
6279a4382812k938613Q15391L518169L584134O78629j313613R35457M059021K009825
$$ y = [-15102449, -9950743, -6116103, -8134279, -14343750, -18921133, -18229016, -13921271, -9941835, -7747554, -5479467, -1430107, 3189975, 5735151, 5246662, 2666245, -1275965, -6198573, -10127087, -10203181, -6710231, -4072172, -5717365, -9849548, -13017368, -16039327, -22173155, -29834176, -32261684, -26434945, -18193865, -15182557, -17575810, -19687944, -18832788, -17911383, -19432778, -21427032, -20704906, -17069273, -12602201, -9044401, -7543724, -9055905, -12858291, -15622199, -13958479, -7986935, -1391778, 2300218, 3284830, 5281622, 11335985, 19406731, 23035668, 17637834, 5514871, -6668895, -14382812, -17321425, -16506034, -12987865, -9403731, -8725102, -10038715, -9103258, -5044237, -3034412]
6270c034412m427134p910238m947923k96203R10121J2477N80998J803993O13400
6261a6694921k234366k854369j70082K682601L119759K378655L041256N078401
6253e653066N849029L758565O49030n95620l86525k045448n992932p170652j486146
6244a3073765P035284J0025725N393812m54570j748361L3387O46605k77626n44155
6235G036336k70521j331824l191451k959073J37573K750832R99682m513865q203282
6226i545593n196940K223294O144164K774963k079212r28685M612399O652750
6218D657140L329392J049439L555725O238025M301561m5505k582058l399698l751337
6209A3352684k127619J314137J623305l520357p804221m601627K383649M288837
$$ y = [-3034412, -7461546, -15371784, -20319707, -20615910, -19705789, -19693312, -19112314, -17308321, -16694921, -18929287, -21783656, -21953738, -19271137, -16151378, -13772723, -10731467, -5653066, 195963, 3954528, 4603558, 4007938, 3621413, 1575965, -4416967, -11587619, -13073765, -6038481, 3987244, 9381056, 8926486, 7178125, 7211512, 7858117, 7580491, 7036336, 6765815, 5433991, 2242540, -716533, -578960, 2171872, 3171554, -1342311, -9545593, -14742533, -12519239, -6375075, -3600112, -5679324, -6608009, -1995610, 4657140, 7986532, 9035971, 12591696, 18829721, 23131282, 23085777, 20503719, 17104021, 13352684, 11225065, 12539202, 14162507, 10642150, 2837929, -1763698, 619951, 4908788]
6201D908788K12185k825879j530469L50007L42080P87623K425025J500731l823173
6192B346918r441075j0513143o803111q46964N387798R967544J0463227O289666
6184F850860j86599n689250p637229m700989J149285M202443Q03542m864386n348846
6175a5421169j29604L825100K185369j514481k340464n55289O89384J90421j215739
6166a4286472k225777j087497K739939N912034M096180j303889l826306j063520
6158a1045308J752596j16063l912625m147235n23315K982282M195720L894227
6150f919721K659212J64632l108505n722796o337536m186132j0105L322748L568470
6141a6569733K444962L052823M395120L031922K6584Q3532K742547J717809m188027
$$ y = [4908788, 5120973, 2295094, 764625, 1114632, 1456712, 2244335, 4669360, 6170091, 2346918, -7094157, -17607300, -24410411, -25257375, -19869577, -9902033, 561194, 6850860, 6664261, 975011, -6662218, -11363207, -10213922, -6011479, -5207937, -10072323, -15421169, -15550773, -11725673, -9540304, -11054785, -13395249, -13950538, -13261154, -13070733, -14286472, -16512249, -17599746, -14859807, -8947773, -4851593, -6155482, -9981788, -11045308, -9292712, -9408775, -13321400, -17468635, -17991950, -15009668, -10813948, -6919721, -4260509, -4095877, -7204382, -12927178, -19264714, -23450846, -23460951, -20138203, -16569733, -14124771, -11071948, -6676828, -3644906, -3618322, -3534790, -792243, 925566, -3262461]
6132c262461p194308k324706M182586M690152J920962K889148O262389N222196
6124A2385958j10477k908884j302890m71573k537885l058018M64271M113734M338210
6115A0912446K834078J756661k87122m158763o899970o091316l839095l206749
6107h979830l652290k865319o98556J170342J607604N01488j152555q66678L001293
6098a1934501P867978R025408N820383K141357M8190k537659o308020p935448
6090c812312n834227l609110l846597l041628K269081Q198407Q489936M245201
6082C058751J898649K611600R36755n091467r474508o871766m70386K740475J131844
6073i530053j118015n80383K223511N136613O595463N755040K823983o27478l126083
$$ y = [-3262461, -10456769, -12781475, -8598889, -3908737, -1987775, 901373, 7163762, 12385958, 12275481, 9366597, 8063707, 7592134, 5054249, 1996231, 2460502, 6574236, 10912446, 13746524, 15503185, 15216063, 11057300, 4157330, -1933986, -5773081, -8979830, -12632120, -15497439, -16195995, -15025653, -13418049, -12916561, -14069116, -14935794, -11934501, -4066523, 4958885, 10779268, 12920625, 12968815, 10431156, 4123136, -3812312, -9646539, -13255649, -17102246, -20143874, -17874793, -9676386, -1186450, 3058751, 4957400, 7569000, 8505755, 3414288, -6060220, -12931986, -13402372, -10661897, -9530053, -10648068, -11228451, -9004940, -3868327, 2727136, 8482176, 11306159, 10678681, 7552598]
6064G552598m519717m565888j872100L460912P537659O274074Q82365l480446
6056A1269457m353219l594031k306380R53951N162666N233501o33468o115898
6048E616579m529842J282856K804391j770176n517444l536938O84993J792012
6040c173569M0548r65440j07268R91885R04590p85846l115203k825597K479449
6031f556451Q674362P623262j564140r172779p563215k050291k359998p312774
6023b0282024o892040J743398R645373R104553L253852p42910j614180k550339
6015h334317m432922n363664m465375k376937L41042K644794K814151J178713
6007a7994515Q30869L140977M883105K745022j376365k938081j094532J064220
$$ y = [7552598, 3032881, -1533007, -3405107, 55805, 7593464, 13867538, 14749903, 11269457, 6916238, 3322207, 1015827, 1969778, 7132444, 12365945, 11732477, 5616579, 1086737, 2369593, 5173984, 3403808, -2113636, -5650574, -4965581, -3173569, -3133021, -4098461, -4205729, -3213844, -2309254, -3095100, -6210303, -9035900, -6556451, 2117911, 9741173, 8177033, -995746, -8558961, -10609252, -12969250, -20282024, -27174064, -25430666, -15785293, -6680740, -3426888, -4169798, -5783978, -8334317, -12767239, -18130903, -22596278, -24973215, -24632173, -21987379, -19173228, -17994515, -17163646, -14022669, -9139564, -6394542, -7770907, -10708988, -11803520, -10739300]
5999a0739300J707593K021433K847395L020019J819405L67737m00252r66994j502804
5990a825768j012222O29489J800438J805547K409176M410568M464715r78335q736506
5981B967102j0200913j791400Q992805J1428781L916450n136893p998632n071789
5973b894489j303042M90239N80268j24808o99236j99327R28438J096734M47667
5964a677556Q62614J752104l40395n286216o865380j236237N754074N665021n89126
5955a961097m643228l288256j681233l483062n391767l954073j206642P9931J347066
5946b4182361M296472O377900M640046Q41818j320553j359228p27449P57702L232961
5937g442692L993261P50055l869547n088863k181286J515843L557871L957263
$$ y = [-10739300, -9031707, -7010274, -4162879, -1142860, 676545, 1044282, 644030, -322964, -1825768, -2837990, -2208501, -408063, 1397484, 3806660, 8217228, 12681943, 11703608, 2967102, -7233811, -9025211, -32406, 11396375, 15312825, 10175932, 2177300, -2894489, -4197531, -3707292, -3127024, -3251832, -3951068, -4150395, -3221957, -2125223, -1677556, -814942, 937162, 596767, -4689449, -11554829, -12791066, -7036992, -1371971, -1961097, -6604325, -9892581, -11573814, -15056876, -20448643, -24402716, -25609358, -25529427, -24182361, -19885889, -13507989, -8867943, -8026125, -9346678, -10705906, -11433355, -10675653, -7442692, -3449431, -2699376, -6568923, -11657786, -13839072, -12323229, -8765358, -4808095]
5929d808095K998226J024383m60124o98339j585698m326955n642974j610130N424536
5920i685170Q428087M521594j905193n478846n175191k531094J175410M169439
5912f480964M324860K303033J520504K938264L071001k65850l460134k028162
5904A922552K245413L402832l55989m590012n030894k390098J88739J337484J504363
5895a765610J076106K95127l15491p30511j328214j177764J515721N752652O950557
5886A0272573K628091k859803k958161K323361O186885L942130j732093n516292
5878A2286691n579947l050967R08709M535169M975110J794900j264944j221547
5870A3383174r3511p55224j572033k176J230188j964514o518034n216227J514391
$$ y = [-4808095, -1809869, -785486, -1245610, -1943949, -3529647, -7856602, -13499576, -15109706, -9685170, -1257083, 3264511, 1359318, -4119528, -9294719, -11825813, -10650403, -6480964, -2156104, 146929, 1667433, 4605697, 7676698, 7410848, 3950714, 1922552, 4167965, 7570797, 7214808, 2624796, -2406098, -4796196, -4607457, -3269973, -1765610, -689504, -394377, -709868, -1440379, -2768593, -3946357, -2430636, 3322016, 10272573, 12900664, 10040861, 7082700, 9406061, 15592946, 19535076, 17802983, 12286691, 6706744, 3655777, 4564486, 9099655, 14074765, 15869665, 14604721, 13383174, 13289663, 12534439, 10962406, 10960230, 12190418, 10225904, 3707870, -1508357, 6034]
5861F034M904837J032672l321983j975805J130212k59761l778006l133740N93831
5852d801709J087171j935194k453821R67821K626379j94517k392848R7833L285661
5843c713224J998140j289991p37250K747320K559681k771697o234942k080915
5835i522878N626585P930578K249102n101307p193586l766608P51443L388885
5827e637786M188089L312689J95689l859324n042503j023549N370789Q154354
5819E658448M158890l388366p535637m416521K304606M864059K17887o057979
5811d194613o566762j162946L906018M770933L481888K715476J972259P62550
5803E684803Q92342K717962L079735K64158k562509k526092k071166m334168o758757
$$ y = [6034, 4910871, 5943543, 2621560, 645755, 1775967, 1516206, -2261800, -5395540, -4801709, -3714538, -5649732, -8103553, -7135732, -4509353, -4703870, -7096718, -6998885, -3713224, -1715084, -3005075, -3742325, -995005, 1564676, -1207021, -7441963, -9522878, -3896293, 4034285, 6283387, 1182080, -6011506, -9778114, -9026671, -5637786, -1449697, 1862992, 2058681, -1800643, -6843146, -7866695, -2495906, 5658448, 9817338, 6428972, -1106665, -5523186, -3218580, 1645479, 1863366, -4194613, -10761375, -11924321, -8018303, -3247370, 234518, 2949994, 4922253, 5684803, 6577145, 9295107, 12374842, 12639000, 10076491, 7550399, 5479233, 1145065, -5613692]
5794e613692m934498n87563N25626k198994l486872q96782J930871K090653J682426
5785a1488825K866397L701540K134797J65700N62309K408127L110088K269552
5777E729685N89022k403709o159945p167655l343216J393463J521760j962619
5769a1803214k728889J423762N485700N325454L844622N405685P853517N295770
5761B0102407k558125r052242r045068m342857N28748L773839N268324L944818
5753H619844l8049l048045k036633O10650L57010k356888k792868L74810K763611
5744B453442Q63745l163018n085667l793940j106146Q89664P42802j634863l936088
5735a3770069l602442j648767j295700k380105j251804K713632N234912L704074
$$ y = [-5613692, -10548190, -11135753, -10610127, -12809121, -16295993, -17192775, -15261904, -13171251, -11488825, -8622428, -4920888, -2786091, -2620391, -2058082, 350045, 3460133, 5729685, 6318707, 3914998, -2244947, -9412602, -12755818, -11362355, -9840595, -11803214, -14532103, -13108341, -7622641, -2297187, 1547435, 6953120, 14806637, 20102407, 17544282, 8492040, -553028, -4895885, -4367137, -593298, 4675026, 8619844, 8581795, 5533750, 3497117, 4107767, 4464777, 2107889, -684979, -310169, 2453442, 3317187, 154169, -4931498, -8725438, -9831584, -8941920, -8199118, -9833981, -13770069, -17372511, -19021278, -20316978, -22697083, -23948887, -21235255, -16000343, -12296269]
5727a2296269R16174j82305n42749r36454P80877M455785N106680M73113m021880
5718f247028l375247r21236j610433k533932J477839O751523N039822k900185
5710d318877p718496n195992k97779L015263O586690J0668757J0712267N182761
5702A8634594p30784k973855l838579n783237o252761k862861J467215K782282
5694D42014J347937o42109k384938k684991L45589M680217M548844j066353n188111
5685f01901k593156J988723R58004m640719o998644k978631K386739L694523J677827
5676g107235Q18452L279680O573019O640140K886552p48862r81695J70581j028843
5667A0501789l387884k603434Q67879J768196j425762m267633m228871m138787
$$ y = [-12296269, -11380095, -11562400, -12105149, -13041603, -12260726, -7804941, -2698261, -2225148, -6247028, -9622275, -10543511, -12153944, -14687876, -13210037, -6458514, -1418692, -4318877, -12037373, -17233365, -17531144, -14515881, -7929191, 2739566, 13451833, 18634594, 17903810, 14929955, 11091376, 5308139, -944622, -3807483, -2340268, 442014, 1789951, 1147842, -1237096, -3922087, -3576498, 1103719, 5652563, 4586210, -601901, -3195057, -1206334, -248330, -4889049, -11887693, -14866324, -12479585, -8785062, -7107235, -6288783, -3009103, 3563916, 10204056, 13090608, 12341746, 11360051, 11530632, 10501789, 7113905, 4510471, 5378350, 7146546, 5720784, 1453151, -2775720, -6914507]
5659f914507n277863m118869L03320K772305N52908r79812K608822O264970L247064
5650a541662l411664n294525j200553K554310K404882O86575l06209o36689K28441
5641f517094K622357L572636K46981m136055l624926J499196M765303K899436
5633A327834o1774Q06118M777589O729624K831467n084964r914929o226983J977943
5624b838075M693483n24950m485578n11397M480996J186563o022706n590443K061820
5615g550287M868547j275426o210031k196826M645768N446002J791521N02951
5607B2219J886259J082645k532651m201640q38185N099830Q106548M163033n171689
5598G616369j2140604r609952J61553P421817O889651L036992J526280J287593
$$ y = [-6914507, -12192370, -16311239, -16007919, -13235614, -12682706, -13662518, -11053696, -4788726, -1541662, -4953326, -10247851, -11448404, -8894094, -6489212, -5802637, -6108846, -6745535, -6517094, -3894737, -322101, -75120, -4211175, -7836101, -6336905, -1571602, 1327834, 1266060, 2072178, 6849767, 13579391, 16410858, 11325894, 1410965, -4816018, -2838075, 1855408, 1330458, -3155120, -3666517, 814479, 2001042, -4021664, -9612107, -7550287, -2681740, -3957166, -10167197, -12364023, -7718255, -2272253, -480732, 22219, 1908478, 2991123, 458472, -3743168, -4581353, 518477, 8625025, 12788058, 7616369, -4524235, -14134187, -13972634, -6550817, 338834, 3375826, 4902106, 6189699]
5590F189699p82832k428689N75233O253987P657637K039747n482725q109742m540471
5581A371844P73330L038470J764007j44457j172690k742926m895737m004093J457763
5572d554489O082974M310387k22749L66460M944380M460213k369929n083131K004542
5563I938658R262614N865439l273563n073831J688905N170143j492890j1077540
5555A1007935j3387327p757860j057730J507686P4952k078075j510382K665620
5547a0535181P202012P302178J922846m693107p352162m729518J91834L290600
5539g400498K920585J297692J911590M845676N916208J955253m281692o705262
5531D59552l058128K404014L628493q99675o683461p776932l139698J965907K179364
$$ y = [6189699, 5406867, 2978178, 3553411, 9807398, 17465035, 19504782, 14022057, 5912315, 1371844, 2145174, 5183644, 6947651, 6803194, 5630504, 2887578, -2008159, -6012252, -4554489, 1528485, 5838872, 5616123, 5982583, 10926963, 15387176, 13017247, 7934116, 9938658, 19201272, 25066711, 21793148, 16719317, 18408222, 23578365, 22085475, 11007935, -2379392, -10137252, -11194982, -9687296, -9612344, -11690419, -13200801, -10535181, -3333169, 3969009, 5891855, 1198748, -6153414, -10882932, -10691098, -7400498, -4479913, -3182221, -1270631, 3575045, 9491253, 11446506, 7164814, 459552, -2598576, -194562, 3433931, 2534256, -4149205, -11926137, -15065835, -13099928, -10920564]
5522a0920564j143635k063200J222285L884571K066119j381804j748226N89113
5514i495341J930532J168701k96142k306227m953677n499393j505764L582434
5506a7374877L433654j976066n324906j882588M021772N296434J419820k113396
5498a4500153j739296O06416J707563J626363K505490M354603M252712L28141
5490h58161m846723o519994l289155J296634L055596J391878j506880l652005
5482a4928810l933052j656164K392645N524498N904608M874591M510938L957390
5474F646644Q98207l839805o291442m524835j174416K93464k68991p09343j36376
5465i106893L57262j29881r97758j071094J34583K284523M675546O338078O003941
$$ y = [-10920564, -12064199, -14127399, -12905114, -9020543, -6954424, -8336228, -10084454, -9495341, -7564809, -6396108, -6692250, -8998477, -13952154, -19451547, -20957311, -17374877, -13941223, -15917289, -21242195, -23124783, -19103011, -13806577, -12386757, -14500153, -16239449, -15633033, -13925470, -12299107, -9793617, -5439014, -1186302, -858161, -5704884, -12224878, -15514033, -14217399, -11161803, -9769925, -11276805, -14928810, -18861862, -20518026, -18125381, -12600883, -6696275, -1821684, 2689254, 6646644, 7544851, 3705046, -2586396, -7111231, -8285647, -7992183, -8261174, -8970517, -9106893, -8749631, -8879512, -9877270, -10948364, -10813781, -8529258, -3853712, 2484366, 8488307]
5456H488307K799507k407625o621197o686185k335644L029902N280133L420658
5448D967856J90109j286752q48567o07685j398759j691997p34624m88559k071374
5439c970352k325712J780212O224168L474215n562611r924760l254034O131759
5431g427115O639240j0885k697776J206660K741517k827006p797834m261323L798379
5422a0636143O869479K694726l395292o671239n691519k06403P600851J1780275
5414B344735Q000573n15794o460208o848571m607004l234194l513791m560762
5406a9395016m904626l141611K13103K612609K894416K801736L412107L085138
5398a2422144J447923J838159N976883R346593O686553J30898l072858j62520
$$ y = [8488307, 11287814, 8880189, 2258992, -4427193, -6762837, -3732935, 1547198, 4967856, 5157965, 3871213, 3022646, 2414961, 1016202, -675795, -1410419, -1898978, -3970352, -6296064, -4515852, 1708316, 5182531, -380080, -10304840, -13558874, -7427115, -787875, -798760, -3496536, -2289876, 451641, -2375365, -10173199, -14434522, -10636143, -3766664, -1071938, -4467230, -11138469, -16829988, -17036391, -9435540, 2344735, 10345308, 9829514, 3369306, -3479265, -8086269, -11320463, -14834254, -19395016, -24299642, -27441253, -27228150, -24615541, -21721125, -18919389, -15507282, -12422144, -10974221, -9136062, -3159179, 6187414, 12873967, 13004865, 9932007, 9769487]
5390I769487M139002M062050j173273p648639j0427860p269636o86167M308968
5382d926068N590098N287019M996712L132724r55306m211224m324087l225519
5374A364349k814605j352935J835227K652254j393199n239030l103856K104109
5366e947686L245706J80757j141711P51811J299902j169739k690881j088058N13493
5357f046406m51580j999621j442248R36812L410058M639383L544964M41172k148736
5348H83798k789741l532844n485808n032822K68756N215153L360404k462332l946426
5339a3521862j23070K289432Q10817K39752K918631M970829M109389K823629J806102
5330F323649j359873m785190k624282L943842N320773k290778r856990q335040
$$ y = [9769487, 13908489, 17970539, 16797266, 9148627, -1279233, -8548869, -9235036, -4926068, 664030, 5951049, 10947761, 14080485, 13125179, 8913955, 4589868, 1364349, -1450256, -2803191, -967964, 1684290, 291091, -4947939, -8051795, -5947686, -2701980, -2521223, -3662934, -2911123, -1611221, -2780960, -5471841, -6559899, -6046406, -6497986, -8497607, -9939855, -9003043, -5592985, -953602, 2591362, 3032534, 883798, -1905943, -5438787, -10924595, -15957417, -15688661, -10473508, -7113104, -9575436, -13521862, -13644932, -11355500, -10544683, -10304931, -7386300, -2415471, 1693918, 4517547, 6323649, 4963776, 178586, -2445696, 1498146, 6818919, 4528141, -5328849, -13663889]
5322a3663889r05440L687698L134534M30605l034350o243290n459423N82779O164848
5313a5305928N516599R84113j216193K710J236616J090170Q77413J393091L003854
5304b417555N903228P239676K712280n458301q229971k302529L628444J619546
5296B694818l259000j809064M174964O067335L408541K933468M477113L78854
5288A9067029r723049j5161429r395874M88927M727146L764533L922754N788884
5280C478921M377897j404683o239149o029388l484377l768645o757085o714245
5272b6540754k52008Q014453J0649766P112745M078739N492000P209051M118176
5264A9882168j960655n590495n479557m294775l299720k013706j361461k343997
$$ y = [-13663889, -14569329, -10881631, -7747097, -7316492, -10350842, -16594132, -22053555, -21470776, -15305928, -9789329, -8805216, -10021409, -10018699, -8782083, -7691913, -6814500, -5421409, -2417555, 3485673, 10725349, 13437629, 7979328, -250643, -2553172, 1075272, 2694818, -564182, -2373246, 1801718, 7869053, 11277594, 14211062, 18688175, 19067029, 9343980, -5817449, -15213323, -14724396, -9997250, -6232717, -2309963, 3478921, 7856818, 6452135, 212986, -5816402, -9300779, -13069424, -19826509, -26540754, -26792762, -18778309, -8128543, -1015798, 3062941, 8554941, 15763992, 19882168, 17921513, 12331018, 6851461, 2556686, -743034, -2756740, -4118201, -6462198]
5256f462198k829002k45156L437594L753277J42230l546630m258949k028058J705305
5247a0331587M593962L913731L90697o58884L521921P337195L916781m012795
5239H671021p204668l070334J574820J542927l81459l09825L62651q47511k200593
5230a862971r77282J412393J522545j028883l535773l781965j704873R51101J386090
5221g619618j858804o093599o289697j042745N308361P721941N518974J247762
5213c107425l035816o268093o896807l649968K011712N753534L920704k249030
5205a3521189o620156m127224K922624O843633L963584r58684j953652j6451J18776
5196a3348739j347265J75407M962043P040082K742500l671931n744939k783435
$$ y = [-6462198, -9291200, -9536356, -6098762, -2345485, -2203255, -5749885, -10008834, -12036892, -10331587, -5737625, -1823894, -1433197, -2092081, 1429840, 8767035, 12683816, 8671021, 1466353, -1603981, -29161, 1513766, 1132307, 822482, 1185133, 337622, -1862971, -2840253, -1427860, 94685, -934198, -4469971, -8251936, -9956809, -9005708, -7619618, -9478422, -15572021, -21861718, -22904463, -17596102, -9874161, -4355187, -3107425, -6143241, -12411334, -19308141, -22958109, -20946397, -15192863, -11272159, -13521189, -20141345, -24268569, -21345945, -14502312, -10538728, -11497412, -13451064, -13467515, -13348739, -14696004, -14520597, -9558554, -2518472, 224028, -3447903, -9192842, -11976277]
5188a1976277Q91687K393448K750605L619439M188645K356583j844621n302809
5180b923300n156350k374564k77112K05100J071955K750916K836341R69916P94694
5171b102404L910328N778584K033683m222620o507297m122121j895433k235040
5163i362320k918109k204702j010028K2932J257439K076515K029163K973428N844506
5154a291176O850893K179624m788548p065048m205112k244259l394646l000413
5146a6958685J729446O845023Q181364O849751N228990K820244n36416k028711
5138A2131006k06383J744060N69424k193425l050424j685321m19481n56464j634081
5129D698911k808978l367731l053584k421285j517375J025762N097879O669906
$$ y = [-11976277, -11084590, -8691142, -5940537, -2321098, 1867547, 4224130, 2379509, -2923300, -8079650, -10454214, -10731326, -10526226, -9454271, -6703355, -3867014, -2897098, -2102404, 1807924, 7586508, 9620191, 5397571, -1109726, -5231847, -7127280, -9362320, -12280429, -14485131, -15495159, -15472227, -14214788, -12138273, -10109110, -7135682, -1291176, 5559717, 7739341, 2950793, -4114255, -8319367, -10563626, -13958272, -16958685, -15229239, -8384216, -202852, 6646899, 11875889, 14696133, 14159717, 12131006, 11924623, 13668683, 14238107, 12044682, 8994258, 7308937, 6889456, 6332992, 4698911, 1889933, -1477798, -4531382, -6952667, -8470042, -7444280, -2346401, 4323505]
5121D323505K298726m630318o940316l060663J361182J632194j018279l185776
5113i219745l108048j58193M447907O058462J298436n218699n277273J100922
5105a0076231N473496L974389J983829K898792J666331m767536r201220m631867
5097a2680017L382638M251041j633917m141631P28598N620182L790761j432907
5089b115252k587832J579164N784865N880944L154446J015517N7751j618645l940786
5080G210172l864434m67694J962829m62289m574024l802536K348682P454456O742920
5071A2548082J760740l498002o134658m110430J949451O500388M502673p12796
5063A2805448j507265K041961K081762l992091r325529r004076o651645n809645
$$ y = [4323505, 6622231, 1991913, -4948403, -8009066, -6647884, -5015690, -6033969, -9219745, -12327793, -12485986, -8038079, -1979617, -681181, -5899880, -11177153, -10076231, -4602735, -628346, 1355483, 4254275, 5920606, 1153070, -8048150, -12680017, -9297379, -5046338, -6680255, -10821886, -10093288, -4473106, -682345, -2115252, -4703084, -3123920, 2660945, 8541889, 11696335, 12711852, 12769603, 11150958, 7210172, 3345738, 2878044, 4840873, 4378584, -195440, -3997976, -1649294, 5805162, 12548082, 14308822, 10810820, 4676162, 565732, 2515183, 9015571, 13518244, 12805448, 11298183, 13340144, 15421906, 11429815, 2104286, -6899790, -13551435, -19361080]
5055a9361080l643358J679669N669878N311071M369140N124841L111864l151763
5047h89738n919840k93130N563723K508026m204630l350326L564784M923904j993174
5038i0401p272952m051903L051111P102322P291697N538380K100605k226595m663257
5029F779007l723355q91750J438005J191170k570374o724800m899855M056809
5021e345143J1565710R262426P18423l619427j050433J512058o11501m114079
5013H318034m674754k846958j143701l81853n83920j703265k518612j721850j9677
5004g276556J245210K191406K644259Q89831k690885m099664j672428L58666j159897
4995i570058k303234J066961N019384L559614p38091m66054M462755O705639K581512
$$ y = [-19361080, -23004438, -21324769, -15654891, -10343820, -5974680, -849839, 2262025, -889738, -6809578, -7102708, -1538985, 969041, -3235589, -6585915, -3021131, 1902773, -90401, -7363353, -11415256, -8364145, -1261823, 6029874, 11568254, 13668859, 11442264, 6779007, 3055652, 2163902, 3601907, 4793077, 2222703, -4502097, -9401952, -5345143, 6220567, 15482993, 16201416, 12581989, 11531556, 13043614, 12432113, 8318034, 3643280, 796322, -347379, -729232, -1313152, -3016417, -5535029, -7256879, -7276556, -6031346, -3839940, -1195681, -305850, -2996735, -7096399, -8768827, -8410161, -9570058, -11873292, -10806331, -5786947, -2227333, -2965424, -3431478, 1031277, 7736916, 10318428]
4986A0318428m088521q576356r245278o004626p57812K066971P97691l20696J502651
4977a4307548J783829k692350n327485N05530Q226141O625063j679240l742975
4969a0609035L032008P796302M886691J560205L462084N173212J191579l944283
4961A2548763l359873J597788M479438K401239k363201n323479k543456M953453
4953A2390672R335538M200786n748159r873933n674055j48540J889431K003796
4945H375536R73463k855316p083656o295864q75173L611159O124714J0107262
4937A2082125J3735167J0639215J446813n613529o977050o693890o469011l646886
4929H502954r1616j444508n859319n198369P37899L354692N92202R9793M309244
$$ y = [10318428, 6229907, -2346449, -11591727, -17596353, -18354165, -16287194, -15489503, -15810199, -14307548, -12523719, -15216069, -20543554, -20038024, -11811883, -5186820, -6866060, -10609035, -7577027, 219275, 5105966, 6666171, 10128255, 15301467, 16493046, 12548763, 9188890, 10786678, 15266116, 17667355, 15304154, 9980675, 7437219, 12390672, 21726210, 25926996, 20178837, 10304904, 4630849, 4482309, 6371740, 8375536, 9348999, 6493683, -589973, -6885837, -7761010, -4149851, 1974863, 12082125, 25817292, 36456507, 37903320, 32289791, 25312741, 18618851, 12149840, 8502954, 8411338, 6966830, 1107511, -4090858, -3352959, 1733, 593935, 693728, 5002972]
4920E002972N848968J828458n88474K299870M300051J496983j129766j17629R03618
4911A9845051J4932j29224q64054o174935j0990382n590155O177208R506600K130835
4902A3925876k711288L9184O04745l960622l123810N283513Q692401L409410J967569
4893B4126978Q071838Q332562q93648m174217L793679O985483p72293l043085
4885D2427297N725485O728709n027144n465077J3085100K1391871O749762K107820
4877H7723823K4974556L7736417J9954778K4899686Q7474603J22754675K2656575
4870D28175113j61223420k47233207j56450077j0608388M4035877J3726612o088920
4863i5666410J1448347J9703888L545262l318615Q964015J2325728r85638o187077
$$ y = [5002972, 10851940, 12680398, 12091924, 14391794, 18691845, 20188828, 19059062, 18941433, 19845051, 19859983, 19730759, 18866705, 12691770, 1701388, -3888767, 2288441, 11795041, 13925876, 11214588, 11253772, 11858517, 7897895, 4774085, 10057598, 18749999, 22159409, 24126978, 32198816, 40531378, 39637730, 35463513, 39257192, 46242675, 45470382, 42427297, 48152782, 54881491, 49854347, 44389270, 57474370, 78866241, 85616003, 87723823, 112698379, 150434796, 170389574, 195289260, 282763863, 405518538, 428175113, 266951693, 19718486, -136731591, -147339979, -103304102, -89577490, -95666410, -84218063, -64514175, -60968913, -64287528, -55323513, -42997785, -43983423, -50170500]
4855e0170500M242048Q649568k94725l671160N040447P801688k775326r565736
4847d0743696k012907P568329Q193391N860774O366092M486548j640927m479494
4839a6401890j899896r48048k787475r32010L010888N8699p145867n237918O258044
4830b6025473J1537778L878329m371337l489541J2474q57590j239541L062960
4822a7491941N774782K434467n63003J744756L670860P30060j041705L031764
4814a709960N971159Q79691o356478o518290j545193O44010m05482M82446L320572
4805e237525L572994J026752j82008P15845O071l966882p821767p257659j879396
4796b1023575M105070N631364K308113p01641L56852J985241j192211p182397
$$ y = [-50170500, -45928452, -37278884, -37573609, -41244769, -36204322, -28402634, -31177960, -40743696, -42756603, -35188274, -26994883, -21134109, -14768017, -10281469, -11922396, -16401890, -18301786, -19249834, -22037309, -22969319, -19958431, -19899732, -27045599, -32283517, -26025473, -14487695, -10609366, -14980703, -18470244, -18457770, -19315360, -20554901, -17491941, -11717159, -9282692, -9845695, -8100939, -4430079, -3700019, -4741724, -1709960, 4261199, 5140890, -1215588, -7733878, -9279071, -8635061, -9040543, -8558097, -5237525, -1664531, -637779, -819787, -103942, -97871, -4064753, -11886520, -19144179, -21023575, -16918505, -11287141, -8979028, -9680669, -9323817, -7338576, -8530787, -15713184]
4788a5713184q818682m422094L77397J743109J915427L288086M363787L310141
4780a3956013O05919k766736n311178l740900K831594Q397737O270064q98984
4772h568497m403961k176440k56896j684639k630325p00992J410627K300432L804790
4763a2905901M893932J833879l638501m715926m12972K351111J18572k250620
4755a4726426j095175L41029o87239j668617j224322k029559l724843j611120
4747b6426272L624025M217794j789524n649558j850628K761509J185131j802006
4739b5729529J000124O008203N332469L36948j792065n67389r59219k669941p45274
4730a9785673M312059O012589J754838l652376m865621j464858L265277N290734
$$ y = [-15713184, -24531866, -28953960, -28576563, -26833454, -24918027, -21629941, -17266154, -13956013, -13350094, -16116830, -21428008, -25168908, -22337314, -13939577, -7669513, -8568497, -12972458, -15148898, -15405794, -17090433, -19720758, -20421750, -19011123, -16710691, -12905901, -8011969, -6178090, -9816591, -14532517, -14945489, -12594378, -12475806, -14726426, -15821601, -15480572, -16167811, -17836428, -19060750, -21090309, -24815152, -26426272, -22802247, -18584453, -20373977, -26023535, -27874163, -25112654, -23927523, -25729529, -24729405, -18721202, -13388733, -13051785, -14843850, -15411239, -16370458, -19040399, -19785673, -15473614, -9461025, -7706187, -11358563, -16224184, -17689042, -14423765, -9133031]
4722i133031K662158j756841k556569J054748M007270L325622J905848J590621
4714A099826n00565m401712l995552K428939O251027J174175n734673n193703
4706h872238p73052j409996m952395k691800L443407K974222m582059p746914
4698b4610825j643736M674613L281517j798353l668266k419075m84823L103914
4690b3565034P897473Q748865L365040k597359l177927K60670L426042N590785
4682e1445O899130M612427k139669p909896p003525j231067L232974M031522K946786
4673C387237O76554l227232o369660m736539J484909O914968O854957K061956
4665G047150k921180m552638k630934J051407M801073P027346N482516o33507
$$ y = [-9133031, -6470873, -8227714, -10784283, -9729535, -5722265, -2396643, -490795, 1099826, 599261, -3802451, -7798003, -5369064, 881963, 2056138, -3678535, -8872238, -9645290, -11055286, -16007681, -18699481, -15256074, -12281852, -16863911, -24610825, -26254561, -21579948, -18298431, -20096784, -23765050, -26184125, -26668948, -23565034, -15667561, -6918696, -3553656, -6151015, -9328942, -9068272, -5642230, -51445, 6847685, 11460112, 9320443, 1410547, -5592978, -6824045, -3591071, 440451, 3387237, 4063791, 836559, -5533101, -10269640, -8784731, -1869763, 4985194, 7047150, 4125970, -426668, -3057602, -2006195, 2794878, 9822224, 15304740, 14671233]
4657A4671233p329382q244450k745209J915504L8446m464357m346630j00135J789666
4648h815314m00001k100734j100778j59261n55546m10456l32075l243987p320442
4639b4438594o908579k163914N46494j19527J702968O849976P363628N00947m191666
4630b0858267K43419O107871L821848k013051j350237L441178K183517m912999
4622a3336721p946856m460065j805483k237829L88679O777666Q559478K980723
4614a1080408j036113K324090N753502J187167o775013q346895k854738K620677
4606a8207731L934919J973363j557093l787804m42378P545348J1466768N614883
4598F540275l671972o864393m563040l513024l538182R16227Q089810R204662
$$ y = [14671233, 7341851, -902599, -3647808, -1732304, -1693858, -6158215, -10504845, -10604980, -8815314, -9215315, -11316049, -12416827, -12576088, -13131634, -13542090, -13874165, -17118152, -24438594, -31347173, -33511087, -32964593, -33084120, -31381152, -24531176, -17167548, -16666601, -20858267, -20614848, -14506977, -10685129, -12698180, -14048417, -10607239, -8423722, -13336721, -21283577, -25743642, -27549125, -29786954, -29398275, -22620609, -14061131, -11080408, -12116521, -9792431, -4038929, -2851762, -9626775, -17973670, -20828408, -18207731, -14272812, -12299449, -13856542, -17644346, -18086724, -10541376, 925392, 6540275, 2868303, -3996090, -8559130, -12072154, -15610336, -14694109, -6604299, 2600363]
4590B600363K483385l548045l408474j788434l415770m673796j137522L599164
4582i289129L510361k03709j625825R44440M461014O931887Q029687N931378n18880
4573A8171224p389728r019988n768314l228405l261239j348280N003368J0243996
4565C402634P466783j493746p517959n645550p53355P7980k545633k157552K986373
4556f180025O432701K740889m204366o427865k794878O84428N34590j48619J755300
4547g607845M454801N236253M687564L969997J887217k070395n263972n760685
4539d67065n264722m900798j937643M966334J0828769R982172M136630n11713
4531A6831964k071091l244892m665467m181638k020455o57470R5818K062797L308093
$$ y = [2600363, 5083748, 1535703, -1872771, -3661205, -7076975, -11750771, -12888293, -9289129, -5778768, -5982477, -7608302, -6663862, -2202848, 4729039, 12758726, 18690104, 18171224, 10781496, 1761508, -4006806, -7235211, -10496450, -11844730, -6841362, 3402634, 10869417, 9375671, 1857712, -3787838, -4541193, -4463213, -7008846, -9166398, -6180025, 252676, 2993565, -1210801, -7638666, -10433544, -9749116, -9214526, -9363145, -7607845, -3153044, 2083209, 6770773, 10740770, 12627987, 10557592, 5293620, -467065, -5731787, -10632585, -12570228, -7603894, 3224875, 13207047, 17343677, 16831964, 14760873, 11515981, 6850514, 2668876, 648421, -9049, 86769, 2149566, 5457659]
4522E457659L14134m468166m494214M42796L232846R21914q81845J304618J958417
4513C788159l539353r004813n715270L574891P727875L010842k434282r95582
4505c587533M336977N436918L27014m952126m613438k94809J321032k604761o810922
4496a1441648m619233K677566P127570M869807O31848l61596J33591k165999o163372
4487i311466o986488l347091J371841M189546M774137L741239K366969K926321
4479b74992N806423P423822M594403k45271k142771r73420j197318m340789o221496
4470B428591l043306K852030N123732K20855q443469j2884308q422888L26233
4462b1842530M035593L60261l091851p6428N213595N456420J771389O72268K733654
$$ y = [5457659, 5771793, 1303627, -3190587, -2747791, 485055, 1406969, 525124, 1829742, 3788159, 248806, -8756007, -14471277, -10896386, -3168511, -157669, -2591951, -3587533, 749444, 6186362, 6513376, 1561250, -3052188, -3346997, -2025965, -4630726, -11441648, -16060881, -13383315, -6255745, -1385938, -754090, -1115686, -982095, -3148094, -9311466, -16297954, -19645045, -18273204, -14083658, -9309521, -5568282, -3201313, -274992, 5531431, 12955253, 17549656, 17304385, 15161614, 14188194, 12990876, 8650087, 2428591, -614715, 2237315, 7361047, 7581902, -861567, -13745875, -22168763, -21842530, -17806937, -17446676, -20538527, -20614955, -15401360, -9944940, -8173551, -7501283, -4767629]
4453d767629K931121Q38520J204564L891398K557977m213311r011093o556969
4445a3125422j171735J046504Q19944J473268J999369M8235k592748k923745j661052
4436a6087382p07420O59130K748111K653237p42014k960778l18520L786792M526193
4427f442651L521854M550773N185186O87403o183578p898963l934382j384132
4419a1898490l374162n022531k529551J377361L631971N513231P920315Q152360
4411C770504N054146J928321O87975j461391n398115n836044N39745P245789N327468
4402A1858398l963657j0783181j0032035o282104m758564l923028M103N695708
4394b2184360Q117410N527160J521508N8123Q99239J133935j53867q59880K03823
$$ y = [-4767629, -1836508, -997988, 206576, 4097974, 6655951, 2442640, -6568453, -13125422, -14297157, -13250653, -12430709, -10957441, -8958072, -8909837, -11502585, -14426330, -16087382, -16794802, -16135672, -13387561, -10734324, -11476338, -14437116, -14755636, -10968844, -6442651, -2920797, 1629976, 6815162, 7502565, 1318987, -6579976, -10514358, -11898490, -15272652, -20295183, -22824734, -21447373, -17815402, -12302171, -4381856, 3770504, 8824650, 10752971, 11440946, 9979555, 4581440, -1254604, -714859, 6530930, 11858398, 7894741, -2888440, -12920475, -19202579, -23961143, -27884171, -27880068, -22184360, -14066950, -8539790, -7018282, -6960159, -6060920, -4926985, -5080852, -5940732, -5736909]
4385e736909O63096j979348n694407n976450k338453Q16103N49351j013461q98719
4376b1609197M97967J413808J367663m83309n493738j0795576r077520J757615
4368d2422287J2599259J3262729N862344Q33031J692727K582091O57725P08875
4360d223506M522884N447111n40738o292086l808910K638819K684538m090986
4352c662874p693767k813355M304752N906282K490678p87308k110626l124810
4344g491028m202576l789171j552703O35730R19146o41612k330212k480728j169309
4335b2102463j11516m36157j179383q65618K38138P21853J42769q08486j466215
4326b5867078j232422M16044K525559K790445R19705O9335K518095N902002O861735
$$ y = [-5736909, -5073813, -7053161, -12747568, -18724018, -21062471, -20246368, -19697017, -20710478, -21609197, -21111230, -19697422, -18329759, -18813068, -24306806, -35102382, -44179902, -42422287, -29823028, -16560299, -10697955, -9864924, -8172197, -5590106, -4932381, -4223506, 299378, 5746489, 5205751, -1086335, -4895245, -2256426, 428112, -3662874, -11356641, -14169996, -9865244, -3958962, -1468284, -2255592, -4366218, -7491028, -11693604, -15482775, -17035478, -16399748, -15480602, -16122214, -18452426, -20933154, -22102463, -22213979, -22650136, -23829519, -24695137, -24456999, -23735146, -23592377, -24400863, -25867078, -27099500, -26683456, -24157897, -21367452, -20447747, -20378412, -17860317, -11958315, -5096580]
4317e096580O387629P359511Q276599M657031l323029r580930r531821m687442
4309e539032R16450M729283N163097J493057l845944o417183m941740k320138
4301a0762150p48290M12132J167633K0135j884400p38013L325675M465345o77783
4292e419716p209808q148286l000257L223424O369843N319913J123522k730452
4284a0471817k371782J107962J991640j503596l794172r96620K122591J98260
4276a3717534k810661K67755P037101P966549R50763n245463l640953K075213
4268g117230M171519J127612k043757p69253M134160P238622M049125l079397
4260G711401o364889k226372L419979L370700o19232j549610J462550K887014
$$ y = [-5096580, 1291049, 8650560, 16927159, 21584190, 18261161, 8680231, -851590, -5539032, -4622582, 106701, 5269798, 6762855, 2916911, -3500272, -8442012, -10762150, -11510440, -11098308, -9930675, -9910540, -11794940, -12532953, -9207278, -4741933, -5419716, -12629524, -20777810, -23778067, -20554643, -14184800, -8864887, -7741365, -10471817, -12843599, -11735637, -9743997, -11247593, -15041765, -16038385, -13915794, -13717534, -16528195, -16260440, -9223339, -1256790, -306027, -5551490, -9192443, -7117230, -2945711, -1818099, -3861856, -4631109, -496949, 6741673, 10790798, 7711401, 1346512, -879860, 2540119, 5910819, 5291587, 3741977, 5204527, 8091541]
4252H091541Q74637l24753J118927J297533k007044n230558n115043l014771m54909
4243d764440L582433P689320O608247m68788n515590j531829O857086Q876238
4235B1332677J647297p153230r917032o862658k657513k03351J86642j158086
4227d785254l229010m021875k784471j776782l282634n204474l015545K821224
4219b5278821N492514J351817l012690O36872Q804465R822269J096141o676483
4211g763916n538433p15571O30464J341696O118725R712539M747260m114934o103500
4202a685670j238316R45329k201599l798097j026452J020171N77232K594216Q063314
4193C250128J0448402O234481Q0810l406986m704563m270182j144962J754918
$$ y = [8091541, 8966178, 8641425, 9760352, 11057885, 9050841, 3820283, -1294760, -4309531, -4764440, -1182007, 6507313, 13115560, 12646772, 7131182, 5599353, 12456439, 21332677, 22979974, 15826744, 5909712, -952946, -3610459, -3813810, -3627168, -4785254, -8014264, -12036139, -14820610, -16597392, -19880026, -25084500, -28100045, -25278821, -19786307, -18434490, -21447180, -20810308, -12005843, -2183574, -1087433, -7763916, -13302349, -14017920, -13387456, -12045760, -5927035, 3785504, 8532764, 4417830, -1685670, -2923986, -1978657, -4180256, -7978353, -9004805, -7984634, -7407402, -4813186, 3250128, 13698530, 19933011, 20013821, 16606835, 11902272, 7632090, 6487128, 8242046]
4185H242046n0106l793687k392876L276601N601180L911000M614205O953114K732775
4176B9094252p450869j2415733q173801k702719J74231N177572J0159256N215044
4168A9077233o911038r646638M20710O529421Q24532k904499K956681N190344
4160A5536746k046003k623814Q584229R427235p313663j0991171J0377683P670218
4152B8621460n8763868j31806856j13169790l551830Q5992786P9231571K3271979
4145i0174548P98837J6471696K0891088K163683p778899K973606J2239848Q373831
4137c4040858M297695O234092M610247j181039M11929Q200742P121787m251835
4129h597240r547596k320828M596399K661787l16849K015464L599649J64554j979014
$$ y = [8242046, 8191940, 4398253, 2005377, 5281978, 10883158, 14794158, 19408363, 26361477, 29094252, 21643383, 9227650, 1053849, -1648870, -1474639, 3702933, 13862189, 19077233, 12166195, 2519557, 2940267, 9469688, 10294220, 7389721, 10346402, 15536746, 13490743, 10866929, 19451158, 28878393, 21564730, 10573559, 20951242, 28621460, -30142408, -161949264, -275119054, -278670884, -192678098, -113446527, -90174548, -89375711, -72904015, -52012927, -49849244, -57628143, -54654537, -42414689, -34040858, -29743163, -23509071, -18898824, -20079863, -19667934, -11467192, -4345405, -8597240, -18144836, -20465664, -15869265, -13207478, -13524327, -11508863, -7909214, -7744660, -9723674]
4120i723674J134867L437440Q77648j449320k94261m32975m062401n446882k018470
4111a7978028j6718l046162n175427j689761K709528K942921K205950M803068
4103a5244629P722378O209089J904344p00454j256719k058270l646897n593334
4095a2664492p627528p586120k997721L463005N721706L281740K145048M756140
4087a1508222O086273K682410j518242k395434k245943m631028p857988p912943
4079b9301117l895499K296956P598972P761769J282270n562760m555561K267454
4071b2107516M712532P70705L23969P869537J2951843O253870m570125o205494
4063f79K60237K858175j918760n867098l855375j37271J157603J741027K910968
$$ y = [-9723674, -8588807, -5151367, -4273719, -5723039, -6017300, -6450275, -10512676, -15959558, -17978028, -17994746, -21040908, -26216335, -27906096, -25196568, -22253647, -20047697, -15244629, -7522251, -1313162, 591182, -109272, -1365991, -3424261, -7071158, -12664492, -20292020, -27878140, -30875861, -27412856, -21691150, -18409410, -16264362, -11508222, -5421949, -2739539, -4257781, -6653215, -8899158, -13530186, -21388174, -29301117, -33196616, -30899660, -23300688, -15538919, -14256649, -19819409, -24374970, -22107516, -17394984, -16624279, -16300310, -8430773, 4521070, 10774940, 6204815, -679, 259558, 3117733, 1198973, -4668125, -8523500, -8660771, -7503168, -5762141, -2851173]
4054b851173J996798j662873l929204k493989p98031j907605l233304j208253
4046a6087634K409884L110587L98121j958189j753837j007257k005878l114410
4038b0008613q15006M429859P058803L079785l940364o823604l965618m24128
4030b1408886L89022R21728L406821M962126K806135P9723J256740M556840M373147
4021A343396k79994m726580n107889j589648L772690Q048383P611603K036324
4013A1108285l317817l570896j821309m392119r599497q938620n40069O577521
4005a4494521N135785m81354j901111J208080K829368N82313k278210k894844
3997a2294494j252017K275574O724258Q543863M710474k146957o134971n736624
$$ y = [-2851173, -854375, -2517248, -6446452, -8940441, -9738472, -11646077, -14879381, -16087634, -13677750, -10567163, -10169042, -12127231, -13881068, -14888325, -16894203, -20008613, -20823619, -16393760, -9334957, -6255172, -10195536, -17019140, -20984758, -21408886, -21019864, -20098136, -16691315, -11729189, -8923054, -8843331, -7586591, -3029751, 1343396, 1063402, -3663178, -8771067, -10360715, -6588025, 1460358, 9071961, 11108285, 7790468, 4219572, 2398263, -1993856, -11593353, -20531973, -21072042, -14494521, -9358736, -9840090, -11741201, -10533121, -7703753, -7121440, -9399650, -12294494, -13546511, -11270937, -4546679, 3997184, 8707658, 6560701, 425730, -5310894]
3989e310894m649479m698586l058852J701958N631131M672324N75856j914842
3981g051384j395694K1067R24650J399443Q26197j422612l505576k734183K64612
3972a2673480K118225J664775J117216J638900J224777j357062l496879k019774
3964a1783302K416556O373160P463892N221414J32212n516182p471109l639189
3956f802548K191226M059107J250026j282713l46564J325861L8176l048975m069127
3947f685531k412613j055352j593313k286782j452044R5219J063902J656230J903600
3938a0766684L12525l371518n713275l119623K785998O658764O330901M621098
3930b261814L713521K190804k70082r660M583175P843885L376082o074075j1373715
$$ y = [-5310894, -9960373, -14658959, -17717811, -16015853, -10384722, -5712398, -5136542, -7051384, -8447078, -8426011, -7501361, -6101918, -5275721, -6698333, -10203909, -12938092, -12673480, -10555255, -8890480, -7773264, -6134364, -4909587, -6266649, -9763528, -11783302, -9366746, -2993586, 4470306, 9691720, 9823932, 4307750, -3163359, -6802548, -4611322, -552215, 697811, -584902, -931466, 394395, 432571, -2616404, -6685531, -9098144, -10153496, -11746809, -14033591, -15485635, -15390416, -14326514, -12670284, -10766684, -10454159, -13825677, -19538952, -22658575, -19872577, -13213813, -6882912, -2261814, 1451707, 3642511, 3372429, 3362769, 7945944, 15789829, 19165911, 13091836, 1718121]
3921A718121r078658m605340k866154k200157J80697K503381J829454q62667k411755
3912a5793078j483228J397670M762088N569771J574549m087845n420521k471374
3904a5951968j711404m758103m191275M100736J1823005R475002R05395k691874
3896c000486O38329L169735J369733m53283j59931j028435l384484k511670K159624
3887c200868M164001J5069n004980m951276j013389K393732L645887K543189j489862
3878b898497o081930n972207l25423M619175L901696L61958p78583P68786K425034
3869c979991L684935M570944K994961j722439n713799n150965j472892J359928
3861e429318K035020J226110r44358l406261l430354r54734k62397l532197o051069
$$ y = [1718121, -7360537, -11965877, -14832031, -17032188, -16851491, -14348110, -12518656, -13381323, -15793078, -17276306, -15878636, -11116548, -5546777, -3972228, -8060073, -13480594, -15951968, -17663372, -22421475, -26612750, -22512014, -10689009, -1214007, -308612, -3000486, -2362157, 807578, 2177311, 1724028, 1564097, 535662, -2848822, -5360492, -3200868, 963133, 978202, -4026778, -8978054, -9991443, -7597711, -3951824, -1408635, -2898497, -8980427, -14952634, -15278057, -10658882, -6757186, -6395228, -7173811, -6405025, -3979991, -295056, 4275888, 7270849, 5548410, -165389, -5316354, -6789246, -5429318, -3394298, -2168188, -3112546, -6518807, -9949161, -10903895, -11166292, -14698489, -20749558]
3852b0749558k263557N935474J1201420R254396K104260n175363p976225m784524
3844a2453677R60728L857363L151034L092139N378840O359652M153511K373797
3836A6873387K831109J058738n318306j0036462p194643j492047j196385m997681
3828i472290m923331L16143M294727M084088L383683M134800L413471J79780k081113
3819C329958j525649q99645k334686l954603l302573m62753K902528M517562K219974
3810D90113k797383n129141j629613L568825N132801M216022L983923J675687
3802I511234n966502j2382582p526505N642175J2351662N829123m555616q152180
3794e249191n839885l353660j379449J327503K596179J303143J208596M408972
$$ y = [-20749558, -23013115, -17077641, -5876221, 3378175, 5482435, 307072, -7669153, -12453677, -11492949, -7635586, -4484552, -1392413, 3986427, 10346079, 14499590, 16873387, 19704496, 20763234, 15444928, 5408466, -1786177, -3278224, -4474609, -9472290, -14395621, -14079478, -9784751, -5700663, -2316980, 1817820, 5231291, 5411071, 3329958, 1804309, 904664, -1430022, -5384625, -8687198, -9149951, -6247423, -1729861, 490113, -2307270, -7436411, -9066024, -5497199, -364398, 3851624, 7835547, 9511234, 3544732, -8837850, -16364355, -10722180, 1629482, 7458605, 2902989, -5249191, -11089076, -14442736, -15822185, -14494682, -11898503, -10595360, -9386764, -4977792]
3786d977792O523843L997854N86545P34978K019539M75589j883440j817389k107948
3777C551779o117934r279977n068535L016430M971390o80619m716030j634742
3769a5958238K401344p132n866577o333551O80685Q187630R597628N878701K152862
3760G33352N21377q12899k510530k063090J650515M870561L426566r39576k819781
3751B056495j175439o05814l915510p775626p477117k542874L939262Q413560
3743i083063Q214047L475121j158227p47337K805497K561723k876302o300241
3735c108782k554771L456738M216330L45662j847718l09426J276905J82862k532886
3726h75086n031324o213523m972245j487463J662739K660579L160454M886086
$$ y = [-4977792, 1546051, 5543905, 6130450, 6865428, 8884967, 9360556, 7477116, 5659727, 3551779, -2566155, -11846132, -16914667, -13898237, -8926847, -9607466, -14323496, -15958238, -13556894, -13564026, -19430603, -25764154, -25083469, -16895839, -7298211, -1419510, 733352, 1254729, 441830, -2068700, -4131790, -2481275, 2389286, 5815852, 4876276, 2056495, 881056, 275242, -3640268, -11415894, -18893011, -21435885, -17496623, -9083063, -869016, 2606105, 1447878, 700541, 3506038, 6067761, 3191459, -3108782, -5663553, -2206815, 2009515, 2355177, 507459, 198033, 1474938, 1657800, -875086, -5906410, -12119933, -17092178, -18579641, -16916902, -14256323, -11095869, -6209783]
3718f209783N735993L016054j422161l473477k816938k461929l180211k561960
3710a3374412N02724L875553M998989L392588N32176j203298m34283J187625O94830
3701A72492j453897j432162J611294L370516J223795j175515M9408K656433K688297
3692G710661J263842J579432K592114J507690m78429r78384j992420o080675r643236
3683d519405p398417j655676N99700j358628j948002M59976J575702r2755p99299
3674a5136804Q24091J464808K52600P79849L865564N469729M206409L802403N381707
3665A0910356M640897J38668k884752j268849L97804k015790m682333k591751
3657B644250J452006J273807k966260n857859m949597k325527j09254P03328j038312
$$ y = [-6209783, -473790, 2542264, 1120103, -2353374, -5170312, -7632241, -10812452, -13374412, -12871688, -8996135, -3997146, -604558, -72382, -1275680, -1709963, -522338, 172492, -1281405, -2713567, -1102273, 2268243, 3492038, 2316523, 2365931, 5022364, 7710661, 8974503, 10553935, 13146049, 14653739, 14175310, 13196926, 11204506, 5123831, -4519405, -11917822, -13573498, -12973798, -14332426, -16280428, -15820452, -14244750, -14337505, -15136804, -14312713, -12847905, -12595305, -11815456, -7949892, -2480163, 1726246, 5528649, 10910356, 15551253, 15689921, 12805169, 11536320, 11934124, 9918334, 5236001, 2644250, 4096256, 5370063, 2403803, -3454056, -8403653, -10729180, -10838434, -10135106, -11173418]
3648a1173418m542161n719705k282293J856132J616853j826340l214405j079510
3640b6364847J215474J168133n39435k617195m023459k923352J348745N756195
3632b6979741O551279M392508L123390L822763L462588k82494n526293p856443
3624a9292443m243717L828359J0018081Q184307j50230o073855l779483K275264
3616i233717M316429J827140k24619q47151l480690p698009p990769k383866M063022
3607b1652230O609942O119545M546605R60498m159644n924144j531694L999337
3599a1031785M292359J208026J783228O872196R619346O036836O94912q02909
3591A8672209L96475K52224p73980K81994J917865l86158n918202q240395m664431
$$ y = [-11173418, -15715579, -21435284, -23717577, -21861445, -20244592, -22070932, -25285337, -26364847, -25149373, -23981240, -24520675, -27137870, -31161329, -34084681, -32735936, -26979741, -20428462, -16035954, -12912564, -9089801, -5627213, -5909707, -11436000, -19292443, -23536160, -19707801, -9689720, -1505413, -1655643, -7729498, -11508981, -9233717, -4917288, -3090148, -3314767, -4161918, -7642608, -15340617, -23331386, -25715252, -21652230, -15042288, -8922743, -4376138, -3415640, -7575284, -13499428, -15031122, -11031785, -6739426, -5531400, -3748172, 3124024, 12743370, 18780206, 19475118, 18672209, 19068684, 19320908, 18546928, 18828922, 20746787, 20360629, 14442427, 6202032, 1537601]
3582A537601m58360l88226j394999J239122M678312K421777m591858q352874n530294
3573a0839799j565258j100136j338528J262372L850625K316279q63910m69886
3565h748241K263640J185061m427319p513161k927513N325322R232778O197488
3557E88055P42086j563019L49819L072383K865971n06132l856727m196363j553668
3548d057595J941773M373973M529084J691747l089981o317429m747795R41231
3540d734992O290830P027377K651150l194381n619279l022000P41076L27814m302387
3531c834792p260607m122535K447611O362324N176727J241885k070528k634723
3523d694638M5732L724090M117913l34843n614538o630258l117488J526924N096763
$$ y = [1537601, 1079241, 691015, -703984, 535138, 5213450, 7635227, 3043369, -5309505, -10839799, -12405057, -13505193, -14843721, -13581349, -9730724, -7414445, -8278355, -8748241, -6484601, -5299540, -9726859, -17240020, -20167533, -14842211, -5609433, 588055, 1330141, -232878, 116941, 3189324, 6055295, 5549163, 1692436, -2503927, -4057595, -2115822, 2258151, 6787235, 8478982, 5389001, -928428, -5676223, -4734992, 1555838, 8583215, 11234365, 8039984, 2420705, -601295, 139781, 467595, -3834792, -11095399, -15217934, -12770323, -6407999, -1231272, 10613, -2059915, -4694638, -4648906, -924816, 3193097, 2858254, -2756284, -9386542, -12504030, -10977106, -5880343]
3514e880343O867364N426522P92527k969949k313395k18829k072617o292543n773926
3505a2435189N23016M600714R98205m951292n094688n9321K761251L58324k401838
3496a5700818l49473N108835P998776M747538j943739n866686l727123J691937
3488h040753N337166N532923L934555J391239k499610o137775o559439m120935
3480a1162629k412694k326634o31190L720075O597681M913457J391275n06919
3472d17578k120271n350452o713713j820744O209635R228842M697190j729328
3464A983581m628229m531048m016698l118627j205643J99869m43020j794104j421423
3455a8975342P15944K587989L200268L733059N577806Q089790Q715052N693296
$$ y = [-5880343, 987021, 6413543, 7206070, 4236121, 1922726, 1703897, -368720, -6661263, -12435189, -11912173, -7311459, -6313254, -11264546, -16359234, -16418555, -13657304, -13298980, -15700818, -16050291, -10941456, -2942680, 1804858, -138881, -6005567, -9732690, -8040753, -2703587, 2829336, 6763891, 8155130, 5655520, -482255, -7041694, -11162629, -13575323, -15901957, -16533147, -12813072, -6215391, -1301934, 89341, -417578, -2537849, -7888301, -14602014, -16422758, -10213123, -984281, 3712909, 1983581, -2644648, -7175696, -11192394, -14311021, -15516664, -15316795, -15759815, -17553919, -18975342, -18259398, -15671409, -12471141, -8738082, -3160276, 4929514, 13644566, 19337862]
3447A9337862O12234k860736l419747l615076n385789o147821k478621L433762
3439e23932N264793J172233l017215j382987M316164P466732N432723K005015
3431B0733526J109140J406215j008421o344665j0351698j0027025p495806o237804
3423a8216538n232700m39841P794140J2885976R871455K152045k736714k063467
3415D014356P58323K048334J004487k087974o244117q249884n163845Q25439M187870
3406h907011L689333L698836O253247P035098K629750k908115l657132p14322
3398G119684N3452k833402n337601n177706m426363m336105l029809J2953J905316
3389a6049581J117012L27640J925028M185663M837330N059047O320522O182346
$$ y = [19337862, 19950096, 17089360, 13669613, 10054537, 4668748, -1479073, -3957694, -523932, 4740861, 5913094, 2895879, 1512892, 5829056, 13295788, 18728511, 20733526, 21842666, 23248881, 22240460, 15895795, 5544097, -4482928, -11978734, -18216538, -23449238, -23889079, -16094939, -3208963, 6662492, 8814537, 6077823, 4014356, 4772679, 6821013, 7825500, 5737526, -506591, -8756475, -13920320, -13094881, -8907011, -5217678, -1518842, 4734405, 11769503, 14399253, 11491138, 7834006, 7119684, 7173136, 4339734, -997867, -6175573, -10601936, -14938041, -17967850, -17954897, -16049581, -14932569, -14604929, -12679901, -8494238, -3656908, 1402139, 7722661, 13905007]
3381A3905007J851357l830244m958618p68643L377933L601171J638690K78523
3373A5095176q41437k562409l252990j879531j168020l831572p450866p204120
3365a3095769k898239P75281J053227J96927Q07371J787191J113691j91787K65740
3356a0186367K167228K934284J799753R21110K006829L604168K776585j112439
3348D911151n094526n418975j740658K074384K222024k62043n61480L640212Q634242
3339H404331Q770701L054076l803092o493613m122638l02030Q69669j162804l235141
3330A979459k503580k3379J024409K1988p50208n31509j235089k823278j732262
3321f573449K838140M952249n40715q948140j0510581l605651L390263M262384
$$ y = [13905007, 15756364, 11926120, 6967502, 6198859, 9576792, 13177963, 14816653, 15095176, 14253739, 11691330, 8438340, 6558809, 5390789, 1559217, -5891649, -13095769, -15994008, -15218727, -14165500, -13968573, -13161202, -11374011, -10260320, -10452107, -10186367, -8019139, -5084855, -3285102, -2363992, -357163, 3247005, 6023590, 4911151, -183375, -5602350, -7343008, -5268624, -3046600, -3308643, -3870123, -229911, 8404331, 17175032, 20229108, 16426016, 9932403, 5809765, 5507735, 6377404, 5214600, 1979459, -524121, -547500, 476909, 498897, -251311, -782820, -2017909, -4841187, -6573449, -3735309, 1216940, 676225, -8271915, -18782496, -22388147, -18997884, -14735500]
3313a4735500K160339K011895K403965J06112k273848J53520N630920P010593
3305B467996J940075l693966l796657O31543M131563L762089J184109o64752r33499
3296E028501r69228j886299k630362j355483J258861K007898l16257k466703j043821
3287b372893K338478K981468p05341n629152p941985n994061l22333O227894R028182
3278b389743N697722n00052m224417m400446l673619k724432K421L218224L269478
3269e724864Q02275J040052N171772P313596L479207j896967k936812j094725
3261F153534j573946m661447o433634n504333l497890r67101J687228J425294
3253a3372295l267290p251755m439331K521409N439083L047838K305379O159842
$$ y = [-14735500, -12575161, -10563266, -8159301, -8053189, -10327037, -10173517, -4542597, 2467996, 4408071, 714105, -3082552, -2451009, 1680554, 5442643, 6626752, 5962000, 5028501, 4059273, 2172974, -457388, -1812871, -554010, 1453888, 1137631, -1329072, -2372893, -34415, 2947053, 2241712, -3387440, -11329425, -17323486, -17645819, -11417925, -2389743, 3307979, 2807927, -1416490, -5816936, -9490555, -12214987, -12212566, -8994342, -5724864, -4922589, -3882537, 1289235, 8602831, 12082038, 10185071, 7248259, 6153534, 4579588, -81859, -6515493, -12019826, -15517716, -16484817, -14797589, -13372295, -16639585, -23891340, -28330671, -25809262, -20370179, -17322341, -15016962, -8857120]
3245h857120Q357937L742638l458937o186766l805868k16400K497799L761861
3237d164856K003678k501046n512043m255397j982212k498009l332913J40143
3229b2102655O201716Q474057N084598N78555j036412k41890Q99890J077274p66166
3220a831033l902216m103075J671906Q834872Q945284J147216n596013m082687
3212A084254K167173M918551K217319j058984j464215j158137l634851q264603
3204e193493j0425219o614952R04868N448131L258868j342249j024872M372550
3196a0616368O773684Q88460p550307q588346j115397N621492L900414l179264
3188a3865632o468708k310623L963638N734905L107198J434001L703919P306042
$$ y = [-8857120, -499183, 3243455, -215482, -6402248, -10208116, -10424516, -7926717, -4164856, -2161178, -4662224, -10174267, -14429664, -16411876, -18909885, -22242798, -22102655, -15900939, -7426882, -2342284, -1763729, -2800141, -3042031, -2142141, -1064867, -1831033, -5733249, -9836324, -8164418, 670454, 9615738, 10762954, 5166941, 1084254, 3251427, 8169978, 10387297, 9328313, 7864098, 6705961, 3071110, -5193493, -15618712, -22233664, -21328796, -15880665, -12621797, -13964046, -14988918, -10616368, -3842684, -2954224, -10504531, -19092877, -20208274, -14586782, -10686368, -13865632, -20334340, -22644963, -18681325, -12946420, -9839222, -8405221, -4701302, 2604740]
3180B604740Q192564N341031K63524n026014p893584n831691p6966L753362J848234
3171C175200k708283m329308k508542r35419p39062K06290J934417J992986O73373
3162c238348Q92318J905462p30712o883622r737001n324343J383672M015038L321902
3153a4395634L348380L772173K066144r0216R68080M116246M858642K503062N49798
3144G696675N86735P63519r0472j388937l292213n905014o787661l893147n1740
3135a2362255N30432p70635N62966L523011K522742k301195l537694K036506P681568
3126b114554O641561J674012o82068k79409j442643m226987m391045r93438J809574
3117d004997Q67873k267245m228318l403678n87513J525244R2695m162560n995360
$$ y = [2604740, 10797304, 16138335, 16401859, 11375845, 3482261, -2349430, -2426396, 1326966, 3175200, 466917, -3862391, -6370933, -7306352, -8045414, -7839124, -5904707, -3911721, -3238348, -2346030, -440568, -1171280, -8054902, -17791903, -23116246, -21732574, -17717536, -14395634, -11047254, -7275081, -5208937, -5299153, -4331073, -214827, 4643815, 7146877, 7696675, 8283410, 9046929, 8956457, 7567520, 4275307, -1629707, -8417368, -12310515, -12362255, -11831823, -12602458, -12039492, -8516481, -5993739, -8294934, -11832628, -9796122, -2114554, 4527007, 6201019, 5518951, 5239542, 3796899, -430088, -4821133, -5814571, -4004997, -3137124, -5404369, -9632687, -13036365, -13623878, -12098634, -12005939, -16168499, -22163859]
3108b2163859j323690O905882J1574422R468093L453947k470247o312041o556548
3100g424041k347203L268913M420301n37581n825584m925989J429106O669244
3092e272834O392225K145534j994737l622290k552693J91707K738577L216260
3084A241749J493754n80018j329393r48421n27577l06615K02708J025314J691687
3075A963188J957481J553176k45303l396858n751944m734580p14102K896041L395687
3066c077214J119934k267404n511059o892035m449861P20686L747302J495768
3058a5113883k894352m115471j706537Q04775K312335M670730P070084N603827
3050c368492Q6387l883798k482307J071759K097457J236338J419733J519579j458889
$$ y = [-22163859, -23487549, -16581667, -5007245, 4460848, 7914795, 5444548, -867493, -7424041, -9771244, -6502331, -2082030, -2619611, -8445195, -13371184, -11942078, -5272834, 1119391, 3264925, 1270188, -2352102, -4904795, -4713088, -1974511, 1241749, 2735503, 2155485, 826092, -122329, -649906, -956521, -753813, 271501, 1963188, 3920669, 5473845, 5228542, 1831684, -3920260, -8654840, -9368942, -6472901, -3077214, -1957280, -4224684, -9735743, -16627778, -21077639, -20356953, -16609651, -15113883, -18008235, -22123706, -23830243, -23025468, -20713133, -16042403, -8972319, -3368492, -3282105, -7165903, -9648210, -8576451, -6478994, -5242656, -3822923, -2303344, -3762233]
3041c762233n592842n281018M81078N895693N719051J188081k923418m199257
3033h474865l559734k354922p60678J316110L076073L115578J114684r80337o99699
3024h207790J500769K190914m00917l524664l667406j541282o77354k147529l596654
3015b0071913k983547n22477K673089N104213M546525M30685l577178k971275
3007a7371878J126448K631476j084436n054040l307283L157850P862483O723774
2999e315606J720133k652320m171812l797238l333417l278577k958973j986866
2991b5774676n09911J775033M987564P023069M910187j89295k554242N63709M250020
2982e518542L075100k83931L00570L538085K579731k655108m096255J435356O636650
$$ y = [-3762233, -9355075, -14636093, -14155015, -8259322, -2540271, -1352190, -4275608, -8474865, -12034599, -14389521, -15150199, -13834089, -10758016, -7642438, -6527754, -7508091, -8207790, -6707021, -4516107, -4917024, -8441688, -12109094, -13650376, -14327730, -16475259, -20071913, -23055460, -23577937, -20904848, -15800635, -11254110, -10823425, -14400603, -17371878, -16245430, -13613954, -14698390, -19752430, -23059713, -19901863, -12039380, -5315606, -3595473, -6247793, -10419605, -14216843, -17550260, -20828837, -23787810, -25774676, -26284587, -24509554, -19521990, -12498921, -7588734, -7778029, -10332271, -9768562, -5518542, -2443442, -2727373, -2426803, 1111282, 3691013, 1035905, -3060350, -1624994, 5011656]
2973E011656N214277Q33808q73410j674467m992615p252148l611479K117534K364410
2964b862434k052686l433030O70358N136475O255459N046214K161320k442113
2956H479563m951865j315332M134138K543549n668456j0189073o377242j673855
2948a5018573k356930l739432k2234M769884M057877K63558r0435J899426K94032
2939i942827l997466l950497J770736O460856N755746K928863K001466J924383
2931B951260L15903j928659k864461k995664l666826l991993j904216K319830
2923a1764826N135788L067381k665069n832421j873372N335132P174427J689584
2915B66624l512160k185604K124455K807701J28134j445947j454267k013385j698018
$$ y = [5011656, 10225933, 11059741, 10186331, 8511864, 3519249, -3732899, -7344378, -5226844, -2862434, -4915120, -8348150, -7677792, -2541317, 3714142, 8760356, 10921676, 8479563, 3527698, 2212366, 6346504, 8890053, 3221597, -6967476, -13344718, -15018573, -17375503, -21114935, -21137169, -16367285, -12309408, -12045850, -12136285, -10236859, -9942827, -13940293, -17890790, -16120054, -9659198, -3903452, -974589, 1026877, 2951260, 3267163, 1338504, -1525957, -4521621, -8188447, -12180440, -14084656, -11764826, -6629038, -3561657, -6226726, -12059147, -13932519, -8597387, -1422960, 266624, -3245536, -5431140, -3306685, -498984, -370850, -1816797, -3271064, -5284449, -6982467]
2906f982467J430581L509402P8570m581287k851383K720561K181899m969391p499313
2897a6962828l21753O796823M371488k905446n154008k180071m49908q89939J021364
2888a6674278N935030R297955P958803K606759m312833q712941o410158N55317
2880i756346L382135j980123p484369m246229L545734N095453j4150k141469J957549
2871a1641815M386362K8216n159846m487315q73192o29964k743079j323798M123428
2862a8321003P285125L795011k850996n423573j251318M928367O631253L292247
2854a914887K51659Q61284K184700P62356j428761j041509K38884q14264j878806
2845b779344J408202O511054O632020K031511N0326K536146K334712m232151r892126
$$ y = [-6982467, -5551886, -2042484, -1963914, -6545201, -9396584, -6676023, -4494124, -9463515, -16962828, -17284581, -10487758, -6116270, -9021716, -14175724, -16355795, -16805703, -17695642, -16674278, -10739248, -1441293, 6517510, 9124269, 4811436, -3901505, -10311663, -9756346, -6374211, -8354334, -15838703, -20084932, -16539198, -11443745, -11457895, -13599364, -11641815, -7255453, -7227237, -12387083, -16874398, -17747590, -18377554, -21120633, -22444431, -18321003, -11035878, -7240867, -10091863, -15515436, -16766754, -11838387, -5207134, -1914887, -1663228, -801944, 1382756, 2145112, 716351, -325158, -86274, -900538, -2779344, -1371142, 5139912, 11771932, 13803443, 13853769, 16389915, 18724627, 14492476, 4600350]
2836D600350o935204J389823O105269M218876n74506m671692o189480l383408
2828e439972K483095N252049P10656o408010p581292j292654O238267R746997
2820C709136R173507O064332J235848l358463m991723l809907l026030m412570
2812E84130o025111n240521k090221J209882K740379K379872J521292J451435
2804c468863K084203K863453M146027N880480N877292K588740j073978j255485
2796A7641869l60382m493225j2264481j3760669m826435N076433N833992J027675
2788f125223P09672M795423M336925k601040p423537m458380J753757N172725
2780c839678N756030M857660J021258m901944o970806k010478M650224O612604
$$ y = [4600350, -2334854, -945031, 5160238, 9379114, 8804608, 4132916, -2056564, -5439972, -2956877, 2295172, 3005828, -3402182, -10983474, -12276128, -6037861, 3709136, 12882643, 18946975, 20182823, 16824360, 11832637, 8022730, 4996700, 584130, -5440981, -10681502, -12771723, -11561841, -8821462, -6441590, -4920298, -3468863, -1384660, 1478793, 5624820, 11505300, 17382592, 19971332, 18897354, 17641869, 17281487, 12788262, 523781, -13236888, -18063323, -12986890, -7152898, -6125223, -5415551, -620128, 3716797, 1115757, -6307780, -10766160, -9012403, -3839678, 1916352, 6774012, 7795270, 2893326, -4077480, -6087958, -1437734, 5174870]
2772E174870N300935N706107O850140L428011m343489r263685o678584n79209
2764E595096J909758j072638n557528p626179p197556o123743m703857j726692
2756b6503339K420290M676608K633378k112174n499330n269331k127233K477031
2748b9304100P284751J0074403Q372080K571563l201594m558640p72109M738972
2740d794674P113809L843487k718981o930650n254241J92024M349037M430075
2732B29886J309554k474445m083258j649497L013963M614331N10326m844122n203960
2723h577222q33995K709868K797121J605343L96601k202274n446586n751133k594971
2714a7897248j64906r03579j958697m66588J915561K498936J799694J518908J612798
$$ y = [5174870, 10475805, 16181912, 23032052, 26460063, 22116574, 12852889, 6174305, 5595096, 7504854, 6432216, 874688, -6751491, -13949047, -20072790, -24776647, -26503339, -24083049, -19406441, -16773063, -18885237, -24384567, -29653898, -31781131, -29304100, -22019349, -11944946, -3572866, -1001303, -4202897, -8761537, -9533646, -4794674, 2319135, 6162622, 3443641, -3487009, -8741250, -8549226, -4200189, 229886, 1539440, -935005, -5018263, -6667760, -3653797, 960534, 1470860, -3373262, -8577222, -9411217, -6701349, -3904228, -2298885, -1902284, -4104558, -9551144, -15302277, -17897248, -18062154, -18965733, -20924430, -21391018, -19475457, -16976521, -15176827, -13657919, -12045121]
2705a2045121J848188L013916M345653L235174k39457k231242r28709O69808M99246
2696a832544J310736M990803P345484L486296m599138j0513352j1040465p237703
2688a8089883r15677N322496P265195L529502j109408j659763m7531j057341l414001
2679a0176411j594145M234582P188081L791203r95178j285910J928837L430005
2671F521064R58408l102626n412399m916074l173763k345063k488664j458852
2663a5417969J578222M042242L351232R43597K66073J947265L721133L941296
2655D373091K315599j340301n716126o986608l217425J543365K062267l61276
2647g327414j53647L270045M585890J511432j492183m80223K355239K962753Q87803
$$ y = [-12045121, -10196933, -7183017, -2837364, 397810, 158353, -2072889, -3001598, -2331790, -1832544, -521808, 4468995, 11814479, 15300775, 10701637, 188285, -10852180, -18089883, -19005560, -13683064, -6417869, -2888367, -3997775, -5657538, -5705069, -6762410, -10176411, -11770556, -7535974, -347893, 3443310, 2448132, 1162222, 3091059, 6521064, 7479472, 4376846, -1035553, -5951627, -9125390, -11470453, -13959117, -15417969, -13839747, -9797505, -6446273, -5502676, -5236603, -3289338, 431795, 4373091, 6688690, 5348389, -367737, -7354345, -10571770, -9028405, -6966138, -7327414, -7481061, -4211016, 374874, 1886306, 394123, -86100, 2269139, 5231892, 6119695]
2638F119695k128915m924183n745003k377917L685334O954301M699579L68310
2630F651201k410509m683634p310295o302534R28723Q205389O819554k029150
2622a31255q085761n639365L79741L324803L219607K941024J799355j830290n071024
2613i093165l595784J323049M106264K820159Q29957K42565q65326k981014k431531
2604i644826K275333N995259L845633q35320j357841J852477K653776N1582m66935
2595D369138K332792J865712n184823j1612667r366335r48394N202487O300093
2587g041997N444927L977482J184148o23924J582525N157957M752427Q90450j480376
2578A3843619k150770n218768r347267p531712J094548P720557N914336j43596
$$ y = [6119695, 3990780, -933403, -6678406, -9056323, -5370989, 1583312, 6282891, 6651201, 4240692, -442942, -7753237, -14055771, -13127048, -4921659, 1897895, -131255, -8217016, -13856381, -13476640, -10151837, -6932230, -3991206, -2191851, -4022141, -9093165, -12688949, -11365900, -7259636, -4439477, -3609520, -3366955, -4232281, -7213295, -9644826, -7369493, -1374234, 2471399, 1636079, 278238, 2130715, 4784491, 4836073, 4369138, 6701930, 8567642, 3382819, -8229848, -17596183, -18544577, -13342090, -7041997, -1597070, 2380412, 3564560, 2940636, 4523161, 9681118, 14433545, 15323995, 13843619, 11692849, 6474081, -2873186, -10404898, -9310350, -1589793, 4324543, 4180947]
2570D180947l729185m796530n817234m878582K35133N612257N851306K235029
2562a106859J1182n9482j103546k809766j451479K805038M706514J447497l207601
2553g68502m278274j793578L77095r5059j679738j363743J741549N282038O062356
2544C484144L258694j286149n343167p532636o958617l821583k62804J623361
2536a6838757K332263L155056K978985N71058j120056J685381O124249N070420
2528C958599j743681n979805k786731K420629L293229J609233J444407R00359
2520C116239l014388o418792l820333K032387L909531J555527J029425L554998
2512A944594L402995k203807q186235q631848l718570J874457L742100N24496
$$ y = [4180947, 451762, -4344768, -10162002, -15040584, -14805451, -9193194, -3341888, -1106859, -1095677, -1155159, -2258705, -5068471, -6519950, -3714912, 991602, 2439099, -768502, -5046776, -6840354, -6463259, -6558318, -8238056, -9601799, -7860250, -2578212, 3484144, 6742838, 5456689, 113522, -7419114, -14377731, -18199314, -18462118, -16838757, -14506494, -11351438, -8372453, -7801395, -8921451, -7236070, -1111821, 3958599, 2214918, -3764887, -6551618, -4130989, -837760, 771473, 2215880, 3116239, 101851, -6316941, -10137274, -8104887, -4195356, -2639829, -1610404, 1944594, 5347589, 3143782, -5042453, -13674301, -17392871, -15518414, -11776314, -11251818]
2504a1251818m717711o296395k209857K770065L649158K152014K675443M620114
2496h608987M686510L740399M339266M051634p30407o338348o075826j692152
2488f627911j055687m811496n733259k079997m61850k978672k774636L291931
2480b3231577Q093933N918155J177508o32308j560728l988545l715275J593907
2472a6344930M997350M62734o119928n605575K57051L112566J834795J884472
2464a5521465M114799M403488K578494K187906K502187k82063m521299m455242
2456h993195l3065K594732P60983j747139j641102N32173L734761O757857O237109
2447H203114J076043k891529k85743M067667J985224l739640l304021K760472
$$ y = [-11251818, -15969529, -22265924, -24475781, -21705716, -18056558, -15904544, -13229101, -8608987, -3922477, -182078, 4157188, 8208822, 7478415, 1140067, -4935759, -6627911, -7683598, -12495094, -18228353, -20308350, -20770200, -23748872, -26523508, -23231577, -15137644, -9219489, -8041981, -8674289, -10235017, -14223562, -17938837, -16344930, -11347580, -10884846, -17004774, -22610349, -22353298, -19240732, -17405937, -15521465, -11406666, -7003178, -4424684, -2236778, 265409, -16654, -4537953, -8993195, -9026260, -6431528, -5670545, -7417684, -9058786, -8526613, -4791852, 1966005, 8203114, 9279157, 6387628, 6101885, 10169552, 12154776, 8415136, 5111115, 7871587]
2439G871587L679389k658599n539482o36958J629227n096413j0170123l373970
2431a4295342O735266O261532j260155j920260M239481L812630o012382j1765976
2423a4205206n721457K007469P54311m004198j362944O508103Q295055J612887
2415f115980m085779k099372L450722N933891N012272L606725J793215j300656
2407F195038k989344j59502M275802L903771j354426l739898R39873N734097K045720
2398A4851131o963385j0197413m732654P00334L5356j428080K373122O896291
$$ y = [7871587, 11550976, 8892377, 3352895, 2715937, 4345164, -751249, -10921372, -14295342, -7560076, -1298544, -2558699, -4478959, -239478, 3573152, -2439230, -14205206, -19926663, -17919194, -17164883, -21169081, -22532025, -16023922, -7728867, -6115980, -10201759, -12301131, -8850409, -2916518, 2095754, 5702479, 7495694, 6195038, 3205694, 3046192, 7321994, 11225765, 9871339, 6131441, 7071314, 12805411, 14851131, 7887746, -2309667, -7042321, -6341987, -6306631, -7734711, -5361589, 1534702]
$$ [...]
##END NTUPLES=NMR SPECTRUM
##END=
