##TITLE=31Pdec_DE-138_oil_TFA
DMSO-d6, 64 sc
 31.3.2026
##JCAMPDX= 6.0         $$ Bruker NMR JCAMP-DX V2.0
##DATA TYPE= NMR SPECTRUM
##DATA CLASS= NTUPLES
##ORIGIN= UXNMR, Bruker Analytische Messtechnik GmbH
##OWNER= root
$$ XWIN-NMR		Version 3.5
$$ Tue Mar 31 13:34:34 2026 Russian Standard Time (UT+4h)  she@DPX200
##.OBSERVE FREQUENCY= 81.013821
##.OBSERVE NUCLEUS= ^31P
##.ACQUISITION MODE= SIMULTANEOUS
##.ACQUISITION SCHEME= undefined
##.AVERAGES= 64
##.DIGITISER RES= 17
##SPECTROMETER/DATA SYSTEM= spect
##.PULSE SEQUENCE= zgpg30
##.SOLVENT NAME= DMSO
##.SHIFT REFERENCE= (INTERNAL, DMSO, 0, 197.392)
##AUDIT TRAIL= $$ (NUMBER, WHEN, WHO, WHERE, WHAT)
$$ ##TITLE= Audit trail, XWIN-NMR		Version 3.5
$$ ##JCAMPDX= 5.01
$$ ##ORIGIN= Bruker BioSpin GmbH
$$ ##OWNER= she
$$ F:/spectra/data/she/nmr/P31/2/pdata/1/auditp.txt
$$ ##AUDIT TRAIL=  $$ (NUMBER, WHEN, WHO, WHERE, WHAT)
(   1,<2026-03-31 13:33:27.34 +0400>,<she>,<DPX200>,
      <continue with go, POWCHK disabled, PULCHK disabled
       configuration hash MD5:
       00 E9 B6 7A A2 85 ED C7 34 08 36 98 17 FE 4E 26
       data hash MD5: 32K
       34 6D 77 67 20 72 E4 2B F5 7B 57 97 43 7A 0A 9C>)
(   2,<2026-03-31 13:33:30.34 +0400>,<she>,<DPX200>,
      <Start of raw data processing
       efp BC_mod = 2 LB = 1.5 FT_mod = 6 PKNL = 1 PHC0 = 1452.16 PHC1 = -72.69934 SI = 64K 
       data hash MD5: 64K
       21 9B 17 A3 E3 FD 48 25 89 97 74 05 8D D2 A9 8E>)
(   3,<2026-03-31 13:33:53.76 +0400>,<she>,<DPX200>,
      <pk PHC0 = -16.31219 PHC1 = -0.8 
       data hash MD5: 64K
       DA EF 75 08 39 BB 95 71 F5 04 E2 B3 73 A8 E1 0E>)
(   4,<2026-03-31 13:34:04.89 +0400>,<she>,<DPX200>,
      <abs ABSG = 5 
       data hash MD5: 64K
       1C 4E C2 C5 2F 09 DD 9F 3F 23 AF 31 CE 44 50 AA>)
$$ ##END=
$$ 
$$ hash MD5
$$ DA FC 06 E2 D7 AE D4 19 8B 86 DF 39 00 B7 8D B9
##$RELAX= 
##$RELAX= 
##$RELAX= 
##$RELAX= 
##$RELAX= 
##$RELAX= 
##$RELAX= 
##$RELAX= 
$$ Bruker specific parameters
$$ --------------------------
##$DU= <F:/spectra>
##$EXPNO= 2
##$NAME= <P31>
##$PROCNO= 1
##$TYPE= <nmr>
##$USER= <she>
##$AMP= (0..31)
100 100 100 100 100 100 100 100 100 100 100 100 100 100 100 100 100 100 
100 100 100 100 100 100 100 100 100 100 100 100 100 100 
##$AQSEQ= 0
##$AQ_mod= 1
##$AUNM= <au_zg>
##$AUTOPOS= <>
##$BF1= 81.014009
##$BF2= 200.13
##$BF3= 200.13
##$BF4= 200.13
##$BF5= 200.13
##$BF6= 200.13
##$BF7= 200.13
##$BF8= 200.13
##$BYTORDA= 1
##$CFDGTYP= 0
##$CFRGTYP= 5
##$CHEMSTR= <none>
##$CNST= (0..31)
1 1 145 1 1 1 1 1 1 1 1 1 1 1 1 1 1 1 1 1 1 1 1 1 1 1 1 1 1 1 1 1 
##$CPDPRG= <waltz16>
##$CPDPRG1= <>
##$CPDPRG2= <waltz16>
##$CPDPRG3= <>
##$CPDPRG4= <mlev>
##$CPDPRG5= <mlev>
##$CPDPRG6= <mlev>
##$CPDPRG7= <mlev>
##$CPDPRG8= <mlev>
##$CPDPRGB= <>
##$CPDPRGT= <>
##$D= (0..31)
0 1 0 0 0 0 0 0 0 0.06 0 0.03 2e-05 3e-06 0 0 0.0002 0 0 0 0 0 0 0 0 0 
0 0 0 0 0 0 
##$DATE= 1774949510
##$DBL= (0..7)
120 120 120 11 120 120 24 19 
##$DBP= (0..7)
150 150 150 150 150 150 150 150 
##$DBP07= 0
##$DBPNAM0= <>
##$DBPNAM1= <>
$$ [...]
##$SUBNAM3= <"">
##$SUBNAM4= <"">
##$SUBNAM5= <"">
##$SUBNAM6= <"">
##$SUBNAM7= <"">
##$SUBNAM8= <"">
##$SUBNAM9= <"">
##$SW= 400.765351723535
##$SWIBOX= (0..15)
0 1 3 0 0 0 0 0 0 0 0 0 0 0 0 0 
##$SW_h= 32467.5324675325
##$TD= 32768
##$TD0= 1
##$TE= 0
##$TE2= 300
##$TE3= 300
##$TEG= 300
##$TL= (0..7)
0 120 53 12 22 120 120 120 
##$TP= (0..7)
150 150 150 150 150 150 150 150 
##$TP07= 0
##$TPNAME0= <>
##$TPNAME1= <>
##$TPNAME2= <>
##$TPNAME3= <>
##$TPNAME4= <>
##$TPNAME5= <>
##$TPNAME6= <>
##$TPNAME7= <>
##$TPOAL= (0..7)
0.5 0.5 0.5 0.5 0.5 0.5 0.5 0.5 
##$TPOFFS= (0..7)
0 0 0 0 0 0 0 0 
##$TUNHIN= 0
##$TUNHOUT= 0
##$TUNXOUT= 0
##$USERA1= <user>
##$USERA2= <user>
##$USERA3= <user>
##$USERA4= <user>
##$USERA5= <user>
##$V9= 5
##$VALIST= <valist>
##$VCLIST= <CCCCCCCCCCCCCCC>
##$VD= 0
##$VDLIST= <DDDDDDDDDDDDDDD>
##$VPLIST= <PPPPPPPPPPPPPPP>
##$VTLIST= <TTTTTTTTTTTTTTT>
##$WBST= 1024
##$WBSW= 4
##$XGAIN= (0..3)
0 0 0 0 
##$XL= 0
##$YL= 0
##$YMAX_a= 8370
##$YMIN_a= -7200
##$ZGOPTNS= <>
##$ZL1= 120
##$ZL2= 120
##$ZL3= 120
##$ZL4= 120
##$ABSF1= 197.3918
##$ABSF2= -203.3724
##$ABSG= 5
##$ABSL= 3
##$ALPHA= 0
##$AQORDER= 0
##$ASSFAC= 0
##$ASSFACI= 0
##$ASSFACX= 0
##$ASSWID= 0
##$AUNMP= <proc_1d>
##$AZFE= 0.1
##$AZFW= 0.5
##$BCFW= 0
##$BC_mod= 2
##$BYTORDP= 0
##$COROFFS= 0
##$CY= -3
##$DATMOD= 1
##$DC= 0
##$DFILT= <>
##$DTYPP= 0
##$F1P= 0
##$F2P= 0
##$FCOR= 1
##$FTSIZE= 65536
##$FT_mod= 6
##$GAMMA= 0
##$GB= 0
##$INTBC= 1
##$INTSCL= 9.790993e-09
##$ISEN= 30
##$LB= 1.5
##$LEV0= 0
##$LPBIN= 0
##$MAXI= 10000
##$MC2= 0
##$MEAN= 0
##$ME_mod= 0
##$MI= 50
##$NCOEF= 0
##$NC_proc= -8
##$NLEV= 6
##$NOISF1= 182.463
##$NOISF2= 159.3651
##$NSP= 0
##$NTH_PI= 0
##$NZP= 0
##$OFFSET= 197.3918
##$PC= 4
##$PHC0= 1435.848
##$PHC1= -73.49934
##$PH_mod= 1
##$PKNL= yes
##$PPARMOD= 0
##$PSCAL= 0
##$PSIGN= 0
##$REVERSE= no
##$SF= 81.014063255964
##$SI= 65536
##$SIGF1= 159.3651
##$SIGF2= -187.1042
##$SINO= 113.3802
##$SIOLD= 16384
##$SREGLST= <1H.CDCl3>
##$SSB= 0
##$STSI= 65536
##$STSR= 0
##$SW_p= 32467.5324675325
##$SYMM= 0
##$S_DEV= 0
##$TDeff= 32768
##$TDoff= 0
##$TI= <>
##$TILT= no
##$TM1= 0
##$TM2= 0
##$TOPLEV= 0
##$USERP1= <user>
##$USERP2= <user>
##$USERP3= <user>
##$USERP4= <user>
##$USERP5= <user>
##$WDW= 1
##$XDIM= 65536
##$YMAX_p= 366746922
##$YMIN_p= -245312777
$$ End of Bruker specific parameters
$$ ---------------------------------
##NTUPLES= NMR SPECTRUM
##VAR_NAME=  FREQUENCY,     SPECTRUM/REAL,   SPECTRUM/IMAG
##SYMBOL=    X,             R,               I
##VAR_TYPE=  INDEPENDENT,   DEPENDENT,       DEPENDENT
##VAR_FORM=  AFFN,          ASDF,            ASDF
##VAR_DIM=   65536,         65536,           65536
##UNITS=     HZ,            ARBITRARY UNITS, ARBITRARY UNITS
##FACTOR=    0.49542278885378, 1,            1
##FIRST=     15991.5117654749, 0,            0
##LAST=      -16476.0207020576, 0,           0
##MIN=       -16476.0207020576, -245312777,  0
##MAX=       15991.5117654749, 366746922,    0
$$ Real data points
##PAGE= N=1
##DATA TABLE= (X++(R..R)), XYDATA
$$ [...]
$$ plain form
44622 5577226 3490057 1223081 1053807 2381400 2803454 1385929 -988820 -3745477
44614 -3745477 -6839928 -9081194 -8613096 -5663064 -2949775 -2544090 -3784148 -4978106
44606 -4978106 -5545428 -5432760 -3997972 -1107289 1651533 2556953 2001394 1579936 1428503
44597 1428503 363775 -1360841 -1576074 673608 3202658 3273488 1129106 -498337 103608
44588 103608 2033396 3608991 4466107 5395244 6934176 8669329 9599655 9020866 7405427
44579 7405427 6355891 7031647 8463193 8096923 4403267 -1417590 -6451431 -8320583
44571 -8320583 -6522689 -2565964 769383 1271938 -690300 -2425349 -1791350 660091
44563 660091 2862119 3696783 3448167 2646120 1689452 1128001 1109096 898361 39858 -586680
$$ packed form
44622E577226k087169k266976j69274J327593M22054j417525k374749k756657
44614c745477l094451k241266M68098K950032K713289M05685j240058j193958
44606d978106n67322J12668J434788K890683K758822R05420n55559m21458j51433
44597A428503j064728j724616k15233K249682K529050P0830k144382j627443O01945
44588A03608J929788J575595Q57116R29137J538932J735153R30326n78789j615439
44579G405427j049536O75756J431546l66270l693656n820857n033841j869152
44571h320583J797894L956725L335347N02555j962238j735049O33999K451441
44563F60091K202028Q34664k48616q02047r56668n61451j8905k10735q58503o26538
$$ plain form
44553 -586680 -221733 -50583 -1689446 -4252823 -5204214 -4165891 -3360742 -3747266 -3492116
44544 -3492116 -1554580 -38966 -819892 -2069916 -956100 1676955 2431599 529937
44536 529937 -1255364 -1060832 -521613 -1900644 -4666741 -6288553 -5344297 -2732684 -247361
44527 -247361 1368486 2870540 4912427 6239318 4728025 754275 -2249402 -2088249
44519 -2088249 -871930 -1451200 -2450880 -332552 4357388 6951052 5385582 2944268
44511 2944268 2815341 3596335 2474580 -189206 -2109598 -2397667 -930500 3170423 9202543
44502 9202543 13049805 11464783 6987534 4822420 5608347 5405444 2755749 1176664
44494 1176664 3225306 6060931 5562323 2282137 341934 1623074 3699673 3451297
$$ packed form
44553e86680L64947J71150j638863k563377r51391J038323Q05149l86524K55150
44544c492116J937536J515614p80926j250024J113816K633055P54644j901662
44536E29937j785301J94532N39219j379031k766097j621812R44256K611613K485323
44527b47361J615847J502054K041887J326891j511293l973750l003677J61153
44519b088249J216319n79270r99680K118328M689940K593664j565470k441314
44511B944268j28927P80994j121755k663786j920392k88069J467167M100923O032120
44502I202543L847262j585022m477249k165114P85927k02903k649695j579085
44494A176664K048642K835625m98608l280186j940203J281140K076599k48376
$$ plain form
44486 3451297 958206 -702926 1006356 4952408 6988756 4364367 -819467 -3697509
44478 -3697509 -2054227 1856121 4966848 6803131 8279164 9047485 8008425 5663840
44470 5663840 4090151 4434536 5551545 5437014 3463577 933957 -408892 -154549 839031
44461 839031 2193602 4652966 8301790 11402917 12566623 13047628 14605513 15677852
44453 15677852 12699623 5653784 -751716 -2773481 -1930061 -1978861 -3917701 -5943934
44445 -5943934 -6359077 -4390426 4041 4796514 6120984 2628033 -1689690 -1912607
44437 -1912607 1513138 3770445 2101372 -1920220 -5963335 -9156348 -10466880 -8431464
44429 -8431464 -3717004 686171 2947310 3892926 4408781 4003154 2930405 2905750 4092100
$$ packed form
44486C451297k493091j661132J709282L946052K036348k624389n183834k878042
44478c697509J643282L910348L110727J836283J476033P68321j039060k344585
44470E663840j573689L44385J117009j14531j973437k529620j342849K54343R93580
44461H39031J354571K459364L648824L101127J163706M81005J557885J072339
44453A5677852k978229p045839o405500k021765Q43420m8800j938840k026233
44445e943934m15143J968651M394467M792473J324470l492951m317723k22917
44437a912607L425745K257307j669073m021592m043115l193013j310532K035416
44429h431464M714460M403175K261139R45616N15855m05627j072749k4655J186350
$$ plain form
44420 4092100 3922579 975619 -2084003 -1774421 1478536 4115757 3838529 1182771 -2285922
44411 -2285922 -5119572 -5847956 -3864270 -680021 1038844 -90306 -3238396 -6361603
44403 -6361603 -7520045 -6132021 -3876794 -3509378 -5848049 -8876244 -10663644 -11727579
44395 -11727579 -13132639 -13823430 -12017871 -8357800 -5409084 -4352821 -4125926 -3648700
44387 -3648700 -3096139 -3043796 -3928141 -6114256 -8914805 -9957410 -7409001 -2599926 1462525
44378 1462525 3906547 6139061 8370990 8709972 6292626 2786216 -223433 -3007625
44370 -3007625 -5607234 -6317192 -4228809 -1586658 -1348538 -3302624 -4642467 -3884223 -2289642
44361 -2289642 -1452144 -1151581 -96828 2173819 4666759 5930418 5578625 4780659 4811047
$$ packed form
44420D092100j69521k946960l059622L09582L252957K637221k77228k655758l468693
44411b285922k833650p28384J983686L184249J718865j129150l148090l123207
44403f361603j158442J388024K255227L67416k338671l028195j787400j063935
44395a1727579j405060o90791J805559L660071K948716J056263K26895M77226
44387c648700N52561N2343q84345k186115k800549j042605K548409M809075M062451
44378A462525K444022K232514K231929L38982k417346l506410l009649k784192
44370c007625k599609p09958K088383K642151K38120j954086j339843P58244J594581
44361b289642Q37498L00563J054753K270647K492940J263659l51793p97966L0388
$$ plain form
44352 4811047 5187532 4274611 2062737 940118 2586335 5252362 5811914 3917989 2155684
44343 2155684 1997858 1681156 -878396 -4619809 -6503318 -5519066 -3683514 -2801225 -1967770
44334 -1967770 560046 4151107 6186013 5436832 3475619 2506986 3284247 5573636 8961436
44325 8961436 12192346 13262005 11656044 9405119 8497339 8383961 7657660 6913967 7722144
44316 7722144 9643594 10757834 10670148 10513620 10347495 9273433 7953087 7987933 8610520
44307 8610520 7221673 3851432 1799563 2842428 5139884 7142581 9820715 12972714
44299 12972714 13188782 8707500 3228450 1220145 1815839 1229927 -696655 -650623 2460801
44290 2460801 6045779 7774795 7562512 5893237 3394730 1788173 2094580 2209280 -512714
$$ packed form
44352D811047L76485r12921k211874j122619J646217K666027N59552j893925j762305
44343B155684j57826l16702k559552l741413j883509R84252J835552Q82289Q33455
44334a967770K527816L591061K034906p49181j961213r68633P77261K289389L387800
44325H961436L230910J069659j605961k250925r07780j13378p26301p43693Q08177
44316G722144J921450J114240q7686j56528j66125j074062j320346L4846O22587
44307H610520j388847l370241k051869J042865K297456K002697K678134L151999
44299A2972714K16068m481282n479050k008305N95694n85912j926582M6032L111424
44290B460801L584978J729016k12283j669275k498507j606557L06407J14700k721994
$$ plain form
44281 -512714 -4611515 -5934031 -3450058 75681 3105073 6699568 10304715 10781629
44273 10781629 7303755 3157892 653657 -1938839 -6021241 -9062062 -8556494 -6414428
44265 -6414428 -5693232 -5385164 -2532836 1951187 3757942 1205094 -2664295 -4318814
44257 -4318814 -3393578 -1646814 -449349 -49841 19734 359665 961466 1306836 1638658
44248 1638658 3049390 5344329 6208284 4142401 1096285 190265 1607188 2895869
44240 2895869 2895743 3000494 4301469 5609207 5267285 3694019 3077506 4797667 7592347
44231 7592347 8535305 6195593 2556970 828386 1553416 2522766 2551892 2835404 3696906
44222 3696906 2991148 -158496 -2700735 -1675971 1192444 2309882 1929299 3111274
$$ packed form
44281e12714m098801j322516K483973L525739L029392L594495L605147M76914
44273A0781629l477874m145863k504235k592496m082402l040821N05568K142066
44265f414428P21196L08068K852328M484023J806755k552848l869389j654519
44257d318814R25236J746764J197465L99508O9575L39931O01801L45370L31822
44248A638658J410732K294939Q63955k065883l046116r06020J416923J288681
44240B895869j26J04751J300975J307738l41922j573266o16513J720161K794680
44231G592347R42958k339712l638623j728584P25030R69350K9126K83512Q61502
44222C696906p05758l149644k542239J024764K868415J117438l80583J181975
$$ plain form
44214 3111274 5997566 7502393 6581031 5361411 4408151 1418340 -3651483 -6363590
44206 -6363590 -3600737 1362654 2729141 -740672 -5309575 -7543265 -7294559 -6175574
44198 -6175574 -5489014 -5584830 -5667340 -4427575 -1978838 -577142 -2191853 -5849714 -8459770
44189 -8459770 -7789757 -3858202 1664805 6278457 7762145 5942360 2991622 949733
44181 949733 -430697 -2284086 -3946496 -3407125 -328090 2929591 3737844 1785529 -1111787
44172 -1111787 -3193252 -4303759 -5269649 -5926416 -4497403 161211 6106470 9656228
44164 9656228 9482565 7863101 7401063 8269917 9542188 11144910 12773358 12625012 9601962
44155 9601962 5802944 4406665 5475753 6072049 4407544 1777730 236019 292694 1288114
$$ packed form
44214C111274K886292J504827r21362j219620r53260k989811n069823k712107
44206f363590K762853M963391J366487l469813m568903k233690K48706J118985
44198f175574O86560r5816q2510J239765K448737J401696j614711l657861k610056
44189h459770O70013L931555N523007M613652J483688j819785k950738k041889
44181I49733j380430j853389j662410N39371L079035L257681Q08253j952315k897316
44172a111787k081465j110507r65890o56767J429013M658614N945259L549758
44164I656228j73663j619464m62038Q68854J272271J602722J628448j48346l023050
44155I601962l799018j396279J069088N96296j664505k629814j541711N6675R95420
$$ plain form
44146 1288114 2348959 2516078 1406258 213467 759989 3170198 5636796 6624084 5992903
44137 5992903 3952149 642452 -2869888 -4940471 -5282509 -4889590 -3510477 614560
44129 614560 7239791 12469157 12798425 9586914 7290456 7898607 9302665 9000127 7248904
44120 7248904 6011126 6393412 7978131 9679186 10457361 9738041 7724430 5124532 2477077
44111 2477077 84930 -1492186 -1541304 9704 2298514 4070574 4196121 1997808 -2022732
44102 -2022732 -5700746 -6455440 -3704332 320124 2593767 1971655 -247510 -1986863
44094 -1986863 -2351627 -2196728 -2893404 -4380978 -4761587 -2548893 862287 2162271 -80909
44085 -80909 -3801281 -6300766 -7385880 -8296858 -8714330 -7113256 -3930969 -1977569 -2840546
$$ packed form
44146A288114J060845J67119j109820j192791N46522K410209K466598R87288o31181
44137E992903k040754l309697l512340k070583l42038L92919J379113M125037
44129F14560O625231N229366L29268l211511k296458O08151J404058l02538j751223
44120G248904j237778L82286J584719J701055P78175p19320k013611k599898k647455
44111B477077k392147j577116m9118J551008K288810J772060J25547k198313m020540
44102b022732l678014p54694K751108M024456K273643o22112k219165j739353
44094a986863l64764J54899o96676j487574l80609K212694L411180J299984k243180
44085h0909l720372k499485j085114r10978m17472J601074L182287J953400q62977
$$ plain form
44076 -2840546 -4773518 -5466891 -5406983 -6699004 -9406709 -11009969 -9443499 -5229053 -597037
44067 -597037 2182637 1647682 -2007195 -6358373 -8388735 -7569447 -6424646 -7325201 -9631216
44058 -9631216 -10874768 -9953212 -8004033 -6502149 -5590890 -4359261 -2143288 470894
44050 470894 1692558 6857 -3943704 -7505253 -8675279 -8093489 -7697103 -8150690 -8773030
44041 -8773030 -9420024 -10752378 -12492355 -12946675 -10944548 -7353357 -4220914 -3167717
44033 -3167717 -4745198 -8225130 -11644908 -13282062 -13612871 -14506674 -15924994 -15307550 -11628233
44024 -11628233 -8145384 -8656538 -12160611 -14168127 -12880524 -10758657 -9545359 -7403914
44016 -7403914 -2827396 1783740 3385726 2997649 3814485 5934248 6556118 4878600 3017411
$$ packed form
44076b840546j932972o93373N9908j292021k707705j603260J566470M214446M632016
44067e97037K779674n34955l654877m351178k030362Q19288J144801r00555k306015
44058i631216j243552R21556J949179J501884R11259J231629K215973K614182
44050D70894J221664j685701l950561l561549j170026N81790L96386m53587o22340
44041h773030o46994j332354j739977m54320K002127L591191L132443J053197
44033c167717j577481l479932l419778j637154l30809q93803j418320O17444L679317
44024a1628233L482849n11154l504073k007516J287603K121867J213298K141445
44016g403914M576518M611136J601986l88077Q16836K119763O21870j677518j861189
$$ plain form
44007 3017411 1811786 -360051 -3406546 -4047978 -897987 2154861 864142 -3222044
43999 -3222044 -4978777 -2703921 680300 2740664 4109224 5690286 6774709 7080309
43991 7080309 7943217 9995710 11601199 10900700 7929783 3872833 -119256 -2621656
43983 -2621656 -2437740 -564534 127226 -1618313 -3987085 -5216446 -6032849 -7376940 -7929663
43974 -7929663 -6228055 -3472324 -1631862 -230180 2127629 4294591 4029766 2213527
43966 2213527 1876395 2944101 1900959 -2218223 -5296113 -3805213 1636 1484036
43958 1484036 115215 -741082 456626 1417445 53722 -2339982 -3225130 -2322588 -1468184
43949 -1468184 -1945628 -3414259 -5118669 -6798901 -8137156 -8306519 -6775292 -4162683
$$ packed form
44007C017411j205625k171837l046495o41432L149991L052848j290719m086186
43999c222044j756733K274856L384221K060364J368560J581062J084423L05600
43991G080309Q62908K052493J605489p00499k970917m056950l992089k502400
43983b621656J83916J873206O91760j745539k368772j229361q16403j344091n52723
43974g929663J701608K755731J840462J401682K357809K166962k64825j816239
43966B213527l37132J067706j043142m119182l077890J490900L806849J482400
43958A484036j368821q56297J197708R60819j363723k393704q85148R02542Q54404
43949a468184m77444j468631j704410j680232j338255j69363J531227K612609
$$ plain form
43941 -4162683 -1704980 -91819 644792 415196 -836432 -2287761 -2492020 -936880 1327299
43932 1327299 2902652 3045225 1237335 -2789028 -7613179 -10038775 -8103242 -3559024
43924 -3559024 120967 1661169 2362503 3173087 3475392 2872718 2169390 1940425 1666422
43915 1666422 956779 298166 -131713 -1235574 -3751792 -6950066 -9058495 -8471565 -4697810
43906 -4697810 806112 4938608 5708129 4899473 6280550 10693451 14737721 15064689 12084147
43897 12084147 8308144 4964769 2033716 209674 641169 3135231 6171153 8455772
43889 8455772 9459561 9003067 7415627 5601612 4026267 2239765 148999 -1244497
43881 -1244497 -1379907 -1280452 -1887178 -2414279 -1979424 -1799304 -3701471 -7028042 -9132053
$$ packed form
43941d162683K457703J613161P36611k29596j251628j451329k04259J555140K264179
43932A327299J575353J42573j807890m026363m824151k425596J935533M544218
43924c559024L679991J540202P01334Q10584L02305o02674p03328k28965k74003
43915A666422p09643o58613m29879j103861k516218l198274k108429N86930L773755
43906d697810N503922M132496P69521q08656J381077M412901M044270L26968k980542
43897A2084147l776003l343375k931053j824042M31495K494062L035922K284619
43889H455772J003789m56494j587440j814015j575345j786502k090766j393496
43881a244497j35410R9455o06726n27101M34855J80120j902167l326571k104011
$$ plain form
43872 -9132053 -8836432 -7539978 -6852862 -6812051 -6536041 -5122905 -1864470 2891426 7007590
43863 7007590 8177212 6419373 3736571 1626447 530223 1123960 3615433 5733359
43855 5733359 4386146 267854 -1979894 239347 3863365 4618334 2731573 1344659
43847 1344659 959727 -849463 -4534264 -7015670 -6059545 -3531304 -2741982 -4318140 -6220855
43838 -6220855 -6585278 -5080434 -2448573 -207981 -100859 -2248273 -4223787 -3518289 -773036
43829 -773036 1092905 1124497 1850502 5712133 11493177 15621174 16033022 13408847 9400744
43820 9400744 5304067 2157101 457363 -460973 -1564763 -2550145 -2305871 -898299 377318
43811 377318 1090220 2142010 3579252 3608223 860723 -3541932 -7221346 -8960172 -9190842
$$ packed form
43872i132053K95621J296454O87116M0811K76010J413136L258435M755896M116164
43863G007590J169622j757839k682802k110124j096224N93737K491473K117926
43855E733359j347213m118292k247748K219241L624018P54969j886761j386914
43847A344659l84932j809190l684801k481406R56125K528241P89322j576158j902715
43838f220855l64423J504844K631861K240592J07122k147414j975514P05498K745253
43829g73036J865941L1592P26005L861631N781044M127997M11848k624175m008103
43820I400744m096677l146966j699738r18336j103790r85382K44274J407572J275617
43811C77318P12902J051790J437242K8971k747500m402655l679414j738826k30670
$$ plain form
43802 -9190842 -9118244 -10000170 -12080470 -13601463 -12372505 -9045950 -6914617 -7340134 -7672478
43793 -7672478 -5525010 -2709464 -2188056 -3166889 -2748521 -1094025 -860263 -1979350 -1347053
43784 -1347053 1693871 3661924 2189599 -510126 -1283874 -184958 1031630 1879922
43776 1879922 2301694 1133497 -2046722 -5232504 -6487268 -6630186 -7221446 -7491951 -5890608
43767 -5890608 -3426386 -2649378 -3998757 -5678637 -6464251 -6049470 -3367045 2238072 8185541
43758 8185541 10272804 7893861 4860081 3993788 3636680 1144097 -2642398 -4880326
43750 -4880326 -5164677 -5722314 -7543505 -8793089 -7658393 -4988396 -2933280 -1917877
43742 -1917877 -429417 2154919 3895831 2601060 -637358 -1841509 1144311 5484176
$$ packed form
43802i190842P2598q81926k080300j520993J228958L326555K131333m25517l32344
43793g672478K147468K815546N21408r78833M18368J654496K33762j119087O32297
43784a347053L040924J968053j472325k699725p73748J098916J216588Q48292
43776A879922M21772j168197l180219l185782j254764j42918n91260k70505J601343
43767e890608K464222P77008j349379j679880p85614M14781K682425N605117N947469
43758H185541K087263k378943l033780q66293l57108k492583l786495k237928
43750d880326k84351n57637j821191j249584J134696K669997K055116J015403
43742a917877J488460K584336J740912j294771l238418j204151K985820M339865
$$ plain form
43734 5484176 6247641 2018231 -3719898 -6570895 -5130205 -866178 4059632 7844103
43726 7844103 9164798 7782588 4946003 2432078 1164768 988760 1373468 1958698 2819394
43717 2819394 4550276 7595836 11068841 12783241 11101953 6492725 911024 -3816809
43709 -3816809 -6573818 -6849177 -5219620 -3550038 -3510001 -4895177 -6320213 -7295255 -8330241
43700 -8330241 -9140835 -8574879 -6863056 -6086452 -7190829 -8137259 -6753313 -4158201 -3141476
43691 -3141476 -3929343 -4208459 -3249394 -3097051 -4876340 -6683825 -6704304 -5992143 -5982779 -5319258
43681 -5319258 -2122212 1815458 2553312 -313185 -2735382 -1858367 229792 48743 -2169847
43672 -2169847 -3330852 -2368784 -1618686 -2867254 -4102932 -1923768 3358883 7038357
$$ packed form
43734E484176P63465m229410n738129k850997J440690M264027M925810L784471
43726G844103J320695j382210k836585k513925j267310j76008L84708N85230Q60696
43717B819394J730882L045560L473005J714400j681288m609228n581701m727833
43709c816809k757009k75359J629557J669582M0037j385176j425036r75042j034986
43700h330241q10594N65956J711823P76604j104377r46430J383946K595112J016725
43691c141476p87867k79116R59065J52343j779289j807485k0479P12161R364O63521
43681e319258L197046L937670P37854k866497k422197Q77015K088159j81049k218590
43672b169847j161005R62068P50098j248568j235678K179164N282651L679474
$$ plain form
43664 7038357 5551642 1408325 385047 3994984 7566086 6992479 4532598 5173034
43656 5173034 9224891 12215711 11425809 8679665 6303358 4032008 1249485 -903522
43648 -903522 -1679064 -2615526 -5081617 -7520232 -7227178 -4036801 -783929 -659997 -4695160
43639 -4695160 -10770487 -14742510 -14081890 -10849731 -9401387 -10993233 -12954136 -13324395
43631 -13324395 -13067366 -12824379 -11220186 -8205826 -6388613 -6580421 -5714326 -2307203 -231377
43622 -231377 -2854317 -6697063 -6070084 -1701474 839709 -117601 -1060729 -279046 -194245
43613 -194245 -1985954 -3190934 -2003501 537734 3804632 8435407 12534969 11810536
43605 11810536 5797941 -215821 -2065774 -1799631 -3239014 -6034638 -7359411 -6639847
$$ packed form
43664G038357j486715m143317j023278L609937L571102n73607k459881O40436
43656E173034M051857K990820p89902k746144k376307k271350k782523k153007
43648i03522p75542r36462k466091k438615K93054L190377L252872J23932m035163
43639d695160o075327l972023O60620L232159J448344j591846j960903l70259
43631a3324395K57029K42987J604193L014360J817213j91808Q66095L407123K075826
43622b31377k622940l842746O26979M368610K541183r57310r43128P81683Q4801
43613a94245j791709j204980J187433K541235L266898M630775M099562p24433
43605A1810536o012595o013762j849953K66143j439383k795624j324773P19564
$$ plain form
43597 -6639847 -5280516 -3887823 -2799296 -3381040 -5802209 -7206402 -5003148 -606270
43589 -606270 2745614 4510170 6457901 8905798 10128409 9016223 6158352 2841826
43581 2841826 730821 1579651 5248753 8713258 8893430 5955004 2477694 326158
43573 326158 -262968 285536 1082436 1024697 330483 693712 2580673 3891048 2922432
43564 2922432 1084066 818578 2318779 4180457 5762162 6921372 6997749 6120058 5884831
43555 5884831 6681177 6302723 3589984 1238551 2023285 4359430 5076449 4615117 5409513
43546 5409513 6720285 5768309 3232695 2794188 5136620 6891555 6049032 4265540 3147764
43537 3147764 2279633 1743180 2565977 3615506 2078463 -1607508 -3276473 -1197375 1109842
$$ packed form
43597f639847J359331J392693J088527n81744k421169j404193K203254M396878
43589f06270L351884J764556J947731K447897J222611j112186k857871l316526
43581B841826k111005Q48830L669102L464505J80172k938426l477310k151536
43573C26158n89126N48504P96900n7739o94214L63229J886961J310375r68616
43564B922432j838366k65488J500201J861678J581705J159210P6377q77691k35227
43555E884831P96346l78454k712739k351433P84734K336145P17019m61332P94396
43546E409513J310772r51976k535614m38507K342432J754935q42523j783492j117776
43537C147764q68131n36453Q22797J049529j537043l685971j668965K079098K307217
$$ plain form
43528 1109842 264619 -2391829 -3947088 -4215670 -4152199 -3048786 -440746 1600506 1160707
43519 1160707 -423895 -919149 -784013 -1630350 -2854037 -2857335 -2395072 -3705696 -6977172
43510 -6977172 -10207887 -12091779 -12936936 -13232667 -13071212 -12374724 -10374394 -6083582 -686699
43501 -686699 2399690 1948583 1507480 4759596 9812037 11434912 8198492 3982119 2552539
43492 2552539 3900982 6254213 8519539 9683576 8387361 4644825 449177 -2426849
43484 -2426849 -4085216 -5303417 -5896693 -5046009 -2521244 799115 3131629 2843860 291020
43475 291020 -1832997 -1323373 674699 1162297 -606171 -2368984 -2350639 -1535710 -1690086
43466 -1690086 -2666133 -2760990 -892611 2385819 5465726 6769949 5766393 3310884 818419
$$ packed form
43528A109842q45223k656448j555259k68582O3471J103413K608040K041252m39799
43519A160707j584602m95254J35136q46337j223687l298M62263j310624l271476
43510f977172l230715j883892q45157k95731J61455O96488K000330M290812N396883
43501f86699L086389m51107m41103L252116N052441J622875l236420m216373j429580
43492B552539J348443K353231K265326J164037j296215l742536m195648k876026
43484b426849j658367j218201n93276Q50684K524765L320359K332514k87769k552840
43475B91020k124017N09624J998072M87598j768468j762813J8345Q14929j54376
43466a690086r76047r4857J868379L278430L079907J304223j003556k455509k492465
$$ plain form
43457 818419 -768401 -937513 731094 3858082 6614132 6943281 4477875 611545 -2892635
43448 -2892635 -4638347 -3810559 -973757 1912006 3516217 4429409 5097339 3789343 -946899
43439 -946899 -6585357 -8399230 -5124353 -161258 3175266 4691711 4952684 3277786
43431 3277786 5439 -1962830 -456233 2765899 4379039 3748822 2667753 2010294
43423 2010294 1029212 -605864 -2236563 -3499096 -4504533 -4985809 -4694766 -4211699 -3984502
43414 -3984502 -3303704 -1910212 -1703619 -4451492 -8217042 -8894208 -5723279 -2575869 -2714077
43405 -2714077 -4781751 -5678937 -5247020 -5622357 -7118390 -7445849 -5025396 -1078110 1907565
43396 1907565 2353374 97859 -3723042 -6863793 -7463987 -6083355 -5161154 -5846014 -6589600
$$ packed form
43457H18419j586820j69112J668607L126988K756050L29149k465406l866330l504180
43448b892635j745712Q27788K836802K885763J604211R13192O67930j307996m736242
43439i46899n638458j813873L274877M963095L336524J516445K60973j674898
43431C277786l272347j968269J506597L222132J613140o30217j081069o57459
43423B010294r81082j635076j630699j262533j005437m81276K91043M83067K27197
43414c984502O80798J393492K06593k747873l765550o77166L170929L147410j38208
43405b714077k067674q97186M31917l75337j496033l27459K420453L947286K985675
43396A907565M45809k255515l820901l140751o00194J380632R22201o84860p43586
$$ plain form
43387 -6589600 -5686018 -3773924 -2389921 -1230573 1100662 4118359 5449199 4052735
43379 4052735 1559969 -91342 -592007 -241189 1000890 2271379 1539438 -1591719 -4235568
43370 -4235568 -3486104 -370009 1685943 1624906 1402541 2014771 1809284 -286982 -2285851
43361 -2285851 -1600143 1395821 3826900 3532256 662427 -3168819 -6188317 -7479666
43353 -7479666 -7723147 -8567524 -10583501 -12436114 -12817011 -12392208 -12670222 -13431879 -12663839
43344 -12663839 -9185738 -4387985 -1018851 -665672 -2477713 -4038552 -3573039 -1508586
43336 -1508586 398570 1508073 2979013 5452774 7155780 5756895 1674640 -2093811
43328 -2093811 -3521350 -3277145 -2400440 -110558 4450917 9386238 11190060 8939870
$$ packed form
43387f589600R03582J912094J384003J159348K331235L017697J330840j396464
43379D052735k492766j651311n00665L50818J242079J270489p31941l131157k643849
43370d235568P49464L116095K055952o1037k22365O12230k05487k096266j998869
43361b285851O85708K995964K431079k94644k869829l831246l019498j291349
43353g479666k43481q44377k015977j852613l80897M24803k78014p61657P68040
43344a2663839L478101M797753L369134L53179j812041j560839M65513K064453
43336a508586J907156J109503J470940K473761J703006j398885m082255l768451
43328b093811j427539K44205Q76705K289882M561475M935321J803822k250190
$$ plain form
43320 8939870 5536244 3954544 3717161 2423937 -275923 -2204559 -2008150 -1010055 -1020664
43311 -1020664 -1897487 -2500926 -2952684 -4370412 -6767656 -8609164 -8471780 -6221917 -2715151
43302 -2715151 704230 2592881 2440944 1447146 1409990 2808511 4682470 6086810 6612034
43293 6612034 5796876 3488301 868018 -268624 483385 2018512 3530501 4858553
43285 4858553 5049456 2810145 -836031 -2533917 -620918 2673999 4662179 5983391
43277 5983391 8687088 11926964 12567261 9921232 7154661 7237457 9496368 11192671 11027841
43268 11027841 9830107 8628934 7393925 5714479 3990057 3491373 5070152 7838596
43260 7838596 9572841 8845490 6531789 4828666 5040406 6678519 8295082 8574175 6904343
$$ packed form
43320H939870l403626j581700k37383j293224k699860j928636J96409R98095j0609
43311a020664q76823o03439m51758j417728k397244j841508J37384K249863L506766
43302b715151L419381J888651j51937r93798l7156J398521J873959J404340N25224
43293F612034q15158k308575k620283j136642P52009J535127J511989J328052
43285D858553J90903k239311l646176j697886J912999L294917J988180J321212
43277E983391K703697L239876O40297k646029k766571Q2796K258911J696303j64830
43268A1027841j197734j201173j235009j679446j724422m98684J578779K768444
43260G838596J734245p27351k313701j703123K11740J638113J616563K79093j669832
$$ plain form
43251 6904343 3662864 70247 -2570661 -3524609 -2587077 -1358 3249239 5665582
43243 5665582 6324744 5463176 3775964 1764877 10533 -871369 -1096654 -1592412 -2428720
43234 -2428720 -2549673 -1852685 -1968378 -3458846 -3735984 -176087 5366206 7867452 5305554
43225 5305554 1237513 314871 2979891 5827812 6061272 4220537 2883766 3689492 5871123
43216 5871123 7434759 7380625 6232035 4523673 2123028 -219515 -272146 2843308 6193206
43207 6193206 5805010 1729553 -1974576 -2519221 -1306791 -964310 -1853099 -2799280 -3250333
43198 -3250333 -2950858 -966741 2958852 6864711 8237934 6969943 5248862 4742149
43190 4742149 5277496 6300293 8103531 10819605 13063338 12774312 9581617 5540872
$$ packed form
43251F904343l241479l592617k640908r53948R37532K585719L250597K416343
43243E665582O59162q61568j687212k011087j754344q81902k25285m95758q36308
43234b428720j20953O96988j15693j490468k77138L559897N542293K501246k561898
43225E305554m068041r22642K665020K847921K33460j840735j336771Q05726K181631
43216E871123J563636n4134j148590j708362k400645k342543n2631L115454L349898
43207F193206l88196m075457l704129n44645J212430L42481q88789r46181m51053
43198c250333K99475J984117L925593L905859J373223j267991j721081n06713
43190D742149N35347J022797J803238K716074K243733k89026l192695m040745
$$ plain form
43182 5540872 2858437 1373752 -538677 -2699738 -2671374 415668 3425151 2672023 -1310426
43173 -1310426 -4837241 -6141961 -6563487 -6929297 -6066098 -3675532 -1612163 -879227 -4920
43164 -4920 1917665 3054114 1745864 -525558 -1364059 -888025 -644363 -714018 -349298
43155 -349298 -88796 -665422 -1028495 -139316 372180 -1682092 -5046855 -6225561 -4269954
43146 -4269954 -1318731 1289095 4034424 6346187 6527020 5418379 6448299 10406199
43138 10406199 13447239 12382539 9063010 7044419 6489577 5415314 4014251 4182394
43130 4182394 5641197 5890510 3946193 1335467 -714622 -2365330 -3009429 -809229
43122 -809229 4232889 8688644 8828539 4315826 -2256597 -8285308 -12291269 -13288793 -11097237
$$ packed form
43182E540872k682435j484685j912429k161061K8364L087042L009483p53128l982449
43173a310426l526815j304720m21526l65810Q63199K390566K063369P32936Q74307
43164d920J922585J136449j308250k271422q38501M76034K43662o9655L64720
43155c49298K60502n76626l63073Q89179N11496k054272l364763j178706J955607
43146d269954K951223K607826K745329K311763J80833j108641J029920L957900
43138A0406199L041040j064700l319529k018591n54842j074263j401063J68143
43130D182394J458803K49313j944317k610726k050089j650708o44099K200200
43122h09229N042118M455755J39895m512713o572423o028711m005961r97524K191556
$$ plain form
43113 -11097237 -7388656 -4932592 -5149806 -7015943 -8589744 -8945875 -8343734 -7242761
43105 -7242761 -5800179 -4037318 -1957500 406275 2710721 4229906 4469695 3771007
43097 3771007 2911409 2173584 1228954 -113450 -1576023 -2885992 -3978835 -4489393 -3635450
43088 -3635450 -1131934 2047793 4287300 4691394 3729037 2731340 2844208 4167623 5778726
43079 5778726 6826603 7529398 8653732 10157918 11077490 10711852 9058008 6192251 2567069
43070 2567069 27218 604736 3390943 4528042 1916467 -1716579 -2485192 -576873
43062 -576873 889585 1165178 2518783 5528987 7403940 6326338 4380667 4071916 4333701
43053 4333701 2586503 -809889 -2929974 -2387088 -536016 1225880 3001132 4884671
$$ packed form
43113a1097237L708581K456064k17214j866137j573801l56131O02141J100973
43105g242761J442582J762861K079818K363775K304446J519185K39789o98688
43097C771007q59598p37825r44630j342404j462573j309969j092843n10558Q53943
43088c635450K503516L179727K239507M04094r62357r97697J12868J323415J611103
43079E778726J047877P02795J124334J504186R19572l65638j653844k865757l625182
43070B567069k539851N77518K786207J137099k611575l633046p68613J908319
43062e76873J466458K75593J353605L010204J874953j077602j945671l08751K61785
43053D333701j747198l396392k120085N42886J851072J761896J775252J883539
$$ plain form
43045 4884671 5954707 5694786 5118110 5490949 6634640 7251497 6577711 5211796 4448470
43036 4448470 4978785 6127190 6418455 5075131 2751044 562644 -1148811 -2577770
43028 -2577770 -3493336 -3433455 -2668455 -1979987 -1433352 -386383 1042060 1668751 1121422
43019 1121422 992453 2840170 5495724 5903124 2930676 -1020126 -3005210 -2972101 -2866115
43010 -2866115 -3125872 -2122972 693309 3145712 3006207 927469 -734601 -1012511 -675237
43001 -675237 -331954 -93199 -682457 -2795212 -5316781 -6202581 -5398540 -4802538 -4844067
42992 -4844067 -3482512 269107 4149521 5780080 6064053 7186142 8695488 8381364
42984 8381364 6436905 5804034 7874678 10164402 9384876 5460440 1424116 -6701
$$ packed form
43045D884671J070036k59921n76676L72839J143691O16857o73786j365915p63326
43036D448470N30315J148405K91265j343324k324087k188400j711455j428959
43028b577770r15566N9881P65000O88468N46635J046969J428443O26691n47329
43019A121422j28969J847717K655554M07400k972448l950802j985084L3109J05986
43010b866115k59757J002900K816281K452403j39505k078738j662070k77910L37274
43001f75237L43283K38755n89258k112755k521569q85800Q04041N96002m1529
42992d844067J361555L751619L880414J630559K83973J122089J509346l14124
42984H381364j944459o32871K070644K289724p79526l924436m036324j430817
$$ plain form
42976 -6701 931052 1504513 -636237 -4805748 -7744259 -7117630 -4016606 -1336457 -490422
42967 -490422 -882738 -1875466 -3536690 -5569815 -7143254 -7981615 -8297783 -7624837 -5236995
42958 -5236995 -1870053 649273 1890109 3287668 5580897 7494935 7796049 6940306
42950 6940306 5541493 2906977 -1226502 -4830164 -5556226 -4003745 -3098081 -4392346
42942 -4392346 -6721377 -8549982 -9828875 -10911897 -11159240 -9773592 -7263053 -4979897
42934 -4979897 -3481661 -2281227 -1237385 -1222132 -2711869 -4181276 -3048308 1282958
42926 1282958 6086443 7951246 6460360 4238339 3435539 3467964 2730069 1317127 882483
42917 882483 2256495 4274857 5073671 4047662 2467132 2296306 4188897 6577653 7121634
$$ packed form
42976f701R37753N73461k140750m169511k938511O26629L101024K680149Q46035
42967d90422l92316r92728j661224k033125j573439q38361l16168O72946K387842
42958e236995L366942K519326J240836J397559K293229J914038L01114q55743
42950F940306j398813k634516m133479l603662p26062J552481R05664j294265
42942d392346k329031j828605j278893j083022k47343J385648K510539K283156
42934d979897J498236J200434J043842J5253j489737j469407J132968M331266
42926A282958M803485J864803j490886k222021q02800L2425p37895j412942m34644
42917H82483J374012K018362P98814j026009j580530j70826J892591K388756N43981
$$ plain form
42908 7121634 5075092 1708954 -1451267 -3814689 -5176126 -5479300 -5687659 -7298904
42900 -7298904 -9912615 -10841340 -8781143 -6509195 -7647402 -11467468 -13469058 -11107292
42892 -11107292 -6488202 -2953407 -1452387 -1295034 -2165217 -3654147 -4461541 -4011425 -3750909
42883 -3750909 -4886713 -5635319 -2962849 2958060 7984769 8262734 3978003 -1609530
42875 -1609530 -5730425 -7953096 -9143242 -9456650 -7693959 -2917723 3317920 7371123
42867 7371123 7105987 4345857 2399389 1793300 440649 -2157449 -3548830 -2146789
42859 -2146789 17997 192192 -1345481 -2721602 -4106100 -6836421 -9527739 -8527562
42851 -8527562 -2939374 3711315 7985662 10074089 11352871 11239418 9132142 7328199
$$ packed form
42908G121634k046542l366138l160221k363422j361437l03174k08359j611245
42900g298904k613711r28725K060197K271948j138207l820066k001590K361766
42892a1107292M619090L534795J501020J57353q70183j488930q07394M50116K60516
42883c750909j135804p48606K672470N920909N026709K77965m284731n587533
42875a609530m120895k222671j190146l13408J762691M776236O235643M053203
42867G371123k65136k760130j946468o06089j352651k598098j391381J402041
42859b146789K164786J74195j537673j376121j384498k730321k691318J000177
42851h527562N588188O650689M274347K088427J278782j13453k107276j803943
$$ plain form
42843 7328199 8446144 10779551 9800950 4470485 -1204137 -3655843 -3735430 -3860191 -4108890
42834 -4108890 -3381249 -2213135 -1701095 -1028441 1132363 3634602 4250929 3783845 5662862
42825 5662862 10799004 15609937 16473698 13981285 11261615 9966388 9760937 10263615 11170734
42816 11170734 11187910 9115719 5962967 4150939 4481943 5519536 6172411 7161778 9255930
42807 9255930 11491838 12148763 10636395 7721296 4728961 3145721 3990210 6595966
42799 6595966 8718111 8796584 7569082 6654814 6307938 5652167 4447547 3259660 2279341
42790 2279341 1369986 984287 1473749 1642405 -139799 -3071964 -4112127 -1871900 1408340
42781 1408340 2919785 2699915 2446124 2349003 1233369 -878482 -2572634 -3308903 -3878273
$$ packed form
42843G328199J117945K333407r78601n330465n674622k451706p9587j24761k48699
42834d108890P27641J168114N12040O72654K160804K502239O16327m67084J879017
42825E662862N136142M810933Q63761k492413k719670j295227k05451N02678R07119
42816A1170734J7176k072191l152752j812028L31004J037593O52875R89367K094152
42807I255930K235908O56925j512368k915099k992335j583240Q44489K605756
42799F595966K122145P8473j227502r14268l46876o55771j204620j187887r80319
42790B279341r09355l85699M89462J68656j782204k932165j040163K240227L280240
42781A408340J511445k19870k53791r7121j115634k111851j694152p36269n69370
$$ plain form
42772 -3878273 -4412911 -3926779 -2512152 -2229759 -4617040 -8425902 -11033930 -11435745 -10774813
42763 -10774813 -10281145 -9647092 -7573792 -3617780 550791 2064227 -232549 -3883208
42755 -3883208 -4922760 -2177245 1580298 3096850 1953254 -170521 -1861628 -2205874
42747 -2205874 -113309 4341203 8376888 8576871 4890784 900045 -394027 448197
42739 448197 1116770 767519 248649 190705 342153 501869 941014 1781362 2649977 3109468
42729 3109468 3095304 2932337 3092772 3713357 4138675 3306188 983059 -1611079 -2754218
42720 -2754218 -1604601 1463926 5238404 7837135 7262058 3069060 -2431190 -5688230
42712 -5688230 -5101145 -2160352 703616 2480205 3290562 2795765 282220 -3675658 -6751368
$$ packed form
42772c878273n34638M86132J414627K82393k387281l808862k608028m01815O60932
42763a0774813M93668O34053K073300L956012M168571J513436k296776l650659
42755c883208j039552K745515L757543J516552j143596k123775j691107l44246
42747b205874K092565M454512M035685J99983l686087l990739j294072Q42224
42739D48197O68573l49251n18870n7944J51448J59716M39145Q40348Q68615M59491
42729C109468j4164j62967J60435O20585M25318q32487k323129k594138j143139
42720b754218J149617L068527L774478K598731n75077m192998n500250l257040
42712e688230N87085K940793K863968J776589Q10357m94797k513545l957878l075710
$$ plain form
42703 -6751368 -6732169 -3714390 -301483 381021 -2751654 -7678519 -10964581 -11001645 -9306777
42694 -9306777 -8120927 -7481046 -6016519 -4143171 -4201019 -6733525 -8812168 -7705054 -4633246
42685 -4633246 -2867891 -3302357 -4324147 -5254199 -6920996 -8778915 -8608685 -6118473 -4118909
42676 -4118909 -4580067 -5915794 -6098472 -6193227 -8100437 -10385400 -9591456 -5237484 -576534
42667 -576534 1741404 2156017 1961900 1210825 -37152 -442616 1080596 3758373 6114843
42658 6114843 7819333 9315441 10387891 10211000 8520209 6049976 3973783 3053312
42650 3053312 2853633 1865794 -713905 -3358308 -3558716 -923340 2506697 5271826 7891960
42641 7891960 10443602 11022909 8622119 5925389 6578881 10216645 12716524 11508241
$$ packed form
42703f751368J9199L017779L412907O82504l132675m926865l286062l7064J694868
42694i306777J185850O39881J464527J873348n7848k532506k078643J107114L071808
42685d633246J765355m34466j021790r30052j666797j857919J70230K490212J999564
42676d118909m61158j335727j82678r4755j907210k284963P93944M353972M660950
42667e76534K317938M14613j94117p51075j247977m05464J523212K677777K356470
42658F114843J704490J496108J072450j76891j690791k470233k076193r20471
42650C053312j99679r87839k579699k644403k00408K635376L430037K765129K620134
42641G891960K551642N79307k400790k696730O53492L637764K499879j208283
$$ plain form
42633 11508241 8358850 6316557 5907974 5419419 3437420 -108095 -4338493 -7624027
42625 -7624027 -8173375 -5703769 -2151907 255891 1227664 1788084 2152131 1797158 1416293
42616 1416293 2781971 5956898 8388481 8097265 6400039 5710209 5707482 4146222 1196768
42607 1196768 113129 2670413 6459491 8360491 8573348 8963405 9162515 7344119 4100777
42598 4100777 2336356 3099205 4341385 4378354 3862374 3342638 1523272 -2398429 -6668688
42589 -6668688 -8911041 -8498073 -5730127 -833750 4370122 6164731 3262760 -58364
42581 -58364 1545511 7454711 11733001 10736106 6916438 4438492 4008399 3605582 2255823
42572 2255823 1162206 1924600 4831674 8485404 10663078 10164611 7963241 5864800
$$ packed form
42633A1508241l149391k042293m08583m88555j981999l545515m230398l285534
42625g624027n49348K469606L551862K407798R71773N60420L64047l54973l80865
42616A416293J365678L174927K431583k91216j697226o89830k727j561260k949454
42607A196768j083639K557284L789078J901000K12857L90057J99110j818396l243342
42598D100777j764421P62849J242180L6969n15980n19736j819366l921701m270259
42589f668688k242353M12968K767946M896377N203872J794609k901971l321124
42581e8364J603875N909200M278290r96895l819668k477946m30093m02817j349759
42572B255823j093617P62394K907074L653730K177674m98467k201370k098441
$$ plain form
42564 5864800 4386446 3173604 3009492 5361110 9705287 13335084 14469288 13768201
42556 13768201 12153971 9196314 4787810 516195 -2170650 -3740590 -5087285 -5655163
42548 -5655163 -4655565 -2939257 -1873535 -1232492 63293 1817426 2920761 3356060 4122819
42539 4122819 5368825 6103899 5716043 4574025 3297434 2473507 2699036 3793565 4522421
42530 4522421 4356709 4801988 7339930 10611457 11602116 9448043 6146516 3609970 2188561
42521 2188561 2214918 4351369 7369824 7970890 4555608 -475597 -3928820 -5798150 -7830826
42512 -7830826 -9237858 -6924214 -557497 5125179 4954768 -619504 -5786554 -5628473
42504 -5628473 -752802 4748383 8484838 11200412 13473797 13489091 9641632 3949178
$$ packed form
42564E864800j478354j212842j64112K351618M344177L629797J134204p01087
42556A3768201j614230k957657m408504m271615k686845j569940j346695n67878
42548e655163R99598J716308J065722O41043J295785J754133J103335M35299P66759
42539D122819J246006P35074l87856j142018j276591q23927K25529J094529P28856
42530D522421j65712M45279K537942L271527R90659k154073l301527k536546j421409
42521B188561K6357K136451L018455O01066l415282n031205l453223j869330k032676
42512g830826j407032K313644O366717N682676j70411n574272n167050J58081
42504e628473M875671N501185L736455K715574K273385J5294l847459n692454
$$ plain form
42496 3949178 583410 1114497 3119968 3812217 3207332 2910156 3439485 4180744 5000490
42487 5000490 6371256 8180719 9559564 9888500 9320858 8461527 7995479 8263345 8679941
42478 8679941 8015338 5865097 3426605 2192480 2333465 3098980 4315596 6425472 9111318
42469 9111318 10847665 10149018 6912414 2574516 -727400 -1495153 -73946 1547051
42461 1547051 1733864 1002624 1337133 3789176 7282637 9819951 10443991 9941534 9836985
42452 9836985 10640882 11079961 9513550 6240425 3581134 3143331 3925555 4078167 3639567
42443 3639567 4013245 5202208 5382252 3405992 150692 -2990216 -5396803 -6445640
42435 -6445640 -5160463 -1807870 1505263 3246134 4409014 6488068 8513101 8342403
$$ packed form
42496C949178l365768N31087K005471O92249o04885k97176N29329P41259Q19746
42487E000490J370766J809463J378845L28936n67642q59331m66048K67866M16596
42478H679941o64603k150241k438492j234125J40985P65515J216616K109876K685846
42469I111318J736347o98647l236604m337898l301916p67753J421207J620997
42461A547051J86813p31240L34509K452043L493461K537314O24040n02457j04549
42452I836985Q03897M39079j566411l273125k659291m37803P82224J52612m38600
42443C639567L73678J188963J80044j976260l255300l140908k406587j048837
42435f445640J285177L352593L313133J740871J162880K079054K025033j70698
$$ plain form
42427 8342403 6615941 6816792 10499099 14543183 14763585 10916316 6330927 3450704
42419 3450704 1842429 382374 -887733 -1701274 -2357292 -2434036 -431376 3722780 7261994
42410 7261994 7738785 6499879 6447198 6986437 4523804 -1510475 -6605580 -6924535 -4268519
42401 -4268519 -2820198 -3281070 -3412857 -2725146 -2791401 -3496521 -2930129 -1423413 -1894855
42392 -1894855 -4861422 -6492279 -3734654 1265773 4287058 4522873 4321601 4940806 5428252
42383 5428252 5054383 4248337 3253656 2012691 1355904 2322168 4183632 4987900 4324504
42374 4324504 3858033 4725969 5962874 6032249 4578664 2134317 -639953 -2770278 -3123551
42365 -3123551 -1518158 973666 3207819 4724168 5195161 4275775 2548558 1642956 2691358
$$ packed form
42427H342403j726462K00851L682307M044084K20402l847269m585389k880223
42419C450704j608275j460055j270107q13541o56018p6744K002660M154156L539214
42410G261994M76791j238906n2681N39239k462633o034279n095105l18955K656016
42401d268519J448321m60872j31787O87711o6255p05120N66392J506716m71442
42392a894855k966567j630857K757625N000427L021285K35815k01272O19205M87446
42383E428252l73869q06046r94681j240965o56787R66264J861464Q04268o63396
42374D324504m66471Q67936J236905O9375j453585k444347k774270k130325l53273
42365c123551J605393K491824K234153J516349M70993r19386j727217r05602J048402
$$ plain form
42356 2691358 5222440 7877986 9412639 8778411 5550080 1142105 -1489024 -676220
42348 -676220 1852384 2794619 1001609 -1555479 -2428251 -1274909 495645 1829915 2991402
42339 2991402 4576253 6395913 7903928 9305490 11217290 13077050 13130028 10834597
42331 10834597 8179366 7230930 7227480 6013706 3951875 3973708 7171013 10556229 10548361
42322 10548361 7226015 3827949 3176028 5735599 10005909 13426672 13844893 11556147
42314 11556147 9314602 9258665 10693968 11958919 13054047 14558948 15148841 12835173
42306 12835173 8481669 5622653 6355935 9342554 12232857 14074027 14707868 13861285
42298 13861285 12084781 11125437 12079875 14146482 16070939 17626470 18703252 18384490
$$ packed form
42356B691358K531082K655546J534653o34228l228331m407975k631129Q12804
42348f76220K528604R42235j793010k557088q72772J153342J770554J334270J161487
42339B991402J584851J819660J508015J401562J911800J859760N2978k295431
42331A0834597k655231r48436l450j213774k061831K1833L197305L385216p868
42322A0548361l322346l398066o51921K559571M270310L420763M18221k288746
42314A1556147k241545n5937J435303J264951J095128J504901N89893k313668
42306A2835173m353504k859016P33282K986619K890303J841170O33841q46583
42298A3861285j776504r59344R54438K066607J924457J555531J076782l18762
$$ plain form
42290 18384490 16521237 15178013 16541861 19730233 21525792 20416188 18213865 17083799
42282 17083799 16459968 14169448 9900763 6066800 4928742 5888938 6540728 6018831 5992417
42273 5992417 7725770 9325787 7630688 2786054 -945198 -12329 4021176 6410394
42265 6410394 4907091 1747539 18542 29089 296144 588278 2025109 4430120 5540532
42256 5540532 3738475 437797 -1440571 -846402 753152 1847698 2494346 3081728 3053146
42247 3053146 2096275 1581832 3069169 5553765 5905676 2620488 -2035166 -4403147 -3255645
42238 -3255645 -565613 1008329 734834 227380 1806606 6244573 11729273 15248460
42230 15248460 15298725 13066093 10884220 10038131 10275102 10684629 10341929 8597479 5690083
$$ packed form
42290A8384490j863253j343224J363848L188372J795559j109604k202323j130066
42282A7083799o23831k290520m268685l833963j138058R60196O51790n21897k6414
42273E992417J733353J600017j695099m844634l731252R32869M033505K389218
42265F410394j503303l159552j728997J0547K67055K92134J436831K405011J110412
42256E540532j802057l300678j878368N94169J599554J094546O46648N87382k8582
42247C053146r56871n14443J487337K484596L51911l285188m655654k367981J147502
42238c255645K690032J573942k73495n07454J579226M437967N484700L519187
42230A5248460N0265k232632k181873q46089K36971M09527l42700j744450k907396
$$ plain form
42221 5690083 3003954 1879822 1980335 1483791 -742788 -3562436 -4553001 -2446049 1660685
42212 1660685 5450340 7528121 8419439 9682285 12266925 15715964 18661469 19881620
42204 19881620 19073743 16984320 14861432 13564718 13076445 12797890 12076185 10389608 7548839
42195 7548839 4200714 1738531 1038743 1541768 2323396 3735354 6779031 10809251 13365360
42186 13365360 13094550 11679004 11599911 12643756 12137232 8727402 4624288 3330016 5648271
42177 5648271 8657110 8712210 5195533 1187559 595796 4833732 12156686 19494195 24325153
42168 24325153 25393017 23071436 19594944 17963047 19620008 23366024 26956388 29323984
42160 29323984 30680260 31019481 29716288 26851201 24031760 23094007 24169923 25799627
$$ packed form
42221E690083k686129j124132J00513m96544k226579k819648r90565K106952M106734
42212A660685L789655K077781Q91318J262846K584640L449039K945505J220151
42204A9881620q07877k089423k122888j296714m88273k78555p21705j686577k840769
42195G548839l348125k462183o99788N03025P81628J411958L043677M030220K556109
42186A3365360k70810j415546p9093J043845n06524l409830m103114j294272K318255
42177E648271L008839N5100l516677m007974n91763M237936P322954P337509M830958
42168B4325153J067864k321581l476492j631897J656961L746016L590364K367596
42160B9323984J356276L39221j303193k865087k819441r37753J075916J629704
$$ plain form
42152 25799627 27219175 29744276 34884849 41460498 46278910 48281119 50195304 54435509
42144 54435509 58894970 59577629 56939396 56423324 62008831 72275906 84382401 98980594
42136 98980594 118496650 142703507 169482250 198809241 231623605 263531167 282889544
42129 282889544 278275422 248302768 203740033 160087829 127355678 105325883 87613335
42122 87613335 69991837 54254902 44194791 40084247 39039581 39135610 40033100 40126578
42114 40126578 36799079 30426091 24945837 22853096 22287070 20885169 19706045 20525933
42106 20525933 21573172 19831131 16584365 16470904 20521916 23901501 22188399 16980420
42098 16980420 13029375 11995340 11801962 10901068 10048887 9918223 9818697 9719883 11334007
$$ packed form
42152B5799627J419548K525101N140573O575649M818412K002209J914185M240205
42144E4435509M459461O82659k638233n16072N585507J0267075J2106495J4598193
42136I8980594J9516056K4206857K6778743K9326991L2814364L1907562J9358377
42129B82889544m614122k9972654m4562735m3652204l2732151k2029795j7712548
42122H7613335j7621498j5736935j0060111m110544j044666R6029Q97490R3478
42114D0126578l327499o372988n480254k092741n66026j401901j179124Q19888
42106B0525933J047239j742041l246766j13461M051012L379585j713102n207979
42098A6980420l951045j034035j93378r00894q52181j30664r9526r8814J614124
$$ plain form
42089 11334007 15686561 21065227 25023010 27492431 30241086 33821795 36885363 38432852
42081 38432852 38986834 39228303 39155631 39302014 41294016 46052741 52345376 58145904 62836007
42072 62836007 67398083 73250980 81575572 92730815 105322873 116827851 126369288 136165812
42064 136165812 149256532 166987263 190183931 221189825 261522634 306834112 346062136
42057 346062136 366746922 361571285 331793531 287018875 240999295 204044934 177649465
42050 177649465 157330514 140181602 127084713 117775920 108100050 94650021 79264141
42043 79264141 65910124 55110197 44794972 35338014 29731109 28533731 28164206 25510934
42035 25510934 21662609 19360099 18652791 17235638 14202732 11340206 10561429 11537723
$$ packed form
42089A1334007M352554N378666L957783K469421K748655L580709L063568J547489
42081C8432852N53982K41469p2672J46383J992002M758725O292635N800528M690103
42072F2836007M562076N852897Q324592J1155243J2592058J1504978R541437R796524
42064A36165812J3090720J7730731K3196668L1005894M0332809M5311478L9228024
42057C46062136K0684786n175637k9777754m4774656m6019580l6954361k6395469
42050A77649465k0318951j7148912j3096889r308793r675870j3450029j5385880
42043G9264141j3354017j0799927j0315225r456958n606905j197378l69525k653272
42035B5510934l848325k302510p07308j417153l032906k862526p78777R76294
$$ plain form
42027 11537723 12431624 12102690 10916722 9819891 9350255 9592245 10533036 12055634 13713455
42018 13713455 14894461 15428158 15965178 17440809 19795104 21357822 20366701 17642571
42010 17642571 16802811 20402271 26286590 29605270 28493026 25586294 23450448 21387164
42002 21387164 18446219 16618723 17809570 19592334 17907372 13187791 9895808 10123856
41994 10123856 11592091 12319505 13070280 14009963 13130804 10115312 8113829 9042245 10212013
41985 10212013 8550728 5504802 4597380 6346242 8869288 11589724 14798184 16992239
41977 16992239 16390400 14410534 14284594 16531862 18714078 19351517 19354158 19913089 21606587
41968 21606587 25273357 31296661 38446488 45641185 53692079 62410194 67406007 63887201
$$ packed form
42027A1537723Q93901l28934j185968j096831m69636K41990R40791J522598J657821
42018A3713455J181006N33697N37020J475631K354295J562718r91121k724130
42010A7642571q39760L599460N884319L318680j112244k906732k135846k063284
42002B1387164k940945j827496J190847J782764j684962m719581l291983K28048
41994A0123856J468235P27414P50775R39683q79159l015492k001483R28416J169768
41985A0212013j661285l045926r07422J748862K523046K720436L208460K194055
41977A6992239o01839j979866j25940K247268K182216O37439K641N58931J693498
41968B1606587L666770O023304P149827P194697Q050894Q718115M995813l518806
$$ plain form
41960 63887201 53273916 41943745 33383349 25853696 18129313 12483121 10195887 8700119
41952 8700119 5969077 4071581 5268156 7620654 7893108 6477386 5859216 5802179 3761353
41943 3761353 -467036 -3740856 -3539688 -824948 1381976 966202 -1673498 -4047037
41935 -4047037 -4007054 -2380162 -2133929 -4132161 -5299581 -2533242 2933418 7011895 7677378
41926 7677378 6424752 5425260 5277981 5486938 5431146 4667243 3499910 3246303 4761592
41917 4761592 6703613 6456904 3128241 -1079507 -2748006 -247248 4930900 9442632
41909 9442632 10850688 9380171 6915179 4696557 2792300 1417989 1278682 2384089
41901 2384089 3944261 5801220 8501268 11508366 12990550 12141641 10280298 9000991
$$ packed form
41960F3887201j0613285j1330171q560396p529653p724383n646192k287234j495768
41952H700119k731042j897496J196575K352498K72454j415722o18170n7037k040826
41943C761353m228389l273820K01168K714740K206924m15774k639700k373539
41935d047037L9983J626892K46233j998232j167420K766339N466660M078477O65483
41926G677378j252626r99492j47279K08957n5792p63903j167333k53607J515289
41917D761592J942021k46709l328663m207748j668499K500758N178148M511732
41909I442632J408056j470517k464992k218622j904257j374311j39307J105407
41901B384089J560172J856959K700048L007098J482184q48909j861343j279307
$$ plain form
41893 9000991 8716160 9398354 10672863 10494806 6316147 -982869 -6713895 -7692648 -5668686
41884 -5668686 -3616439 -1345914 2368396 5746673 5930415 3685261 2417082 3003210
41876 3003210 3061383 1285102 -671575 -894498 906519 4340182 8521227 11180867 10283318
41867 10283318 6935619 4325458 3580464 3127592 2168961 1838923 2452445 2661664 2272604
41858 2272604 2973433 4994391 5819776 3886598 1183514 378708 1430261 2858410 4439634
41849 4439634 6587966 8635190 9850998 11023578 13048177 14844069 14538695 12076600
41841 12076600 9003826 6218847 3506046 914244 -877642 -1497133 -1142038 -9179
41833 -9179 1848163 4363206 7598497 11474609 14996604 16714472 16595060 16433888 17627910
$$ packed form
41893I000991k84831O82194J274509j78057m178659p299016n731026r78753K023962
41884e668686K052247K270525L714310L378277J83742k245154j268179N86128
41876C003210N8173j776281j956677k22923J801017L433663M181045K659640q97549
41867A0283318l347699k610161p44994m52872r58631l30038O13522K09219l89060
41858B272604P00829K020958Q25385j933178k703084q04806J051553J428149J581224
41849D439634K148332K047224J215808J172580K024599J795892l05374k462095
41841A2076600l072774k784979k712801k591802j791886o19491L55095J132859
41833i179J857342K515043L235291L876112L521995J717868j19412j61172J194022
$$ plain form
41824 17627910 19600709 21410100 23821265 28366102 34860233 41013669 44225338 43099802
41816 43099802 37912099 30556540 23593965 18555184 15427196 13849195 13681608 14135256
41808 14135256 14114209 14305476 16855744 21313931 23059462 18643543 11424999 8418567
41800 8418567 11628982 15917643 16286747 14003131 13489475 15603464 16973360 15177764
41792 15177764 11828034 10003323 10365906 10756605 8859402 4504204 -392000 -3582624
41784 -3582624 -4035789 -1996549 1890553 6855929 11490271 14110439 14646885 15665529
41776 15665529 20140005 27876750 35118914 38136596 36335079 31448725 25148527 18755823
41768 18755823 13986382 11633538 9825376 6030189 1086841 -1286055 202181 2346093
$$ packed form
41824A7627910J972799J809391K411165M544837O494131O153436L211669j125536
41816D3099802n187703p355559o962575n038781l127988j578001j67587M53648
41808A4135256k1047J91267K550268M458187J745531m415919p218544l006432
41800H418567L210415M288661L69104k283616n13656K113989J369896j795596
41792A5177764l349730j824711L62583L90699j897203m355198m896204l190624
41784c582624m53165K039240L887102M965376M634342K620168N36446J018644
41776A5665529M474476P736745P242164L017682j801517m886354o300198o392704
41768A8755823m769441k352844j808162l795187m943348k372896J488236K143912
$$ plain form
41760 2346093 2274394 1590530 3089601 5661503 6025909 4245055 3632987 5517119 7821306
41751 7821306 9060715 10051588 10922815 10057279 7302612 4935533 3976779 2867736 1500062
41742 1500062 2850010 7959236 12765246 13454243 12113367 12969259 15310985 14998483 11763594
41733 11763594 9737609 10505736 10575621 7210574 2739417 907475 1894735 3184261 3211486
41724 3211486 2073402 228568 -1679961 -2940182 -4080230 -6633507 -10181744 -11285462
41716 -11285462 -7450990 -1092594 2795995 2588454 1460525 2689274 5647241 7561081
41708 7561081 7734749 8185177 10385384 13206025 14911308 15904969 17856516 20508684 21350475
41699 21350475 19066338 15535800 13160055 11682412 9420369 6524021 4720225 4261438
$$ packed form
41760B346093p1699o83864J499071K571902L64406j780854o12068J884132K304187
41751G821306J239409R90873Q71227q65536k754667k367079r58754j109043j367674
41742A500062J349948N109226M806010O88997j340876Q55892K341726l12502l234889
41733A1763594k025985P68127O9885l365047m471157j831942R87260J289526K7225
41724C211486j138084j844834j908529j260221j140048k553277l548237j103718
41716a1285462L834472O358396L888589k07541j127929J228749K957967J913840
41708G561081J73668M50428K200207K820641J705283R93661J951547K652168Q41791
41699B1350475k284137l530538k375745j477643k262043k896348j803796m58787
$$ plain form
41691 4261438 3574736 2185065 1651368 2760607 3841003 3247971 2065416 2708107 5590012
41682 5590012 8646165 9939383 9625955 9210106 9501474 9647624 8247310 5394733 3107260
41673 3107260 3175889 5102321 7050070 8233736 8915064 8471955 5679255 1415974 -1024165
41664 -1024165 463285 4447284 8405327 11815456 15072673 16838730 15075967 10403868
41656 10403868 6108433 4453519 4708779 5172024 5389292 5668284 6008399 6673497 8654150
41647 8654150 12200611 15603609 16765010 15551384 13300157 10398010 6078782 775110
41639 775110 -3286079 -4887275 -5681592 -7679659 -9956900 -9873997 -7119263 -4293709 -3195795
41630 -3195795 -2652253 -871954 1973382 4814673 7673520 10825900 13096093 12926561
$$ packed form
41691D261438o86702j389671n33697J109239J080396n93032j182555O42691K881905
41682E590012L056153J293218l13428m15849K91368J46150j400314k852577k287473
41673C107260O8629J926432J947749J183666O81328m43109k792700m263281k440139
41664a024165J487450L983999L958043L410129L257217J766057j762763m672099
41656A0403868m295435j654914K55260M63245K17268K78992L40115O65098J980653
41647H654150L546461L402998J161401j213626k251227k902147m319228n303672
41639G75110m061189j601196p94317j998067k277241Q2903K754734K825554J097914
41630c195795N43542J780299K845336K841291K858847L152380K270193j69532
$$ plain form
41622 12926561 10671070 8218328 6742235 6333944 7333685 10070593 13247282 14484633
41614 14484633 13091925 10981746 10225530 10656630 10361157 7803240 3218009 -1378850
41606 -1378850 -3384749 -1462585 3556308 9664625 14937491 17541919 16051598 11293821
41598 11293821 6786051 5324862 5750882 5088063 3196810 2777004 5032548 8154828
41590 8154828 10387072 11796672 12361159 11098219 8214149 5641278 4288311 3170197
41582 3170197 2320516 3612166 6896683 8261631 4774362 -1229179 -5286288 -6330121
41574 -6330121 -6249234 -5747710 -4095864 -1988568 -1101676 -998558 344792 2737106 3444660
41565 3444660 1346936 -1057627 -822365 2023566 5078961 6300163 5591306 4790283 6330748
$$ packed form
41622A2926561k255491k452742j476093m08291R99741K736908L176689J237351
41614A4484633j392708k110179p56216M31100k95473k557917m585231m596859
41606a378850k005899J922164N018893O108317N272866K604428j490321m757777
41598A1293821m507770j461189M26020o62819j891253m19806K255544L122280
41590H154828K232244J409600N64487j262940k884070k572871j352967j118114
41582C170197q49681J291650L284517J364948l487269o003541m057109j043833
41574f330121Q0887N01524J651846K107296Q86892J03118J343350K392314P07554
41565C444660k097724k404563K35262K845931L055395J221202p08857q01023J540465
$$ plain form
41556 6330748 10782742 15515316 16822325 13546384 7969631 3533948 2412583 4351679
41548 4351679 6588672 5886724 2231709 -552973 320804 2557561 2200049 -291962 -1033405
41539 -1033405 812516 1828189 148148 -1847438 -2225583 -2830188 -5307866 -7107076
41531 -7107076 -4733253 1188239 7199028 11556699 14324227 14466398 10706067 5065042
41523 5065042 2172751 4307002 9266123 13450693 14979886 13541228 9568263 4670728
41515 4670728 1262015 501314 1304413 1958105 1987574 2042290 2642673 3467447 3629196 2780625
41505 2780625 2149287 3617342 7011359 9530951 9447927 9172557 12081715 16882397 18547224
41496 18547224 15637859 13277568 16613106 23771326 28168288 26381101 20798823 15269935
$$ packed form
41556F330748M451994M732574J307009l275941n576753m435683j121365J939096
41548D351679K236993p01948l655015k784682Q73777K236757l57512k492011p41443
41539a033405J845921J015673j680041j995586l78145o04605k477678j799210
41531g107076K373823N921492O010789M357671K767528J42171l760331n641025
41523E065042k892291K134251M959121M184570J529193j438658l972965m897535
41515D670728l408713p60701Q03099O53692K9469N4716O00383Q24774J61749q48571
41505B780625o31338J468055L394017K519592q3024k75370K909158M800682J664827
41496A8547224k909365k360291L335538P158220M396962j787187n582278n528888
$$ plain form
41488 15269935 11311330 8800336 7399247 6113387 3623775 501061 -482111 2307786
41480 2307786 6889949 9904410 10314910 9483452 8534018 7448309 6316992 5619702 5184569
41471 5184569 4421983 3753454 4279096 5699837 6159211 4820368 3122159 2527269 2427609
41462 2427609 1687812 1199255 3040297 7333379 11558079 13266127 12361984 10425722 8803869
41453 8803869 7894763 7634566 8007356 9093826 10750084 12303316 12951182 12723197 12506645
41444 12506645 12623888 12119479 10418131 8987768 9788069 12235105 13495548 12218477
41436 12218477 10253739 9776877 10316233 10067517 8915464 8264599 8503222 8676753 8655441
41427 8655441 9619481 11833831 13736751 14281158 14689232 16403470 18368330 18232319 15882380
$$ packed form
41488A5269935l958605k510994j401089j285860k489612l122714r83172K789897
41480B307786M582163L014461M10500q31458r49434j085709j131317o97290m35133
41471E184569p62586o68529N25642J420741M59374j338843j698209n94890r9660
41462B427609p39797m88557J841042M293082M224700J708048r04143j936262j621853
41453H803869r09106k60197L72790J086470J656258J553232O47866k27985k16552
41444A2506645J17243n04409j701348j430363Q00301K447036J260443j277071
41436A2218477j964738m76862N39356k48716j152053o50865K38623J73531k1312
41427H655441R64040K214350J902920N44407M08074J714238J964860j36011k349939
$$ plain form
41418 15882380 13875559 14117590 15854302 17672912 19915065 23730170 28618673 32472547
41410 32472547 34004423 34131594 34900320 37752868 42920390 50010202 58961077 70112389
41402 70112389 82636925 93283641 98745361 100274467 103607319 111609256 118290862 113707635
41394 113707635 95157850 70578624 50168822 37601620 30538469 26155971 23102478
41387 23102478 20114899 16312719 12663774 10864808 10851563 10972306 10161774 8503634 6367448
41378 6367448 4558117 4529508 6742975 9530957 11197698 12259473 13818553 15116509
41370 15116509 15255215 16073620 19895804 24898383 26456175 23497310 19945327 18909959
41362 18909959 18970752 17848390 16486685 17036122 19143101 20799062 21270845 20958277 19701512
$$ packed form
41418A5882380k006821K42031J736712J818610K242153L815105M888503L853874
41410C2472547J531876J27171P68726K852548N167522P089812Q950875J1151312
41402G0112389J2524536J0646716N461720J529106L332852Q001937O681606m583227
41394A13707635j8549785k4579226k0409802j2567202p063151m382498l053493
41387B3102478k987579l802180l648945j798966j3245J20743q10532j658140k136186
41378F367448j809331k8609K213467K787982J666741J061775J559080J297956
41370A5116509J38706Q18405L822184N002579J557792k958865l551983j035368
41362A8909959O0793j122362j361705N49437K106979J655961M71783l12568j256765
$$ plain form
41353 19701512 17333792 14817673 12996336 11329145 9546157 9141527 11135469 13613528
41345 13613528 13921672 12477134 11952526 13283230 15094853 16828920 19582140 23361405
41337 23361405 26157659 26957061 27692762 30708410 35535055 39546380 40999693 40308704
41329 40308704 39009135 38654351 40330385 44020486 48302267 51497088 53397246 55358630
41321 55358630 58530904 62569547 66440169 69914567 73544441 77443775 81050010 84174736
41313 84174736 87272447 90264073 92144754 92506930 92469556 93061761 93577251 92837180 91316848
41304 91316848 90436808 90251574 89470937 87329685 83738672 78225635 70978886 64487142
41296 64487142 61277642 59824474 55752536 47908104 40169205 35910268 33795758 31147633
$$ packed form
41353A9701512k367720k516119j821337j667191j782988m04630J993942K478059
41345A3613528L08144j444538n24608J330704J811623J734067K753220L779265
41337B3361405K796254P99402P35701L015648M826645M011325J453313o90989
41329D0308704j299569l54784J676034L690101M281781L194821J900158J961384
41321E5358630L172274M038643L870622L474398L629874L899334L606235L124726
41313H4174736L097711K991626J880681L62176l7374N92205N15490p40071j520332
41304I1316848q80040j85234p80637k141252l591013n513037p246749o491744
41296F4487142l209500j453168m071938p844432p738899m258937k114510k648125
$$ plain form
41288 31147633 28614210 28536481 30589601 32159552 32047018 31116439 29935734 28191071 26122537
41279 26122537 24599526 24026936 24523969 26366259 28758303 29214733 26020868 20671321
41271 20671321 16399816 15026971 16246800 18503092 19305992 16767997 12693151 11875107
41263 11875107 15962558 20467535 20833542 18827996 18943801 20894507 20881033 18927076 19138987
41254 19138987 22724329 26340183 28063893 29604158 31445302 31394443 29963644 31644116
41246 31644116 37725822 42824809 42475944 39998882 41376213 46712271 51645178 54697251
41238 54697251 57977321 61924530 64533041 65826054 68846146 75484844 84379103 93355185
41230 93355185 101275931 107184982 110234971 111097330 111504910 112048318 111998916 111086181 109543465
$$ packed form
41288C1147633k533423p7729K053120J569951j12534r30579j180705j744663k068534
41279B6122537j523011n72590M97033J842290K392044M56430l193865n349547
41271B0671321m271505j372845J219829K256292Q02900k537995m074846q18044
41263A1875107M087451M504977L66007k005546J15805J950706j3474j953957K11911
41254A9138987L585342L615854J723710J540265J841144n0859j430799J680472
41246C1644116O081706N098987l48865k477062J377331N336058M932907L052073
41238E4697251L280070L947209K608511J293013L020092O638698Q894259Q976082
41230I3355185P920746N909051L049989Q62359M07580N43408m9402r12735j542716
$$ plain form
41221 109543465 106641639 101344763 94438604 87903059 82093659 75746072 69008049 63995371
41213 63995371 61422225 58849485 53760214 46912333 41041084 37062548 33177139 27754012
41205 27754012 21965797 18846140 19817245 22726446 23951296 22288839 19763214 18358758
41197 18358758 17318785 14693699 10531203 7118444 6451919 8502246 11570006 13495520
41189 13495520 13129791 11567670 11320221 13426343 16252526 18010204 19055168 20208576
41181 20208576 20341408 18019207 14642301 13181672 13882968 13809020 11086528 7420993 5754192
41172 5754192 7190544 10701987 14125149 15053669 12658302 9237897 8102814 9258140
41164 9258140 9260714 6405288 3849071 5658077 11190730 15629824 15606371 12429790 9646687
$$ packed form
41221A09543465k901826n296876o906159o535545n809400o347587o738023n012678
41213F3995371k573146k572740n089271o847881n871249l978536l885409n423127
41205B7754012n788215l119657R71105K909201J224850j662457k525625j404456
41197A8358758j039973k625086m162496l412759o66525K050327L067760J925514
41189A3495520l65729j562121k47449K106122K826183J757678J044964J153408
41181B0208576J32832k322201l376906j460629P01296p3948k722492l665535j666801
41172E754192J436352L511443L423162R28520k395367l420405j135083J155326
41164I258140K574k855426k556217J809006N532653M439094k3453l176581k783103
$$ plain form
41155 9646687 8829182 8481820 6686523 4137359 3760226 6844596 10460316 10258512 5582666
41146 5582666 -56397 -3673221 -5580068 -6624145 -5453830 -972147 4272401 6313064
41138 6313064 4991905 4093172 5891380 8217132 8157855 6555725 6831699 10346739 14941199
41129 14941199 17934010 18826690 18571775 17637978 15965420 14048415 12563696 10940305
41121 10940305 7813430 3633116 1537434 4078243 9485846 12864236 11482640 7589623
41113 7589623 5348106 6161798 8069364 8851972 8241690 7259956 6854230 7667624 10121631
41104 10121631 13915226 17885570 21041589 23562325 26252121 29107759 30967063 30717154
41096 30717154 28509213 25602838 23209260 21604300 20207012 18395810 16254327 14381470
$$ packed form
41155I646687q17505l47362j795297k549164l77133L084370L615720k01804m675846
41146E582666n639063l616824j906847j044077J170315M481683N244548K040663
41138F313064j321159q98733J798208K325752n9277j602130K75974L515040M594460
41129A4941199K992811Q92680k54915r33797j672558j917005j484719j623391
41121A0940305l126875m180314k095682K540809N407603L378390j381596l893017
41113G589623k241517Q13692J907566P82608o10282r81734m05726Q13394K454007
41104A0121631L793595L970344L156019K520736K689796K855638J859304k49909
41096C0717154k207941k906375k393578j604960j397288j811202k141483j872857
$$ plain form
41088 14381470 12859744 10868434 7937456 5190879 4190895 4551845 4225222 2696599
41080 2696599 2155275 4238002 7313041 8945409 9566111 11094570 13219964 14633461
41072 14633461 17247197 24267729 32887497 34083815 23280531 7620987 -1711787 -2068521
41064 -2068521 275878 428028 -96730 1270197 3346388 3910207 3322825 2872376 2179795
41055 2179795 650774 -545050 -242117 522902 172362 -808262 -907171 -221648 -124575
41046 -124575 -962892 -1836055 -2264543 -2583514 -2917334 -2957025 -2543509 -1596520 121663 2404192
41036 2404192 4368264 5544388 6316093 6478297 4730047 1121847 -1284634 461034
41028 461034 4901775 7460831 6174403 3717573 3058829 3638586 3464750 2814537 3232016
$$ packed form
41088A4381470j521726j991310k930978k746577r99984L60950l26623j528623
41080B696599n41324K082727L075039J632368O20702J528459K125394J413497
41072A4633461K613736P020532Q619768J196318j0803284j5659544r332774l56734
41064b068521K344399J52150n24758J366927K076191N63819n87382m50449o92581
41055B179795j529021j195824L02933P65019l50540r80624r8909O85523R7073
41046a24575q38317q73163m28488l18971l33820l9691M13516R46989J718183K282529
41036B404192J964072J176124P71705J62204j748250l608200k406481J745668
41028D61034M440741K559056j286428k456830o58744N79757j73836o50213M17479
$$ plain form
41019 3232016 3997293 2708117 -503883 -2334943 -1055095 745177 265429 -773241
41011 -773241 1319437 5898896 7987614 5123661 796009 -518947 1071031 2369869
41003 2369869 1768686 -205128 -3154679 -6561552 -8366971 -6877149 -3601332 -1517037
40995 -1517037 -1049998 -452381 612669 1121643 1697339 3612972 4810636 1461181 -5428535
40986 -5428535 -9546565 -7538701 -3569392 -2813786 -4316245 -4120540 -2267759 -1923970 -3380220
40977 -3380220 -3788997 -2350998 -1429870 -2228428 -3008597 -2264120 -621836 1103541 2987454
40968 2987454 4347737 3635328 1059224 -938276 -1094280 -1303222 -3750137 -7545451 -9769574
40959 -9769574 -8983550 -6321020 -3541818 -1207948 1112447 3570095 5482317 6103550
$$ packed form
41019C232016P65277j289176l212000j831060J279848J800272m79748j038670
41011g73241K092678M579459K088718k863953m327652j314956J589978J298838
41003B369869o01183j973814k949551l406873j805419J489822L275817K084295
40995a517037M67039N97617J065050N08974N75696J915633J197664l349455o889716
40986e428535m118030K007864L969309P55606j502459J95705J852781L43789j456250
40977c380220m08777J437999R21128p98558p80169P44477J642284J725377J883913
40968B987454J360283p12409k576104j997500j56004k08942k446915l795314k224123
40959i769574P86024K662530K779202K333870K320395K457648J912222O21233
$$ plain form
40951 6103550 5500575 4009392 1127254 -3643143 -8488319 -9666275 -5669630 202307
40943 202307 3121615 1797078 -1217047 -3212167 -3325182 -1669498 1028110 2899303
40935 2899303 2207308 -436715 -2676847 -3293817 -2909317 -1963907 -4450 2670509 4487845
40926 4487845 4359270 2638919 -3408 -3334267 -6923130 -9999472 -12040866 -12385454
40918 -12385454 -9766048 -4082108 1691562 3794997 2292770 1188508 3287095 7028879
40910 7028879 9248877 9001483 7478274 5949570 5214080 5750724 7022404 7429166 5849595
40901 5849595 2590677 -1377648 -4941986 -6563515 -5309154 -2696380 -1698527 -3165748
40893 -3165748 -4899104 -4866518 -3375245 -1332347 1311155 4071265 5078719 3434271
$$ packed form
40951F103550o02975j491183k882138m770397m845176j177956L996645N871937
40943B02307K919308j324537l014125j995120j13015J655684K697608J871193
40935B899303o91995k644023k240132o16970L84500R45410J959457K674959J817336
40926D487845j28575j720351k642327l330859l588863l076342k041394l44588
40918a2385454K619406N683940N773670K103435j502227j104262K098587L741784
40910G028879K219998k47394j523209j528704p35490N36644J271680M06762j579571
40901E849595l258918l968325l564338j621529J254361K612774R97853j467221
40893c165748j733356L2586J491273K042898K643502K760110J007454j644448
$$ plain form
40885 3434271 703131 -1453200 -3320689 -5240687 -5765633 -3882136 -1386425 -724233
40877 -724233 -1820541 -3194312 -4599374 -5959230 -5265677 -942305 4397096 6021228
40869 6021228 3033781 -748573 -2166741 -1971633 -1973501 -1926678 -881103 549741 1233918
40860 1233918 1557249 2614358 3951215 3591895 386855 -4373933 -7855571 -8168439 -6154845
40851 -6154845 -4499054 -4719631 -5518098 -4727467 -2178017 545325 2645802 4785027 7208209
40842 7208209 8813047 8637199 7205592 5947263 6032371 7817212 10383510 11550076 9618351
40833 9618351 5483197 1865231 44458 -1430574 -4197091 -7499954 -9167369 -8303164
40825 -8303164 -5894476 -3251665 -1010869 400276 431749 -890819 -2449861 -2964361 -2562122
$$ packed form
40885C434271k731140k156331j867489j919998n24946J883497K495711O62192
40877g24233j096308j373771j405062j359856O93553M323372N339401J624132
40869F021228k987447l782354j418168J95108j868M6823J045575J430844O84177
40860A233918L23331J057109J336857l59320l205040m760788l481638l12868K013594
40851f154845J655791k20577p98467P90631K549450K723342K100477K139225K423182
40842G208209J604838j75848j431607j258329Q5108J784841K566298J166566j931725
40833I618351m135154l617966j820773j475032k766517l302863j667415Q64205
40825h303164K408688K642811K240796J411145L1473j322568j559042n14500M02239
$$ plain form
40816 -2562122 -2856536 -4938306 -7666853 -8804983 -7710621 -5774291 -4107363 -2387755
40808 -2387755 -687901 -607732 -2932913 -5526527 -5742308 -4247866 -4185412 -6772665 -9992754
40799 -9992754 -11733924 -11921168 -11032848 -8760027 -5184747 -1555254 1168029 3178533
40791 3178533 4579298 4930780 4741385 5395788 6533127 5775586 2766353 1127226 3750342
40782 3750342 7979822 8871173 6231108 4508037 5638996 6233865 3435814 -204375
40774 -204375 -699718 1082148 842751 -2523597 -5552376 -5631823 -4253847 -3600972 -2996266
40765 -2996266 -1098279 557639 -653733 -3918137 -5336560 -3189518 -337343 -338319 -3014217
40756 -3014217 -5177211 -4543141 -1640585 1435239 3096339 3425036 3768483 4821606 5385348
$$ packed form
40816b562122k94414k081770k728547j138130J094362J936330J666928J719608
40808b387755J699854Q0169k325181k593614k15781J494442O2454k587253l220089
40799i992754j741170j87244Q88320K272821L575280L629493K723283K010504
40791C178533J400765L51482j89395O54403J137339p57541l009233j639127K623116
40782C750342M229480Q91351k640065j723071J130959N94869k798051l640189
40774b04375m95343J781866k39397l366348l028779p9447J377976O52875O04706
40765b996266J897987J655918j211372l264404j418423K147042K852175r76k675898
40756c014217k162994O34070K902556L075824J661100L28697L43447J053123N63742
$$ plain form
40747 5385348 4246601 2852639 3626911 5217620 2793840 -4922060 -12173708 -13198513
40739 -13198513 -10234202 -9832714 -12565994 -12260878 -6260450 -555079 -1525148 -6913957
40731 -6913957 -9323999 -6076566 -1016915 2261354 4297999 6441669 7642057 6468506
40723 6468506 4029656 2804149 3460550 4284690 3438267 855471 -2003758 -3621842 -3453891
40714 -3453891 -1878831 242601 1628310 872464 -2117569 -5026255 -4955920 -1919614 913500
40705 913500 1373666 1143610 2866381 5688959 6065049 2754100 -1263297 -2457133 -723458
40696 -723458 1062715 330441 -3035424 -6919143 -8652950 -7069716 -3462863 -253323
40688 -253323 1369881 2047014 2717972 3440150 3823814 3642871 2659989 680605 -1880280
$$ packed form
40747E385348j138747j393962P74272J590709k423780p715900p251648j024805
40739a3198513K964311M01488k733280L05116O000428N705371r70069n388809
40731f913957k410042L247433N059651L278269K036645K143670J200388j173551
40723F468506k438850j225507O56401Q24140q46423k582796k859229j618084J67951
40714c453891J575060K121432J385709p55846k990033k908686P0335L036306K833114
40705I13500M60166k30056J722771K822578L76090l310949m017397j193836J733675
40696g23458J786173p32274l365865l883719j733807J583234L606853L209540
40688b53323J623204O77133O70958P22178L83664j80943r82882j979384k560885
$$ plain form
40679 -1880280 -4296096 -6613937 -9312319 -11421358 -10509022 -5919704 -995092 -136162
40671 -136162 -3773609 -7977968 -9272271 -7972112 -5943568 -3094915 1703731 7155898
40663 7155898 9821003 8494807 6080838 5740420 6920979 7109408 6186860 6340623 7928421
40654 7928421 8309498 5635495 1427962 -1951496 -4289199 -6134057 -6310249 -3542956
40646 -3542956 300434 1529080 -640340 -3169593 -3580747 -2843886 -2720225 -2446117 -178371
40637 -178371 3481967 5822367 5809847 5575010 7418015 10568827 11909690 9486314 4591468
40628 4591468 466699 -570977 1333458 4417943 7165480 9220433 10868692 12178283
40620 12178283 12819439 12442585 11017533 8932569 6872946 5415916 4560225 3746729 2467559
$$ packed form
40679a880280k415816k317841k698382k109039R12336M589318M924612Q58930
40671a36162l637447m204359j294303J300159K028544K848653M798646N452167
40663G155898K665105j326196k413969l40418J180559J88429r22548J53763J587798
40654G928421L81077k674003m207533l379458k337703j844858j76192K767293
40646c542956L843390J228646k169420k529253m11154P36861J23661K74108K267746
40637a78371L660338K340400j2520k34837J843005L150812J340863k423376m894846
40628D591468m124769j037676J904435L084485K747537K054953J648259J309591
40620A2178283O41156l76854j425052k084964k059623j457030q55691q13496j279170
$$ plain form
40611 2467559 786406 -734307 -1338166 -198369 3229105 8248185 12377929 12758800
40603 12758800 8937331 3940746 1664624 3036564 5479772 6284294 5379980 4068477
40595 4068477 2282887 -1067150 -5289212 -7480612 -5744943 -1568895 1936703 3222478
40587 3222478 2850216 1868396 939584 538957 720095 866971 673221 994749 2505331
40578 2505331 3798844 2453876 -1656409 -5510663 -6123914 -3637589 -572876 1098135
40570 1098135 1303212 1047831 1354892 2767728 4908484 6422781 6063499 4042235 1862775
40561 1862775 719118 560481 908683 1920825 3958679 6424914 7969600 8062056 7523731
40552 7523731 7048444 6145121 4529122 3652473 5021906 7157436 6469657 2059979 -2326175
$$ packed form
40611B467559j681153j520713o03859J139797L427474N019080M129744L80871
40603A2758800l821469m996585k276122J371940K443208Q04522r04314j311503
40595D068477j785590l350037m222062k191400J735669M176048L505598J285775
40587C222478l72262r81820r28812m00627J81138J46876j93750L21528J510582
40578B505331J293513j344968m110285l854254o13251K486325L064713J671011
40570A098135K05077k55381L07061J412836K140756J514297l59282k021264k179460
40561A862775j143657j58637L48202J012142K037854K466235J544686R2456n38325
40552G523731m75287r03323j615999q76649J369433K135530o87779m409678m386154
$$ plain form
40543 -2326175 -2758802 -52631 1819057 1205094 121522 389393 1226479 1497669 2001938
40534 2001938 3951606 6711408 8745270 9841208 10695733 10859435 8962268 5182769
40526 5182769 1967384 1501333 3298978 5168255 6127965 7277172 9514650 11452165
40518 11452165 10805286 7644656 4799962 4466691 5770299 6779854 7530494 9045962
40510 9045962 10250223 8710716 4862151 2753317 5121356 9723219 12361021 12015168
40502 12015168 10916775 10710002 11092813 11949222 14257901 18178082 22008997 23981378
40494 23981378 24004582 23074663 22095827 21953882 23576773 26810964 29915999 31281064 31329244
40485 31329244 31752717 33014531 33600156 31918409 28102119 23508707 19121242 15153927
$$ packed form
40543b326175m32627K706171J871688o13963j083572K67871Q37086K71190N04269
40534B001938J949668K759802K033862J095938Q54525J63702j897167l779499
40526E182769l215385m66051J797645J869277R59710J149207K237478J937515
40518A1452165o46879l160630k844694l33271J303608J009555P50640J515468
40510I045962J204261j539507l848565k108834K368039M601863K637802l45853
40502A2015168j098393k06773L82811Q56409K308679L920181L830915J972381
40494B3981378K3204r29919r78836j41945J622891L234191L105035J365065M8180
40485C1329244M23473J261814N85625j681747l816290m593412m387465l967315
$$ plain form
40477 15153927 11878757 9916926 9523447 10268803 11765724 14057465 16712457 18155044
40469 18155044 16908894 13385338 9566217 7020420 6244701 7818734 12494291 19308436
40461 19308436 25078229 27314397 26913812 26426598 26123553 23640391 17725761 10540975
40453 10540975 5335361 3135727 2883363 3784818 5798464 8027457 8487377 6333967
40445 6333967 3281766 1744368 2080266 2736423 2789271 2946938 3789388 4505445 4341299
40436 4341299 4121279 4871600 5723838 5056827 3442943 3233231 4701959 4823497 1236059
40427 1236059 -4299321 -8104136 -8854372 -7611053 -4776800 124699 5759199 9046457
40419 9046457 8974575 8118469 8960856 10589903 10881591 10418739 11691429 14869145 16908540
$$ packed form
40477A5153927l275170j961831l93479P45356J496921K291741K654992J442587
40469A8155044j246150l523556l819121k545797p75719J574033M675557O814145
40461A9308436N769793K236168m00585m87214l03045k483162n914630p184786
40453A0540975n205614k199634k52364R01455K013646K228993M59920k153410
40445F333967l052201j537398L35898O56157N2848J57667Q42450P16057j64146
40436D341299k20020P50321Q52238o67011j613884k09712J468728J21538l587438
40427A236059n535380l804815p50236J243319K834253M901499N634500L287258
40419I046457p1882q56106Q42387J629047K91688m62852J272690L177716K039395
$$ plain form
40410 16908540 15401552 11389755 7505251 4939882 3467623 3097965 3887869 4712433
40402 4712433 4184937 2981124 3514425 6572634 9687927 9996658 7755010 5688056 5479575
40393 5479575 6443783 7475304 8583821 9909218 10505262 9142321 5872013 2157534
40385 2157534 -361236 -1086479 -869324 -1202469 -2413206 -2859332 -982456 1937911 2698610
40376 2698610 343661 -2299078 -2315182 -317691 1177705 1519972 1915527 2627660 2764342
40367 2764342 2637599 3670305 5412903 5118583 1578883 -2436729 -3175114 -270955 3233985
40358 3233985 4445513 2923129 25067 -2735578 -4733060 -6395592 -8278741 -9776108
40350 -9776108 -9507772 -7512885 -6005570 -6798268 -8711109 -8989391 -6933390 -4494808 -3184724
$$ packed form
40410A6908540j506988m011797l884504k565369j472259l69658P89904Q24564
40402D712433n27496j203813N33301L058209L115293L08731k241648k066954k08481
40393E479575R64208J031521J108517J325397N96044j362941l270308l714479
40385B157534k518770p25243K17155l33145j210737m46126J876876K920367P60699
40376B698610k354949k642739j6104J997491J495396L42267L95555P12133J36682
40367B764342j26743J032706J742598k94320l539700m015612p38385K904159L504940
40358C233985J211528j522384k898062k760645j997482j662532j883149j497367
40350i776108K68336J994887J507315p92698j912841k78282K056001K438582J310084
$$ plain form
40341 -3184724 -2182992 -433873 792462 -844244 -5176813 -8779369 -8496932 -4935832
40333 -4935832 -1598672 -970714 -2524104 -4564196 -6585544 -8805358 -10433441 -10207129
40325 -10207129 -8615102 -7904992 -9270825 -11311049 -11978432 -10791346 -8225491 -4434551
40317 -4434551 -237497 1846908 12529 -3641883 -4873416 -2793510 -1245898 -3536613
40309 -3536613 -7953318 -10359247 -9473508 -7119734 -4429135 -915112 2758716 4242734
40301 4242734 2753333 394608 -993594 -1921863 -2610507 -951549 4044978 8734928
40293 8734928 8468911 3905884 -150148 -2032648 -4858350 -9743989 -12070366 -7711538
40285 -7711538 329484 5518528 6053664 5424215 5878823 5898018 4454998 3537191 4769079
$$ packed form
40341c184724J001732J749119J226335j636706m332569l602556K82437L561100
40333d935832L337160O27958j553390k040092k021348k219814j628083K26312
40325a0207129J592027P10110j365833k040224o67383J187086K565855L790940
40317d434551M197054K084405j834379l654412j231533K079906J547612k290715
40309c536613m416705k405929Q85739K353774K690599L514023L673828J484018
40301D242734j489401k358725j388202r28269o88644J658958M996527M689950
40293H734928k66017m563027m056032j882500k825702m885639k326377M358828
40285g711538Q041022N189044N35136o29449M54608J9195j443020r17807J231888
$$ plain form
40276 4769079 6536944 6416048 4456983 2457394 1606442 2181156 3938658 5412412 4372811
40267 4372811 574413 -3147741 -3955272 -2139734 -42987 776717 -86495 -2826457 -6784339
40258 -6784339 -9923039 -10914737 -10943114 -11543287 -11624354 -9060749 -4696521 -1981839 -2330905
40249 -2330905 -3336403 -2410232 -141011 1052119 29780 -2405414 -4754217 -5733478
40241 -5733478 -4871908 -3015895 -1569149 -901439 -448597 -380717 -1424632 -2537906 -995592
40232 -995592 3672807 7708966 7309864 3572795 762774 369253 -176294 -2718629 -5428489
40223 -5428489 -5970956 -5102683 -5009596 -5810390 -6222585 -6621008 -8456875 -10711725 -10033912
40214 -10033912 -5568838 -1148736 -754400 -3527164 -5489935 -4955642 -3562329 -2481691
$$ packed form
40276D769079J767865j20896j959065j999589q50952N74714J757502J473754j039601
40267D372811l798398l722154q07531J815538K096747Q19704q63212k739962l957882
40258f784339l138700r91698k8377o00173q1067K563605M364228K714682l49066
40249b330905j005498R26171K269221J193130j022339k435194k348803r79261
40241e733478Q61570J856013J446746O67710M52842O7880j043915j113274J542314
40232i95592M668399M036159l99102l737069k810021l93521n45547k542335k709860
40223e428489n42467Q68273R3087q00794m12195l98423j835867k254850O77813
40214a0033912M465074M420102L94336k772764j962771N34293J393313J080638
$$ plain form
40206 -2481691 -606207 2922898 6954444 10192498 12630331 13771971 11667365 5952227
40198 5952227 278144 -1036517 1783721 4603005 4997040 4616475 5544685 7039023 7399559
40189 7399559 7067134 7699810 9094777 9233155 7494238 6082741 7366166 10617574 12450833
40180 12450833 10546746 6309912 3383770 3745072 5823420 6557552 4655316 1355206
40172 1355206 -1526997 -3514847 -5444249 -8014323 -10485475 -10844211 -7728415 -2393121
40164 -2393121 1941393 3221303 2394997 1611363 1560985 1555246 1215441 590461 -692941
40155 -692941 -2659575 -3807635 -2626705 -167698 894716 -151010 -1532533 -2347672
40147 -2347672 -3953983 -7034107 -9704249 -10280627 -10083568 -11460174 -14239858 -16054621
$$ packed form
40206b481691J875484L529105M031546L238054K437833J141640k104606n715138
40198E952227n674083j314661K820238K819284L94035l80565R28210J494338L60536
40189G399559l32425O32676J394967J38378j738917j411497J283425L251408J833259
40180A2450833j904087m236834k926142L61302K078348P34132j902236l300110
40172A355206k882203j987850j929402k570074k471152l58736L115796N335294
40164b393121M334514J279910q26306p83634n0378n739l39805o24980j283402
40155f92941j966634j148060J180930K459007J062414j045726j381523q15139
40147b347672j606311l080124k670142n76378J97059j376606k779684j814763
$$ plain form
40139 -16054621 -15248180 -11749992 -6098224 345725 4926666 5739502 4100986 3099222
40131 3099222 3659284 3853842 2241526 -42716 -1147294 -878871 -379062 -542488 -1496405
40122 -1496405 -2772406 -3356060 -2317181 16998 2085781 2685843 1958583 530571 -1524165
40113 -1524165 -4289351 -7142012 -8977555 -9215595 -8316001 -7405337 -7443881 -8549539 -10070199
40104 -10070199 -11288020 -11739913 -10919650 -8625564 -6047479 -5198989 -6068752 -5640159 -1796027
40095 -1796027 2688374 2870820 -1653200 -5931245 -6466283 -5524719 -6527167 -8286345 -7524801
40086 -7524801 -5196327 -5558006 -8986555 -10511955 -7351248 -3918713 -5981799 -12288925
40078 -12288925 -16019000 -13693994 -8686639 -5471577 -4167232 -2590172 -759888 -393414
$$ packed form
40139a6054621Q06441L498188N651768O443949M580941Q12836j638516j001764
40131C099222N60062J94558j612316k284242j104578K68423M99809j63426r53917
40122a496405j276001n83654J038879K334179K068783O00062p27260j428012k054736
40113a524165k765186k852661j835543k38040Q99594R10664l8544j105658j520660
40104a0070199j217821m51893Q20263K294086K578085Q48490q69763M28593L844132
40095a796027M484401J82446m524020m278045n35038R41564j002448j759178P61544
40086g524801K328474l61679l428549j525400L160707L432535k063086o307126
40078a2288925l730075K325006N007355L215062J304345J577060J830284L66474
$$ plain form
40070 -393414 -1319454 -1414446 27806 1269754 850927 -534244 -1380718 -1004233 647841
40061 647841 3153743 4878640 3818704 395262 -2026297 -895111 2305065 4081106
40053 4081106 3190778 1132561 -833514 -2942797 -5198958 -6438521 -5845857 -4159358
40045 -4159358 -2770598 -2437026 -3096038 -4078472 -4420359 -3901270 -3754828 -5248839 -7580263
40036 -7580263 -8501979 -7230685 -5402422 -4861449 -5882549 -7903592 -10348012 -11965310
40028 -11965310 -11034328 -7555232 -4085732 -2991438 -3614831 -3460806 -1645302 87616
40020 87616 -423938 -3437066 -7014742 -8461874 -6415327 -2084624 1856773 3791814 3944471
40011 3944471 2758019 79554 -3324586 -5158416 -4091213 -1803979 -896909 -1517826
$$ packed form
40070c93414r26040r4992J442252J241948m18827j385171q46474L76485J652074
40061F47841K505902J724897j059936l423442k421559J131186L200176J776041
40053D081106q90328k058217j966075k109283k256161j239563N92664J686499
40045d159358J388760L33572o59012r82434l41887N19089J46442j494011k331424
40036g580263r21716J271294J828263N40973j021100k021043k444420j617298
40028a1965310R30982L479096L469500J094294o23393J54025J815504J732918
40020H7616n11554l013128l577676j447132K046547M330703L941397J935041J52657
40011C944471j186452k678465l404140j833830J067203K287234R07070o20917
$$ plain form
40003 -1517826 -1751948 -741855 497413 1151321 1498220 1385382 -430065 -4434291 -8697470
39994 -8697470 -9948562 -6423480 145527 5254116 5158632 480153 -4280624 -5431200
39986 -5431200 -3339651 -372323 2527428 5300022 6539653 4920330 2281005 2053297
39978 2053297 4396343 5945883 4946837 3409367 2995619 2067252 -1013762 -4321953 -4835531
39969 -4835531 -2717791 -553278 364647 512716 32538 -1275657 -2536338 -2703573 -2288895
39960 -2288895 -2038848 -791635 2662298 6200811 5992691 1618016 -3366823 -6252840
39952 -6252840 -7380842 -6877171 -3006264 4026830 9678526 9574904 4742341 -369973
39944 -369973 -3603339 -5847718 -7257477 -6448435 -3741563 -1910790 -2491418 -3769844 -3795939
$$ packed form
40003a517826k34122J010093J239268O53908L46899j12838j815447m004226m263179
39994h697470j251092L525082O569007N108589r5484m678479m760777j150576
39986e431200K091549K967328K899751K772594J239631j619323k639325k27708
39978B053297K343046J549540r99046j537470m13748r28367l081014l308191n13578
39969d835531K117740K164513R17925J48069m80178j308195j260681j67235M14678
39960b288895K50047J247213L453933L538513k08120m374675m984839k886017
39952f252840j128002N03671L870907P033094N651696j03622m832563n112314
39944c69973l233366k244379j409759Q09042K706872J830773n80628j278426k6095
$$ plain form
39935 -3795939 -3293706 -3856351 -4930352 -4803668 -3793939 -4262131 -7362780 -11359384 -13555229
39926 -13555229 -12871310 -10214277 -7139135 -4550785 -2268420 352309 3230168 5319385
39918 5319385 5939681 5726682 5472465 4746258 2994566 1426308 1820035 3386504 3051924
39909 3051924 -318811 -4089363 -5570984 -5563740 -6244541 -7338001 -7186536 -6583965 -8190182
39900 -8190182 -11969774 -14308756 -12663690 -8599511 -5011673 -2650883 -962285 -171911
39892 -171911 -314988 198690 2419376 4084916 1728644 -4410102 -9973540 -11634563 -10761945
39883 -10761945 -10895315 -12977085 -14634041 -13761343 -11326058 -9945468 -10341621 -10382028 -8037466
39874 -8037466 -4232160 -1516018 -582634 -80620 83975 -2228880 -7840239 -13872044 -16874234
$$ packed form
39935c795939N02233n62645j074001J26684J009729m68192l100649l996604k195845
39926a3555229O83919K657033L075142K588350K282365K620729K877859K089217
39918E319385O20296k12999k54217p26207j751692j568258L93727J566469l34580
39909C051924l370735l770552j481621P244o80801j093460J51465O02571j606217
39900h190182l779592k338982J645066M064179L587838K360790J688598P90374
39892a71911j43077N13678K220686J665540k356272o138746n563438j661023Q72618
39883a0761945j33370k081770j656956Q72698K435285J380590l96153m0407K344562
39874h037466L805306K716142R33384N02014J64595k312855n611359o031805l002190
$$ plain form
39865 -16874234 -16810497 -15858641 -14681324 -12550022 -10254585 -9730443 -10657464 -10213008 -6924151
39856 -6924151 -2643186 -53742 -39838 -1912060 -4275175 -5249029 -3876137 -1794305 -1449652
39847 -1449652 -2362659 -1736537 785052 2285968 1795874 2687295 7235191 11883042 11574862
39838 11574862 6868151 2936207 2589933 4043358 5114175 5756373 5901367 4202186
39830 4202186 305117 -3883242 -6383926 -7033976 -6630772 -5907278 -5843562 -7188527 -9083439
39821 -9083439 -9881377 -9794530 -10720566 -12747638 -13141266 -10262136 -6561014 -5686360 -7768764
39812 -7768764 -9532443 -8487574 -5246140 -1913772 148844 686954 55602 -771358 -341463
39803 -341463 1990115 4586538 4239054 -414140 -6311641 -8466761 -5725025 -2267040
$$ packed form
39865a6874234O3737R51856J177317K131302K295437N24142r27021M44456L288857
39856f924151M280965K589444J3904j872222k363115r73854J372892K081832L44653
39847a449652r13007O26122K521589J500916m90094Q91421M547896M647851l08180
39838A1574862m706711l931944l46274J453425J070817O42198J44994j699181
39830D202186l897069m188359k500684o50050M03204P23494O3716j344965j894912
39821i083439p97938Q6847r26036k027072l93628K879130L701122Q74654k082404
39812g768764j763679J044869L241434L332368K062616N38110o31352q26960M29895
39803c41463K331578K596423l47484m653194n897501k155120K741736L457985
$$ plain form
39795 -2267040 -1976698 -3235306 -1883054 2045367 4163237 2190298 -1162421 -2720400
39787 -2720400 -2833508 -3122149 -3220810 -2118262 -538148 400228 1137559 2033947 1498257
39778 1498257 -1692921 -5565293 -7092032 -6219856 -5259821 -5159577 -5014454 -4575465 -4398440
39769 -4398440 -3825145 -1734663 597831 337756 -2493416 -4052766 -1422225 3501926
39761 3501926 6162611 4230037 -599704 -4811546 -6313762 -5883156 -5639876 -6127612 -5826565
39752 -5826565 -4054455 -2615896 -2980872 -3590648 -2446522 -850123 -1315383 -2845719 -2255640
39743 -2255640 148680 609236 -1872075 -3944260 -3852211 -4269940 -6816364 -8202671 -5359512
39734 -5359512 -795527 1221990 990475 1471731 2286687 575178 -3159843 -4976129 -3420768
$$ packed form
39795b267040K90342j258608J352252L928421K117870j972939l352719j557979
39787b720400j13108k88641r8661J102548J580114R38376P37331Q96388n35690
39778A498257l191178l872372j526739Q72176R60035J00244J45123M38989J77025
39769d398440N73295K090482K332494k60075k831172j559350K630541M924151
39761C501926K660685j932574m829741m211842j502216M30606K43280m87736L01047
39752e826565J772110J438559l64976o09776J144126J596399m65260j530336N90079
39743b255640K404320M60556k481311k072185R2049m17729k546424j386307K843159
39734e359512M563985K017517k31515M81256Q14956j711509l735021j816286J555361
$$ plain form
39725 -3420768 -1363408 -1280309 -2336064 -3065972 -3709378 -4597109 -4865830 -4157700 -3603665
39716 -3603665 -4021257 -4778610 -5143271 -5149583 -4765832 -4024029 -4173996 -6450237 -9240233
39707 -9240233 -9027450 -5172970 -1380978 -988698 -2841433 -3465998 -1599299 1266278 3539185
39698 3539185 4816493 5174539 4734302 3797778 2687842 1774529 1754890 2849063 3506558
39689 3506558 1456666 -3214325 -7436045 -8530764 -7051569 -5418248 -4896808 -4845527 -4002652
39680 -4002652 -1794296 846882 1805361 143885 -1980420 -1645838 634877 1609069 447236
39671 447236 -142086 909305 606395 -2816172 -5705128 -3892507 609066 2064575 -1081856
39662 -1081856 -4827743 -5606009 -3879525 -1728967 -247314 180758 -333443 -770740 -653039
$$ packed form
39725c420768K057360Q3099j055755p29908o43406q87731k68721P08130N54035
39716c603665m17592p57353l64661o312L83751P41803j49967k276241k789996
39707i240233K12783L854480L791992L92280j852735o24565J866699K865577K272907
39698C539185J277308L58046m40237r36524j109936r13313j9639J094173O57495
39689C506558k049892m670991m221720j094719J479195J633321N21440N1281Q42875
39680d002652K208356K641178R58479j661476k124305L34582K280715R74192j161833
39671D47236n89322J051391l02910l422567k888956J812621M501573J455509l146431
39662a081856l745887p78266J726484K150558J481653M28072n14201m37297J17701
$$ plain form
39653 -653039 -1468059 -4270040 -6765842 -5986453 -3215338 -2514777 -4520631 -5807148 -4836932
39644 -4836932 -4212669 -5821586 -7884562 -8559119 -8599665 -8399541 -6215895 -1918757 1026722
39635 1026722 332567 -1475403 -1364158 -711206 -2203100 -4465718 -4176738 -1916002 -1584701
39626 -1584701 -4782656 -9516739 -13773987 -16706010 -16928997 -13615955 -9251483 -7626730
39618 -7626730 -8848649 -9661846 -8752412 -8033648 -8269892 -7393022 -4383949 -1278028 270205
39609 270205 1257664 2453828 2276685 -285167 -3088357 -3444872 -1482139 934562 2746678
39600 2746678 3420261 2196172 -273978 -1367956 226940 2312979 2476900 1860444 2947028
39591 2947028 4956513 4609983 1066018 -2697191 -3546708 -1191430 2322281 4186610
$$ packed form
39653f53039q15020k801981k495802P79389K771115P00561k005854j286517R70216
39644d836932O24263j608917k062976o74557m0546K00124K183646M297138K945479
39635A026722o94155j807970J11245O52952j491894k262618K88980K260736L31301
39626a584701l197955m734083m257248k932023k22987L313042M364472J624753
39618g626730j221919q13197R09434P18764k36244Q76870L009073L105921J548233
39609B70205R87459J196164j77143k561852k803190l56515J962733K416701J812116
39600B746678O73583j224089k470150j093978J594896K086039J63921o16456J086584
39591B947028K009485l46530l543965l763209q49517K355278L513711J864329
$$ plain form
39583 4186610 2316357 -2513221 -6185387 -5170627 -986870 1459231 40894 -2526158
39575 -2526158 -3175195 -2388476 -2485240 -4266973 -6887958 -9328131 -10401651 -8778549 -4877010
39566 -4877010 -1820026 -2565387 -6222321 -8610884 -6606591 -1144845 3959222 5471486
39558 5471486 3184574 -383382 -2571353 -2939288 -2880145 -3224096 -3302344 -2564544 -1727084
39549 -1727084 -1438120 -941630 707770 2890626 4180267 4263162 3726804 2395467 -455325
39540 -455325 -4180393 -6662919 -6656157 -5051489 -3277892 -1537449 617107 2839788 4109842
39531 4109842 3908152 2549094 604274 -1440728 -3241828 -4866791 -6732527 -8660576
39523 -8660576 -9278000 -7286964 -3515818 -830535 -1262648 -3520642 -4122442 -1138596 3779691
$$ packed form
39583D186610j870253m829578l672166J014760M183757K446101j418337k567052
39575b526158o49037P86719r6764j781733k620985k440173j073520J623102L901539
39566d877010L056984p45361l656934k388563K004293N461746N104067J512264
39558E471486k286912l567956k187971l67935N9143l43951p8248P37800Q37460
39549a727084K88964M96490J649400K182856J289641Q2895n36358j331337k850792
39540d55325l725068k482526O762J604668J773597J740443K154556K222681J270054
39531D109842k01690j359058j944820k045002j801100j624963j865736j928049
39523h660576o17424J991036L771146K685283m32113k257994o01800K983846M918287
$$ plain form
39514 3779691 7411384 8378151 7789056 6855505 5173138 1934133 -2112867 -4974994 -5435976
$$ packed form
39514C779691L631693R66767n89095r33551j682367l239005m047000k862127m60982
$$ [...]
##END NTUPLES=NMR SPECTRUM
##END=
