##TITLE=31Pdec_DE-138Mk_TFA
 DMSO-d6_CCl4, 64 sc
 16.7.2026
##JCAMPDX= 6.0         $$ Bruker NMR JCAMP-DX V2.0
##DATA TYPE= NMR SPECTRUM
##DATA CLASS= NTUPLES
##ORIGIN= UXNMR, Bruker Analytische Messtechnik GmbH
##OWNER= root
$$ XWIN-NMR		Version 3.5
$$ Thu Jul 16 13:11:47 2026 Russian Standard Time (UT+4h)  she@DPX200
##.OBSERVE FREQUENCY= 81.013821
##.OBSERVE NUCLEUS= ^31P
##.ACQUISITION MODE= SIMULTANEOUS
##.ACQUISITION SCHEME= undefined
##.AVERAGES= 64
##.DIGITISER RES= 17
##SPECTROMETER/DATA SYSTEM= spect
##.PULSE SEQUENCE= zgpg30
##.SOLVENT NAME= DMSO
##.SHIFT REFERENCE= (INTERNAL, DMSO, 0, 197.392)
##AUDIT TRAIL= $$ (NUMBER, WHEN, WHO, WHERE, WHAT)
$$ ##TITLE= Audit trail, XWIN-NMR		Version 3.5
$$ ##JCAMPDX= 5.01
$$ ##ORIGIN= Bruker BioSpin GmbH
$$ ##OWNER= she
$$ F:/spectra/data/she/nmr/P31/2/pdata/1/auditp.txt
$$ ##AUDIT TRAIL=  $$ (NUMBER, WHEN, WHO, WHERE, WHAT)
(   1,<2026-07-16 13:10:25.90 +0400>,<she>,<DPX200>,
      <created by zg, POWCHK disabled, PULCHK disabled
       configuration hash MD5:
       00 E9 B6 7A A2 85 ED C7 34 08 36 98 17 FE 4E 26
       data hash MD5: 32K
       9A 6F A8 2E 77 B2 DC C1 0A C5 7E D7 09 C6 F0 98>)
(   2,<2026-07-16 13:10:28.23 +0400>,<she>,<DPX200>,
      <Start of raw data processing
       efp BC_mod = 2 LB = 1.5 FT_mod = 6 PKNL = 1 PHC0 = 1861.531 PHC1 = 355.0987 SI = 64K 
       data hash MD5: 64K
       6B 38 29 3A 49 1C 16 D0 86 4D 91 25 99 EC 07 3A>)
(   3,<2026-07-16 13:11:12.14 +0400>,<she>,<DPX200>,
      <pk PHC0 = -113.7466 PHC1 = 336.9998 
       data hash MD5: 64K
       81 5B 5B 1D 9B 33 72 63 1E D3 6B 07 29 2F 07 72>)
$$ ##END=
$$ 
$$ hash MD5
$$ 76 97 61 8F 51 CE EF 7E 70 74 2D 39 A9 61 A1 F4
##$RELAX= 
##$RELAX= 
##$RELAX= 
##$RELAX= 
##$RELAX= 
##$RELAX= 
##$RELAX= 
##$RELAX= 
$$ Bruker specific parameters
$$ --------------------------
##$DU= <F:/spectra>
##$EXPNO= 2
##$NAME= <P31>
##$PROCNO= 1
##$TYPE= <nmr>
##$USER= <she>
##$AMP= (0..31)
100 100 100 100 100 100 100 100 100 100 100 100 100 100 100 100 100 100 
100 100 100 100 100 100 100 100 100 100 100 100 100 100 
##$AQSEQ= 0
##$AQ_mod= 1
##$AUNM= <au_zg>
##$AUTOPOS= <>
##$BF1= 81.014009
##$BF2= 200.13
##$BF3= 200.13
##$BF4= 200.13
##$BF5= 200.13
##$BF6= 200.13
##$BF7= 200.13
##$BF8= 200.13
##$BYTORDA= 1
##$CFDGTYP= 0
##$CFRGTYP= 5
##$CHEMSTR= <none>
##$CNST= (0..31)
1 1 145 1 1 1 1 1 1 1 1 1 1 1 1 1 1 1 1 1 1 1 1 1 1 1 1 1 1 1 1 1 
##$CPDPRG= <waltz16>
##$CPDPRG1= <>
##$CPDPRG2= <waltz16>
##$CPDPRG3= <>
##$CPDPRG4= <mlev>
##$CPDPRG5= <mlev>
##$CPDPRG6= <mlev>
##$CPDPRG7= <mlev>
##$CPDPRG8= <mlev>
##$CPDPRGB= <>
##$CPDPRGT= <>
##$D= (0..31)
0 1 0 0 0 0 0 0 0 0.06 0 0.03 2e-05 3e-06 0 0 0.0002 0 0 0 0 0 0 0 0 0 
0 0 0 0 0 0 
##$DATE= 1784193025
##$DBL= (0..7)
120 120 120 11 120 120 24 19 
##$DBP= (0..7)
150 150 150 150 150 150 150 150 
##$DBP07= 0
##$DBPNAM0= <>
##$DBPNAM1= <>
##$DBPNAM2= <>
##$DBPNAM3= <>
##$DBPNAM4= <>
##$DBPNAM5= <>
##$DBPNAM6= <>
##$DBPNAM7= <>
##$DBPOAL= (0..7)
0.5 0.5 0.5 0.5 0.5 0.5 0.5 0.5 
$$ [...]
##$SUBNAM2= <"">
##$SUBNAM3= <"">
##$SUBNAM4= <"">
##$SUBNAM5= <"">
##$SUBNAM6= <"">
##$SUBNAM7= <"">
##$SUBNAM8= <"">
##$SUBNAM9= <"">
##$SW= 400.765351723535
##$SWIBOX= (0..15)
0 1 3 0 0 0 0 0 0 0 0 0 0 0 0 0 
##$SW_h= 32467.5324675325
##$TD= 32768
##$TD0= 1
##$TE= 0
##$TE2= 300
##$TE3= 300
##$TEG= 300
##$TL= (0..7)
0 120 53 12 22 120 120 120 
##$TP= (0..7)
150 150 150 150 150 150 150 150 
##$TP07= 0
##$TPNAME0= <>
##$TPNAME1= <>
##$TPNAME2= <>
##$TPNAME3= <>
##$TPNAME4= <>
##$TPNAME5= <>
##$TPNAME6= <>
##$TPNAME7= <>
##$TPOAL= (0..7)
0.5 0.5 0.5 0.5 0.5 0.5 0.5 0.5 
##$TPOFFS= (0..7)
0 0 0 0 0 0 0 0 
##$TUNHIN= 0
##$TUNHOUT= 0
##$TUNXOUT= 0
##$USERA1= <user>
##$USERA2= <user>
##$USERA3= <user>
##$USERA4= <user>
##$USERA5= <user>
##$V9= 5
##$VALIST= <valist>
##$VCLIST= <CCCCCCCCCCCCCCC>
##$VD= 0
##$VDLIST= <DDDDDDDDDDDDDDD>
##$VPLIST= <PPPPPPPPPPPPPPP>
##$VTLIST= <TTTTTTTTTTTTTTT>
##$WBST= 1024
##$WBSW= 4
##$XGAIN= (0..3)
0 0 0 0 
##$XL= 0
##$YL= 0
##$YMAX_a= 5264
##$YMIN_a= -6187
##$ZGOPTNS= <>
##$ZL1= 120
##$ZL2= 120
##$ZL3= 120
##$ZL4= 120
##$ABSF1= 0
##$ABSF2= 0
##$ABSG= 0
##$ABSL= 0
##$ALPHA= 0
##$AQORDER= 0
##$ASSFAC= 0
##$ASSFACI= 0
##$ASSFACX= 0
##$ASSWID= 0
##$AUNMP= <proc_1d>
##$AZFE= 0.1
##$AZFW= 0.5
##$BCFW= 0
##$BC_mod= 2
##$BYTORDP= 0
##$COROFFS= 0
##$CY= -3
##$DATMOD= 1
##$DC= 0
##$DFILT= <>
##$DTYPP= 0
##$F1P= 0
##$F2P= 0
##$FCOR= 1
##$FTSIZE= 65536
##$FT_mod= 6
##$GAMMA= 0
##$GB= 0
##$INTBC= 1
##$INTSCL= 9.790993e-09
##$ISEN= 30
##$LB= 1.5
##$LEV0= 0
##$LPBIN= 0
##$MAXI= 10000
##$MC2= 0
##$MEAN= 0
##$ME_mod= 0
##$MI= 50
##$NCOEF= 0
##$NC_proc= -8
##$NLEV= 6
##$NOISF1= 182.463
##$NOISF2= 159.3651
##$NSP= 0
##$NTH_PI= 0
##$NZP= 0
##$OFFSET= 197.3918
##$PC= 4
##$PHC0= 1747.784
##$PHC1= 692.0985
##$PH_mod= 1
##$PKNL= yes
##$PPARMOD= 0
##$PSCAL= 0
##$PSIGN= 0
##$REVERSE= no
##$SF= 81.014063255964
##$SI= 65536
##$SIGF1= 159.3651
##$SIGF2= -187.1042
##$SINO= 113.3802
##$SIOLD= 16384
##$SREGLST= <1H.CDCl3>
##$SSB= 0
##$STSI= 65536
##$STSR= 0
##$SW_p= 32467.5324675325
##$SYMM= 0
##$S_DEV= 0
##$TDeff= 32768
##$TDoff= 0
##$TI= <>
##$TILT= no
##$TM1= 0
##$TM2= 0
##$TOPLEV= 0
##$USERP1= <user>
##$USERP2= <user>
##$USERP3= <user>
##$USERP4= <user>
##$USERP5= <user>
##$WDW= 1
##$XDIM= 65536
##$YMAX_p= 178217050
##$YMIN_p= -222760468
$$ End of Bruker specific parameters
$$ ---------------------------------
##NTUPLES= NMR SPECTRUM
##VAR_NAME=  FREQUENCY,     SPECTRUM/REAL,   SPECTRUM/IMAG
##SYMBOL=    X,             R,               I
##VAR_TYPE=  INDEPENDENT,   DEPENDENT,       DEPENDENT
##VAR_FORM=  AFFN,          ASDF,            ASDF
##VAR_DIM=   65536,         65536,           65536
##UNITS=     HZ,            ARBITRARY UNITS, ARBITRARY UNITS
##FACTOR=    0.49542278885378, 1,            1
##FIRST=     15991.5117654749, 0,            0
##LAST=      -16476.0207020576, 0,           0
##MIN=       -16476.0207020576, -222760468,  0
##MAX=       15991.5117654749, 178217050,    0
$$ Real data points
##PAGE= N=1
##DATA TABLE= (X++(R..R)), XYDATA
$$ [...]
##PAGE= N=2
##DATA TABLE= (X++(I..I)), XYDATA
$$ plain form
7480 -9633698 -9661302 -8173680 -4553882 -965582 569005 898404 1720492 2599275 2285579
7471 2285579 1543304 1893131 2405580 701971 -3082047 -6219915 -7462634 -8263541 -9247912
7462 -9247912 -8485260 -4942112 -1202123 -434691 -2188480 -3516857 -3269279 -2850175 -3178213
7453 -3178213 -3407900 -3015937 -2968583 -3848351 -4462380 -3648929 -2433046 -2860750 -5009529
7444 -5009529 -6535699 -5487823 -2659460 -614139 -860751 -2558103 -3807209 -3599728 -2325780
7435 -2325780 -893008 52186 70107 -1294054 -4236698 -8297306 -12449953 -15554429 -16753621
7426 -16753621 -15859787 -13693876 -11726834 -10858091 -10624024 -10005198 -8791192 -7527049 -6302752
7417 -6302752 -4612074 -2699766 -1989212 -3279899 -5077762 -4724236 -1137147 4169973 8557146
$$ packed form
7480i633698k7604J487622L619798L588300J534587L29399Q22088Q78783l13696
7471B285579p42275L49827N12449j703609l784018l137868j242719q00907r84371
7462i247912P62652L543148L739989P67432j753789j328377K47578M19104l28038
7453c178213k29687L91963M7354q79768o14029Q13451J215883m27704k148779
7444e009529j526170J047876K828363K045321k46612j697352j249106K07481J273948
7435b325780J432772R45194J7921j364161k942644m060608m152647l104476j199192
7426a6753621Q93834K165911J967042Q68743K34067O18826J214006J264143J224297
7417f302752J690678J912308P10554j290687j797863L53526L587089N307120M387173
$$ plain form
7408 8557146 10056936 8091893 3650683 -908104 -3197481 -2683692 -950296 128030
7400 128030 -21794 -1027191 -2567647 -4216765 -4852492 -3350154 -75058 2946379 3718971
7391 3718971 1987707 -854875 -3387970 -5411737 -7387731 -8826459 -8016944 -4031394
7383 -4031394 1466901 5470620 6622621 5865632 4134478 1105341 -2979172 -5996120
7375 -5996120 -6233913 -5051407 -5265195 -7229442 -8506356 -7533413 -5603657 -4533930 -4151926
7366 -4151926 -3231540 -1530290 510513 3079317 6335376 8888102 8675699 5642328 2254077
7357 2254077 790616 1002657 1035253 -122434 -2012613 -4054945 -6230970 -8072376 -8067350
7348 -8067350 -5252142 -1154535 1127506 310330 -1516854 -1548447 188697 1138064 -162718
$$ packed form
7408H557146J499790j965043m441210m558787k289377N13789J733396J078326
7400A28030j49824j005397j540456j649118o35727J502338L275096L021437P72592
7391C718971j731264k842582k533095k023767j975994j438728Q09515L985550
7383d031394N498295M003719J152001p56989j731154l029137m084513l016948
7375e996120k37793J182506k13788j964247j276914R72943J929756J069727L82004
7366d151926R20386J701250K040803K568804L256059K552726k12403l033371l388251
7357B254077j463461K12041L2596j157687j890179k042332k176025j841406N026
7348h067350K815208M097607K282041q17176j827184l1593J737144R49367j300782
$$ plain form
7339 -162718 -2227467 -2949899 -2610015 -3321423 -5786539 -7834775 -6744662 -2479900 2115025
7330 2115025 4369294 4392192 4194049 4745174 4941208 3609234 1460694 343531 1228206
7321 1228206 3637889 6395691 8053153 7270615 4073593 499233 -1179529 -761806 302038
7312 302038 1088135 1424388 413395 -2919605 -7012767 -8178382 -5079370 -1087843 -425385
7303 -425385 -3141640 -5788676 -6199934 -5366870 -4691993 -3645543 -1102810 2394110 5042024
7294 5042024 6026778 6289373 6848779 7137172 5825553 3194351 1555977 2559673 4953231
7285 4953231 6299747 6259479 6311153 6457648 4746665 929074 -1815507 -607519 3343427
7276 3343427 6656915 8203230 9396512 10935797 11726323 10979598 9268670 7133010 4246094
$$ packed form
7339a62718k064749p22432L39884p11408k465116k048236J090113M264762M594925
7330B115025K254269K2898j98143N51125J96034j331974k148540j117163Q84675
7321A228206K409683K757802J657462p82538l197022l574360j678762M17723J063844
7312C02038P86097L36253j010993l333000m093162j165615L099012L991527O62458
7303d25385k716255k647036m11258Q33064O74877J046450K542733L496920K647914
7294E042024R84754K62595N59406K88393j311619k631202j638374J003696K393558
7285D953231J346516m0268N1674J46495j710983l817591k744581J207988L950946
7276C343427L313488J546315J193282J539285P90526p46725j710928k135660k886916
$$ plain form
7267 4246094 435145 -3572721 -6656030 -7782074 -6292349 -2751162 833238 2751522
7259 2751522 3236605 3505095 4056262 5144339 7639458 11444431 14221536 14191797 13224180
7250 13224180 14147500 15786076 14425021 10048458 6737135 6043228 4673295 767256
7242 767256 -2202534 -1186359 826869 -530418 -3710060 -3933434 -1483085 -1478958 -5351795
7233 -5351795 -8099222 -5643870 -384895 3025515 3890572 4478940 5377125 5234080 4015265
7224 4015265 3479883 4468324 5845314 6336069 5785402 4258995 1326070 -2855907 -6391437
7215 -6391437 -6693502 -3185982 1355635 3000362 659156 -2672134 -3278409 -698995 2567837
7206 2567837 4536396 5282218 5398735 5034383 4851573 5794137 6878788 5272409 334867
$$ packed form
7267D246094l810949m007866l083309j126044J489725L541187L584400J918284
7259B751522M85083K68490N51167J088077K495119L804973K777105k9739r67617
7250A3224180R23320J638576j361055m376563l311323o93907j369933l906039
7242G67256k969790J016175K013228j357287l179642k23374K450349M127l872837
7233e351795k747427K455352N258975L410410Q65057N88368Q98185j43045j218815
7224D015265n35382R88441J376990M90755n50667j526407k932925m181977l535530
7215f391437l02065L507520M541617J644727k341206l331290o06275K579414L266832
7206B567837J968559P45822J16517l64352j82810R42564J084651j606379m937542
$$ plain form
7197 334867 -4006799 -3332831 1474728 4958995 3734101 146141 -1493771 -348913 871851
7188 871851 142248 -1548071 -2047736 -643651 1771099 4030965 5307275 5043131 3374951
7179 3374951 1496182 672977 832313 919440 579668 332534 -20302 -1489025 -3602752
7170 -3602752 -3834967 -1022587 2068484 1985853 -372780 -762938 2351372 5642612 5602967
7161 5602967 2651941 -823788 -3996793 -7062073 -9123877 -9140488 -7870178 -6651300 -5194795
7152 -5194795 -2763826 -534025 -200372 -916211 -450605 921061 781429 -1003604 -1603769
7143 -1603769 25867 983209 -1158752 -4547412 -6004002 -5468885 -4737470 -3614190 -674044
7134 -674044 3041144 4529116 3160843 1683080 2465540 5176651 8568920 11941697 14015033
$$ packed form
7197C34867m341666O73968M807559L484267j224894l587960j639912J144858J220764
7188H71851p29603j690319m99665J404085K414750K259866J276310k64144j668180
7179C374951j878769q23205J59336Q7127l39772k47134l52836j468723k113727
7170c602752k32215K812380L091071q2631k358633l90158L114310L291240l9645
7161E602967k951026l475729l173005l065280k061804j6611J270310J218878J456505
7152e194795K430969K229801L33653p15839M65606J371666j39632j785033o00165
7143a603769J629636R57342k141961l388660j456590N35117P31415J123280K940146
7134f74044L715188J487972j368273j477763P82460K711111L392269L372777K073336
$$ plain form
7125 14015033 13034932 9519342 6698075 6478280 6906501 5528617 3245428 2253474 1894628
7116 1894628 -4775 -2518343 -2301022 767330 2528891 538517 -2535659 -3827634
7108 -3827634 -5158755 -9301704 -13812859 -13490714 -8339692 -4032123 -3539607 -3185976 519883
7099 519883 4439380 3315117 -2014967 -5828319 -5947558 -6001357 -8718634 -11567643 -11131120
7090 -11131120 -8320652 -6372483 -5872564 -4737958 -1953877 1334118 3919171 5554927
7082 5554927 6192105 5980035 5718697 5805019 5324850 3770448 2697763 3459095 4095203
7073 4095203 1399497 -3999979 -7741395 -7575959 -6109702 -6461396 -8049081 -8599923 -7855532
7064 -7855532 -6783672 -4944964 -1413407 2786912 5765150 7508480 9024778 9396878
$$ packed form
7125A4015033r80101l515590k821267k19795M28221j377884k283189r91954l58846
7116A894628j899403k513568K17321L068352J761561j990374l074176j291975
7108c827634j331121m142949m511155L22145N151022M307569M92516L53631L705859
7099E19883L919497j124263n330084l813352j19239n3799k717277k849009M36523
7090a1131120K810468J948169M99919J134606K784081L287995K585053J635756
7082E554927O37178k12070k61338Q6322m80169j554402j072685P61332O36108
7073D095203k695706n399476l741416J65436J466257l51694j587685n50842P44391
7064g855532J071860J838708L531557M200319K978238J743330J516298L72100
$$ plain form
7056 9396878 6621056 1552580 -1737789 -562324 3239601 5657781 4681275 1510686
7048 1510686 -1087914 -968533 1792770 4840996 5757974 4543337 3273454 3614444 5660132
7039 5660132 8623135 11073480 10982863 7662527 3564825 1787128 1591035 -830159 -6353015
7030 -6353015 -10771236 -10446163 -7420322 -6246574 -7569116 -7899419 -4953384 -362268 2900639
7021 2900639 3494062 1753757 -1454282 -5188235 -8514052 -10462075 -9876826 -6147461 -611990
7012 -611990 3903830 5832003 6027607 5480427 3724555 921380 -628676 602971 2719257
7003 2719257 3397115 3857477 6352874 8951879 7197020 908995 -5017825 -7379742 -8005103
6994 -8005103 -8964963 -8799707 -6124627 -3324550 -3175087 -4331781 -3815398 -2212923 -2597008
$$ packed form
7056I396878k775822n068476l290369J175465L801925K418180r76506l170589
7048A510686k598600J19381K761303L048226R16978j214637j269883L40990K045688
7039E660132K963003K450345r0617l320336m097702j777697j96093k421194n522856
7030f353015m418221L25073L025841J173748j322542l30303K946035M591116L262907
7021B900639N93423j740305l208039l733953l325817j948023N85249L729365N535471
7012f11990M515820J928173J95604n47180j755872k803175j550056J231647K116286
7003B719257O77858M60362K495397K599005j754859o288025n926820k361917o25361
6994h005103r59860J65256K675080K800077J49463j156694N16383J602475l84085
$$ plain form
6985 -2597008 -5109571 -6320921 -4175826 -604919 1454319 1386605 456326 -282391 -779692
6976 -779692 -1707113 -3911812 -7491416 -11236684 -13525465 -13727335 -12401280 -10555547 -9052913
6967 -9052913 -7944927 -5957587 -1817493 3223709 5745006 4293288 1639825 1233815
6959 1233815 2854724 3889961 3613502 3468665 3743809 2838443 -40482 -3778323 -7047066
6950 -7047066 -8978400 -8324730 -4514794 246579 2533521 1841464 688803 213539 -1233527
6941 -1233527 -4011903 -5016101 -1838298 3364117 6763038 7808537 8554186 9373465 8462273
6932 8462273 5389200 2434447 1743252 2852579 3750581 3386494 2568653 2783280 4333488
6923 4333488 5735519 5417765 3825536 2680503 2123470 423630 -2790247 -5148038 -4911578
$$ packed form
6985b597008k512563j211350K145095L570907K059238o7714r30279p38717m97301
6976g79692r27421k204699l579604l745268k288781k01870J326055J845733J502634
6967i052913J107986J987340M140094N041202K521297j451718k653463m06010
6959A233815J620909J035237k76459j44837K75144r05366k878925l737841l268743
6950g047066j931334O53670L809936M761373K286942o92057j152661m75264j447066
6941a233527k778376j004198L177803N202415L398921J045499P45649Q19279r11192
6932H462273l073073k954753o91195J109327Q98002l64087q17841K14627J550208
6923D333488J402031l17754j592229j145033n57033j699840l213877k357791K36460
$$ plain form
6914 -4911578 -3810294 -4365893 -5885863 -5681633 -3320430 -928130 318738 1282611 2434220
6905 2434220 2936125 2576812 2336513 2495590 2264669 1767544 2201343 3415464 3654588
6896 3654588 2617654 2391178 4019088 5425991 4483498 2087901 138877 -1652574 -4369187
6887 -4369187 -6735252 -6422304 -4000385 -2621788 -3540729 -4586497 -3806685 -2271730 -1972021
6878 -1972021 -2722693 -2867802 -2120491 -1998672 -3485681 -5429580 -5746972 -3829765 -1268465
6869 -1268465 28200 109768 642898 2274969 3571746 3292610 2329577 1866473 818118
6860 818118 -2526585 -6791153 -8246588 -5722764 -2155974 -268000 673114 2190353 3262834
6851 3262834 2171124 -139730 -1433763 -1816087 -3038865 -4821342 -4995959 -3315548 -2029970
$$ packed form
6914d911578J101284n55599j519970K04230K361203K392300J246868R63873J151609
6905B434220N01905l59313k40299J59077k30921m97125M33799J214121K39124
6896C654588j036934k26476J627910J406903r42493k395597j949024j791451k716613
6887d369187k366065L12948K421919J378597r18941j045768P79812J534955K99709
6878a972021p50672j45109P47311J21819j487009j943899l17392J917207K561300
6869a268465J296665Q1568N33130J632071J296777k79136r63033m63104j048355
6860H18118l344703m264568j455435K523824L566790J887974R41114J517239J072481
6851C262834j091710k310854j294033l82324j222778j782477j74617J680411J285578
$$ plain form
6842 -2029970 -2132632 -1964521 -523865 636552 236196 -598809 -834477 -1740174 -4240365
6833 -4240365 -6091125 -4666645 -1361010 -93940 -1802718 -3351419 -2218777 281659
6825 281659 1286957 -19765 -2070564 -2912908 -1830646 126639 875877 -610795 -2900766
6816 -2900766 -3662371 -2355016 -211199 1926561 3945728 4873339 3218078 -550672 -3810820
6807 -3810820 -4848407 -4476851 -4003919 -3461306 -2756121 -2699633 -3595169 -4319015 -4094566 -3875378
6797 -3875378 -4796926 -6451534 -7548489 -6804239 -2601431 5763579 15051892 19062815 15260390
6788 15260390 8388830 4672594 4374206 3567835 1553148 1756352 5341572 8642132 8453245
6779 8453245 6313619 5570795 6828131 8227877 8205838 6241086 2663075 -662425 -1117839
$$ packed form
6842b029970j02662J68111J440656J160417m00356q35005k35668r05697k500191
6833d240365j850760J424480L305635J267070j708778j548701J132642K500436
6825B81659J005298j306722k050799q42344J082262J957285P49238j486672k289971
6816b900766p61605J307355K143817K137760K019167R27611j655261l768750l260148
6807c810820j037587L71556M72932N42613P05185N6488q95536p23846K24449K19188
6797c875378r21548j654608j096955P44250M202808Q365010R288313M010923l802425
6788A5260390o871560l716236k98388q06371k014687K03204L585220L300560j88887
6779H453245k139626p42824J257336J399746k2039j964752l578011l325500m55414
$$ plain form
6770 -1117839 1543621 4325923 4842873 4591848 6547082 10675803 13917881 14056819 11828218
6761 11828218 9424508 8297257 8289010 7944543 5982366 3144575 1791193 2745843 3645188
6752 3645188 1943670 -1277204 -2465813 -368513 2361507 2827812 1473861 843724 1732694
6743 1732694 2155018 383374 -2182591 -2453666 116641 2212899 584265 -3785990 -7082792
6734 -7082792 -7568758 -6856721 -6280289 -4705439 -1151587 2694537 4557481 4777846 5488478
6725 5488478 7402373 9088791 8893134 6275900 1917062 -2304963 -4219330 -3437774 -1710368
6716 -1710368 -275043 1735456 4914771 7411853 7266833 5384217 3649999 1530231
6708 1530231 -2258689 -5733032 -5245658 -1113431 2361013 3335328 4917679 9395639 13649209
$$ packed form
6770a117839K661460K782302N16950k51025J955234M128721L242078J38938k228601
6761A1828218k403710j127251q247l44467j962177k837791j353382R54650Q99345
6752C645188j701518l220874j188609K097300K730020M66305j353951o30137Q88970
6743A732694M22324j771644k565965k71075K570307K096258j628634m370255l296802
6734g082792m85966P12037N76432J574850L553852L846124J862944K20365P10632
6725E488478J913895J686418j95657k617234m358838m222025j914367P81556J727406
6716a710368J435325K010499L179315K497082j45020j882616j734218k119768
6708A530231l788920l474343M87374M132227L474444R74315J582351M477960M253570
$$ plain form
6699 13649209 13353320 9287913 5999146 5355314 4706224 1331556 -3968187 -8308166 -9870686
6690 -9870686 -8773485 -5972410 -2359532 1215963 3625976 3679931 1094881 -2808052 -5867547
6681 -5867547 -6631189 -4963656 -1723644 1336336 2122759 364365 -971094 1527932 7036289
6672 7036289 10565407 8621731 3086762 -1554221 -3069371 -2192330 -269687 1666214
6664 1666214 2439558 1528224 134369 -164161 263795 -438700 -2746286 -4603088 -3665589
6655 -3665589 -156403 2956145 2864444 252168 -831552 2442902 7526452 8709134 3763213
6646 3763213 -3690590 -9141969 -12030558 -14078791 -15311132 -14488602 -12042818 -9671357
6638 -9671357 -7675708 -5233946 -2782706 -1604186 -1411250 -921330 -648223 -2365054 -5550868
$$ packed form
6699A3649209k95889m065407l288767o43832o49090l374668n299743m339979j562520
6690i870686J097201K801075L612878L575495K410013N3955k585050l902933l059495
6681e867547p63642J667533L240012L059980P86423j758394j335459K499026N508357
6672G036289L529118j943676n534969m640983j515150Q77041J922643J935901
6664A666214P73344r11334j393855k98530M27956p02495k307586j856802R37499
6655c665589L509186L112548r1701k612276j083720L274454N083550J182682m945921
6646C763213p453803n451379k888589k048233j232341Q22530K445784K371461
6638i671357J995649K441762K451240J178520J92936M89920K73107j716831l185814
$$ plain form
6629 -5550868 -7163599 -5804911 -3772849 -3895934 -6198038 -8676565 -9689598 -8623313
6621 -8623313 -5752390 -2429263 -213011 779289 1447738 1625690 405025 -1213886 -611799
6612 -611799 2477543 4839249 4132773 1887209 204066 -1934654 -6159738 -10553344 -11684511
6603 -11684511 -9872464 -8617504 -8821409 -7422773 -2861611 1535967 1787050 -1460272
6595 -1460272 -4289322 -4696829 -3928391 -3402760 -2901740 -2084414 -1697633 -2330712 -3241292
6586 -3241292 -3374701 -2721376 -1848969 -889864 -9157 -189653 -2139056 -4641438 -5566197
6577 -5566197 -4790274 -4555962 -6221316 -8193928 -8299433 -6815474 -5426005 -4276752 -2415347
6568 -2415347 -686139 -1407536 -4610468 -7155092 -6897147 -5602834 -5883402 -6912961 -5646850
$$ packed form
6629e550868j612731J358688K032062j23085k302104k478527j013033J066285
6621h623313K870923L323127K216252R92300O68449J77952j220665j618911O02087
6612f11799L089342K361706p06476k245564j683143k138720m225084m393606j131167
6603a1684511J812047J254960k03905J398636M561162M397578K51083l247322
6595a460272k829050m07507P68438N25631N01020Q17326L86781o33079r10580
6586c241292j33409O53325Q72407R59105Q80707j80496j949403k502382r24759
6577e566197P75923K34312j665354j972612j05505J483959J389469J149253J861405
6568b415347J729208p21397l202932k544624K57945J294313k80568j029559J266111
$$ plain form
6559 -5646850 -1554698 2424582 3921055 4021135 5152613 7472195 8717482 7219172
6551 7219172 3892679 981422 -433164 -971555 -1303282 -1143346 -577536 -1341135 -5141546
6542 -5141546 -10880458 -15327845 -16993800 -17562551 -18607467 -18838226 -16480234 -13015556 -11956531
6533 -11956531 -14036292 -15923496 -14324992 -9637632 -4700074 -1389787 272998 546981
6525 546981 -867513 -3820120 -6751232 -7478509 -5162332 -1437880 700961 -459769 -3678992
6516 -3678992 -5800833 -4541309 -424176 3684353 4905555 2730836 -505883 -1758380
6508 -1758380 -146684 2470138 3790465 3344559 2271101 1647480 1711936 2179409 2522407
6499 2522407 2182540 1088151 -281180 -1704415 -3520450 -5607944 -6869927 -6684223 -6232956
$$ packed form
6559e646850M092152L979280J496473J00080J131478K319582J245287j498310
6551G219172l326493k911257j414586n38391l31727J59936N65810p63599l800411
6542e141546n738912m447387j665955n68751j044916k30759K357992L464678J059025
6533a1956531k079761j887204J598504M687360M937558L310287J662785K73983
6525E46981j414494k952607k931112p27277K316177L724452K138841j160730l219223
6516c678992k121841J259524M117133M108529J221202k174719l236719j252497
6508a758380J611696K616822J320327m45906j073458o23621O4456M67473L42998
6499B522407l39867j094389j369331j423235j816035k087494j261983J85704M51267
$$ plain form
6490 -6232956 -7181047 -9345059 -10879569 -10675444 -9456698 -8539034 -8612313 -9746214 -11343789
6481 -11343789 -11845578 -9788269 -5865812 -3039751 -3770091 -7534057 -11567105 -13609987
6473 -13609987 -13422040 -11963999 -9818876 -6715617 -2505753 1747837 4214099 4020841
6465 4020841 2019963 -483859 -3046712 -5493229 -6869084 -6287328 -4551302 -3614587 -4242049
6456 -4242049 -5191034 -4921092 -3291770 -1352870 -77732 607191 1929444 5004213 8827920
6447 8827920 10334110 7729217 3135475 270261 27757 496805 1043622 3344453 7445302
6438 7445302 9838925 7766987 3473552 1475272 2652780 3867481 3233419 2896529 5493943
6429 5493943 9822125 11881529 9753792 5930051 4261844 5373792 6218336 4356607
$$ packed form
6490f232956r48091k164012j534510K04125J218746R17664p3279j133901j597575
6481a1343789n01789K057309L922457K826061p30340l763966m033048k042882
6473a3609987J87947J458041K145123L103259M209864M253590K466262j93258
6465D020841k000878k503822k562853k446517j375855N81756J736026R36715o27462
6456d242049r48985K69942J629322J938900J275138O84923J322253L074769L823707
6447H827920J506190k604893m593742k865214k42504M69048N46817K300831M100849
6438G445302K393623k071938m293435j998280J177508J214701o34062l36890K597414
6429E493943M328182K059404k127737l823741j668207J111948Q44544j861729
$$ plain form
6421 4356607 1392549 841990 3308789 5789273 5913280 4658599 3878580 3285416 1744341
6412 1744341 -61195 -710132 -951155 -2904564 -6422620 -8753924 -8445783 -7408363 -7960116
6403 -7960116 -9485524 -9500073 -7049670 -3652460 -1354230 -962260 -1874763 -2666115 -2033653
6394 -2033653 -82419 1399682 831106 -955888 -1409689 376438 1938893 178278 -4500346
6385 -4500346 -8127137 -7715695 -4715190 -2815372 -3106884 -3225894 -1411339 616483 110164
6376 110164 -2731673 -5086598 -5244078 -4075520 -2736109 -953137 1519637 3444820 3625167
6367 3625167 2871674 2796873 3293417 3145185 2907651 4692006 8198117 9370303 5186618
6358 5186618 -1594662 -5098321 -3282654 432941 2568229 3551612 5088282 6454734
$$ packed form
6421D356607k964058n50559K466799K480484J24007j254681p80019n93164j541075
6412A744341j805536o48937k41023j953409l518056k331304L08141J037420n51753
6403g960116j525408j4549K450403L397210K298230L91970r12503p91352O32462
6394b033653J951234J482101n68576j786994m53801J786127J562455j760615m678624
6385d500346l626791M11442L000505J899818k91512j19010J814555K027822n06319
6376A10164k841837k354925j57480J168558J339411J782972K472774J925183J80347
6367C625167p53493p4801M96544j48232k37534J784355L506111J172186m183685
6358E186618o781280l503659J815667L715595K135288R83383J536670J366452
$$ plain form
6350 6454734 5865048 3707303 1682121 -235464 -3227327 -6582929 -8028565 -7120886 -5690218
6341 -5690218 -4592772 -2636818 516211 2849272 2614251 603473 -1228922 -1741214 -551859
6332 -551859 1833537 2965136 59440 -5793672 -9421645 -7505204 -2558611 1070802
6324 1070802 2714918 4023545 4386306 1805082 -2516736 -4517318 -2538178 926999
6316 926999 3064810 3284408 1560380 -2328523 -6643892 -7904343 -5307093 -2591263 -3190271
6307 -3190271 -5292300 -4367110 313859 4459915 4322710 1298310 -148797 2027643 5520177
6298 5520177 7071149 6329719 5320962 5016048 4382672 3031666 2586471 4011086 5276127
6289 5276127 3733057 -213194 -3935325 -6337990 -8414434 -10403909 -10961745 -9495543
$$ packed form
6350F454734n89686k157745k025182j917585k991863l355602j445636R07679J430668
6341e690218J097446J955954L153029K333061k35021k010778j832395n12292J189355
6332e51859K385396J131599k905696n853112l627973J916441M946593L629413
6324A070802J644116J308627L62761k581224m321818k000582J979140L465177
6316I26999K137811K19598j724028l888903m315369j260451K597250K715830n99008
6307c190271k102029R25190M680969M146056j37205l024400j447107K176440L492534
6298E520177J550972p41430j008757l04914o33376j351006m45195J424615J265041
6289E276127j543070l946251l722131k402665k076444j989475n57836J466202
$$ plain form
6281 -9495543 -7153019 -5004235 -3173904 -2198284 -3172800 -5729752 -7571796 -6919311 -4260527
6272 -4260527 -1343047 253599 -449392 -3046353 -5229519 -4839376 -2476518 -209434 1833700
6263 1833700 4758524 7031838 5164507 -764279 -6068540 -7675870 -7791442 -9167405
6255 -9167405 -10470525 -9588882 -8263332 -9237167 -10971521 -9619320 -5112124 -1134036 399802
6246 399802 921556 1414676 854137 -1001260 -2470469 -2466553 -1677222 -672853 847831
6237 847831 2473671 3013648 2538295 2481231 3368115 4384551 5269215 6422244 7041959
6228 7041959 5655317 2883381 1144767 1005673 355648 -1991902 -4461263 -5595604 -6274744
6219 -6274744 -7494885 -8040719 -6227500 -2603472 573348 1576329 117365 -2712815
$$ packed form
6281i495543K342524K148784J830331R75620r74516k556952j842044O52485K658784
6272d260527K917480J596646p02991k596961k183166L90143K362858K267084K043134
6263A833700K924824K273314j867331n928786n304261j607330j15572j375963
6255i167405j303120Q81643J325550r73835j734354J352201M507196L978088J533838
6246C99802N21754M93120n60539j855397j469209L916P89331J004369J520684
6237H47831J625840N39977m75353n7064Q86884J016436Q84664J153029O19715
6228G041959j386642k771936j738614j39094o50025k347550k469361j134341o79140
6219f274744j220141n45834J813219L624028L176820J002981j458964k830180
$$ plain form
6211 -2712815 -4834661 -5053710 -4938122 -6870471 -9955262 -10628638 -8114103 -5891233 -6071477
6202 -6071477 -6005471 -3364690 -1059198 -2720220 -5712587 -4016211 2605972 7629354 6721748
6193 6721748 2967616 1395631 2341762 2904915 1938547 456401 -953607 -2026166 -1415173
6184 -1415173 1509897 4097779 2789865 -1737544 -4712236 -3472020 -948115 -1266106
6176 -1266106 -3932821 -4937849 -2696413 -53800 22218 -1590040 -1745643 931329 5085945
6167 5085945 8828703 11327640 12461048 12228648 10792433 8504651 5881840 3713429
6159 3713429 2441037 945692 -2736051 -8209739 -11614442 -9923267 -5501213 -3582333
6151 -3582333 -5395053 -7017984 -5698442 -3711484 -3920717 -4617115 -2026860 3784864 8885016
$$ packed form
6211b712815k121846k19049J15588j932349l084791o73376K514535K222870j80244
6202f071477O6006K640781K305492j661022k992367J696376O622183N023382r07606
6193F721748l754132j571985R46131N63153r66368j482146j410008j072559O10993
6184a415173K925070K587882j307914m527409k974692J240216K523905l17991
6176a266106k666715j005028K241436K642613P6018j612258j55603K676972M154616
6167E085945L742758K498937J133408k32400j436215k287782k622811k168411
6159C713429j272392j495345l681743n473688l404703J691175M422054J918880
6151c582333j812720j622931J319542J986958k09233o96398K590255N811724N100152
$$ plain form
6142 8885016 10611782 9670547 7325908 3614423 -902246 -4078915 -4263319 -2150607 338990
6133 338990 2122367 3358106 4622431 6110842 7166440 6731642 4918476 3533327 3816212
6124 3816212 4239479 2279199 -1921857 -5698586 -7698967 -9216934 -11067162 -11604981 -9364000
6115 -9364000 -5707241 -2877557 -726513 2462197 6567548 9184694 8616980 5657701
6107 5657701 2099759 -1164578 -3953752 -5642659 -5134770 -2075431 2156750 5042193
6099 5042193 5032190 3138809 1840738 2275702 3248153 3154340 1776369 -283231 -2557401
6090 -2557401 -4121791 -3466514 -573052 1954339 1825337 422366 914824 3345887 4369342
6081 4369342 2355607 -149428 -489475 230902 -309936 -1262984 48554 3256173 4818774
$$ packed form
6142H885016J726766r41235k344639l711485m516669l176669j84404K112712K489597
6133C38990J783377J235739J264325J488411J055598m34798j813166j385149K82885
6124C816212M23267j960280m201056l776729k000381j517967j850228n37819K240981
6115i364000L656759K829684K151044L188710M105351K617146n67714k959279
6107E657701l557942l264337k789174j688907N07889L059339M232181K885443
6099E042193j0003j893381j298071M34964R72451r3813j377971k059600k274170
6090b557401j564390O55277K893462K527391j29002j402971M92458K431063J023455
6081D369342k013735k505035l40047P20377n40838r53048J311538L207619J562601
$$ plain form
6072 4818774 3123970 681158 10659 -113904 -2350481 -6410226 -9255283 -8870499 -5843738
6063 -5843738 -1734006 1984058 3455823 1372111 -2682688 -4651395 -2293927 1916867
6055 1916867 3547541 1170783 -2797289 -5710257 -7333691 -8540576 -9042390 -7800405
6047 -7800405 -5173163 -3256224 -3581605 -5132128 -5390814 -3301677 -460979 1013265 1112505
6038 1112505 1463084 2481014 2479019 316979 -2270196 -2402192 388533 3826097 6059158
6029 6059158 7516799 9024358 9625806 7735203 3816957 436581 -466389 624886 1894268
6020 1894268 2171946 1409348 -76217 -1993404 -3717084 -4070780 -1990328 2182874 6050068
6011 6050068 6540086 2824538 -2344596 -5204616 -4959866 -4082286 -4475397 -5097301 -4527801
$$ packed form
6072D818774j694804k442812o70499j24563k236577m059745k845057L84784L026761
6063e843738M109732L718064J471765k083712m054799j968707K357468M210794
6055A916867J630674k376758l968072k912968j623434j206885n01814J241985
6047g800405K627242J916939l25381j550523k58686K089137K840698J474244R9240
6038A112505L50579J017930j995k162040k587175j31996K790725L437564K233061
6029F059158J457641J507559O01448j890603l918246l380376r02970J091275J269382
6020A894268K77678p62598j485565j917187j723680l53696K080452M173202L867194
6011F050068M90018l715548n169134k860020K44750Q77580l93111o21904N69500
$$ plain form
6002 -4527801 -4032955 -5560145 -7586103 -6302818 -1548026 1702037 -292393 -4716959
5994 -4716959 -6066142 -3643178 -1789733 -3191922 -5558762 -5690678 -3797133 -2226084
5986 -2226084 -2063285 -2626473 -2764781 -1284301 2368001 6440761 7551096 4785317 1636117
5977 1636117 1761034 4093092 4690694 2612605 1008643 2307171 5133711 6926362 7422912
5968 7422912 8153547 9740907 10963130 10029057 6320773 1355924 -2069404 -2544886 -1599158
5959 -1599158 -1475962 -1838107 -420902 3237400 6871826 8619934 8947554 8874049 8459812
5950 8459812 7886423 7771255 7328722 4692919 587482 -1023107 1729443 5116413 4704306
5941 4704306 1673633 495329 1788437 2070219 314653 -200686 2182557 4267067 3147137
$$ packed form
6002d527801M94846j527190k025958J283285M754792L250063j994430m424566
5994d716959j349183K422964J853445j402189k366840j31916J893545J571049
5986b226084J62799n63188j38308J480480L652302M072760J110335k765779l149200
5977A636117J24917K332058N97602k078089j603962J298528K826540J792651M96550
5968G422912P30635J587360J222223r34073l708284m964849l425328m75482R45728
5959a599158J23196l62145J417205L658302L634426J748108L27620p3505m14237
5950H459812n73389j15168m42533k635803m105437j610589K752550L386970m12107
5941D704306l030673j178304J293108K81782j755566n15339K383243K084510j119930
$$ plain form
5932 3147137 970171 1356552 3718640 4798651 4219789 4611422 6681820 7829949 6252388
5923 6252388 3521543 2013400 2005363 2558891 3505825 5113447 6918865 8183786 8806517
5914 8806517 8912012 8297868 7030923 5690310 4228511 1711137 -1689658 -3656419 -2391705
5905 -2391705 588716 2508228 3643149 6730021 11648942 13996575 11020698 6355681
5897 6355681 5552417 8271309 8883215 4914088 702369 789918 3175735 2514462 -1981301
5888 -1981301 -5820626 -5977708 -4475275 -4315401 -5150148 -4968215 -3705234 -2669566 -1774270
5879 -1774270 31255 2070811 2084978 -699518 -4387523 -6608963 -6556307 -4826590 -2801543
5870 -2801543 -2286909 -3905275 -5328437 -3090899 2703608 7212290 5999427 167577
$$ packed form
5932C147137k176966L86381K362088J080011n78862L91633K070398J148129j577561
5923F252388k730845j508143q037N53528R46934J607622J805418J264921O22731
5914H806517J05495o14144j266945j340613j461799k517374l400795j966761J264714
5905b391705K980421J919512J134921L086872M918921K347633k975877m665017
5897F355681q03264K718892O11906l969127m211719Q7549K385817o61273m495763
5888a981301l839325j57082J502433J59874q34747J81933J262981J035668Q95296
5879a774270J805525K039556J4167k784496l688005k221440N2656J729717K025047
5870b801543N14634j618366j423162K237538N794507M508682j212863n831850
$$ plain form
5862 167577 -5273889 -7148972 -6416136 -5602114 -6218718 -8557334 -11766739 -13642716 -12217952
5853 -12217952 -8323131 -5131636 -4556143 -5521140 -6307554 -6785268 -7314916 -7277162 -6310708
5844 -6310708 -5591776 -6023771 -6249687 -4534403 -1870190 -940512 -2300953 -3917284 -4599170
5835 -4599170 -5487061 -7452110 -9263990 -9575129 -8923872 -8294446 -7175546 -4790407 -2153395
5826 -2153395 -922608 -771636 85717 1831400 2505992 1070065 -718249 -586639 1212472
5817 1212472 2450571 1959165 818352 562421 1310167 1937754 1185656 -1780030 -6833069
5808 -6833069 -11979565 -13887848 -10988524 -6028755 -3910549 -6392485 -10242561 -11321874
5800 -11321874 -8985123 -5269546 -1413776 2558270 5671597 6184293 4237426 2059425
$$ packed form
5862A67577n441466j875083P32836Q14022o16604k338616l209405j875977J424764
5853a2217952L894821L191495N75493r64997p86414m77714n29648L7754R66454
5844f310708P18932m31995k25916J715284K664213R29678j360441j616331o81886
5835d599170q87891j965049j811880l11139O51257O29426J118900K385139K637012
5826b153395J230787J50972Q57353J745683O74592j435927j788314J31610J799111
5817A212472J238099m91406j140813k55931P47746O27587p52098k965686n053039
5808f833069n146496j908283K899324M959769K118206k481936l850076j079313
5800a1321874K336751L715577L855770L972046L113327N12696j946867k178001
$$ plain form
5792 2059425 841958 -655590 -3551935 -6732258 -8409709 -8261113 -6922999 -4941236
5784 -4941236 -3439645 -4044500 -6336740 -6932859 -3426359 1750409 3880618 1863771 -935753
5775 -935753 -1568948 -561751 328069 756063 988972 619667 -231651 41033 2389974
5766 2389974 4905075 4684917 1729203 -680725 234845 3836825 7380846 9108616 9085446
5757 9085446 7713268 5003030 1711488 -180388 544993 2449023 3050135 2184545 1936993
5748 1936993 2836156 2340160 -1365191 -5831010 -6908478 -3990386 -384450 1168752 984077
5739 984077 353580 -563215 -1836582 -2542507 -1668585 628913 3265245 4936557 4537862
5730 4537862 2132815 -336356 -723682 668682 1537960 829100 -217594 -576574 -916730
$$ packed form
5792B059425j217467j497548k896345l180323j677451J48596J338114J981763
5784d941236J501591o04855k292240n96119L506500N176768K130209k016847k799524
5775i35753o33195J007197Q89820M27994K32909l69305q51318K72684K348941
5766B389974K515101k20158k955714k409928R15570L601980L544021J727770k3170
5757I085446j372178k710238l291542j891876P25381J904030O01112q65590k47552
5748A936993Q99163m95996l705351m465819j077468K918092L605936J553202j84675
5739I84077o30497r16795j273367p05925Q73922K297498K636332J671312l98695
5730D537862k405047k469171l87326J392364Q69278p08860j046694l58980l40156
$$ plain form
5721 -916730 -1777008 -2265737 -1716555 -916524 -566861 -212331 230036 -210337 -1460194 -1760556
5711 -1760556 -764522 -1025121 -4144158 -7473665 -7443186 -4625912 -2460063 -2054868 -1531097
5702 -1531097 48558 1435569 1988766 2733135 4109524 5100240 5124441 4796159 4549776
5693 4549776 4380482 4810588 6029556 6455440 4657336 2303778 2197260 3628183 3301244
5684 3301244 1137430 979034 4271143 7199418 6329633 3447564 2046570 2176329 1934782
5675 1934782 1418384 1724014 2041196 1196542 544156 1983115 4368289 5136487 4407787
5666 4407787 4284956 5116769 5737490 6451348 8280996 10020778 9716773 8479333 8871119
5657 8871119 9901196 8100093 3802178 1537286 3061833 4808096 4187262 3699630 5848179
$$ packed form
5721i16730q60278m88729N49182Q00031L49663L54530M42367m40373j249857l00362
5711a760556R96034k60599l119037l329507L0479K817274K165849M05195N23771
5702a531097J579655J387011N53197P44369J376389R90716K4201l28282k46383
5693D549776j69294M30106J218968M25884j798104k353558j06518J430923l26939
5684C301244k163814j58396L292109K928275q69785k882069j400994J29759k41547
5675A934782n16398L05630L17182q44654o52386J438959K385174P68198p28700
5666D407787j22831Q31813O20721P13858J829648J739782l04005j237440L91786
5657H871119J030077j801103m297915k264892J524547J746263o20834m87632K148549
$$ plain form
5648 5848179 8252094 7742569 5929037 6127956 7095192 4761664 -848591 -5160031 -5401320
5639 -5401320 -3138706 -41696 4510442 9905741 12131667 8199659 879770 -3933477
5631 -3933477 -4058472 -2893039 -4301357 -7686831 -9343280 -7577840 -4631415 -3302433
5623 -3302433 -3479791 -3467267 -3477068 -5308535 -8642592 -10442427 -9129995 -6950954 -6461302
5614 -6461302 -6766504 -5595045 -3478639 -2970776 -4508347 -5999460 -6385744 -6760233 -7476846
5605 -7476846 -6796861 -3633991 176717 1728380 239802 -2401562 -3568718 -1923306
5597 -1923306 1776162 5525695 7999767 9274552 9343405 7287584 3296988 96354 41324
5588 41324 1652550 1636717 -289709 -1626638 -1749203 -2646981 -4614822 -5207538 -3823569
$$ packed form
5648E848179K403915n09525j813532J98919R67236k333528n610255m311440k41289
5639e401320K262614L097010M552138N395299K225926l932008p319889m813247
5631c933477j24995J165433j408318l385474j656449J765440K946425J328982
5623c302433j77358J2524r801j831467l334057j799835J312432K179041M89652
5614f461302l05202J171459K116406N07863j537571j491113l86284l74489p16613
5605g476846O79985L162870L810708J551663j488578k641364j167156J645412
5597a923306L699468L749533K474072J274785O8853k055821l990596l200634n5030
5588D1324J611226j5833j926426j336929j22565q97778j967841n92716J383969
$$ plain form
5579 -3823569 -3409485 -5450362 -6936503 -5246801 -2854571 -3598207 -6788273 -8960721 -9570938
5570 -9570938 -10643470 -11928445 -10948882 -7704534 -5080372 -4036884 -2217312 1650778
5562 1650778 5354474 6536987 5589270 3844696 1483380 -1289277 -3303882 -4217571 -5208414
5553 -5208414 -6459165 -6036503 -2929354 717550 2250572 1794039 1147981 1007058 1222324
5544 1222324 2344562 4595527 6257002 5350939 2418139 -291166 -1863254 -3023972
5536 -3023972 -3817166 -3067710 -319819 3238139 5938628 6666197 5133787 2461335 984951
5527 984951 1926189 3652865 3830826 2667382 2001851 1839464 604039 -1169620 -724653
5518 -724653 2200829 3638732 505645 -4864234 -7853534 -7576302 -6904272 -7424626 -7496339
$$ packed form
5579c823569M14084k040877j486141J689702K392230p43636l190066k172448o10217
5570i570938j072532j284975R79563L244348K624162J043488J819572L868090
5562A650778L703696J182513r47717j744574k361316k772657k014605r13689r90843
5553e208414j250751M22662L107149L646904J533022m56533o46058j40923K15266
5544A222324J122238K250965J661475r06063k932800k709305j572088j160718
5536c023972p93194P49456K747891L557958K700489P27569j532410k672452j476384
5527I84951R41238J726676J77961j163444o65531j62387j235425j773659M44967
5518g24653K925482J437903l133087n369879k989300K77232O72030n20354p1713
$$ plain form
5509 -7496339 -5541225 -2663077 -1052595 -1471570 -3153181 -4887809 -5457117 -4149205 -1724401
5500 -1724401 -104308 -388517 -1729315 -2601133 -2526173 -2118172 -2083132 -2644065 -3446090 -3783457
5490 -3783457 -3484841 -3515516 -4671633 -5667195 -4084549 204681 4178940 5161573 3577636
5481 3577636 1085248 -2062719 -5815584 -8350341 -8199721 -7189543 -7946703 -9142367 -7089575
5472 -7089575 -2178423 699912 -513844 -1719149 761013 4315429 4507597 2072484
5464 2072484 666858 -139628 -4078672 -11106458 -16639955 -18348436 -18503594 -18335164 -15327812
5455 -15327812 -8608848 -2217335 546518 2022422 5205972 7304956 3682960 -3733189
5447 -3733189 -7940644 -6597234 -4745709 -6697644 -10170183 -10805419 -8475008 -5911538
$$ packed form
5509g496339J955114K878148J610482m18975j681611j734628n69308J307912K424804
5500a724401J620093k84209j340798q71818P4960M08001L5040n60933q02025l37367
5490c783457K98616l0675j156117r95562J582646M289230L974259R82633j583937
5481C577636k492388l147967l752865k534757J50620J010178p57160j195664K052792
5472g089575M911152K878335j213756j205305K480162L554416J92168k435113
5464B072484j405626q06486l939044p027786n533497j708481j55158J68430L007352
5455a5327812O718964O391513K763853J475904L183550K098984l621996p416149
5447c733189m207455J343410J851525j951935l472539o35236K330411K563470
$$ plain form
5439 -5911538 -3893604 -1353380 1247395 2063571 1021810 154677 657980 1649859 2090810
5430 2090810 2181916 2372906 2354507 1673103 438705 -1102816 -3042494 -5403389 -7680162
5421 -7680162 -9105063 -9228568 -8305264 -7309839 -7154015 -7301070 -5619758 -717566 5550812
5412 5550812 9062505 7489858 2716652 -1270000 -2279025 -1250341 -489218 -1507239
5404 -1507239 -4211923 -7091590 -8010069 -5706314 -1077032 3359338 5632935 5785885 5101901
5395 5101901 4399532 3560262 2439549 1544239 1584491 2653877 4033925 4683400 3933516
5386 3933516 2050895 367334 572540 3250184 6787131 8149346 5576278 835923
5378 835923 -1840595 118810 4701712 7259035 5366007 899298 -2717564 -3928237
$$ packed form
5439e911538K017934K540224K600775Q16176j041761q67133N03303R91879M40951
5430B090810R1106J90990j8399o81404j234398j541521j939678k360895k276773
5421g680162j424901j23505R23304R95425J55824j47055J681312M902192O268378
5412E550812L511693j572647m773206l986652j009025J028684P61123j018021
5404a507239k704684k879667r18479K303755M629282M436370K273597J52950o83984
5395E101901p02369q39270j120713q95310M0252J069386J380048O49475p49884
5386C933516j882621j683561K05206K677644L536947J362215k573068m740355
5378H35923k676518J959405M582902K557323j893028m466709l616862j210673
$$ plain form
5370 -3928237 -3032286 -401577 3391928 6372739 6399622 4050943 2490750 3650656 5963735
5361 5963735 6806471 5808592 4424146 3327843 1969374 251306 -1044541 -1585060 -1896385
5352 -1896385 -2169872 -1719521 -11289 2496128 4758560 5795769 5005705 2715600 471363
5343 471363 -226683 279476 244955 -961704 -1935712 -1405279 -95413 643366 1083416 2494153
5333 2494153 4696834 5848085 4824613 2482696 164612 -1766280 -3221508 -3485916
5325 -3485916 -2300029 -1100181 -1636232 -3488549 -4426329 -3453971 -2032986 -1691029 -1980167
5316 -1980167 -2066708 -2967635 -6049393 -9750811 -10302656 -6521213 -2010435 -1220460 -4444739
5307 -4444739 -8047638 -8759619 -6313284 -2559760 217288 291866 -2290840 -5015491 -4983339
$$ packed form
5370c928237Q95951K630709L793505K980811K6883k348679j560193J159906K313079
5361E963735Q42736r97879j384446j096303j358469j718068j295847n40519l11325
5352a896385k73487M50351J708232K507417K262432J037209p90064k290105k244237
5343D71363o98046N06159l4521j206659r74008N30433J309866P38779M40050J410737
5333B494153K202681J151251j023472k341917k318084j930892j455228k64408
5325c485916J185887J199848n36051j852317r37780R72358J420985L41957k89138
5316a980167q6541r00927l081758l701418n51845L781443M510778P89975l224279
5307d444739l602899p11981K446335L753524K777048P4578k582706k724651L2152
$$ plain form
5298 -4983339 -2458102 -956524 -2765020 -5616554 -5389221 -1353577 3159789 5230339
5290 5230339 5499551 6202289 7838250 9207841 9574668 9050437 7495632 5005684 3300196
5281 3300196 4382854 7292178 8411429 6168942 3286247 2530075 2282516 -771786 -5770693
5272 -5770693 -8077791 -5672184 -1762179 -25905 -206034 18279 1420262 3578245 6648019
5263 6648019 10202208 11772129 9319128 4552543 1435252 1659548 3532022 4967770
5255 4967770 5597485 6061210 7076955 9224722 12075382 13643730 12215146 8517925 4684578
5246 4684578 1594452 -1116713 -3207139 -4199234 -4995280 -6582070 -7536567 -5737904 -2427483
5237 -2427483 -1196258 -2543941 -3164315 -1710766 -1233535 -3708163 -5997604 -4656236 -1810082
$$ packed form
5298d983339K525237J501578j808496k851534K27333M035644M513366K070550
5290E230339K69212P02738J635961J369591L66827n24231j554805k489948j705488
5281C300196J082658K909324J119251k242487k882695p56172k47559l054302m998907
5272e770693k307098K405607L910005J736274j80129K24313J401983K157983L069774
5263F648019L554189J569921k453001m766585l117291K24296J872474J435748
5255D967770O29715M63725J015745K147767K850660J568348j428584l697221l833347
5246D684578l090126k711165k090426r92095p96046j586790r54497J798663L310421
5237b427483J231225j347683o20374J453549M77231k474628k289441J341368K846154
$$ plain form
5228 -1810082 -2154588 -5840378 -8487516 -7531710 -4782890 -2868764 -2562997 -3765800 -5942055
5219 -5942055 -7229340 -6116575 -4443967 -5646070 -9346542 -11018771 -8280019 -4217624
5211 -4217624 -2532314 -2506856 -1504456 194353 508121 -280102 -278779 -32248 -1877193
5202 -1877193 -5192410 -6118862 -3083083 630385 1363783 -599912 -2943698 -4829306 -6067584
5193 -6067584 -5091330 -996707 3670572 5451450 4662534 4302994 4606783 2466173 -2982662
5184 -2982662 -7950864 -9037896 -7623358 -6817813 -6576670 -4844072 -1751251 694767 2189783
5175 2189783 4060600 5853488 5271310 2077539 -785625 -1086847 -70275 -49542 -1066852
5166 -1066852 -1477471 -664854 310172 240316 -1003954 -2451312 -2797608 -1678803 -335265
$$ packed form
5228a810082l44506l685790k647138R55806K748820J914126L05767j202803k176255
5219e942055j287285J112765J672608j202103l700472j672229K738752M062395
5211d217624J685310K5458J002400J698809L13768p88223J323K46531j844945
5202a877193l315217r26452L035779L713468P33398j963695k343786j885608j238278
5193f067584R76254M094623M667279J780878p88916l59540L03789k140610n448835
5184b982662m968202j087032J414538Q05545K41143J732598L092821K446018J495016
5175B189783J870817J792888n82178l193771k863164l01222J016572K0733j017310
5166a066852m10619Q12617R75026o9856j244270j447358l46296J118805J343538
$$ plain form
5157 -335265 -292687 -1305813 -1539668 47872 2450537 3855275 3167825 373895 -3266774
5148 -3266774 -5220340 -3388513 1570029 6691639 9770000 10774687 10170132 7737950
5140 7737950 3968894 1010376 762753 2649826 4136882 3043832 -832550 -5465879
5132 -5465879 -7749091 -6034793 -1916827 1446539 2777056 3221686 3715891 3736583 2949354
5123 2949354 2088900 1539426 783801 -128815 -243126 763172 2498578 5418638 10048574
5114 10048574 14338495 14767325 11057992 6939543 5149998 4757006 4577312 5415216 6841415
5105 6841415 5809078 1688043 -926085 1613352 6047387 6927305 4869356 5041695 8877858
5096 8877858 12573370 13487989 13082568 12928154 12107229 9819574 7390491 6547158 7788509
$$ packed form
5157c35265M2578j013126k33855J587540K402665J404738o87450k793930l640669
5148c266774j953566J831827M958542N121610L078361J004687o04555k432182
5140G737950l769056k958518k47623J887073J487056j093050l876382m633329
5132e465879k283212J714298M117966L363366J330517M44630M94205K0692p87229
5123B949354q60454n49474p55625r12616j14311J006298J735406K920060M629936
5114A0048574M289921M28830l709333m118449j789545l92992j79694Q37904J426199
5105F841415j032337m121035k614128K539437M434035Q79918k057949J72339L836163
5096H877858L695512R14619m05421j54414q20925k287655k429083q43333J241351
$$ plain form
5087 7788509 10520186 12680442 11090336 5169704 -565028 -1328747 1258790 1469294 -1905626
5078 -1905626 -4135271 -2430823 -33639 -316743 -1399360 94380 3187217 4060075 1550290
5069 1550290 -1956171 -4134207 -4820436 -5041208 -5689434 -6956587 -8127477 -8189829 -6954519
5060 -6954519 -5159717 -3768643 -3864272 -6224794 -9498859 -10037178 -5913381 -233776 2213638
5051 2213638 791244 -1451188 -3020460 -4842420 -6330643 -5127367 -1425439 1542809
5043 1542809 2160744 1618137 -134736 -4866129 -11102632 -13654449 -10482784 -5599579 -2552851
5034 -2552851 324305 4766564 7293615 3980684 -2524094 -5889881 -4507679 -2584619
5026 -2584619 -3606608 -6501200 -8210472 -7258523 -4637082 -2824566 -3589531 -5890056 -7114612
$$ packed form
5087G788509K731677K160256j590106n920632n734732p63719K587537K10504l374920
5078a905626k229645J704448K397184k83104j082617J493740L092837Q72858k509785
5069A550290l506461k178036o86229k20772o48226j267153j170890o2352J235310
5060f954519J794802J391074r5629k360522l274065n38319M123797N679605K447414
5051B213638j422394k242432j569272j821960j488223J203276L701928K968248
5043A542809O17935n42607j752873m731393o236503k551817L171665M883205L046728
5034b552851K877156M442259K527051l312931o504778l365787J382202J923060
5026b584619j021989k894592j709272R51949K621441J812516p64965k300525j224556
$$ plain form
5017 -7114612 -6920480 -7631436 -9993134 -11448846 -10129092 -7549946 -5568472 -3858139 -2459442
5008 -2459442 -3293507 -6467441 -8564949 -7697163 -6831753 -8731628 -11207268 -11476707 -11711418
4999 -11711418 -15224117 -19888245 -20786826 -17578403 -13992472 -11493470 -8801317 -6666378
4991 -6666378 -7495214 -10251694 -10838368 -8135578 -5356182 -4819329 -5272411 -5022084 -4211086
4982 -4211086 -3325549 -2447551 -2449799 -4330711 -7196053 -9072239 -9288702 -8116712 -5486582
4973 -5486582 -2573869 -2644888 -6893778 -11298654 -11485690 -8873555 -7635339 -7501578 -4997726
4964 -4997726 -704913 702005 -2160070 -5385247 -5847172 -4379269 -2132946 1467786
4956 1467786 5902539 8820923 9378482 8894370 7613099 4350665 -234110 -3567425 -4677405
$$ packed form
5017g114612J94132p10956k361698j455712J319754K579146J981474J710333J398697
5008b459442q34065l173934k097508Q67786Q65410j899875k475640k69439k34711
4999a1711418l512699m664128q98581L208423L585931K499002K692153K134939
4991f666378q28836k756480n86674K702790K779396N36853m53082K50327Q10998
4982d211086Q85537Q77998k248j880912k865342j876186k16463J171990K630130
4973e486582K912713p1019m248890m404876j87036K612135J238216J33761K503852
4964d997726M292813J406918k862075l225177m61925J467903K246323L600732
4956A467786M434753K918384N57559m84112j281271l262434m584775l333315j109980
$$ plain form
4947 -4677405 -4554840 -3399143 -1138201 88086 -1743787 -4411536 -4273408 -2536997 -3626285
4938 -3626285 -7822890 -11051628 -11788266 -12360317 -13197964 -11784269 -7969691 -4563359 -2010191
4929 -2010191 1747977 5702125 6334829 4398079 4615497 7709148 9377893 8205365 7546590
4920 7546590 8268313 6966120 3076945 327706 -674457 -3543204 -7962323 -8824157 -5842011
4911 -5842011 -5111858 -8099367 -8417000 -3379648 834039 199527 -711301 1216908 1005503
4902 1005503 -4329276 -8401140 -5698158 -772183 261415 -835653 -862904 -2414413 -6694688
4893 -6694688 -7733832 -2266265 2979846 2201763 -121860 893599 1338925 -1724429 -2395381
4884 -2395381 2045802 3481761 -1427845 -2027283 6817402 12554163 8734719 11252998
$$ packed form
4947d677405J22565J155697K260942J226287j831873k667749J38128J736411j089288
4938c626285m196605l228738p36638n72051q37647J413695L814578L406332K553168
4929b010191L758168L954148O32704j936750K17418L093651J668745j172528o58775
4920G546590P21723j302193l889175k749239j002163k868747m419119q61834K982146
4911e842011P30153k987509l17633N037352M213687o34512r10828J928209k11405
4902A005503n334779m071864K702982M925975J033598j097068k7251j551509m280275
4893f694688j039144N467567N246111p78083k323623J015459M45326l063354o70952
4884b395381M441183J435959m909606n99438Q844685N736761l819444K518279
$$ plain form
4876 11252998 28543158 39061906 33202431 56010810 155210165 289900124 349455756
4869 349455756 282408177 159096728 79548492 61639898 56616415 38095314 23749891
4862 23749891 24723193 25347290 16709402 11710122 17489832 21680622 15964990 10254152
4854 10254152 13309256 17952741 15513326 9878025 7921551 8247036 7529353 7553655 8914160
4845 8914160 7151313 1544905 -896310 3674407 8803457 7325710 1360438 -2628948
4837 -2628948 -2792807 -973047 1917443 4986714 6033343 4701457 3379519 2913062 1617389
4828 1617389 -175316 203764 2082105 1169723 -3120946 -5832948 -4173325 -1430907 -869274
4819 -869274 -1441306 -2205918 -5135025 -10170190 -12883570 -10848545 -7716394 -7360038 -8301847
$$ packed form
4876A1252998J7290160J0518748n859475K2808379R9199355J34689959N9555632
4869C49455756o7047579j23311449p9548236j7908594n023483j8521101j4345423
4862B3749891R73302O24097q637888m999280N779710M190790n715632n710838
4854A0254152L055104M643485k439415n635301j956474L25485p17683K4302J360505
4845H914160j762847n606408k441215M570717N129050j477747n965272l989386
4837b628948j63859J819760K890490L069271J046629j331886j321938m66457j295673
4828A617389j792705L79080J878341r12382m290669k712002J659623K742418N61633
4819h69274n72032p64612k929107n035165k713380K035025L132151L56356r41809
$$ plain form
4810 -8301847 -7484429 -5329436 -3267132 -134557 4892869 8939991 8956505 6249894 4247198
4801 4247198 3897151 4044730 4179290 4234976 3570299 2190411 1145994 416812 -1299060
4792 -1299060 -3786636 -5196257 -5503172 -6643685 -8419485 -8360741 -6707442 -6768034 -8689771
4783 -8689771 -8127099 -3614414 169413 8773 -219137 3873401 9417633 10440662 6530543
4774 6530543 2028053 -1001320 -3719943 -6042106 -6211628 -4249202 -1880716 424095
4766 424095 3133822 5271668 5406504 4184486 3224663 2524756 1303306 7114 -843898
4757 -843898 -2136560 -4130554 -4852957 -3014657 -532400 357962 302304 649231 761962
4748 761962 420847 1890245 5947325 8769701 7043984 3563491 3032617 4654693 4212746
$$ packed form
4810h301847Q17418K154993K062304L132575N027426M047122J6514k706611k002696
4801D247198l50047J47579J34560N5686o64677j379888j044417p29182j715872
4792a299060k487576j409621l06915j140513j775800N8744J653299o0592j921737
4783h689771N62672M512685L783827j60640k27910M092538N544232J023029l910119
4774F530543m502490l029373k718623k322163j69522J962426K368486K304811
4766D24095K709727K137846J34836j222018r59823o99907j221450j296192q51012
4757h43898j292662j993994p22403J838300K482257Q90362n5658L46927J12731
4748G61962l41115J469398M057080K822376j725717l480493n30874J622076m41947
$$ plain form
4739 4212746 1732274 1164068 3118465 3717861 1020906 -2483054 -4444960 -5241621 -5340100
4730 -5340100 -4217291 -2577485 -1890187 -1346338 998707 4004344 4494963 2656944 1891709
4721 1891709 2848346 2450077 -91219 -1279827 746363 2871725 2092038 98607 71503
4712 71503 2077650 4292140 6117523 7607584 7976527 6771390 4734505 2291408 -564887
4703 -564887 -2145483 -51011 4449890 6584041 4452213 1700540 1639434 2430673 1078301
4694 1078301 -1277176 -1752461 -687672 -338124 -657059 -154258 732353 872538 1645306
4685 1645306 5058099 9564416 11432386 9740342 6657189 3443362 -87239 -2416457
4677 -2416457 -835679 3899329 6862196 4556281 -1002774 -5039416 -5000460 -1809516 2017195
$$ packed form
4739D212746k480472n68206J954397N99396k696955l503960j961906p96661r8479
4730e340100J122809J639806O87298N43849K345045L005637M90619j838019p65235
4721A891709R56637l98269k541296j188608K026190K125362p79687j993431k7104
4712G1503K006147K214490J825383J490061L68943j205137k036885k443097k856295
4703e64887j580596K094472M500901K134151k131828k751673o1106P91239j352372
4694A078301k355477m75285J064789L49548l18935N02801Q86611J40185P72768
4685A645306L412793M506317J867970j692044l083153l213827l530601k329218
4677b416457J580778M735008K962867k305915n559055m036642L8956L190944L826711
$$ plain form
4668 2017195 4178124 3614764 879210 -2702019 -6085913 -8165748 -7362515 -3356637 1246995
4659 1246995 3134678 2193885 1140185 1200808 734886 -1133648 -2232903 -475693 2692650
4650 2692650 4220444 3715981 3494671 4718077 5704065 4642326 2361029 1213474 1929147
4641 1929147 2823405 2229762 747558 426636 2236896 5212826 7880915 9414973 9255010
4632 9255010 7013513 3617676 1330130 1243952 1494286 -451474 -4053956 -5983504 -4389687
4623 -4389687 -1350930 -323920 -2173329 -4543462 -4527678 -1240898 3780062 7911266 9226461
4614 9226461 7621454 4610068 2060250 981456 1271259 2365052 3947560 5886895
4606 5886895 7607483 8243962 7967098 8378353 10262820 11374290 8518561 2369525 -1946375
$$ packed form
4668B017195K160929n63360k735554l581229l383894k079835Q03233M005878M603632
4659A246995J887683r40793j053700O0623m65922j868534j099255J757210L168343
4650B692650J527794n04463k21310J223406R85988j061739k281297j147555P15673
4641A929147Q94258n93643j482204l20922J810260K975930K668089J534058j59963
4632I255010k241497l395837k287546q6178K50334j945760l602482j929548J593817
4623d389687L038757J027010j849409k370133J5784L286780N020960M131204J315195
4614I226461j605007l011386k549818j078794K89803J093793J582508J939335
4606E886895J720588O36479k76864M11255J884467J111470k855729o149036m315900
$$ plain form
4597 -1946375 -549465 4567468 8474955 9450384 9681810 10610585 10644696 8106881 3978625
4588 3978625 408357 -1880839 -3332654 -3841326 -2802953 -573759 1160940 639342 -2517138
4579 -2517138 -6772809 -9456239 -8574012 -4294424 1282820 5594573 6838943 4751888
4571 4751888 1198930 -686902 533371 2662453 2361290 -490427 -2734395 -2548322 -1963390
4562 -1963390 -3501502 -6096604 -6490868 -3923192 -1160907 -633587 -1505666 -1689510 -1412601
4553 -1412601 -2859242 -6332057 -8765707 -7387178 -3680981 -1679215 -2581226 -3460113 -1939363
4544 -1939363 437476 1241558 1220736 2464436 4006950 2878882 -686671 -2701127 -867183
4535 -867183 2530625 4416082 4700827 4502565 3252915 189735 -2987790 -3773606 -2438207
$$ packed form
4597a946375J396910N116933L907487R75429K31426R28775L4111k537815m128256
4588C978625l570268k289196j451815n08672J038373K229194J734699n21598l156480
4579b517138m255671k683430Q82227M279588N577244M311753J244370k087055
4571D751888l552958j885832J220273K129082l01163k851717k243968J86073N84932
4562a963390j538112k595102l94264K567676K762285N27320q72079j83844K76909
4553a412601j446641l472815k433650J378529L706197K001766r02011q78887J520750
4544a939363K376839Q04082k0822J243700J542514j128068l565553k014456J833944
4535h67183L397808J885457K84745j98262j249650l063180l177525p85816J335399
$$ plain form
4526 -2438207 -1545552 -2099574 -2213253 127873 4424578 8237014 9688343 9161373 8601121
4517 8601121 8882256 8295033 4921434 278437 -1669024 173389 2190619 1046418 -1936207
4508 -1936207 -3596091 -3772761 -4152217 -4052586 -1420080 2487310 3594131 906558 -1712741
4499 -1712741 -1092617 998222 1131410 -654447 -1441759 213588 2771361 4002516 3130513
4490 3130513 923048 -1169482 -2059701 -1859881 -1441587 -986059 161656 1767264 2009471
4481 2009471 -423896 -4219012 -6533943 -6022353 -4037165 -3009315 -4212119 -6975849
4473 -6975849 -9570666 -10756383 -10626817 -10095064 -9936551 -10553809 -11980916 -13270282 -12401684
4464 -12401684 -8082176 -1609492 4161904 7687542 9501410 10435096 10730078 10993642 12045512
$$ packed form
4526b438207Q92655n54022j13679K341126M296705L812436J451329n26970n60252
4517H601121K81135n87223l373599m642997j947461J842413K017230j144201k982625
4508a936207j659884j76670l79456R9631K632506L907390J106821k687573k619299
4499a712741O20124K090839J33188j785857p87312J655347K557773J231155q72003
4490C130513k207465k092530q90219J99820M18294M55528J147715J605608K42207
4481B009471k433367l795116k314931N11590J985188J027850j202804k763730
4473f975849k594817j185717J29566N31753J58513o17258j427107j289366Q68598
4464a2401684M319508O472684N771396L525638J813868R33686K94982K63564J051870
$$ plain form
4455 12045512 13042448 11518882 6518238 419871 -3571759 -4791896 -4930436 -5489162 -6575159
4446 -6575159 -7368974 -6624359 -3450641 1226340 4646219 4857501 2841235 871828 -560106
4437 -560106 -2653194 -5422846 -6751139 -5019513 -1619893 224375 -954919 -3180124
4429 -3180124 -3393558 -1225569 563603 -219553 -2331424 -3229580 -2965290 -3652116 -5421372
4420 -5421372 -5736923 -3378631 -402863 1112051 1748465 2545221 2636671 1352935 433741
4411 433741 1353769 2253177 730487 -1607795 -886095 3374823 7723460 9632839 9505143
4402 9505143 7901310 4557002 916070 -16101 2077837 3690599 2297197 -315512
4394 -315512 -1259032 -520270 352574 1205931 2402072 2752370 1009651 -1638246 -2885228
$$ packed form
4455A2045512R96936j523566n000644o098367l991630j220137j38540n58726j085997
4446f575159p93815P44615L173718M676981L419879K11282k016266j969407j431934
4437e60106k093088k769652j328293J731626L399620J844268j179294k225205
4429c180124k13434K167989J789172p83156k111871q98156K64290o86826j769256
4420e421372l15551K358292K975768J514914O36414P96756R1450j283736r19194
4411D33741R20028Q99408j522690k338282P21700M260918M348637J909379j27696
4402I505143j603833l344308l640932r32171K093938J612762j393402k612709
4394c15512r43520P38762Q72844Q53357J196141L50298j742719k647897j246982
$$ plain form
4385 -2885228 -2297966 -1075943 83634 797899 -124101 -3041225 -5521685 -4830863 -2080292
4376 -2080292 -1098532 -3068230 -5082481 -4596823 -2633839 -1510002 -1741513 -2600282 -3774035
4367 -3774035 -4903708 -5023297 -3958042 -2921812 -2380297 -896094 2261114 5050735 5480620
4358 5480620 5096819 6777786 9805825 10479664 7873454 5671991 7042225 10451383 12366544
4349 12366544 11871524 10439754 8803758 6480012 3456632 172243 -3507055 -7301082
4341 -7301082 -9251149 -7716408 -4245982 -2157337 -2351567 -2759968 -1877245 -383546 936548
4332 936548 2188975 2637801 756876 -2777933 -4730546 -3507006 -1298000 -185919 1347570
4323 1347570 5327468 9704899 10289353 6467786 1845708 -679992 -1637539 -2458295 -2900926
$$ packed form
4385b885228N87262J222023J159577P14265r22000k917124k480460O90822K750571
4376b080292R81760j969698k014251M85658J962984J123837k31511q58769j173753
4367c774035j129673j19589J065255J036230N41515J484203L157208K789621M29885
4358E480620l83801J680967L028039O73839k606210k201463J370234L409158J915161
4349A2366544m95020j431770j635996k323746l023380l284389l679298l794027
4341g301082j950067J534741L470426K088645j94230m08401Q82723J493699J320094
4332I36548J252427M48826j880925l534809j952613J223540K209006J112081J533489
4323A347570L979898M377431N84454l821567m622078k525700r57547q20756m42631
$$ plain form
4314 -2900926 -2090134 -379170 1043978 1621720 1851958 2668915 4423301 5987797 5234512
4305 5234512 1163955 -4722191 -9694758 -11826383 -10424939 -6011551 -1114591 538648
4297 538648 -2230752 -6022348 -6733620 -4820056 -4415232 -7550767 -11595622 -12588645 -9164500
4288 -9164500 -3010013 2817292 5859496 6101978 5962892 7320701 9117638 9293393 8002705
4279 8002705 6771230 5434175 2663453 -908859 -2956060 -2844218 -2175597 -2015111 -2165208
4270 -2165208 -2996759 -5053989 -6822797 -6015799 -3346400 -1860244 -2139193 -1573322 849900
4261 849900 2486318 992114 -2684208 -6440603 -9301141 -10569536 -9667576 -7803329 -6843827
4252 -6843827 -5847563 -2198083 3066594 5231972 2638809 -856962 -2076948 -2728630 -4815685
$$ packed form
4314b900926Q10792J710964J423148N77742K30238Q16957J754386J564496p53285
4305E234512m070557n886146m972567k131625J401444M413388M896960J653239
4297E38648k769400l791596p11272J913564M04824l135535m044855r93023L424145
4288i164500O154487N827305L042204K42482j39086J357809J796937J75755j290688
4279H002705j231475j337055k770722l572312k047201J11842O68621J60486j50097
4270b165208q31551k057230j768808Q06998K669399J486156k78949N65871K423222
4261H49900J636418j494204l676322l756395k860538j268395R01960J864247R59502
4252f843827R96264L649480N264677K165378k593163l495771j219986o51682k087055
$$ plain form
4243 -4815685 -6224329 -4421942 -1034181 885580 1212211 1057074 -272538 -3029083 -4396358
4234 -4396358 -1834626 2912528 6220040 6930462 5722139 2799537 -916834 -3025470
4226 -3025470 -3032903 -3787703 -6765602 -9086505 -8201354 -6064565 -5349397 -5226253 -4560370
4217 -4560370 -5373882 -8869303 -11693782 -10626005 -7608806 -6065697 -6032722 -6832638 -9815849
4208 -9815849 -14034394 -14630503 -10530091 -7669069 -9109292 -9279552 -4710204 -1815334 -5229642
4199 -5229642 -7893151 -3925441 -1211813 -7025233 -12032103 -7150281 -4917132 -17641639
4191 -17641639 -21742019 20541156 98689934 149132978 130309103 73610018 37180878
4184 37180878 33986921 34685779 23327942 14183324 17979629 24285225 22790684 17957778
$$ packed form
4243d815685j408644J802387L387761J919761L26631j55137j329612k756545j367275
4234d396358K561732M747154L307512P10422j208323k922602l716371k108636
4226c025470p433p54800k977899k320903Q85151K136789P15168J23144O65883
4217d560370q13512l495421k824479J067777L017199J543109L2975p99916k983211
4208i815849m218545n96109M100412K861022j440223j70260M569348K894870l414308
4199e229642k663509L967710K713628n813420n006870M881822K233149j2724507
4191a7641639m100380M2283175P8148778N0443044j8823875n6699085l6429140
4184C7180878l193957O98858j1357837r144618L796305O305596j494541m832906
$$ plain form
4176 17957778 15201246 10982008 3782701 -87574 1767923 2846382 -73877 -1320268
4168 -1320268 2251856 5385551 4892289 5265408 8675800 9813788 6512228 5510042 10852796
4159 10852796 15552570 12384192 5427856 2994187 5157324 6082089 4004386 1557214
4151 1557214 -317512 -2253303 -2900689 -889455 1958138 3591331 5081199 7184398
4143 7184398 6976167 2226364 -3857512 -6455113 -5117503 -2406503 374898 2404920
4135 2404920 1549130 -2433836 -5527775 -4297475 -731144 1320763 1831507 2860595 3772654
4126 3772654 2492370 -347023 -2408826 -3210622 -3383361 -2359387 -130700 848466 -941419
4117 -941419 -2892677 -2108588 -282944 -779233 -2781490 -2706612 -137219 1909793 1834731
$$ packed form
4176A7957778k756532m219238p199307l870275J855497J078459k920259j246391
4168a320268L572124L133695m93262L73119L410392J137988l301560j002186N342754
4159A0852796M699774l168378o956336k433669K163137R24765k077703k447172
4151A557214j874726j935791o47386K011234K847593J633193J489868K103199
4143G184398k08231m749803o083876k597601J337610K711000K781401K030022
4135B404920q55790l982966l093939J230300L566331K051907N10744J029088R12059
4126C772654j280284k839393k061803q01796j72739J023974K228687R79166j789885
4117i41419j951258P84089J825644m96289k002257P4878K569393K047012p5062
$$ plain form
4108 1834731 694287 -784104 -2804306 -4556920 -4916626 -4631907 -4968571 -5010034 -3281055
4099 -3281055 -1099832 -1112227 -3247740 -5234823 -6308043 -7171052 -7066895 -4404923 -8654
4090 -8654 3464143 5093111 5758844 5281805 2928705 451363 871251 3748272 4947671
4081 4947671 1977101 -3060861 -6501773 -6770735 -4559416 -1673048 -278170 -1365502
4073 -1365502 -3544025 -4862128 -5520438 -6942649 -8808536 -9486492 -9067085 -9263500 -10256257
4064 -10256257 -10257090 -8485894 -6152637 -4146028 -2040168 269919 2145116 3661675 5257203
4055 5257203 5734525 3155031 -1650690 -4853609 -3922859 -353580 2638722 3387569 2027070
4046 2027070 -689928 -3631772 -5458113 -5573456 -4517530 -3207340 -2218366 -1506186 -297788
$$ packed form
4108A834731j140444j478391k020202j752614l59706K84719l36664m1463J728979
4099c281055K181223j2395k135513j987083j073220q63009J04157K661972M396269
4090h654L472797J628968O65733m77039k353100k477342M19888K877021J199399
4081D947671k970570n037962l440912k68962K211319K886368J394878j087332
4073a365502k178523j318103o58310j422211j865887o77956M19407j96415r92757
4064a0256257q33J771196K333257K006609K105860K310087J875197J516559J595528
4055E257203M77322k579494m805721l202919R30750L569279K992302P48847j360499
4046B027070k716998k941844j826341j15343J055926J310190R88974P12180J208398
$$ plain form
4037 -297788 2022465 4302423 4219507 1540531 -931002 -1230408 -975293 -1888524 -1823849
4028 -1823849 2134321 7964757 10201864 6892621 1482994 -2165352 -3224576 -2491555
4020 -2491555 -1208172 -1549355 -4702313 -8031413 -7649959 -4137032 -1872747 -2233220 -1863623
4011 -1863623 1020475 3121991 1122682 -3466511 -6985071 -8037576 -6981832 -4053828
4003 -4053828 -361941 2000696 2939476 4572628 6594469 5144570 -887753 -6182964
3995 -6182964 -5469067 -684350 2511862 2816679 3181027 4547911 4939128 4125609 4148836
3986 4148836 4823562 3211813 -1416507 -5958639 -8109430 -9121907 -10217939 -9429750 -4659053
3977 -4659053 2077059 6246020 5973062 3478324 1548886 539191 -525097 -1404279 -788899
$$ packed form
4037b97788K320253K279958q2916k678976k471533k99406K55115r13231O4675
4028a823849L958170N830436K237107l309243n409627l648346j059224P33021
4020b491555J283383l41183l152958l329100L81454L512927K264285l60473L69597
4011a863623K884098K101516j999309m589193l518560j052505J055744K928004
4003d053828L691887K362637R38780J633152K021841j449899o032323n295211
3995f182964P13897M784717L196212L04817L64348J366884L91217q13519K3227
3986D148836O74726j611749m628320m542132k150791j012477j096032P88189M770697
3977d659053O736112M168961k72958k494738j929438j009695j064288q79182O15380
$$ plain form
3968 -788899 1341075 3241375 3965606 4775569 6503302 7079341 4351011 496593 98054
3959 98054 3555655 6197130 5132405 3109685 3427721 4887419 5010520 4757912 5784524
3950 5784524 5829569 2058227 -2701884 -2816884 1425056 3692383 1027737 -2140975 -1309813
3941 -1309813 1935960 4146032 5953954 9424927 12304153 9902405 2095163 -5522824
3933 -5522824 -7915233 -5391008 -1754552 72652 -119596 -784576 -559545 131046 -576837
3924 -576837 -3347261 -5947586 -5621354 -2875058 -1048039 -1759435 -2745015 -1402290 1189645
3915 1189645 1874656 271737 -554385 1234161 3322758 2655308 61946 -979162 490555
3906 490555 1702387 398718 -2253475 -3837639 -3349894 -388862 5649479 13093360 16804798
$$ packed form
3968g88899K129974J900300P24231Q09963J727733N76039k728330l854418l98539
3959I8054L457601K641475j064725k022720L18036J459698J23101k52608J026612
3950E784524M5045l771342m760111j15000M241940K267327k664646l168712Q31162
3941a309813L245773K210072J807922L470973K879226k401748p807242p617987
3933e522824k392409K524225L636456J827204j92248o64980K25031O90591p07883
3924e76837k770424k600325L26232K746296J827019p11396r85580J342725K591935
3915A189645O85011j602919q26122J788546K088597o67450k593362j041108J469717
3906D90555J211832j303669k652193j584164M87745K961032O038341P443881L711438
$$ plain form
3897 16804798 12987652 4574444 -1448239 -2174841 -1216170 -2597243 -5574277 -7125292
3889 -7125292 -6798531 -6516582 -7086105 -7471161 -6987500 -6081546 -4934563 -2981543 -206299
3880 -206299 2133271 2450328 43965 -4427939 -8974256 -10977350 -8900594 -3746638 1493757
3871 1493757 4025987 2943436 -674169 -4641520 -6800961 -6113491 -3152360 420925
3863 420925 2828506 2839646 288050 -3443841 -6001672 -6107830 -4908928 -4290867 -3879901
3854 -3879901 -1155690 4684707 10258753 11019933 6434140 591681 -2528891 -2919948 -3058089
3845 -3058089 -4040421 -4616751 -3409508 -708949 1816697 2238668 -496129 -5391093 -9473209
3836 -9473209 -10214660 -8007482 -5352132 -3821645 -3054137 -2456974 -2034958 -1201157 1200030
$$ packed form
3897A6804798l817146q413208o022683p26602R58671j381073k977034j551015
3889g125292L26761K81949n69523l85056M83661R05954J146983J953020K775244
3880b06299K339570L17057k406363m471904m546317k003094K076756N153956N240395
3871A493757K532230j082551l617605l967351k159441O87470K961131L573285
3863D20925K407581J1140k551596l731891k557831j06158J198902O18061M10966
3854c879901K724211N840397N574046P61180m585793n842459l120572l91057j38141
3845c058089r82332n76330J207243K700559K525646M21971k734797m894964m082116
3836i473209p41451K207178K655350J530487P67508N97163M22016Q33801K401187
$$ plain form
3827 1200030 4630889 6343409 4661364 1616772 678724 2572201 4922465 5621726 4956026
3818 4956026 4330428 4208539 3876089 2699649 1140103 303273 312154 -382694 -3119045
3809 -3119045 -6725461 -8593452 -8147902 -7395403 -7456675 -6716581 -3726710 42056 2159389
3800 2159389 2340291 1679794 350313 -1691281 -3086423 -2776401 -2326131 -3830393 -6239078
3791 -6239078 -6636038 -4727497 -3052461 -2828928 -2665777 -1700766 -999390 -1137916 -1130348 -574708
3781 -574708 -369657 -621788 -424332 -289692 -1789700 -3908400 -3171124 1038719 4712405
3772 4712405 4918818 3958356 5032001 6917066 6636911 4933156 4680649 5294950 3374566
3763 3374566 -1344346 -5021274 -5313580 -4177308 -3972832 -4119934 -3274887 -2143817 -2169703
$$ packed form
3827A200030L430859J712520j682045l044592r38048J893477K350264O99261o65700
3818D956026o25598j21889l32450j176440j559546q36830Q881o94848k736351
3809c119045l606416j867991M45550P52499o1272P40094K989871L768766K117333
3800B159389J80902o60497j329481k041594j395142L10022M50270j504262k408685
3791f239078l96960J908541J675036K23533J63151R65011P01376j38526P568N55640
3781e74708K05051k52131J97456J34640j500008k118700P37276M209843L673686
3772D712405K06413r60462J073645J885065k80155j703755k52507O14301j920384
3763C374566m718912l676928k92306J136272K04476j47102Q45047J131070k5886
$$ plain form
3754 -2169703 -3281816 -4641922 -6056600 -7076736 -6199655 -2835636 909108 2253237
3746 2253237 1138266 203529 1636403 5140176 8696298 10271945 9023784 5873374
3738 5873374 2893907 1396719 722858 -542822 -2619670 -4584291 -5829736 -6282732 -5488745
3729 -5488745 -3046705 -228387 394735 -2113865 -5498056 -6740651 -5428008 -3701436
3721 -3701436 -3362903 -4144511 -4627159 -3779169 -1573294 936757 2024491 679412 -2155035
3712 -2155035 -4383901 -4840482 -3902680 -2347595 -801013 -202696 -1191641 -2666202 -2626491
3703 -2626491 -1125158 -645768 -2518768 -4716345 -4666642 -2667857 -776766 177225 381111
3694 381111 -755860 -3609233 -6489220 -7519066 -7760851 -9627216 -12581321 -13552297 -11628089
$$ packed form
3754b169703j112113j360106j414678j020136Q77081L364019L744744J344129
3746B253237j114971r34737J432874L503773L556122J575647j248161l150410
3738E873374k979467j497188o73861j265680k076848j964621j245445m52996P93987
3729e488745K442040K818318O23122k508600l384191j242595J312643J726572
3721c701436L38533p81608m82648Q47990K205875K510051J087734j345079k834447
3712b155035k228866m56581R37802J555085J546582N98317r88945j474561L9711
3703b626491J501333M79390j873000k197577M9703J998785J891091R53991K03886
3694C81111j136971k853373k879987j029846k41785j866365k954105r70976J924208
$$ plain form
3685 -11628089 -9045827 -7187423 -5158944 -3158857 -3287035 -5166026 -4566143 711007
3677 711007 6577962 7642235 4261736 1250231 1275306 3062985 4848982 5798204 4606495
3668 4606495 539179 -3973917 -5255016 -3456821 -2549208 -4390460 -5916552 -3703359
3660 -3703359 1292567 5415172 6780962 6181149 4963891 3894985 3255880 2555248 799116
3651 799116 -1794090 -3173103 -1786870 1235721 3578956 4724763 5877480 7328959
3643 7328959 7767422 6502013 4701513 3553283 2459253 368783 -1831750 -1946330 390684
3634 390684 2796366 3246412 2851451 3984291 6281405 6568851 3162563 -1570087 -3960619
3625 -3960619 -3008441 -471341 1692853 2399464 1042610 -1847629 -3951362 -3336451 -1423445
$$ packed form
3685a1628089K582262J858404K028479K000087j28178j878991N99883N277150
3677G11007N866955J064273l380499l011505K5075J787679J785997R49222j191709
3668D606495m067316m513096j281099J798195R07613j841252j526092K213193
3660c703359M995926M122605J365790n99813j217258j068906o39105p00632j756132
3651G99116k593206j379013J386233L022591K343235J145807J152717J451479
3643G328959M38463j265409j800500j148230j094030k090470k200533j14580K337014
3634C90684K405682M50046l94961J132840K297114K87446l406288m732650k390532
3625c960619R52178K537100K164194P06611j356854k890239k103733O14911J913006
$$ plain form
3616 -1423445 -1702290 -5004577 -8132139 -8137896 -5938396 -4122023 -2985509 -1099058 1236862
3607 1236862 1935707 623012 -379472 563682 2153695 2565679 2224596 2380891 2477401
3598 2477401 1387092 401920 2136088 6451072 10250888 11813474 12438668 12844136 11259551
3589 11259551 7212034 4039373 4345012 5359010 2806084 -2275459 -5093992 -4553978
3581 -4553978 -4137677 -5399007 -6037302 -5515754 -6830135 -10132406 -10108508 -3803431 3444613
3572 3444613 4879702 1696641 13842 1032022 478884 -3154617 -6161235 -5945101 -4253276
3563 -4253276 -2750306 -304019 3316548 5355383 4339691 3095100 4646060 7537333
3555 7537333 8003538 5198412 1896190 936969 2586529 4612613 4104061 380851 -3412935
$$ packed form
3616a423445k78845l302287l127562n757K199500J816373J136514J886451K335920
3607A236862O98845j312695j002484R43154J590013M11984l41083J56295R6510
3598B477401j090309r85172J734168M314984L799816J562586O25194M05468j584585
3589A1259551m047517l172661L05639J013998k552926n081543k818533N40014
3581d553978M16301j261330o38295N21548j314381l302271K3898O305077P248044
3572C444613J435089l183061j682799J018180n53138l633501l006618K16134J691825
3563d253276J502970K446287L620567K038835j015692j244591J550960K891273
3555G537333M66205k805126l302222r59221J649560K026084n08552l723210l793786
$$ plain form
3546 -3412935 -3292098 605874 4276574 5540359 6385666 8316048 8962963 6201751 2736947
3537 2736947 2675275 5156682 5548967 2509456 -169042 649047 3318332 4484728 3500777
3528 3500777 1873354 397360 -797652 -574984 2141251 5672676 6407842 3294641 -273932
3519 -273932 -581317 1700736 2993035 2219155 1849952 3121997 3375745 125872 -4635563
3510 -4635563 -6990902 -6454028 -5813118 -6574501 -7702751 -8441746 -9121878 -9116884 -7228376
3501 -7228376 -4465317 -3218533 -3155070 -1457997 1898743 2972296 -215576 -4134449 -4581317
3492 -4581317 -1967831 866747 3100428 4978150 5115569 2644326 263808 1225502 4356514
3483 4356514 5749448 4575425 3504012 3776542 3648725 1974287 -60713 -1365452 -2157357
$$ packed form
3546c412935J20837L897972L670700J263785Q45307J930382O46915k761212l464804
3537B736947o1672K481407L92285l039511k678498Q18089K669285J166396r83951
3528C500777j627423j475994j195012K22668K716235L531425P35166l113201l568573
3519b73932l07385K282053J292299p73880l69203J272045K53748l249873m761435
3510d635563k355339N36874O40910p61383j128250p38995o80132M994J888508
3501g228376K763059J246784O3463J697073L356740J073553l187872l918873m46868
3492d581317K613486K834578K233681J877722J37419k471243k380518R61694L131012
3483D356514J392934j174023j071413K72530j27817j674438k035000j304739p91905
$$ plain form
3474 -2157357 -2149665 -324143 2731749 4853601 5483270 6317557 7861718 7966129 5313456
3465 5313456 2152822 1621515 3767612 6017587 6629567 6049710 5402146 5123795 5114395
3456 5114395 5288195 5638073 5953862 5690833 4536525 3331867 3681164 5839965 7662531
3447 7662531 6862767 3933966 1489885 894451 968704 159627 -1290034 -1696968 320867
3438 320867 4426808 8119970 8133693 3573574 -2374052 -5044221 -2809639 1613169 4007509
3429 4007509 2088515 -3090968 -7894476 -8860498 -6000664 -2773069 -1738743 -1583377 -157959
3420 -157959 1333154 353159 -1705666 -290670 5632884 11174072 11341272 6718670 1750770
3411 1750770 -517022 -357375 220970 -717885 -3623721 -6561942 -6755594 -3950109 -1090352
$$ packed form
3474b157357P692J825522L055892K121852O29669Q34287J544161J04411k652673
3465E313456l160634n31307K146097K249975O11980n79857o47564k78351r400
3456E114395J73800L49878L15789k63029j154308j204658L49297K158801J822566
3447G662531p99764k928801k444081n95434P4253q09077j449661m06934K017835
3438C20867M105941L693162J3723m560119n947626k670169K234582M422808K394340
3429D007509j918994n179483m803508r66022K859834L227595J034326J55366J425418
3420a57959J491113r79995k058825J414996N923554N541188J67200m622602m967900
3411A750770k267792J59647N78345r38855k905836k938221j93652K805485K859757
$$ plain form
3402 -1090352 -844603 -2709990 -4325489 -4256048 -2581853 -108740 1929194 2424153 1491740
3393 1491740 156845 -1289118 -3220870 -4824783 -4397287 -2240866 -1081278 -2285978
3385 -2285978 -3587087 -2233442 1083148 3205433 2393878 -300805 -2795445 -3834969
3377 -3834969 -3624841 -3426323 -4028284 -4468414 -3329222 -1219072 -190893 -510550 -191877
3368 -191877 1689995 3582219 4211747 4318765 4540183 4091876 2904129 2502434 3239717
3359 3239717 3287982 1984748 1220315 1598199 623325 -2658496 -4776101 -3131920 -897913
3350 -897913 -2245377 -5415000 -5593427 -2786610 -1405597 -2981510 -4644026 -4573679 -3848207
3341 -3848207 -2742024 -208565 2451660 2332755 150655 -130411 2025437 2424547 -885816
$$ packed form
3402a090352K45749j865387j615499O9441J674195K473113K037934M94959r32413
3393A491740j334895j445963j931752j603913M27496K156421J159588j204700
3385b285978j301109J353645L316590K122285q11555k694683k494640j039524
3377c834969K10128J98518o01961m40130J139192K110150J028179l19657L18673
3368a91877J881872J892224O29528J07018K21418m48307j187747m01695P37283
3359C239717M8265j303234p64433L77884r74874l281821k117605J644181K234007
3350h97913j347464l169623j78427K806817J381013j575913j662516P0347P25472
3341c848207J106183K533459K660225j18905k182100k81066K155848L99110l310363
$$ plain form
3332 -885816 -4390169 -5142745 -5214069 -7130009 -9205926 -8898383 -7115757 -5637711 -3647298
3323 -3647298 -582467 831256 -1301833 -3658037 -2132086 1419566 1817721 -1443796
3315 -1443796 -3949583 -3533375 -2584833 -2856409 -2840506 -1651949 -1374118 -3571969 -6624788
3306 -6624788 -8450117 -9219140 -9444852 -7830282 -3424106 1720386 4420003 4026381 2315903
3297 2315903 485048 -1663210 -3652380 -3524693 -169702 4411222 6409408 4055393
3289 4055393 -427258 -3245226 -3050728 -1689245 -1162817 -1362543 -1403884 -1570429 -2433544
3280 -2433544 -3178710 -2750601 -2139363 -3472638 -6750356 -9330917 -9173063 -7152142 -5555462
3271 -5555462 -5441092 -6158869 -6628721 -6401807 -5850254 -5664763 -6064875 -6717892 -7569382 -8901388
$$ packed form
3332h85816l504353p52576p1324j915940k075917L07543J782626J478046J990413
3323c647298L064831J413723k133089k356204J525951L551652L98155l261517
3315a443796k505787M16208R48542k71576J5903J188557K77831k197851l052819
3306f624788j825329p69023k25712J614570M406176N144492K699617l93622j710478
3297B315903j830855k148258j989170J27687L354991M580924J998186k354015
3289D055393m482651k817968J94498J361483N26428j99726m1341j66545q63115
3280b433544p45166M28109O11238j333275l277718k580561J57854K020921J596680
3271e555462J14370p17777m69852K26914N51553J85491m00112o53017q51490j332006
$$ plain form
3261 -8901388 -9982412 -8949880 -5437479 -2156623 -1811884 -3199323 -2806863 56827 2517202
3252 2517202 2716416 2142896 2439716 2797221 2239151 2053826 3674577 5832180 6152143
3243 6152143 4503122 2635630 1272920 -438555 -3015713 -5833202 -7916484 -8371514
3235 -8371514 -6757064 -4230968 -3226702 -4411733 -5172830 -3171578 -247966 -44725 -2320070
3226 -2320070 -2827524 679012 5253437 6787342 4949685 2582330 1852228 2640325 3715030
3217 3715030 4049867 3424596 2521243 1997955 1309268 -520123 -2772731 -3245345 -1258966
3208 -1258966 1047405 1365623 -240797 -2389737 -4282915 -5099360 -3184036 1894306 7372030
3199 7372030 9680884 8470826 6184147 3939870 379511 -4853582 -8909563 -8633996
$$ packed form
3261h901388j081024J032532L512401L280856L44739j387439L92460K863690K460375
3252B517202J99214n73520K96820L57505n58070j85325J620751K157603L19963
3243F152143j649021j867492j362710j711475k577158k817489k083282m55030
3235h371514J614450K526096J004266j185031p61097K001252K923612K03241k275345
3226b320070n07454L506536M574425J533905j837657k367355p30102P88097J074705
3217C715030L34837o25271r03353n23288o88687j829391k252608m72614J986379
3208a258966K306371L18218j606420k148940j893178q16445J915324N078342N477724
3199G372030K308854j210058k286679k244277l560359n233093m055981K75567
$$ plain form
3191 -8633996 -4512484 -287611 890172 -1002884 -3744123 -5301993 -5328036 -4796228 -4559886
3182 -4559886 -4500624 -4159173 -3699727 -3643675 -3944865 -4141546 -4334018 -5087581 -6187472 -6366623
3172 -6366623 -4732161 -1931970 454611 1312760 655163 -552447 -975432 168126 2381287
3163 2381287 4294454 4945588 4484402 3703853 3217835 2969823 2157262 -99229 -3440176
3154 -3440176 -5941490 -5969045 -4236158 -3059027 -3520697 -4370323 -3974813 -2406470 -1110449
3145 -1110449 -1123391 -1996930 -2106041 -49388 3664006 6472188 6131637 3165332 145917
3136 145917 -1147961 -761227 754500 2888839 4363407 3720608 1270702 -1154631 -2715973
3127 -2715973 -3937518 -4316938 -2267073 1479800 3328358 1700988 -167351 1002435
$$ packed form
3191h633996M121512M224873J177783j893056k741239j557870k6043N31808K36342
3182d559886N9262L41451M59446N6052l01190j96681j92472p53563j099891j79151
3172f366623J634462K800191K386581Q58149o57597j207610m22985J143558K213161
3163B381287J913167O51134m61186p80549m86018k48012q12561k256491l340947
3154c440176k501314k7555J732887J177131m61670q49626L95510J568343J296021
3145a110449j2942q73539j09111K056653L713394K808182l40551k966305l019415
3136A45917j293878L86734J515727K134339J474568o42799k449906k425333j561342
3127b715973j221545l79420K049865L746873J848558j627370j868339J169786
$$ plain form
3119 1002435 3314450 2746471 -237668 -1297862 1074594 3702986 4074893 3470671 3255329
3110 3255329 1706865 -2826247 -8043792 -9959467 -7928014 -4915102 -3320552 -2795661
3102 -2795661 -2195996 -1621330 -1684763 -2028736 -1764744 -1015247 -853853 -1332248 -595118 2781171
3092 2781171 7009072 8523763 6592861 4371199 4166810 4005647 1292344 -2109277 -2081493
3083 -2081493 1203461 2909470 219209 -4194225 -6544832 -6485562 -5539829 -3960578 -1592320
3074 -1592320 275400 464915 -51322 245958 1080268 1563844 2321397 4281837 6533415
3065 6533415 7591244 7778453 8081509 7621057 4906598 1089644 -845249 -283857 220296
3056 220296 -968851 -1985691 -352685 2941940 3931581 214443 -5807853 -8819563 -6004126
$$ packed form
3119A002435K312015n67979k984139j060194K372456K628392L71907o04222k15342
3110C255329j548464m533112n217545j915675K031453L012912J594550N24891
3102b795661N99665N74666o3433l43973K63992P49497J61394m78395P37130L376289
3092B781171M227901J514691j930902k221662k04389j61163k713303l401621K7784
3083b081493L284954J706009k690261m413434k350607N9270R45733J579251K368258
3074a592320J867720J89515n16237K97280Q34310M83576P57553J960440K251578
3065F533415J057829J87209L03056m60452k714459l816954j934893N61392N04153
3056B20296j189147j016840J633006L294625R89641l717138o022296l011710K815437
$$ plain form
3047 -6004126 -149968 3566137 3538509 2697724 3429633 4311057 3450906 2378764 3722634
3038 3722634 6732502 8416954 8236387 8270355 8959871 8123594 4830896 1361318 249858
3029 249858 1445704 3105462 3370931 1099016 -2988828 -5541035 -3369161 2323893 6731610
3020 6731610 7028500 4805537 2449191 94871 -2560501 -4390804 -4804800 -5225188 -6481691
3011 -6481691 -6738144 -4218300 -281610 2398968 3188427 2916631 1615377 -680197 -2220918
3002 -2220918 -1369171 670558 1421712 652106 -235270 -1547097 -4896692 -9393649 -11337746
2993 -11337746 -8803156 -4366179 -2016456 -2722949 -4045836 -3191430 284328 4227341
2985 4227341 5999650 5175495 3806034 3477156 3037006 544660 -3321837 -5637552 -4779256
$$ packed form
3047f004126N854158L716105k7628q40785P31909Q81424q60151j072142J343870
3038C722634L009868J684452j80567L3968O89516q36277l292698l469578j111460
3029B49858J195846J659758K65469k271915m087844k552207K171874N693054M407717
3020F731610K96890k222963k356346k354320k655372j830303m13996m20388j256503
3011f481691k56453K519844L936690K680578P89459k71796j301254k295574j540721
3002b220918Q51747K039729P51154p69606q87376j311827l349595m496957j944097
2993a1337746K534590M436977K349723p06493j322887Q54406L475758L943013
2985D227341J772309q24155j369461l28878m40150k492346l866497k315715Q58296
$$ plain form
2976 -4779256 -1935024 783080 2084007 1514120 -430834 -2098700 -2291702 -2142418 -3560746
2967 -3560746 -5757624 -5537496 -1676967 3016073 4935230 3338042 99111 -2376036
2959 -2376036 -2165945 1253798 5837100 8361399 8206859 7987048 9078430 8732124 4046717
2950 4046717 -2800547 -6455412 -5168374 -2717631 -2977483 -5063291 -5326811 -2623384 333815
2941 333815 696171 -924136 -1460229 418189 2369040 1445677 -1771057 -3831393 -3196478
2932 -3196478 -2257928 -3540251 -5720843 -5322884 -1358070 3736563 7361825 8971358 8938340
2923 8938340 7082964 3233802 -1608180 -5459990 -6747592 -5654266 -4112856 -3727260
2915 -3727260 -3443774 -556043 5199850 10177924 11011401 8739455 6560076 4934761 2155499
$$ packed form
2976d779256K844232K718104J300927n69887j944954j667866j93002J49284j418328
2967c560746k196878K20128L860529M693040J919157j597188l238931k475147
2959b376036K10091L419743M583302K524299j54540k19811J091382l46306m685407
2950D046717o847264l654865J287038K450743k59852k085808k63520K703427K957199
2941C33815L62356j620307n36093J878418J950851r23363l216734k060336O34915
2932c196478R38550j282323k180592L97959L964814N094633L625262J609533l3018
2923H938340j855376l849162m841982l851810j287602J093326J541410L85596
2915c727260K83486K887731N755893M978074Q33477k271946k179379j625315k779262
$$ plain form
2906 2155499 -932749 -858900 2990396 6547286 6559403 4825367 4643990 5777725 5929422
2897 5929422 5139588 5164576 5563648 4047710 680460 -1441197 -275207 2843567 5456293
2888 5456293 6323404 5181408 2696813 1383933 3893794 9021130 11842992 9677966
2880 9677966 5776492 4773787 6272209 5941096 2071715 -2300989 -4092611 -4021601 -4545267
2871 -4545267 -6067361 -6857837 -5586102 -2466174 1463876 4938473 6653311 5957795 3504297
2862 3504297 726367 -1289991 -2173516 -1865291 -360006 2176208 5179135 7458533 7463824
2853 7463824 4634697 702856 -1371472 -502183 1220767 1157258 -697106 -2280025 -2600834
2844 -2600834 -2734518 -3725916 -5092940 -5874054 -5831958 -4972981 -3100526 -714405 755227
$$ packed form
2906B155499l088248P3849L849296L556890J2117j734036j81377J133735J51697
2897E929422p89834K4988L99072j515938l367250k121657J165990L118774K612726
2888E456293Q67111j141996k484595j312880K509861N127336K821862k165026
2880I677966l901474j002705J498422l31113l869381m372704j791622P1010n23666
2871d545267j522094p90476J271735L119928L930050L474597J714838o95516k453498
2862C504297k777930k016358q83525L08225J505285K536214L002927K279398N291
2853G463824k829127l931841k074328Q69289J722950o3509j854364j582919l20809
2844b600834j33684r91398j367024p81114M2096Q58977J872455K386121J469632
$$ plain form
2835 755227 704531 384053 874870 933554 -1367807 -5288041 -7754184 -7238002 -5282034
2826 -5282034 -3515845 -1266776 2359330 5688154 5974089 3032551 -639666 -3131649
2818 -3131649 -4557992 -5219326 -4508953 -2451960 -586840 -213263 -1061256 -2611654 -5151483
2809 -5151483 -8139621 -9145217 -6581579 -2546946 -607348 -1289449 -2238861 -2459775 -3235084
2800 -3235084 -4387792 -3255596 698908 3367503 1093991 -3772914 -5812861 -3745721
2792 -3745721 -1046694 76491 1194400 3430478 4640043 2809376 -580606 -2893758
2784 -2893758 -3915452 -4785472 -5202856 -4348478 -3343055 -4023538 -5869963 -6627622 -5626903
2775 -5626903 -4175835 -2957158 -1422162 356926 1699096 3219694 6112331 9261418
$$ packed form
2835G55227n0696l20478M90817N8684k301361l920234k466143N16182J955968
2826e282034J766189K249069L626106L328824K85935k941538l672217k491983
2818c131649j426343o61334P10373K056993J865120L73577q47993j550398k539829
2809e151483k988138j005596K563638M034633J939598o82101r49412k20914p75309
2800c235084j152708J132196L954504K668595k273512m866905k039947K067140
2792c745721K699027J123185J117909K236078J209565j830667l389982k313152
2784b893758j021694q70020m17384Q54378J005423o80483j846425p57659J000719
2775e626903J451068J218677J534996J779088J342170J520598K892637L149087
$$ plain form
2767 9261418 9941112 8108027 6951177 7874477 8086666 5274289 1665355 435253 547431
2758 547431 -970124 -3171430 -2097374 2638282 6490328 6182873 3548907 1640518 484529
2749 484529 -867802 -986711 1795097 5416415 5849540 2663674 -134491 661793 3721918
2740 3721918 5483241 4221841 701217 -3577649 -7134965 -8473062 -7118894 -4664514
2732 -4664514 -3372122 -3463712 -2943168 -582206 2104373 2945238 2355489 2822507 5138323
2723 5138323 6965096 6128163 3909998 3399054 5265298 7066522 6709433 4783083 3047053
2714 3047053 2284503 2377156 2926774 2797311 586897 -3024735 -4763629 -2462320 1626178
2705 1626178 3206785 1035014 -2458749 -5113931 -6937939 -7913613 -6934676 -4223976 -2283280
$$ packed form
2767I261418O79694j833085j156850R23300K12189k812377l608934j230102J12178
2758E47431j517555k201306J074056M735656L852046l07455k633966j908389j155989
2749D84529j352331j18909K781808L621318M33125l185866k798165P96284L060125
2740C721918J761323j261400l520624m278866l557316j338097J354168K454380
2732d664514J292392r1590N20544K360962K686579Q40865n89749M67018K315816
2723E138323J826773q36933k218165n10944J866244J801224l57089j926350j736030
2714C047053p62550R2653N49618j29463k210414l611632j738894K301309M088498
2705A626178J580607k171771l493763k655182j824008r75674R78937K710700J940696
$$ plain form
2696 -2283280 -2526671 -2962762 -1445113 503934 -49149 -2475959 -3239465 -1455506 -382047
2687 -382047 -2352891 -5241209 -5772781 -3938615 -1797572 203338 2799675 4876108 4138884
2678 4138884 925057 -1567805 -1646799 -1204447 -2198758 -3360967 -2418692 -27721 966561
2669 966561 -337308 -1743738 -1205103 428417 568518 -2018885 -5621387 -6642060 -2530948
2660 -2530948 5496173 12840613 15513270 13628175 10214232 7261428 4485056 1627700
2652 1627700 -229261 -372375 212686 217574 -515761 -1730442 -3604463 -5750190 -6596960
2643 -6596960 -5171852 -2646999 -834060 11784 519522 270304 -1588653 -4185060 -5291678
2634 -5291678 -4047533 -1858509 -420861 -195708 -996402 -2587688 -4135801 -4274061 -2523801
$$ packed form
2696b283280k43391m36091J517649J949047n53083k426810p63506J783959J073459
2687c82047j970844k888318n31572J834166K141043K000910K596337K076433p37224
2678D138884l213827k492862p8994M42352r94311j162209R42275K390971R94282
2669I66561j303869j406430N38635J633520J40101k587403l602502j020673M111112
2660b530948Q027121P344440K672657j885095l413943k952804k776372k857356
2652A627700j856961j43114N85061M888p33335j214681j874021k145727q46770
2643f596960J425108K524853J812939Q45844N07738k49218j858957k596407j106618
2634e291678J244145K189024J437648K25153q00694j591286j548113j38260J750260
$$ plain form
2625 -2523801 -29053 1609721 1856609 1563750 2252183 4771806 7949642 9109152 7086053
2616 7086053 4156598 3365613 4427339 4444782 2533733 914418 751657 64550 -2381243
2607 -2381243 -3950787 -1864478 1866684 2770667 385641 -1213477 451541 3058172
2599 3058172 3548936 2400726 1862583 2149715 1910108 1278049 1863849 3928687 5762900
2590 5762900 6173951 5776987 5231943 3880023 1232185 -1462750 -2606980 -2454971 -2327839
2581 -2327839 -2066224 -245353 2837149 4558517 3508108 1755116 1726111 2313144 755412
2572 755412 -2276088 -2709381 1168909 5893602 7285488 5416257 3182169 1920279 1015397
2563 1015397 588080 1602811 3506591 4310975 3312466 1706810 327980 -1097337 -2116015
$$ packed form
2625b523801K494748J638774K46888k92859O88433K519623L177836J159510k023099
2616G086053k929455p90985J061726J7443j911049j619315j62761o87107k445793
2607b381243j569544K086309L731162R03983k385026j599118J665018K606631
2599C058172M90764j148210n38143K87132k39607o32059N85800K064838J834213
2590E762900M11051l96964n45044j351920k647838k694935j144230J52009J27132
2581b327839K61615J820871L082502J721368j050409j752992k9005N87033j557732
2572G55412l031500m33293L878290M724693J391886j869231k234088j261890r04882
2563A015397m27317J014731J903780Q04384r98509j605656j378830j425317j018678
$$ plain form
2554 -2116015 -1395585 555161 700746 -2773916 -7485142 -9441416 -7763566 -5160000 -4217285
2545 -4217285 -4816911 -5144216 -3923777 -1406355 1038860 2122383 1855579 1445621 1658895
2536 1658895 1827311 1052054 -321870 -1385388 -2163965 -3107894 -3479803 -1932554 1121612
2527 1121612 3387273 3642278 3412860 4644942 6832759 7841480 6895592 5270589 4340313
2518 4340313 4453792 5710532 8150303 10581434 10677787 7356993 2338188 -1403977 -1968002
2509 -1968002 1140473 7372195 14273317 17606527 14876458 8611256 3888329 2401768
2501 2401768 1272210 -1826429 -5164961 -6058281 -4936609 -3969071 -3449760 -2337798 -1224459
2492 -1224459 -1648413 -2799948 -1997868 1126321 3632291 3246527 905902 -1664527 -4466571
$$ packed form
2554b116015P20430J950746J45585l474662m711226j956274J677850K603566R42715
2545d217285n99626l27305J220439K517422K445215J083523k66804m09958K13274
2536A658895J68416p75257j373924j063518p78577r43929l71909J547249L054166
2527A121612K265661K55005k29418J232082K187817J008721r45888j625003r30276
2518D340313J13479J256740K439771K431131R6353l320794n018805l742165n64025
2509a968002L108475O231722O901122L333210k730069o265202m722927j486561
2501B401768j129558l098639l338532q93320J121672R67538N19311J111962J113339
2492a224459m23954j151535Q02080L124189K505970l85764k340625k570429k802044
$$ plain form
2483 -4466571 -7717945 -9918251 -9644210 -8075084 -7535815 -8019210 -7024004 -2817369 3472567
2474 3472567 8959904 11105015 8899273 3254978 -3341909 -8209927 -9991236 -9022338
2466 -9022338 -6684916 -4552036 -3482602 -3025698 -2086955 -389731 1292419 2363901 2851634
2457 2851634 2504570 896406 -1068275 -1436834 -20346 706627 -1089780 -3926853 -5309171
2448 -5309171 -5202863 -5131873 -5241705 -4952260 -5499819 -8534906 -12337369 -12778044 -8757537
2439 -8757537 -3796663 -1220333 -433996 789483 2954889 5413508 7854947 9254703
2431 9254703 7604195 3176490 155377 1962262 6098997 6868196 2860702 -1414415
2423 -1414415 -1695396 1127409 3219093 2484375 -369841 -3637815 -5801068 -5908704 -4127482
$$ packed form
2483d466571l251374k200306K74041J569126N39269m83395R95206M206635O289936
2474C472567N487337K145111k205742n644295o596887m868018j781309R68898
2466i022338K337422K132880J069434M56904R38743J697224J682150J071482M87733
2457B851634l47064j608164j964681l68559J416488P26973j796407k837073j382318
2448e309171J06308P0990j09832K89445n47559l035087l802463m40675M020507
2439h757537M960874K576330P86337J223479K165406K458619K441439J399756
2431I254703j650508m427705l021113J806885M136735P69199m007494m275117
2423a414415k80981K822805K091684p34718k854216l267974k163253j07636J781222
$$ plain form
2414 -4127482 -1375370 2222001 7383138 13282318 16597830 14842309 9957667 6498238
2406 6498238 6201471 6356557 4119737 436777 -1772855 -1868930 -1791258 -2605228 -3034674
2397 -3034674 -1918077 -124092 1169559 2564056 5153858 8216319 10179909 11313910
2389 11313910 13080503 14689806 12956119 6883245 309325 -2057294 -135396 1974067
2381 1974067 1328319 -948368 -2075196 -1175390 130707 -285681 -2845205 -5551843 -5788803
2372 -5788803 -3497592 -1832475 -3372527 -6387917 -6749325 -3270336 1020713 3099436
2364 3099436 3086084 2519658 1972972 1759979 2811232 4938904 5980822 4769367 3416858
2355 3416858 4256605 5881772 5177011 2428550 960285 1704065 1811505 -299421 -2026326
$$ packed form
2414d127482K752112L597371N161137N899180L315512j755521m884642l459429
2406F498238k96767J55086k236820l682960k209632r6075P7672q13970m29446
2397c034674J116597J793985J293651J394497K589802L062461J963590J134001
2389A1313910J766593J609303j733687o072874o573920k366619J921898K109463
2381A974067o45748k276687j126828Q99806J306097m16388k559524k706638k36960
2372e788803K291211J665117j540052l015390l61408L478989M291049K078723
2364C099436j3352n66426n46686k12993J051253K127672J041918j211455j352509
2355C416858Q39747J625167p04761k748461j468265P43780J07440k110926j726905
$$ plain form
2346 -2026326 -850636 1231607 443207 -3276706 -6570411 -7695642 -8183457 -9242489 -9310395
2337 -9310395 -6576623 -2319458 -12124 -1357896 -4180996 -4513277 -645939 4957502
2329 4957502 7954515 6342722 1974213 -2107564 -4717345 -6189764 -6252230 -4081266 -332789
2320 -332789 2623190 3149621 2086927 1573672 2789906 5129280 6939450 6848077 4920774
2311 4920774 2588480 906279 -845542 -3908419 -7662619 -9874769 -9518236 -7974691
2303 -7974691 -6939289 -6402593 -5403614 -3682427 -1822136 -651060 -1016109 -2956497 -4495260
2294 -4495260 -2840891 1971605 6025383 5690985 1758414 -2274038 -4881028 -7180958
2286 -7180958 -9599834 -10688925 -9739624 -8236381 -7705255 -7858419 -7933327 -8368060 -9807446
$$ packed form
2346b026326J175690K082243p88400l719913l293705j125231m87815j059032o7906
2337i310395K733772M257165K307334j345772k823100l32281L867338N603441
2329D957502K997013j611793m368509m081777k609781j472419o2466K170964L748477
2320c32789K955979N26431j062694n13255J216234K339374J810170r1373j927303
2311D920774k332294j682201j751821l062877l754200k212150L56533J543545
2303g974691J035402N36696R98979J721187J860291J171076l65049j940388j538763
2294d495260J654369M812496M053778l34398l932571m032452k606990k299930
2286g180958k418876j089091R49301J503243N31126j53164p4908m34733j439386
$$ plain form
2277 -9807446 -11398695 -11348076 -8791976 -4496637 -312838 1678929 575485 -2000254 -3000602
2268 -3000602 -1443444 116068 -1176616 -4587618 -6685738 -5665802 -3096503 -1365607
2260 -1365607 -1053774 -1316195 -1420372 -1016012 133567 1675918 2467160 1749591 303204
2251 303204 -246301 831840 2679495 3576298 2058572 -1975824 -6478990 -8202113 -5758993
$$ packed form
2277i807446j591249N0619K556100M295339M183799J991767j103444k575739j000348
2268c000602J557158J559512j292684l411002k098120J019936K569299J730896
2260a365607L11833k62421j04177M04360J149579J542351P91242p17569j446387
2251C03204n49505J078141J847655Q96803j517726m034396m503166j723123K443120
$$ [...]
##END NTUPLES=NMR SPECTRUM
##END=
