##TITLE=31Pdec_DE-138K2_TFA_d6
 DMSO-d6+CCl4,24 sc
 24.4.2026
##JCAMPDX= 6.0         $$ Bruker NMR JCAMP-DX V2.0
##DATA TYPE= NMR SPECTRUM
##DATA CLASS= NTUPLES
##ORIGIN= UXNMR, Bruker Analytische Messtechnik GmbH
##OWNER= root
$$ XWIN-NMR		Version 3.5
$$ Fri Apr 24 13:45:49 2026 Russian Standard Time (UT+4h)  she@DPX200
##.OBSERVE FREQUENCY= 81.013821
##.OBSERVE NUCLEUS= ^31P
##.ACQUISITION MODE= SIMULTANEOUS
##.ACQUISITION SCHEME= undefined
##.AVERAGES= 24
##.DIGITISER RES= 17
##SPECTROMETER/DATA SYSTEM= spect
##.PULSE SEQUENCE= zgpg30
##.SOLVENT NAME= DMSO
##.SHIFT REFERENCE= (INTERNAL, DMSO, 0, 197.392)
##AUDIT TRAIL= $$ (NUMBER, WHEN, WHO, WHERE, WHAT)
$$ ##TITLE= Audit trail, XWIN-NMR		Version 3.5
$$ ##JCAMPDX= 5.01
$$ ##ORIGIN= Bruker BioSpin GmbH
$$ ##OWNER= she
$$ F:/spectra/data/she/nmr/P31/2/pdata/1/auditp.txt
$$ ##AUDIT TRAIL=  $$ (NUMBER, WHEN, WHO, WHERE, WHAT)
(   1,<2026-04-24 13:44:25.93 +0400>,<she>,<DPX200>,
      <created by zg, POWCHK disabled, PULCHK disabled
       configuration hash MD5:
       00 E9 B6 7A A2 85 ED C7 34 08 36 98 17 FE 4E 26
       data hash MD5: 32K
       62 8B 2E 07 BA 62 0C DE 28 23 93 95 C7 B7 DF FF>)
(   2,<2026-04-24 13:44:34.54 +0400>,<she>,<DPX200>,
      <Start of raw data processing
       efp BC_mod = 2 LB = 1.5 FT_mod = 6 PKNL = 1 PHC0 = 1158.5 PHC1 = 815.3004 SI = 64K 
       data hash MD5: 64K
       25 C9 B9 E7 8C 75 BF 1A 23 01 CD 5A 0C C2 95 83>)
(   3,<2026-04-24 13:45:02.29 +0400>,<she>,<DPX200>,
      <pk PHC0 = 119.1022 PHC1 = -412.8 
       data hash MD5: 64K
       AB 61 2F FA 73 9E AD 4F 1A 42 CD 6D 73 D1 89 91>)
(   4,<2026-04-24 13:45:07.81 +0400>,<she>,<DPX200>,
      <abs ABSG = 5 
       data hash MD5: 64K
       2A F0 3B 17 88 CA EE 02 B9 33 FD 86 49 15 C7 79>)
$$ ##END=
$$ 
$$ hash MD5
$$ E8 84 7C 59 3F 43 4D 00 8B 1D 70 08 9D C1 76 76
##$RELAX= 
##$RELAX= 
##$RELAX= 
##$RELAX= 
##$RELAX= 
##$RELAX= 
##$RELAX= 
##$RELAX= 
$$ Bruker specific parameters
$$ --------------------------
##$DU= <F:/spectra>
##$EXPNO= 2
##$NAME= <P31>
##$PROCNO= 1
##$TYPE= <nmr>
##$USER= <she>
##$AMP= (0..31)
100 100 100 100 100 100 100 100 100 100 100 100 100 100 100 100 100 100 
100 100 100 100 100 100 100 100 100 100 100 100 100 100 
##$AQSEQ= 0
##$AQ_mod= 1
##$AUNM= <au_zg>
##$AUTOPOS= <>
##$BF1= 81.014009
##$BF2= 200.13
##$BF3= 200.13
##$BF4= 200.13
##$BF5= 200.13
##$BF6= 200.13
##$BF7= 200.13
##$BF8= 200.13
##$BYTORDA= 1
##$CFDGTYP= 0
##$CFRGTYP= 5
##$CHEMSTR= <none>
##$CNST= (0..31)
1 1 145 1 1 1 1 1 1 1 1 1 1 1 1 1 1 1 1 1 1 1 1 1 1 1 1 1 1 1 1 1 
##$CPDPRG= <waltz16>
##$CPDPRG1= <>
##$CPDPRG2= <waltz16>
##$CPDPRG3= <>
##$CPDPRG4= <mlev>
##$CPDPRG5= <mlev>
##$CPDPRG6= <mlev>
##$CPDPRG7= <mlev>
##$CPDPRG8= <mlev>
##$CPDPRGB= <>
##$CPDPRGT= <>
##$D= (0..31)
0 1 0 0 0 0 0 0 0 0.06 0 0.03 2e-05 3e-06 0 0 0.0002 0 0 0 0 0 0 0 0 0 
0 0 0 0 0 0 
##$DATE= 1777023865
##$DBL= (0..7)
120 120 120 11 120 120 24 19 
##$DBP= (0..7)
150 150 150 150 150 150 150 150 
##$DBP07= 0
##$DBPNAM0= <>
##$DBPNAM1= <>
$$ [...]
##$SUBNAM3= <"">
##$SUBNAM4= <"">
##$SUBNAM5= <"">
##$SUBNAM6= <"">
##$SUBNAM7= <"">
##$SUBNAM8= <"">
##$SUBNAM9= <"">
##$SW= 400.765351723535
##$SWIBOX= (0..15)
0 1 3 0 0 0 0 0 0 0 0 0 0 0 0 0 
##$SW_h= 32467.5324675325
##$TD= 32768
##$TD0= 1
##$TE= 0
##$TE2= 300
##$TE3= 300
##$TEG= 300
##$TL= (0..7)
0 120 53 12 22 120 120 120 
##$TP= (0..7)
150 150 150 150 150 150 150 150 
##$TP07= 0
##$TPNAME0= <>
##$TPNAME1= <>
##$TPNAME2= <>
##$TPNAME3= <>
##$TPNAME4= <>
##$TPNAME5= <>
##$TPNAME6= <>
##$TPNAME7= <>
##$TPOAL= (0..7)
0.5 0.5 0.5 0.5 0.5 0.5 0.5 0.5 
##$TPOFFS= (0..7)
0 0 0 0 0 0 0 0 
##$TUNHIN= 0
##$TUNHOUT= 0
##$TUNXOUT= 0
##$USERA1= <user>
##$USERA2= <user>
##$USERA3= <user>
##$USERA4= <user>
##$USERA5= <user>
##$V9= 5
##$VALIST= <valist>
##$VCLIST= <CCCCCCCCCCCCCCC>
##$VD= 0
##$VDLIST= <DDDDDDDDDDDDDDD>
##$VPLIST= <PPPPPPPPPPPPPPP>
##$VTLIST= <TTTTTTTTTTTTTTT>
##$WBST= 1024
##$WBSW= 4
##$XGAIN= (0..3)
0 0 0 0 
##$XL= 0
##$YL= 0
##$YMAX_a= 5855
##$YMIN_a= -5003
##$ZGOPTNS= <>
##$ZL1= 120
##$ZL2= 120
##$ZL3= 120
##$ZL4= 120
##$ABSF1= 197.3918
##$ABSF2= -203.3724
##$ABSG= 5
##$ABSL= 3
##$ALPHA= 0
##$AQORDER= 0
##$ASSFAC= 0
##$ASSFACI= 0
##$ASSFACX= 0
##$ASSWID= 0
##$AUNMP= <proc_1d>
##$AZFE= 0.1
##$AZFW= 0.5
##$BCFW= 0
##$BC_mod= 2
##$BYTORDP= 0
##$COROFFS= 0
##$CY= -3
##$DATMOD= 1
##$DC= 0
##$DFILT= <>
##$DTYPP= 0
##$F1P= 0
##$F2P= 0
##$FCOR= 1
##$FTSIZE= 65536
##$FT_mod= 6
##$GAMMA= 0
##$GB= 0
##$INTBC= 1
##$INTSCL= 9.790993e-09
##$ISEN= 30
##$LB= 1.5
##$LEV0= 0
##$LPBIN= 0
##$MAXI= 10000
##$MC2= 0
##$MEAN= 0
##$ME_mod= 0
##$MI= 50
##$NCOEF= 0
##$NC_proc= -9
##$NLEV= 6
##$NOISF1= 182.463
##$NOISF2= 159.3651
##$NSP= 0
##$NTH_PI= 0
##$NZP= 0
##$OFFSET= 197.3918
##$PC= 4
##$PHC0= 1277.602
##$PHC1= 402.5004
##$PH_mod= 1
##$PKNL= yes
##$PPARMOD= 0
##$PSCAL= 0
##$PSIGN= 0
##$REVERSE= no
##$SF= 81.014063255964
##$SI= 65536
##$SIGF1= 159.3651
##$SIGF2= -187.1042
##$SINO= 113.3802
##$SIOLD= 16384
##$SREGLST= <1H.CDCl3>
##$SSB= 0
##$STSI= 65536
##$STSR= 0
##$SW_p= 32467.5324675325
##$SYMM= 0
##$S_DEV= 0
##$TDeff= 32768
##$TDoff= 0
##$TI= <>
##$TILT= no
##$TM1= 0
##$TM2= 0
##$TOPLEV= 0
##$USERP1= <user>
##$USERP2= <user>
##$USERP3= <user>
##$USERP4= <user>
##$USERP5= <user>
##$WDW= 1
##$XDIM= 65536
##$YMAX_p= 536541386
##$YMIN_p= -111555556
$$ End of Bruker specific parameters
$$ ---------------------------------
##NTUPLES= NMR SPECTRUM
##VAR_NAME=  FREQUENCY,     SPECTRUM/REAL,   SPECTRUM/IMAG
##SYMBOL=    X,             R,               I
##VAR_TYPE=  INDEPENDENT,   DEPENDENT,       DEPENDENT
##VAR_FORM=  AFFN,          ASDF,            ASDF
##VAR_DIM=   65536,         65536,           65536
##UNITS=     HZ,            ARBITRARY UNITS, ARBITRARY UNITS
##FACTOR=    0.49542278885378, 1,            1
##FIRST=     15991.5117654749, 0,            0
##LAST=      -16476.0207020576, 0,           0
##MIN=       -16476.0207020576, -111555556,  0
##MAX=       15991.5117654749, 536541386,    0
$$ Real data points
##PAGE= N=1
##DATA TABLE= (X++(R..R)), XYDATA
$$ [...]
45415 6977491 7035886 7346670 8110624 7835266 4790920 -104940 -3074845 -1480036 2556460
45406 2556460 4319687 2140582 -1323116 -3660209 -5698468 -8588369 -10634717 -9423414
45398 -9423414 -5353901 -792210 2847189 5160966 5652921 4873698 4788585 5421661 3417778
45389 3417778 -2593462 -7644255 -6348269 -1561421 -1149919 -6430411 -10416416 -8744891
45381 -8744891 -5534400 -5526750 -6888086 -6330424 -5876703 -8742883 -12519978 -12692377 -10163493
45372 -10163493 -9042690 -9034455 -6613424 -2526297 -1105188 -2098951 -232375 5724851 10024523
45363 10024523 8594493 4962737 4371694 6738207 8895288 9727926 9436336 7187591
45355 7187591 3253262 613584 880876 1249213 -1060960 -4013177 -4195916 -2576693 -2559742
45346 -2559742 -4112828 -4181637 -1844740 911336 2627230 2915877 762663 -3766680 -7268039
45337 -7268039 -6815932 -5146988 -7235944 -12218426 -14135931 -11030211 -7436989 -6316946
45329 -6316946 -4483785 751620 5548096 4784042 32003 -2540872 -562187 2484803
45321 2484803 2844223 553378 -1975448 -2622670 -591696 3183824 6395735 7284977 5854495
45312 5854495 2397778 -3660236 -11636330 -17738965 -18149341 -13698881 -9016756 -6891761
45304 -6891761 -5851336 -3892871 -2121134 -2884134 -5655175 -7018205 -4928812 -1419323
45296 -1419323 -28428 -1151469 -1260022 2909829 10367843 16757822 18463588 15047022
45288 15047022 8643588 2456756 -804323 -890413 -333579 -1219050 -2103578 -291593 3346798
45279 3346798 5018697 3796995 3020840 4380585 4423192 -42545 -6054531 -7946011 -4927972
45270 -4927972 -1186174 590191 1478896 2211298 1269541 -1594180 -3737624 -3739480 -4202732
45261 -4202732 -7669087 -11759883 -11685580 -6903736 -2117147 -1122421 -2216700 -1147983 3048074
45252 3048074 7179111 8300931 6916287 5323490 4594178 4570272 5667478 8561754 12045358
45243 12045358 13025180 9516588 2839885 -3471706 -6176262 -3992082 1559946 6584254
45235 6584254 7792693 5887748 4522977 5245863 5450323 2563102 -1989527 -5237412
45227 -5237412 -7347296 -10818203 -15600989 -18042672 -15188914 -7976146 366628 7104802
45219 7104802 10438862 9131349 3447458 -4011562 -9607615 -11135470 -8979740 -5000302
45211 -5000302 -390605 5146383 11714269 17203463 18488221 15146521 10441633 7554557
45203 7554557 6247426 4534512 2073590 -8733 -1348186 -2109164 -1558892 466121
45195 466121 1330189 -2036363 -8280043 -12025378 -10079550 -5041451 -1833786 -2610842 -5956597
45186 -5956597 -9104035 -9741943 -7300693 -3765848 -2026737 -2533354 -2950578 -1898872 -1192030
45177 -1192030 -2870111 -5536665 -5705418 -2229641 2317503 4587912 3546862 608289
45169 608289 -2260318 -4132789 -5212360 -5809807 -5719750 -4851812 -3853662 -3341576 -3031101
45160 -3031101 -2605899 -2762894 -3868315 -4142163 -1375406 3405678 6256607 5052121 2020087
45151 2020087 730228 2378921 5929714 9912381 12750849 13146404 11779962 11162325
45143 11162325 12210697 12433739 9260755 3770104 -921178 -3803792 -6226879 -8774431
45135 -8774431 -10305725 -9974809 -8165222 -5308636 -1445967 2873053 6539418 8695388
45127 8695388 8628101 5574433 153424 -4726681 -6373352 -5399283 -4419532 -4095905 -2716793
45118 -2716793 547773 4546179 8338274 11686684 13110744 10840522 6745655 5653511
45110 5653511 8713652 10968845 8448327 4273753 3623295 5568465 5429136 3458976
45102 3458976 4373493 8027908 7969971 1993082 -2694115 289137 6571867 7737443 3989873
45093 3989873 2463684 4914242 5617906 2008819 -939905 298538 1745646 -832255
45085 -832255 -4576753 -4666034 -2024117 -187513 1489616 4907792 6543809 1369680 -7655215
45076 -7655215 -11735731 -8515708 -5010952 -6454595 -9074020 -7397197 -2965140 -1099812
45068 -1099812 -3020604 -6016696 -8807482 -12044762 -14950557 -15671544 -14533325 -13724663
45060 -13724663 -13942789 -13829141 -12474697 -10397623 -8210303 -5830046 -2682996 2109960
45052 2109960 8566283 14107370 15166743 12106555 10062212 12385232 15495051 13563175
45044 13563175 6672932 481340 -1438437 -935624 -947881 -1726665 -2388669 -3016835 -3669547
45035 -3669547 -3591148 -2839861 -2901780 -4379514 -5479080 -3904997 818784 7552535 14680627
45026 14680627 20218487 22127137 19799891 14794593 9560710 5940174 4865778 6201039
45018 6201039 8241869 8494186 5996221 2507971 790212 1879349 4246354 5341927
45010 5341927 3943760 1342104 85220 1116099 2477404 1597085 -1370201 -3440060
45002 -3440060 -2171433 1608687 4754389 5048021 3209772 1723409 1829263 2231863 1318778
44993 1318778 -193135 -512639 -325245 -2423917 -6868425 -9300264 -6284436 -190434
44985 -190434 4081133 5651581 7502413 10535361 11764782 9213988 5336088 3879708
44977 3879708 5440909 7663906 8272076 6413762 2232250 -3202787 -7846916 -9699277
44969 -9699277 -8113429 -4029233 787578 4750546 7189742 8241162 8023743 6514732
44961 6514732 4498939 3590778 4431489 5679945 5671793 4205213 1906157 -853919 -3336460
44952 -3336460 -4369921 -4375779 -5593918 -8364886 -9405057 -6639281 -3615000 -5118247 -9717666
44943 -9717666 -11323865 -7919994 -3915751 -3025775 -3531698 -2606377 -1400626 -2995536 -7754594
44934 -7754594 -13142974 -16591464 -17005843 -15014219 -12794826 -12081949 -11860421 -9948409 -6715870
44925 -6715870 -4294564 -2162751 2428332 8790974 12121754 10467347 8024518 8760932
44917 8760932 10860159 10939865 9923901 10319306 10636563 7490535 1559498 -3210685 -5429540
44908 -5429540 -7147192 -9511216 -11369663 -12002400 -11945807 -11261270 -9836863 -8970281 -9823088
44899 -9823088 -10830842 -9504729 -6316320 -4061504 -4005526 -5351512 -7511884 -9772839
44891 -9772839 -9827972 -6472903 -3106787 -4381977 -9414719 -12512978 -11043670 -8337868
44883 -8337868 -7843321 -8537548 -7725215 -4750802 -187014 5272727 9157227 7686884 359744
44874 359744 -8314185 -13665081 -15133150 -14142778 -11015819 -6791500 -5096926 -8074574
44866 -8074574 -11865062 -10304182 -3124380 2968841 2288612 -3222827 -6631751 -3791213
44858 -3791213 2765470 7081600 5871287 1083969 -3252574 -5805068 -8473282 -12396181
44850 -12396181 -15232302 -13684691 -7895142 -1766522 1329956 2189226 4320974 9078127
44842 9078127 13437395 13735869 10807724 9064054 10132847 10480327 7287013 3635441
44834 3635441 4172655 7640891 8479216 5197907 2019420 1626487 1566913 -264600 -1617615
44825 -1617615 -470430 689600 -863264 -2986138 -2332621 -448765 -1102606 -3117719
44817 -3117719 -1389777 4959936 10435830 10267785 5686376 772602 -2403106 -3688172
44809 -3688172 -2954528 -768618 905482 940067 973061 3395887 8039130 12032127 12450975
44800 12450975 8522319 2185321 -2790794 -3337151 195195 4473082 6979480 8433278
44792 8433278 10664779 13358283 14470214 13255061 11152263 9654737 8839361 8426695
44784 8426695 8803175 9843266 9659875 6251885 532991 -3786002 -4207482 -2330976 -1580137
44775 -1580137 -2866175 -4236648 -4566652 -5343264 -7894325 -10717051 -11191587 -8875344 -5504556
44766 -5504556 -2546163 -470888 159729 -1015164 -2704838 -2774746 -1146673 -378759 -2505489
44757 -2505489 -6382091 -8951270 -8265798 -4583412 537582 5154579 7513950 6904512
44749 6904512 4178199 1092568 -831732 -893876 576318 2137201 2081449 179896 -1798416
44740 -1798416 -2130079 -1440065 -1958910 -4404803 -6715166 -6583001 -4541614 -3465997 -5128504
44731 -5128504 -8304722 -10609215 -11151715 -10488611 -8802806 -5780809 -2340986 -719148
44723 -719148 -1784932 -3353331 -2453302 1287062 5653318 8590866 9381712 7478623 2429861
44714 2429861 -4169536 -8450090 -7692747 -3349119 619555 1912429 1194513 -147107
44706 -147107 -1696078 -3241082 -4094878 -4130064 -4265025 -4763749 -3997062 -380927 4854760
44697 4854760 8310653 7853720 4200071 -833688 -6019584 -10246630 -12173761 -11660236
44689 -11660236 -10429542 -9962638 -9578070 -7980650 -5836943 -4932393 -5170047 -4517973 -2143013
44680 -2143013 438858 1977419 3278005 5179477 6431599 5386382 2863337 1427411
44672 1427411 2037465 3017476 2514806 663374 -1131937 -2082105 -2538935 -3073803 -3469927
44663 -3469927 -2532618 972761 6612791 11401801 11456488 5482243 -3292154 -9326355 -9501408
44654 -9501408 -5611686 -1872301 -280677 714430 2961874 5500735 5893815 3817505
44646 3817505 1593830 1116424 1811882 2184504 2103988 2678829 4613447 7444345 9925469
44637 9925469 10701370 9141963 5949302 2521391 -411748 -2936875 -4940039 -6114057
44629 -6114057 -6980267 -8276002 -8905761 -6483969 -1090502 3414753 3758619 1587402 1139760
44620 1139760 3398114 5178957 4064040 1652903 941171 2358157 3824254 3676915
44612 3676915 2130648 201266 -1656381 -3561714 -5346508 -6141203 -5166709 -3049178
44604 -3049178 -1875583 -3308978 -6666946 -9339661 -9230263 -6608697 -3625472 -2128027
44596 -2128027 -1876133 -1088704 831850 1602528 -1537730 -7506195 -11193993 -8817220 -2239973
44587 -2239973 3467305 5731711 5944444 6014332 5861962 4659728 2566382 225900 -2378788
44578 -2378788 -5740250 -10006893 -14624904 -18299699 -19506660 -17991915 -15635712 -14566235
44570 -14566235 -14304782 -12266588 -7672783 -3485451 -3192874 -6487520 -9515692 -9195966
44562 -9195966 -6069217 -2736461 -743686 57255 -170986 -1862762 -4427666 -5436810
44554 -5436810 -3049394 1112145 3144031 1158674 -2905795 -5922193 -6436080 -4575381
44546 -4575381 -1160326 2023853 2956201 1890592 1529497 3133116 4287178 2683265
44538 2683265 385603 1464559 6419983 11901514 15264180 16298883 14918301 10747005
44530 10747005 5442985 2030042 933469 -363825 -2773803 -3960896 -2793312 -2175862
44522 -2175862 -4883529 -8959303 -10125121 -7248116 -2775095 1051253 3682229 4737090
44514 4737090 3825746 1969170 892055 518853 -903179 -3659499 -5415337 -4368241
44506 -4368241 -2251841 -2465027 -5388859 -7242606 -4617690 751130 3482799 1047779
44498 1047779 -3022327 -3641548 -445079 2412844 1930934 -709193 -2910063 -4133806
44490 -4133806 -5586707 -7837169 -9813616 -9714115 -6748448 -2430627 459700 1128024 1941957
44481 1941957 4827708 7803075 7506637 4064160 375653 -2545768 -5676725 -7833888
44473 -7833888 -6144872 -1495731 1254954 307875 -328370 2454542 5797478 5778593 3464559
44464 3464559 2135681 1695264 140240 -1854930 -2128094 -990555 -121571 695757 1980038
44455 1980038 1767925 -1352424 -4342119 -3506293 -616767 -246496 -2206164 -2132060 829393
44446 829393 2587318 837123 -1996265 -3445255 -3783795 -3100816 -378755 3172766 4483494
44437 4483494 3800119 4849849 8137407 9037401 5131284 801122 1187953 5365709 8889466
44428 8889466 9806918 8785669 6359999 3624942 3076960 5268932 6823301 4913036
44420 4913036 1397475 -626965 -1758468 -4084575 -6549893 -6908531 -6489178 -8300612
44412 -8300612 -11376628 -11778028 -9152986 -7831162 -10567132 -14843273 -16613265 -14974675
44404 -14974675 -11938077 -9543960 -8165427 -6545236 -3484538 -363549 -712389 -5418348
44396 -5418348 -9924291 -9093295 -3815252 464767 1008709 -143212 -1052159 -2586627 -5399778
44387 -5399778 -8010154 -9378799 -10225196 -10235170 -7028708 11744 7271820 10396510 8651665
44378 8651665 4450214 481750 -1357565 -469041 1178044 295296 -3298091 -5479320
44370 -5479320 -3180748 1017540 2251032 -300308 -3415406 -4982830 -5758185 -6322200
44362 -6322200 -5770831 -4178449 -3479940 -4526875 -5366728 -3975656 -1126030 1125253 2659173
44353 2659173 5012338 8159730 9595651 7596047 4380368 4500999 9682433 16149923
44345 16149923 18078106 13549334 6144249 572155 -1936803 -3128168 -4039511 -3778474
44337 -3778474 -1754926 913974 3082451 5201289 7883058 9693192 8188279 3312581
44329 3312581 -1780685 -4063503 -3677366 -2656507 -1682831 142921 2688890 4160357
44321 4160357 3786358 3267553 4174303 5300934 4386374 1563560 -934111 -2150638 -3426305
44312 -3426305 -5881117 -8749173 -10678367 -11041061 -9454312 -5789697 -1600351 102993
44304 102993 -2046545 -5818753 -7728366 -6621458 -3985172 -1537738 305052 2041319
44296 2041319 4141854 6258216 6995705 5217860 1932105 -296906 -395948 211330 451422
44287 451422 1473918 4011687 5817175 4406084 1212860 18371 1689589 3538070
44279 3538070 3930800 4218887 5206872 4952043 2027877 -1402466 -2119488 16363 2637045
44270 2637045 4542529 6619293 9530919 12450205 14232017 14570122 13869620 12796688
44262 12796688 11813924 10496944 7740882 3430631 -604930 -2270215 -1504565 -27696
44254 -27696 930021 1789475 3600750 6355113 8199805 6516581 850310 -5218489 -7051968
44245 -7051968 -4670802 -3267169 -6217897 -9846088 -8173697 -1400272 4201889 4562766
44237 4562766 2024090 532139 459344 146520 -401739 50009 1630962 3620508 5616478
44228 5616478 6656243 4839187 42691 -4290547 -4485402 -1022517 2420565 3451281
44220 3451281 2338240 -161079 -3558984 -6328103 -6509839 -4285102 -2063579 -1538248
44212 -1538248 -2249505 -3177770 -3765306 -3013924 136552 4490145 6647141 4887320 1582700
44203 1582700 157026 746786 727820 -993790 -2315366 -1169104 997370 443136 -4101719
44194 -4101719 -9053609 -9539690 -5212278 -1089843 -1898216 -6835414 -11159828 -11763847 -9320573
44185 -9320573 -5846236 -2785318 -1502364 -2821936 -5054327 -4883678 -1845295 -66365
44177 -66365 -3515636 -10607572 -15553970 -14695233 -9915049 -5986422 -5937515 -9086508 -12447230
44168 -12447230 -13596678 -12613980 -11407468 -11124677 -10649499 -7985651 -2731575 3205927
44160 3205927 7107890 7526469 5380261 3256101 3287005 5558019 8621271 10884501 10826679
44151 10826679 6998005 -205059 -7020012 -8852485 -4994952 851210 5195281 7922337
44143 7922337 10146955 11261060 9899177 6458588 2948731 939511 483830 229261
44135 229261 -1710276 -5572526 -8507488 -7467553 -3805115 -2034580 -3257580 -3683609
44127 -3683609 -1614142 -1466026 -6967099 -14007172 -15616081 -11991192 -9764534 -11873405
44119 -11873405 -13895921 -11288671 -5207606 667913 5009628 8242000 10054769 9833214
44111 9833214 7880717 4956855 2030095 585907 940651 462723 -3350104 -7914504
44103 -7914504 -7651413 -2051612 2506943 1017043 -3884377 -6558824 -5858748 -4561755
44095 -4561755 -3867088 -2324243 857113 4547735 7300067 8174536 6691173 3499401
44087 3499401 118865 -2948531 -6034714 -7341379 -3250249 6150563 14821300 17232746
44079 17232746 14689253 11781414 9006690 3528871 -4138920 -9448062 -10074632 -8424773
44071 -8424773 -7003844 -5222841 -2279217 146311 166340 -1512867 -2909748 -3509166 -4358435
44062 -4358435 -6310596 -8812917 -9729280 -6643564 254267 6957048 9214784 7192003
44054 7192003 4617915 3603510 2830916 1008979 -734348 -828357 751956 3516230 7369532
44045 7369532 11437377 13928392 14217604 13309660 11551741 8188990 4234701 3125477
44037 3125477 6546402 11640871 14529091 14937525 15064491 15323533 13979081 10386191 5962169
44028 5962169 1846375 -2279963 -6615436 -10145623 -11810523 -11763999 -10975255 -10227267 -9775006
44019 -9775006 -9438534 -8737097 -7170339 -4542122 -1137435 2204712 4476197 5648603
44011 5648603 7257807 10717451 14848273 16407486 13848583 9564182 7425304 8656534
44003 8656534 10937870 11231384 8940050 6454787 6645801 9492402 11702471 10590802
43995 10590802 7478183 5318443 3669793 -698118 -7594337 -11584846 -8761394 -2417572
43987 -2417572 1260627 1162192 1285918 4078095 7768789 10131650 10859404 9411704 4320703
43978 4320703 -3390337 -8940169 -8490834 -3584197 1161849 3479052 4428820 4957288 4194738
43969 4194738 1650234 -868421 -869419 1830072 4700199 5259342 3752568 2539090 2881242
43960 2881242 3295663 1899177 -373955 -548065 2233783 5029767 4655232 1802982 128734
43951 128734 1615844 4340759 5134551 3274732 729267 -571736 -509237 270300 1936017
43942 1936017 4828075 7569695 7386496 3205577 -2365608 -5303620 -4237066 -1379488
43934 -1379488 424901 507290 -5267 -408566 -1542142 -4841488 -10392338 -15789420 -17421676
43925 -17421676 -13832423 -7713344 -3423024 -2320688 -1886242 -35915 1412439 -625462
43917 -625462 -5360760 -8219277 -6639823 -3551003 -3333072 -5692048 -6129159 -2549208 1283121
43908 1283121 582750 -3759851 -5841345 -2037005 4541304 7695973 4766387 -1411954
43900 -1411954 -6015391 -6434285 -3645121 -665271 438254 561604 2134587 5323189
43892 5323189 6870971 3883953 -2251755 -7272397 -8603113 -6882794 -3807262 -832875
43884 -832875 214961 -2026403 -6249278 -9175018 -9242419 -7814354 -6400680 -5221369 -5200915
43875 -5200915 -7997494 -12068230 -12102658 -5762080 1635596 3430733 817076 545980 4025540
43866 4025540 4766664 -1664607 -10748074 -15537711 -15761984 -15858900 -16938559 -16103172 -12577199
43857 -12577199 -9148354 -7102813 -4378912 -72356 3224864 3574122 2887028 3568588
43849 3568588 4595323 3609128 905943 -1432093 -2869529 -4160263 -5070718 -5254455 -6251005
43840 -6251005 -9225406 -11403492 -8804858 -2943681 -559849 -4767864 -9986921 -8602209
43832 -8602209 -324247 8276807 12056039 11646394 10032940 8350654 6137514 3319791
43824 3319791 330464 -2544152 -4689234 -4797692 -2121408 2159436 5636070 6833400
43816 6833400 6327575 5688065 5589653 5217498 3542648 777806 -1928279 -4023203 -5951922
43807 -5951922 -7902401 -9056767 -8535697 -6374436 -3248424 -186236 1085367 -986981
43799 -986981 -5422452 -8528508 -7777653 -5032093 -4061321 -5426558 -6007942 -3591588 357622
43790 357622 3170374 4214292 4430612 4107123 2748513 545105 -1542731 -3255804 -5495949
43781 -5495949 -8697640 -11225847 -10429409 -5827968 -455954 2273584 2667573 3736720
43773 3736720 5945334 5947295 2190992 -1374201 -596275 2188337 1418372 -2785358 -4482980
43764 -4482980 -1324200 1603831 -165027 -3601754 -3374825 -179403 966063 -1497820
43756 -1497820 -4559778 -6278316 -7712203 -9134700 -8712474 -6097033 -3974301 -4574308
43748 -4574308 -6980592 -8968860 -9459459 -8333971 -5925507 -3671857 -3405923 -4944306
43740 -4944306 -5853927 -4369588 -1172682 2067480 4156767 4070699 1494437 -1438212 -1292950
43731 -1292950 2246668 5005546 3103241 -2380148 -7241155 -9255111 -9396273 -8900810
43723 -8900810 -7435785 -4360074 -350340 2702419 3100639 985366 -1244610 -1078044
43715 -1078044 1187722 2896992 2845954 2872298 4633338 6807970 7335403 6749778 6909187
43706 6909187 7567191 6843268 4488928 2041177 -18281 -2545765 -5069602 -5708173 -4568197
43697 -4568197 -4598319 -7567941 -11140514 -11580892 -7987747 -2414129 2797008 5987683 5600941
43688 5600941 1082301 -5308865 -9283734 -8180819 -3495734 705679 1840695 1063601
43680 1063601 1349744 3572820 5362612 4461551 2231174 2196835 5326119 8674408 9269230
43671 9269230 7581071 6098699 5987015 6651213 7555591 8754550 10032709 10921075 11338821
43662 11338821 11103658 9217568 4988639 -273762 -3984395 -4810916 -3478649 -1188293
43654 -1188293 1415874 3474608 3614111 1500457 -923783 -853168 2458025 6537051 7861949
43645 7861949 5389701 1587728 -597374 -1313857 -2966484 -5903774 -7259531 -5294340
43637 -5294340 -2562996 -2363329 -3830781 -3859622 -2847987 -4374198 -8827507 -11649068 -9740919
43628 -9740919 -6129373 -5637206 -8422104 -10496011 -8791595 -3329949 3716867 8640039
43620 8640039 8039460 3156501 380281 3785167 8949962 8598224 2951021 -1095376
43612 -1095376 -855679 -1464086 -6764045 -12674973 -13403938 -9662534 -6263228 -5035163 -4941971
43603 -4941971 -6553793 -10911378 -15157023 -14693084 -9860656 -5961313 -6021904 -7522029 -7156882
43594 -7156882 -5028336 -2689204 -337871 2234432 4423722 6085623 7841059 8986617
43586 8986617 7580793 3881370 1034897 719837 770364 -890667 -2689270 -2402068 -1274271
43577 -1274271 -1795682 -3036643 -1906809 1579778 3751214 2124430 -1898937 -5275362
43569 -5275362 -5799127 -2442673 3890930 9399947 9859327 5202180 -289294 -3115600
43561 -3115600 -3817325 -4310559 -4446518 -2970687 -103340 2845593 5292723 6989756 6807747
43552 6807747 3989552 209533 -1626434 -820259 473886 403681 -246539 355221 2263602
43543 2263602 3665020 3219461 1483074 -47768 -506568 17715 993130 1578155 660424
43534 660424 -2175250 -5456761 -6431920 -3540656 1877664 6490748 7291166 3357121 -3387856
43525 -3387856 -8690501 -8650343 -3290527 3002646 5572272 3654543 -3914 -2496340
43517 -2496340 -2612983 -669347 1642903 1995631 -33542 -1688443 -243158 3170228
43509 3170228 5283911 5619813 6622719 8898223 9914853 8452381 6777329 6419939
43501 6419939 4939394 -293045 -7370823 -12005448 -12983558 -12596507 -12646578 -12876739 -12875292
43492 -12875292 -12934225 -13034872 -12884732 -12671877 -12193282 -10146803 -6315800 -3336520 -3568327
43483 -3568327 -5002401 -3550453 753929 3404986 2003313 -212696 978365 5290059
43475 5290059 9064353 9919130 8285942 5784244 4036556 4255582 6384025 8974679
43467 8974679 10652591 10973118 9565237 6048274 1616882 -1150350 -1495754 -1816473 -3955621
43458 -3955621 -5653615 -3178019 3177803 8712388 9483918 5802429 346120 -5062634
43450 -5062634 -9793955 -13042021 -13648420 -11132994 -6362353 -1379977 1436484 850160
43442 850160 -2083222 -4788816 -5565589 -4912409 -4168738 -3414059 -1583760 1434527 3925658
43433 3925658 4258832 3021181 2227996 2652923 3144071 2723479 2026229 2080844 2930123
43424 2930123 4248624 5953423 7154506 6186586 3405520 2199857 4610195 7366931
43416 7366931 5772949 796824 -1930032 -497499 615468 -2019873 -5339735 -5134309
43408 -5134309 -3040647 -3554703 -6334331 -6688947 -3238240 -174464 -885888 -3281376 -3457030
43399 -3457030 -1395000 -666187 -3505450 -7833125 -9112482 -4858516 2393244 7033206
43391 7033206 6178253 2944534 2605124 6107500 9316485 8521383 4541532 867270 -411613
43382 -411613 131050 818636 664194 1011 -267496 49043 633358 2384150 7059270
43373 7059270 13587047 16709920 12419364 3857395 -1662568 -1340999 1062725 2100347
43365 2100347 3044510 5584660 7435130 5954399 3530063 5112090 11193336 16842153
43357 16842153 17829813 14825220 10909927 7385588 3432495 -1406115 -5977345 -8791661
43349 -8791661 -9834088 -10568750 -12002922 -13276774 -12846631 -10603231 -7702807 -4689040
43341 -4689040 -1456257 973887 848192 -1363571 -2448310 -220095 3721958 6288691
43333 6288691 6482879 5315838 3653508 1925688 915660 1025460 1341710 812152 -273748
43324 -273748 -1085646 -1641527 -2241960 -2497154 -2094754 -1507251 -888650 340537 1633344
43315 1633344 932181 -1993453 -3648597 -713623 5493378 10909976 13716426 14669068
43307 14669068 13924965 11257066 8863700 9908147 13660288 15609648 13520621 10320060
43299 10320060 9547596 10652762 10702739 8776417 6634984 6094984 7290380 9022747 9952981
43290 9952981 9750872 9203157 8794576 7858824 6110916 4861488 4963660 4915255 3611493
43281 3611493 3577498 7555667 12452228 11557840 3854999 -3442820 -3627703 2239163 8998869
43272 8998869 13979961 16474876 14587805 7680971 146911 -2055114 1600628 5989876
43264 5989876 6748277 4119428 1026068 58352 1936529 4624860 4669796 1504284 -944076
43255 -944076 584068 3748438 4179919 2191798 1616865 3129561 3711889 2397275 1094441
43246 1094441 -819004 -6724806 -15517089 -19827174 -15085380 -5875386 723751 4083713
43238 4083713 7528537 10424084 9143964 4655874 2724799 5649376 8954047 8142544
43230 8142544 4579210 2140188 1208392 -826843 -4783188 -8392356 -9395922 -7880562
43222 -7880562 -5563818 -4171232 -4511181 -5970236 -6706217 -5179722 -1835254 1202563
43214 1202563 2400046 2526637 3739086 6855605 9805086 9256168 3920923 -4121242
43206 -4121242 -11416467 -15731181 -16480534 -13997519 -9843061 -7068386 -8012550 -11364072
43198 -11364072 -13055368 -10970766 -7525677 -6478098 -8164343 -9337429 -7357495 -3160291
43190 -3160291 98104 347098 -1770972 -3831806 -3721209 -1212195 2070378 4266282
43182 4266282 4944701 5055564 5288050 4875450 2386710 -2320114 -7280167 -9930180 -9498188
43173 -9498188 -7546620 -5906752 -4548976 -2204840 1124735 3353397 2418920 -1511084
43165 -1511084 -6374615 -10039409 -11278765 -9826173 -6546125 -3215350 -1172725 -218294
43157 -218294 689065 2165242 4445639 7701596 10938732 11397734 7156483 315356 -4501121
43148 -4501121 -5255025 -4096740 -3283156 -2010348 1073721 4463038 5564995 4733531 4753527
43139 4753527 6557317 7982158 7135170 4856587 3151111 2933995 4212809 6995894
43131 6995894 10734197 13626409 13691760 10657782 6521064 4110258 4518283 5508488 3436823
43122 3436823 -2039936 -6162142 -4035168 3009740 8498169 8463684 5347106 3480538
43114 3480538 3676426 4261793 4973616 6871938 9635536 11814227 13324515 15241955 17289497
43105 17289497 17815993 16351465 14064411 11461291 7796000 3362962 319643 141359
43097 141359 1796295 3508792 4906513 6156666 6292631 4225889 930946 -1058035
43089 -1058035 -458169 1599186 3330071 4090828 3977845 2638622 -490913 -4870555 -8476013
43080 -8476013 -9065326 -5833624 -32062 5731359 9003530 9030439 7210193 5668761 5032178
43071 5032178 3931403 1033794 -2979788 -6096481 -7120077 -6273833 -4171228 -1490878
43063 -1490878 527890 890123 489984 1431895 4107784 6457135 7009281 7110273 8745057
43054 8745057 11380022 12663311 11512126 8847399 5763627 2664430 32083 -1609737
43046 -1609737 -2747955 -4565889 -7071586 -8332347 -6047016 237927 8223643 13984540
43038 13984540 14786293 11434591 7172590 3815455 170513 -4964425 -9921852 -11893917
43030 -11893917 -10211938 -6106686 -606614 5023820 8156895 7373487 5662209 7553805
43022 7553805 12660632 15312441 11581175 3792845 -3090062 -6703657 -7305098 -5373338
43014 -5373338 -1733676 1575625 2973878 3094127 3322312 3651707 3527068 3657164 5071695
43005 5071695 6945180 7060713 4398134 302439 -2776492 -3356215 -2386167 -2731785 -5904315
42996 -5904315 -9133022 -7673945 -806968 6658136 10169086 10425759 10615748 10901348 8760133
42987 8760133 3829573 -676805 -1558158 1380013 5914579 9362815 10193675 9243437 9063730
42978 9063730 10798329 12473717 11919115 10269647 10317289 12161701 13177985 12119317 10559482
42969 10559482 9975059 9926052 9698376 9301021 7929018 3787105 -3085439 -9499886 -12079759
42960 -12079759 -10402193 -6280261 -1467519 2625462 4465889 3692392 2352745 3115265
42952 3115265 6171001 8977544 9018593 5921270 1067278 -3654797 -6433807 -6083307 -3087507
42943 -3087507 155729 1099519 -533029 -2452999 -2220588 310234 3118283 4024417 2170412
42934 2170412 -1692340 -5394726 -6485910 -4645166 -2702443 -3682227 -6977953 -9280022
42926 -9280022 -9159174 -8249564 -7547220 -5669107 -2253835 -90275 -1488108 -4947119 -8089191
42917 -8089191 -11595522 -16885333 -21704690 -22091023 -18103872 -13843435 -11795533 -10525413
42909 -10525413 -8180218 -5044428 -2033708 554853 2154177 2148796 1324842 926229 399422
42900 399422 -1564084 -4333721 -6574719 -9200343 -13147755 -15011943 -10238587 -1187113
42892 -1187113 3862056 1749369 -1210976 942271 5177955 5366994 2250141 1448741
42884 1448741 4168827 6132860 4858707 2333856 207401 -2722705 -7029694 -10495877
42876 -10495877 -10985543 -8855588 -5403060 -1253333 2554013 3867221 1372889 -3507051
42868 -3507051 -7513682 -8215149 -5955623 -3497398 -3200505 -4348523 -4393818 -3017887 -2829098
42859 -2829098 -5090561 -7330434 -7122554 -5872088 -6306046 -8201777 -9404045 -9298976 -8335002
42850 -8335002 -5928422 -2217979 -151382 -1886659 -4491190 -3556798 -90422 995684
42842 995684 -1195105 -2391359 -344625 2213871 3211150 4609429 7696912 9580960
42834 9580960 7679666 4319932 3568048 6002802 9415874 12188630 13083546 10066297
42826 10066297 2726390 -5543941 -10665072 -12058159 -11452980 -9147061 -4320745 2017736
42818 2017736 7331604 10331835 11037592 8644202 2070110 -7118942 -14553499 -16704473
42810 -16704473 -13771994 -8860224 -5186068 -4066299 -4754375 -5805211 -6396882 -6140774
42802 -6140774 -4573398 -2332357 -2036540 -5387276 -9378023 -8516317 -1788250 5567643
42794 5567643 8574824 7775875 6370005 5565876 5352246 6652275 9346510 10680845 8992020
42785 8992020 6608296 5714702 4302021 469003 -2392334 -423040 3130583 2178154
42777 2178154 -1507312 138699 8354714 14288337 11917753 6646041 6006797 8136486
42769 8136486 6179770 -101222 -4588144 -4776064 -4416854 -6229333 -8035047 -7348227 -5013204
42760 -5013204 -2691903 -675078 105592 -2496498 -8077152 -12139524 -10997576 -6464888
42752 -6464888 -3201459 -2597449 -1751488 1938391 7420582 11593980 12784895 11910042 10780962
42743 10780962 9808719 7533452 2651059 -3532060 -7376402 -6223812 -1129734 4189100
42735 4189100 6851941 6785646 5586889 4368870 3138729 1816002 1010337 1173519 1125527
42726 1125527 -1449773 -6868228 -11228597 -9329314 -927759 7368469 8558665 3223096
42718 3223096 -1217840 357249 4795482 5394755 565683 -4944679 -6609891 -4725753
42710 -4725753 -2013333 314470 2223763 2545755 -538244 -7034959 -14564361 -19921809
42702 -19921809 -20467785 -15175823 -5962345 2657900 6926198 6694923 3982289 -175750
42694 -175750 -5529040 -10317154 -12098954 -11027972 -9645488 -8864250 -6791208 -2483517
42686 -2483517 1868816 4160714 5320187 6849727 7509688 5247967 1082076 -1970333
42678 -1970333 -3198456 -4422564 -6007585 -5802952 -2944262 -38597 61211 -2094490 -3754633
42669 -3754633 -3561634 -2279740 -756344 1037368 2990418 4345118 4735890 4985507 6253997
42660 6253997 8470467 9862637 8300717 3459114 -2270746 -5419660 -4394887 -846891
42652 -846891 1885680 1519876 -1810227 -6242918 -9737536 -11192666 -10668456 -8905332 -6644670
42643 -6644670 -4208976 -1510585 1489261 4077098 4736616 2614055 -658787 -1620817
42635 -1620817 1463671 6244822 8800554 8333874 7833496 9772367 12847247 14065148
42627 14065148 12768795 10976390 10291253 10149413 9277842 7609996 6272905 6392738 8150276
42618 8150276 10350820 10799560 7902508 2231116 -4017256 -9070226 -12239447 -12741349
42610 -12741349 -9640731 -3818322 1610529 4367499 5357772 6276898 6241692 3613516 522406
42601 522406 1638505 7181605 10831534 7502660 650969 -1922611 1795152 6276622
42593 6276622 6663839 4299484 2713998 2124113 735152 -1259974 -2391668 -3141847 -5227400
42584 -5227400 -8383082 -10834581 -12588410 -15147492 -17754868 -17138214 -12210133 -6449754
42576 -6449754 -3882856 -4483440 -5260568 -4480930 -2999853 -2345652 -3202329 -5247505 -7083435
42567 -7083435 -6829541 -4092916 -895847 556174 466804 570647 1467089 2571571 4097838
42558 4097838 6764636 9431243 9458716 6342805 3002127 2192356 3240153 3696598 2692768
42549 2692768 900832 -1513068 -4583920 -6858420 -6527614 -4350068 -3090818 -3420616
42541 -3420616 -2610830 1426137 6682295 9501047 9297370 8738147 9670302 10945708 10544280
42532 10544280 8102736 4596224 803159 -2895845 -5914868 -7608809 -7750800 -6361657
42524 -6361657 -3573536 -314895 1466571 478798 -1925537 -2573410 -2121 3488665
42516 3488665 4315778 2013855 -5396 1262772 4208882 3978130 -1919498 -10529281
42508 -10529281 -16465733 -17007606 -13438147 -8437967 -3837355 -723931 173263 -776239
42500 -776239 -1955098 -2164019 -2060198 -3090935 -5167279 -6262437 -4680176 -1339828 736431
42491 736431 -542184 -4048691 -6654458 -6603413 -4767250 -2354377 1023211 5546718 8728564
42482 8728564 7338877 1890691 -3138058 -4272717 -2255471 415939 2796120 4882214
42474 4882214 5953633 5820571 6261185 8790366 11862348 12446730 9644390 4839707 -542743
42465 -542743 -5031020 -6226781 -3316373 184881 -34847 -2771685 -2488873 2574711 7783659
42456 7783659 9113207 8309772 8275861 7409002 2698607 -4348002 -9490600 -11847930 -13743328
42447 -13743328 -15508260 -15132825 -12928614 -11838007 -12327056 -11358448 -7912783 -5350632
42439 -5350632 -5877661 -6251853 -2318172 4593623 9351830 9805390 8579303 8625033 10022140
42430 10022140 11416063 12038813 11436905 9033205 5132968 1422057 -509779 -834949
42422 -834949 -1137542 -2415976 -3688131 -2970753 38326 2877843 3129737 1998030 3039190
42413 3039190 6774157 9077206 6753813 2467033 1077610 2448177 1826387 -2457900
42405 -2457900 -5711845 -3134027 3617738 8741195 9400219 7780587 6937700 7384316 7979550
42396 7979550 7883791 6569699 3212828 -2524605 -9051623 -12847994 -10782321 -3334552
42388 -3334552 4627809 7747502 5584481 2834338 3217541 4944295 4235230 1612249
42380 1612249 1188001 3993772 5943928 3746053 -523242 -2933521 -3005163 -2619913 -1803747
42371 -1803747 760252 4055571 5367659 4624658 4694423 6769202 8588024 8233062 6705948
42362 6705948 5304689 3291153 180106 -2106566 -1849470 -460211 -259149 -767812 194705
42353 194705 2842979 5429003 6961177 7343026 5822671 2334349 -346827 731283
42345 731283 4000114 4911386 2493192 561159 1422638 2361577 358597 -3335127 -6087776
42336 -6087776 -8214352 -10947039 -12419525 -9732587 -4002437 418761 1636128 2001584
42328 2001584 4006047 7065891 8908668 8081510 4692988 389135 -2271684 -2071239
42320 -2071239 -750134 -825966 -2165313 -2579324 -1308345 484987 2477276 5663593 9653829
42311 9653829 12097091 11644998 9372735 6700509 4223598 3157899 5123423 9187390
42303 9187390 11628057 10235636 6756799 3702112 1047273 -2337455 -6472299 -11346720
42295 -11346720 -17504761 -23110695 -23255547 -15744364 -5633437 -175059 -537812 -2359528
42287 -2359528 -3230607 -4810989 -7598992 -8732738 -6595786 -3508906 -1734667 -237603
42279 -237603 2156419 3383809 951053 -3865110 -7480248 -8250016 -6700637 -2949266
42271 -2949266 3043869 9276868 12779572 13121061 12552060 12432761 11760134 9777839 7872367
42262 7872367 7685505 8784645 9389734 8436338 5943951 2279326 -1768285 -4791611 -5896106
42253 -5896106 -5830960 -5927169 -6008665 -4582900 -1419285 1335430 1603475 108519 -725696
42244 -725696 -334686 -840253 -3866886 -8021012 -10561313 -10410444 -8180984 -4241827 1303114
42235 1303114 7062029 10832136 11940181 11482597 10076616 7395089 4508269 4269516
42227 4269516 7668074 11533986 12015854 9382093 7326501 8091114 10280971 11275060 9911558
42218 9911558 6786743 3685730 2874734 5141659 8031313 7642920 2964789 -2758371
42210 -2758371 -5581840 -4711151 -2460431 -1800242 -4530343 -10210145 -15673510 -16929502
42202 -16929502 -13074889 -7496815 -3895252 -2141424 172527 2982080 3158622 -940194
42194 -940194 -6516352 -9154260 -7420507 -3637091 -970442 -751835 -2034182 -2776382 -1761037
42185 -1761037 -97480 -500145 -4292812 -9347001 -11797286 -9803494 -5031214 -540062
42177 -540062 2017692 2987324 3305739 3127121 1807567 -933894 -4019084 -5623396 -5120585
42168 -5120585 -4000863 -4201373 -5687749 -6366036 -4417078 -255313 3678766 4629228 1551177
42159 1551177 -3642876 -7283127 -7577787 -6646374 -7366276 -8656215 -6453649 134895 6593726
42150 6593726 8601782 7360334 6895310 8171675 9123216 9139476 9678828 10739372 10602594
42141 10602594 9608734 10345349 12673859 12195674 6153248 -1827941 -5764931 -4311535
42133 -4311535 -967150 1362060 3035867 5410945 8545406 11331667 12127656 9413518
42125 9413518 3592729 -2001297 -3761453 -1752572 396272 -228438 -2761015 -3845442
42117 -3845442 -1079441 4657940 9497891 9701124 5467089 998643 -218197 831878
42109 831878 947102 -754910 -2706955 -4023206 -4862411 -4345424 -1444083 1967508 2339532
42100 2339532 -532876 -2920623 -2681895 -2049593 -3121338 -3853066 -1476782 2381470 3391321
42091 3391321 280894 -4031918 -6565817 -6905098 -5798221 -3551602 -456118 2628217
42083 2628217 4641638 4680516 2381487 -1138380 -3369394 -2754112 -591620 582909 100106
42074 100106 -593415 -294585 873694 2584512 4944358 7622510 9351287 8749661 5381792
42065 5381792 315896 -3942993 -4847420 -2153036 1481192 2965213 1357565 -2446569
42057 -2446569 -7274480 -11693286 -13721708 -12397511 -9107279 -5897124 -3214088 -829642
42049 -829642 214307 -1041363 -2929901 -2754994 -860174 -416050 -2819310 -5814663 -6708506
42040 -6708506 -5050985 -1616064 2636466 5749746 5734400 3714822 3457253 6036085 7584120
42031 7584120 4652789 -504002 -2873143 -1244488 1255753 2119302 1688318 743868 -997478
42022 -997478 -3422499 -5444152 -6620099 -7571074 -8261414 -7490296 -4612001 -356086 4365992
42013 4365992 8909656 11760938 10715888 5264251 -2143044 -7903809 -9778704 -7795415
42005 -7795415 -4068337 -1815967 -2743782 -4706258 -3549866 1919468 8349957 12001603
41997 12001603 12578976 11660164 9518512 5895961 2390137 992476 691794 -1511333
41989 -1511333 -6023806 -9968176 -11798491 -13685738 -17604182 -21429811 -21402645 -17127227
41981 -17127227 -11711340 -7738298 -5475472 -4579400 -4879706 -5150434 -3608671 -602033
41973 -602033 1251905 814748 426798 2504315 5720848 6789510 5158214 3480741 3521363
41964 3521363 3999732 3241942 2012371 2271118 4064714 4970588 2497665 -3397846 -9706007
41955 -9706007 -12040301 -8017521 45764 6453976 7296671 4165152 1982214 3567459
41947 3567459 7488808 11019424 13442363 15567274 17295302 17326288 15130799 11855240
41939 11855240 8856711 6257565 3518332 740358 -1359334 -2376857 -2389606 -1471584
41931 -1471584 148042 1534161 1498733 -198136 -2599536 -4436418 -4713679 -2820868 839626
41922 839626 4537372 6933047 9068880 12775613 16741762 16645516 10730652 3125343 -679395
41913 -679395 -147947 1060705 927434 908375 2267913 3969536 4923282 5488693 5686152
41904 5686152 4421883 1791756 -74831 63245 770498 569388 425335 1866848 4421861
41895 4421861 6891713 9539998 12751187 14876048 14016244 11206877 9352855 9387361 9709193
41886 9709193 9044307 7523709 5145189 1766152 -1059743 -822236 2351422 4853324
41878 4853324 3657664 -98767 -2726248 -2174434 363437 2277292 2097162 658205
41870 658205 260402 2393559 6170320 9342113 10552713 9920159 8006475 5560830 3970802
41861 3970802 4271728 5520059 5686325 4387126 3108482 2499948 1521755 -6305 -333931
41852 -333931 1206634 2201821 516605 -1711608 -280096 5223917 10597311 12628341
41844 12628341 12950424 14691209 17140608 16378340 11039962 5058493 3408183 6390258
41836 6390258 9773396 10093577 7916276 5590785 3918723 2532690 2009555 3279438
41828 3279438 5457371 6673761 7289409 9929930 15350249 20276846 20951185 17502398
41820 17502398 13159377 10126960 8160252 6758517 6595292 8128796 10209243 11128072
41812 11128072 10591483 9951975 10566150 12275405 13550698 13064179 11116684 9418516 9276734
41803 9276734 9972147 9155146 5195300 -688868 -4931866 -4775388 -978750 2991254 4271942
41794 4271942 2392423 -1730447 -6617596 -9547259 -7587937 -1462293 3391078 2572636
41786 2572636 -1340550 -1877322 2535584 6593581 5812527 2514288 1962228 5330454 9283741
41777 9283741 10833076 9996824 8688135 9168256 12813487 18609046 23684965 26741065
41769 26741065 29521871 33266508 35761101 34700644 32389559 33603613 39457711 46843810
41761 46843810 53643595 60855710 69540883 79990380 95029757 119160011 150512723
41754 150512723 176413935 181830305 162857798 129730294 96676181 70935645 51543810
41747 51543810 35579038 22760815 14199013 9192040 5544076 2989246 4041786 9851447
41739 9851447 16714315 19281331 16788202 13199378 10870204 7563977 1596121 -3387016
41731 -3387016 -2600359 2260371 3858632 -1542485 -8946829 -10618693 -5172036 1667959
41723 1667959 4517898 4041703 4597248 7978007 11305966 11109348 7989352 5999804 7689828
41714 7689828 11147712 12697348 11608558 10701372 12259471 14845109 15209612 12541985
41706 12541985 9345246 8189206 9186305 11234143 14037887 17328611 19296400 18230429
41698 18230429 15659635 15544165 19712562 26055053 31912797 36989249 41745927 45535432
41690 45535432 48590586 53720888 63088121 74779160 85755885 97063790 112672438
41683 112672438 134323677 161877429 197496002 242090728 284917719 303910775 283997964
41676 283997964 233796620 178859548 138767597 114859019 98679145 84921324 73059157
41669 73059157 62056962 49831178 37092071 27180360 21363827 17258562 12774194 8932225
41661 8932225 7152404 5943495 2854399 -1326178 -3134432 -1195257 2204008 4863982
41653 4863982 7244712 9911147 11172762 9792057 7948927 8312977 9541211 8261984
41645 8261984 4707975 2338555 2041284 1257618 -414932 206993 3647621 5125265 1823244
41636 1823244 -1463778 1065035 6974873 8754506 4737140 878251 1716479 5418245
41628 5418245 9007514 12936940 17803515 21163912 21357410 21245027 24039753 27460319
41620 27460319 26276212 19897571 13489216 11198849 11524792 10405064 6307654 721350
41612 721350 -4560564 -8695900 -11144336 -11571142 -10507367 -8988504 -7244007 -4487807
41604 -4487807 -333685 4205050 7612548 9313318 9637986 8781114 6802034 4740349
41596 4740349 4639378 7673703 12626846 16796898 18320376 17553138 16742844 18583336 24218116
41587 24218116 31795777 37346419 37940915 34146104 29177740 25842395 24410454 22989550
41579 22989550 19678484 14716165 10610369 9667800 11494789 13650265 14424346 13742221
41571 13742221 11742666 8527656 5477431 4381808 4558945 3456431 1178343 1231462
41563 1231462 4744750 7346939 5168538 1094407 577121 3088126 2949903 -1739946
41555 -1739946 -6200132 -5888694 -1975138 1560534 2700959 1728467 -140726 -1043687 -27165
41546 -27165 887412 -819050 -3223977 -1592232 3924316 6940751 3576700 -2000321 -4068017
41537 -4068017 -3076104 -2507935 -1767267 2091406 7597141 9802270 7646748 5189884 5010836
41528 5010836 4966725 2703155 -439682 -1697371 -310049 2672064 5720870 6876199
41520 6876199 4626680 -27218 -3972654 -5204614 -4161958 -1678059 2096506 5877961
41512 5877961 6707566 3064112 -2628465 -6123502 -5518125 -2508995 -52076 525244 283794
41503 283794 783216 1506526 26335 -4457135 -8811554 -8963006 -4790793 -182301 1768290
41494 1768290 1777568 2345796 4509784 7297586 9162434 9396832 8989516 10151400 13959792
41485 13959792 18559884 20839579 19642470 16074666 11242960 5643281 552477 -2257579
41477 -2257579 -2631767 -2078575 -1490913 -661579 -129118 -1196593 -3581133 -5294670 -5684257
41468 -5684257 -6544925 -9316463 -13038825 -15842106 -16574863 -14479241 -9701750 -4886877
41460 -4886877 -3385559 -4526777 -3670854 1096405 5449801 4893166 1624139 1457557 5470576
41451 5470576 8889973 7952175 4034776 465229 -1423489 -1836574 -744559 1679737
41443 1679737 4241830 5696548 5864069 5197589 4071932 3022770 2990387 4808950 8664565
41434 8664565 13937474 19225592 23025891 25071557 26425991 27468086 26660134 22625223
41426 22625223 16689481 11602268 8090310 4639585 774848 -1544868 -665276 2115430
41418 2115430 3680844 2019719 -2625108 -8501533 -13249223 -14646218 -11565953 -4547889
41410 -4547889 4484536 12773650 17347613 16386658 10875284 4444163 592542 -254267
41402 -254267 -626912 -2818316 -6188937 -8146623 -7532090 -5843152 -4537932 -2570330 1614486
41393 1614486 6519684 8694490 7514999 5885616 5111639 2340775 -4382687 -11231683
41385 -11231683 -12519431 -8235372 -3860198 -3080331 -4492283 -5817131 -7352360 -9657475
41377 -9657475 -11107750 -10073368 -7340177 -4256767 -408203 4538946 8239608 7682719
41369 7682719 3280978 -1329898 -3469450 -3555290 -3159504 -2824575 -2290411 -1455752 -364301
41360 -364301 917536 1774688 960019 -2272158 -6961822 -10710656 -11448409 -9144947 -5679215
41351 -5679215 -2764479 -271076 2820378 6171615 8074261 7978189 7654705 8822473 10512203
41342 10512203 10086199 6619016 2263967 284734 2323386 7310720 12299937 14572086
41334 14572086 13839257 12653078 14235817 19730419 27553889 34977425 39955078 41922974
41326 41922974 41594687 39960627 37131471 32457551 26179894 20360242 17227482 16764264
41318 16764264 16842102 15779114 13872572 12176010 10667359 8303699 4501038 -21088
41310 -21088 -3767683 -5528932 -5115616 -3474818 -2074951 -1762421 -1985668 -1358721 716125
41301 716125 3113496 4111889 3515090 3038580 4119378 5894584 6286346 4950329 3989541
41292 3989541 5271305 7941216 9406160 8265687 5446092 2781330 1421013 1555064
41284 1555064 2636203 3457073 2845404 1046442 -27858 1160455 3500717 3938583 987775
41275 987775 -3056808 -4233557 -1123862 3753336 6754619 6527015 4382625 2177502
41267 2177502 648616 -462319 -1431102 -1930230 -1283684 586770 2655895 3772080 3970914
41258 3970914 3873524 2938298 53064 -3599052 -4516303 -1457012 1902625 1520991 -1207601
41249 -1207601 -1602938 1011683 2349071 184472 -2027132 -882622 1318913 264128
41241 264128 -3471365 -5441209 -4224705 -3041869 -4186953 -5641676 -4581711 -1384455
41233 -1384455 1594640 3100425 2959466 657960 -3814712 -8418223 -10331440 -8743537
41225 -8743537 -5150046 -1162901 2595982 5543833 6727504 6000881 4514754 3301588
41217 3301588 2205991 922190 40949 -317597 -2215438 -8085308 -16652617 -22540488
41209 -22540488 -21435439 -14717063 -7619357 -3663048 -2508782 -2455423 -2555534 -2036555 -122379
41200 -122379 2360324 3010804 953714 -1442784 -1501873 194809 905249 -367267 -1972270
41191 -1972270 -2302993 -1398516 399122 3447967 7382708 9984820 9113495 5587827 2720149
41182 2720149 2347203 2353352 -465258 -5408097 -7862476 -5337266 -1465729 -1501243 -4948419
41173 -4948419 -6098947 -2175658 2635915 2958735 -912944 -4415844 -4898314 -3569671
41165 -3569671 -2537601 -2718589 -4203619 -6358967 -7720165 -7430519 -6250289 -4793340
41157 -4793340 -2139550 1785182 4111824 2372050 -1067965 -1351452 2468059 6827774
41149 6827774 9312518 10943789 12119747 10464506 4894543 -1219807 -3464089 -1069413
41141 -1069413 3568068 8023862 10615894 9986596 6275255 1749705 -1350279 -2678543
41133 -2678543 -2521104 -404524 3387618 6353064 5803182 1776382 -3195458 -6395353
41125 -6395353 -6327175 -3295973 449687 2624499 3721297 6078811 9548314 10933100
41117 10933100 9152057 7641512 9038717 10599559 8512024 4239347 2153787 2498433
41109 2498433 1682210 -880765 -1393034 1829249 4915327 3625853 -1058742 -4685321
41101 -4685321 -4603006 -1708241 1518325 3148509 2940118 2356672 2874401 4105921 4438823
41092 4438823 3167067 751686 -2328043 -5276336 -6478062 -5584859 -5107718 -7044690
41084 -7044690 -8976057 -7312873 -3658965 -3028949 -5602292 -6044027 -2475153 390421
41076 390421 516818 4415197 17453686 32720530 37315483 28330418 15644399 8999549
41068 8999549 8844394 10866398 12999037 14975238 15925724 16285623 18973251 25121883 30705594
41059 30705594 30648052 25144484 19324401 17329027 18639899 19648221 17378792 12299825
41051 12299825 8431911 9562265 14349138 16726665 12657699 5021618 -16847 -225626
41043 -225626 1166466 190550 -3789120 -8130523 -9038760 -4244393 4291105 10861448 11616906
41034 11616906 9423417 10464431 15907985 20031969 17606930 10215653 3533282 907046
41026 907046 1978263 5527819 10441057 14625463 16034931 15085899 14052117 14069844 14730912
41017 14730912 16451326 20560049 26324423 30432992 30930410 29749943 29642920 30210593
41009 30210593 29043859 25676693 22090198 19702531 17945171 15734470 12446719 7455433
41001 7455433 827199 -5089250 -6938484 -4342534 -968671 -356684 -2045297 -3210621
40993 -3210621 -2815757 -2218598 -2380347 -2534955 -1640822 507850 3773824 7695397 10649652
40984 10649652 10690227 8278907 6976434 9885505 15735039 19895975 19649641 17458458
40976 17458458 18142767 23192021 29007797 31152565 29224405 26383470 24959443 24703818
40968 24703818 25415881 28369734 33370953 36857270 36100518 34149274 36952980 45488528
40960 45488528 54331274 59072625 61708366 66670290 74606905 83206736 92126648 103392895
40952 103392895 117589109 133102206 149498398 168894638 193136882 221510302 251909670
40945 251909670 282834533 313960058 346071485 379985152 413142891 437134901 441665954
40938 441665954 422911407 386787487 343329586 299681408 259148390 223858937 195192867
40931 195192867 172490368 153729983 137352490 122270104 107210676 91926406 78321367
40924 78321367 68436113 61666753 55647028 49429566 43995350 39969754 36809167 34193998
40916 34193998 32256187 30228578 26842178 22652374 20248294 21277460 24477189 27301101
40908 27301101 28323812 27446104 25007292 21651151 18253643 15207810 12372381 10122410
40900 10122410 9552773 11065263 13624182 16135891 18865264 22738602 27794391 33066445
40892 33066445 37604795 40896744 42525496 42186613 40238656 37840754 36230481 35972619
40884 35972619 37282458 41003311 48134942 57338914 64023667 64465851 61074557 60667062
40876 60667062 66172011 72964595 75792878 76478176 81034742 91140938 102957714 113428533
40868 113428533 122963290 132177771 141374512 154210760 176368263 208134826 242929710
40861 242929710 276121786 311122188 353266643 401351076 449002159 490801165 522248490
40854 522248490 536541386 527562970 496253712 450403923 398671850 347644100 302585180
40847 302585180 265948109 235163107 205941602 177994518 154421484 136338004 122082471
40840 122082471 111072859 103818045 98010337 89359451 77275452 65616023 56909752
40833 56909752 49981396 44211186 41411921 41526905 40831822 37103495 33038870 31817308
40825 31817308 32368972 31809154 29829979 27895914 26421837 25341261 25323789 26058176 25516002
40816 25516002 23176628 21560674 22144476 22477701 20438065 18774224 21479363 27212586
40808 27212586 30334714 27939147 22534797 18092914 16445850 17500694 20240133 23068952
40800 23068952 24979160 26519021 28537173 30751779 32805014 35384038 38542358 40317362
40792 40317362 39152170 36512397 34937329 34591803 33856031 32162454 30139310 28227824
40784 28227824 27204436 28337658 30608894 29866706 23937381 16709813 13465675 13791146
40776 13791146 13246707 10591202 8421837 7378330 5177981 1862145 763068 2941636
40768 2941636 5307207 5806450 6052494 7082026 7107809 5897051 6867688 11439091 15059454
40759 15059454 12869539 6690717 2513491 3023870 6301619 10247557 14332303 17712824
40751 17712824 19245338 19377147 19324190 18620150 16102194 13083267 12654509 15347927 17929665
40742 17929665 17405215 14410461 11685886 10675662 10877547 11679018 13303975 15581432
40734 15581432 16641345 14078384 7960737 1746404 -1202634 -1750846 -3912576 -9269105
40726 -9269105 -14200089 -13777294 -7311390 1063527 6632891 8116158 8051078 9864817 14308099
40717 14308099 18796301 20756039 20899794 21753732 23616651 24341123 23229613 22631581 24931030
40708 24931030 30087572 36745491 43361487 47531712 47063174 43020241 38959530 35707382
40700 35707382 29997093 20310291 10783058 6273757 6147938 6221805 4618888 2219698
40692 2219698 -620072 -3814903 -5526288 -4492123 -3293726 -5128630 -8140153 -7457585
40684 -7457585 -2639726 1550429 2156677 1172572 768900 136851 -1058495 -517636 2581837
40675 2581837 4827436 3096406 -781371 -2937344 -2841943 -2635031 -2858162 -2219449 -628377
40666 -628377 653668 1410111 2253976 2352102 127184 -3724489 -6610248 -7869938 -9534331
40657 -9534331 -12200505 -12787284 -8659372 -2453735 17321 -3344433 -8461094 -10307132
40649 -10307132 -8679619 -7100189 -7236728 -7038295 -4755617 -2377233 -3252084 -7407780
40641 -7407780 -11199009 -11428617 -8202834 -3577173 930498 4543791 6119047 4492418
40633 4492418 211566 -4105179 -6115532 -6302053 -7116667 -9255570 -10229388 -7991313 -4634455
40624 -4634455 -3880635 -5334040 -4602175 -25119 4140051 3425687 -747844 -3545905 -3145696
40615 -3145696 -1371651 588691 3375744 6777329 9084008 9193196 6992613 2278491
40607 2278491 -4012931 -8380925 -7957878 -4700981 -2900720 -2920319 -1462007 2003347 3885761
40598 3885761 2618214 1401765 2763836 4604972 4292081 3001637 2985003 3550856 2777455
40589 2777455 675897 -1997781 -5399917 -8475938 -8296750 -4673000 -2212725 -3840314
40581 -3840314 -5275967 -841794 7525389 12643765 12245753 10874451 11676600 12306231 10514764
40572 10514764 8471529 8629107 9160225 6882418 2395125 -752394 -796591 676802 1216973
40563 1216973 -157556 -2695712 -4741905 -4938450 -3230289 -727338 1195750 1315859
40555 1315859 -1095987 -5192630 -8422151 -8848081 -7121649 -4979305 -2912249 -1138904
40547 -1138904 -1410563 -4760807 -8102408 -6674743 -357689 5608718 6928500 4251964
40539 4251964 99502 -4736765 -9973219 -14043563 -15838402 -16057298 -14911797 -10894299
40531 -10894299 -4183997 1071291 1065788 -2383587 -3946332 -1538261 1780635 2376209 -120024
40522 -120024 -3750513 -6670706 -7857707 -7062603 -5247127 -4501589 -6672913 -11679290 -17005688
40513 -17005688 -19393085 -18027544 -15657245 -14863222 -13556263 -7159216 3810087 11854425
40505 11854425 10949724 4303816 109226 1227777 3183165 1719719 -2099887 -5052526
40497 -5052526 -6044543 -5506294 -3523041 -817961 318632 -1755418 -5789380 -8914478
40489 -8914478 -9383531 -7443103 -4791228 -3806521 -5704584 -8564452 -8838895 -5868616 -3112059
40480 -3112059 -3531195 -5586762 -5668447 -2936585 446700 2689065 3538894 2918493 1023261
40471 1023261 -453178 315981 2552258 3701263 3122033 2565240 2610531 1366131 -2076783
40462 -2076783 -5337366 -5734567 -3798205 -1859110 -648650 426248 687983 -1446184
40454 -1446184 -5576825 -9108192 -10434793 -10658239 -11582622 -13423219 -15125720 -15732362 -14692750
40445 -14692750 -11782696 -7523044 -3130980 455027 3088994 4888475 6000386 7062301
40437 7062301 8877431 11153253 12417037 11670632 9359392 6388164 3260828 756833
40429 756833 249083 2331864 5930838 9573028 12545767 13887403 11629531 4930700
40421 4930700 -3605224 -9633162 -11157939 -9590782 -6928052 -3604881 434651 4017124
40413 4017124 5135849 2791810 -1749889 -5410108 -5650414 -3086143 -862511 -281341
40405 -281341 1642688 7955063 15958139 19073761 15143037 9486155 7876551 9445244
40397 9445244 9484626 7143777 6314247 9114537 12224088 11092310 5515991 -606652 -3773366
40388 -3773366 -3631237 -1978695 -529858 196181 647187 1423382 2636159 3912700 4877745
40379 4877745 5530652 6214806 7208262 8128311 7828318 5458930 1802864 -1128787 -2215110
40370 -2215110 -2213801 -2115428 -1491061 400302 2575110 2975591 1106411 -1382662 -2936356
40361 -2936356 -3574551 -3799859 -3547851 -3108304 -3716208 -5716276 -6933667 -4738993 197888
40352 197888 3896208 3512660 553074 -1395631 -1169059 -714578 -1635783 -2981603 -3221982
40343 -3221982 -2864643 -3518203 -5020058 -5270505 -3080425 300533 3029323 4680806 5357168
40334 5357168 3820826 -1665282 -10280891 -17640168 -19028761 -13899308 -6728073 -2938709
40326 -2938709 -3942108 -6535477 -7047337 -5114094 -3002997 -2622781 -4622344 -9253154
40318 -9253154 -15597214 -20049190 -18461054 -11042334 -3012071 1064095 1663244 1440282
40310 1440282 288988 -3772828 -9997028 -14608629 -15344248 -13667046 -11957125 -10796965
40302 -10796965 -9813128 -9172723 -9134585 -9545159 -10604451 -12727558 -14874409 -14577811 -10807050
40293 -10807050 -5619613 -1800423 132927 1412351 2523641 2808637 2183866 1717570
40285 1717570 2089052 2307779 645826 -3103780 -6662962 -7213185 -4519005 -1232072 565254
40276 565254 1869238 4337159 6647398 5878284 2080152 -1500002 -2958024 -3314068 -2960545
40267 -2960545 -391887 3737897 5253542 2319910 -645768 1015556 4893696 5109207
40259 5109207 1565151 -44697 2742167 5938572 6241841 6043085 8610789 12518179
40251 12518179 14291999 13635277 12639794 12013524 11297164 11037992 11532863 10744088 6662115
40242 6662115 971685 -2454168 -2108771 579503 4304838 8572608 11879868 12364319
40234 12364319 10457761 8334769 6718132 4793091 3088310 3264984 4654076 4310790
40226 4310790 1566512 -526427 296288 2428265 3561546 4177237 5553619 6590298
40218 6590298 5388265 2518739 120086 -1239303 -2489928 -3775848 -4474875 -4742116
40210 -4742116 -4948284 -4376647 -2589635 -1213530 -2002993 -3909299 -4660192 -4543683 -5565793
40201 -5565793 -7187165 -6478106 -3087741 -542615 -1230709 -3227416 -3969838 -4208106 -5776549
40192 -5776549 -7759378 -7991275 -6980745 -7100839 -8415764 -8458118 -6419156 -4678909 -5104283
40183 -5104283 -6181667 -5640304 -4476515 -6088278 -11492995 -17229233 -18795271 -15135272
40175 -15135272 -8763997 -2302532 3389890 7635300 8711057 5829798 1175540 -2013105
40167 -2013105 -2999187 -3401709 -3857609 -3096701 -640653 1895947 3174701 3896297 5052136
40158 5052136 6125516 6312296 5953202 5393124 4016332 1988372 1309429 3097790 5168822
40149 5168822 4601183 1683212 -1087358 -2999908 -5248079 -7424119 -7100310 -3594677
40141 -3594677 510346 2772874 3748009 5183699 7097976 8175094 7977431 7368898 7297653
40132 7297653 8102161 9589232 11170125 12327799 13286397 14692756 16495702 17899961
40124 17899961 18564334 18869246 18684242 16934993 13063069 8213745 4365295 2713223
40116 2713223 3206047 5073527 7398789 9590695 11654278 13853731 16102142 17809185
40108 17809185 18075675 16050398 11983793 8209854 7595325 10000830 11915198 11219660
40100 11219660 10446241 12673632 15890950 15405254 11307199 8927408 10927617 13426737
40092 13426737 12233911 9085465 8507709 11427434 15642850 20665776 27915311 36563122
40084 36563122 42756937 43559967 39504661 33122486 26848014 22318055 19760412 17693110
40076 17693110 14468922 10081586 5495984 959154 -3511563 -6744553 -7528732 -6831560
40068 -6831560 -6967789 -8503686 -9620819 -8634972 -5746550 -2372326 -111604 -142522 -2113350
40059 -2113350 -3778245 -3257766 -1523736 -1098966 -2461788 -3450650 -2276056 533433 3365353
40050 3365353 5209419 5939055 6254112 7418018 9820366 11969581 12240306 11238647 10826603
40041 10826603 11220616 11000046 9773259 8728245 8467319 8238231 7315796 5259719 1203840
40032 1203840 -4612876 -8863903 -7757632 -2014764 3774782 7157219 9627216 11554223
40024 11554223 9607984 1884967 -7707006 -13415473 -13773280 -10969890 -6501275 -986523
40016 -986523 3337812 3941338 1624497 -166761 300763 1591289 1749629 410215 -1352516
40007 -1352516 -1577703 1316276 6014122 8408529 6578106 4118644 5388489 8820297
39999 8820297 9030630 4993403 1438790 1527566 2862753 2588046 2103294 3715182 5933236
39990 5933236 5771667 3714072 2812114 3929520 5118323 5212674 5049541 5048805 4205430 2109996
39980 2109996 64002 -467971 851321 3759383 7635924 10677659 10404151 6167517
39972 6167517 420965 -3427301 -4004744 -2292298 259489 2788130 4436129 4149972
39964 4149972 1910838 -483022 -942660 589443 2176087 2264701 849157 -2148586 -7928222
39955 -7928222 -16439296 -23869493 -25051094 -18980385 -10215486 -4043778 -1716097 -1131858
39947 -1131858 -340406 1239997 3694172 6502823 7919436 6373137 2773686 59411
39939 59411 8133 1425535 1911268 742098 -472888 224249 2724884 4560121 3420256
39930 3420256 -10341 -2517915 -1982229 425509 2223905 2564880 2159179 1607622 1531275
39921 1531275 3314588 7438829 11540196 12591110 11012476 10038316 10650592 10116263 6752779
39912 6752779 3183072 2649000 4435749 5673910 5814207 5991348 5143164 827648 -5788269
39903 -5788269 -9534482 -7395915 -2372126 520921 -224697 -3106707 -7399319 -13224098
39895 -13224098 -18559697 -19491322 -14487844 -6632712 -532311 1990061 2433049 2922085
39887 2922085 4110776 5382601 5997976 5565404 3796541 553075 -3378185 -5892241
39879 -5892241 -4963911 -969698 3066139 4370747 3237506 2150668 2413398 2743002 1332757
39870 1332757 -1750760 -4732811 -5951242 -4959065 -2442843 181798 1404027 743328
39862 743328 -518693 -279855 2215082 5224223 5929957 3236860 -1008504 -3799999 -3804728
39853 -3804728 -2190174 -1062579 -1808568 -4647507 -8469633 -10784894 -9323219 -4722222
39845 -4722222 -497625 821495 340983 144543 -436517 -3209881 -6648703 -6657679 -2466682
39836 -2466682 1609450 1887077 -195585 -1535521 -2480936 -5071520 -7989828 -7496233 -3287282
39827 -3287282 384536 430935 -1223394 -966350 1662233 4243673 5048042 4626203 4745365
39818 4745365 6965340 11429214 16054677 17845981 16040129 13071710 11453561 10757464
39810 10757464 8889888 5289662 1295180 -1841909 -3527858 -2983903 82350 3897174
39802 3897174 5640285 4607458 2942738 2773226 4006078 5427265 6380438 6484924 5230369
39793 5230369 3184649 2407704 4071178 6444418 6844459 4961727 2449718 -332470
39785 -332470 -4803501 -10934300 -15764351 -16433842 -13249590 -8531139 -3883838 -261859
39777 -261859 614210 -2512821 -7822809 -11174093 -10042112 -5354973 575483 5936839
39769 5936839 8800633 7215883 1823373 -3220230 -4171960 -1829601 154728 291714
39761 291714 243730 1181233 2024335 1980871 2107036 2787196 1978943 -1643692 -5327224 -4972949
39751 -4972949 -845666 2348574 1610753 -783781 -1216869 27628 -258469 -3180895 -6273844
39742 -6273844 -6956476 -5214754 -2375271 752627 3487117 4765616 4591968 4817385 6707237
39733 6707237 8494847 7367758 3657889 982438 1881631 5136609 7912506 8682541
39725 8682541 7247656 3934882 263163 -1377637 -658913 -505403 -3114047 -6007921
39717 -6007921 -4961702 -348511 2750613 1348587 -1620869 -1708294 1330642 4135326
39709 4135326 4146623 1256156 -3514693 -8519799 -11321876 -10363090 -6910742 -3768315 -2160892
39700 -2160892 -1386621 -1264467 -2943603 -6827285 -11270707 -14120211 -14671566 -13805145 -13093571
39691 -13093571 -13793669 -15465186 -15500856 -11620967 -5239353 -539926 646781 1082493 3709621
39682 3709621 6933513 6986603 4068975 2841367 6169156 11155312 13015758 10907434
39674 10907434 7697962 5112758 1886616 -2932472 -7132196 -7284715 -2694524 3771943
39666 3771943 8441287 9517940 7321116 3062089 -2018268 -6735316 -9830259 -10140108
39658 -10140108 -7284224 -2463778 1768315 3289814 2196907 416821 -490565 -497288 33572
39649 33572 1520450 4245898 7048467 8370420 8405247 8639760 9075752 7765755 4073030
39640 4073030 601871 60177 1491482 2074357 1946475 3997965 8334395 10441057 7071872
39631 7071872 1355886 -1112376 283412 1258032 -471827 -2460919 -2519331 -2425529 -4253141
39622 -4253141 -5916584 -3746066 1822907 6289692 6495091 3456667 -94131 -2569721
39614 -2569721 -3566841 -3213292 -2264125 -1377129 93166 2950126 5505132 4339679 -973688
39605 -973688 -5784406 -5086974 425536 4882605 3673347 -2035495 -7210792 -8071475 -4938842
39596 -4938842 -1056257 529498 -875611 -3796699 -6327077 -7578013 -7877911 -8131871
39588 -8131871 -8973449 -10137965 -10765262 -10705253 -11060509 -12462381 -13082287 -9888003 -2422969
39579 -2422969 5891640 11065397 12247599 11325438 9816307 7498783 3791042 -729224
39571 -729224 -4366135 -5345779 -3081245 892987 3528045 2828263 61228 -1394040 22387
39562 22387 1789589 41536 -5106351 -8185288 -4122507 4662035 9311703 4290977
39554 4290977 -5785134 -11621698 -10170912 -6513765 -5302501 -5108034 -3065917 -724831
39546 -724831 -1385724 -4114999 -4696730 -1721717 1919297 3460621 3056614 2025968 1085585
39537 1085585 668500 600650 -687692 -4115160 -6974264 -4949842 2081191 9010540 11419973
39528 11419973 10017882 7838887 5742861 2988812 312086 -428041 874811 2134801
39520 2134801 1506895 -872761 -3334507 -4184478 -3296467 -2523382 -3513463 -4990632 -4064770
39511 -4064770 -847200 729963 -1685283 -5068600 -5148120 -2387422 -654994 -1238274 -2007653
39502 -2007653 -2249652 -4165056 -8336866 -11224600 -9469059 -4474175 -411095 841258
39494 841258 599588 399645 533507 1154971 2575473 4108644 4277146 2742815 858002
39485 858002 -243574 -1128243 -2989338 -5753814 -7868143 -7642590 -4597917 -47684 3444774
39476 3444774 4038245 2615359 2046960 3726366 5678721 5223745 2668869 544097 -544660
39467 -544660 -3003022 -8499643 -15221711 -20256598 -22988477 -24242943 -23446749 -19266136
39459 -19266136 -12753702 -7336605 -5124401 -5032245 -5104395 -5073022 -5954184 -8465423 -12387809
39450 -12387809 -16233342 -17352947 -14238465 -9328177 -7403341 -9936265 -12951780 -12131201
39442 -12131201 -8223631 -5243331 -4831405 -5193240 -4837033 -4234377 -3526531 -1512542 1854939
39433 1854939 4103594 3015392 -472882 -3614443 -5247267 -6349286 -7599963 -7942454
39425 -7942454 -5990445 -1939346 2537823 5818410 7123656 6158311 3145719 -219867
39417 -219867 -877694 3039896 9665536 14594372 15048174 12058586 8420886 5763856 4146963
39408 4146963 3117138 2045523 433769 -933974 10410 4190721 9517531 12551690
39400 12551690 11566997 7271451 1638687 -2764283 -3634607 -1155860 1295822 610943
39392 610943 -2363270 -4446762 -4730496 -5091322 -6360719 -6798330 -4991847 -1920899 622393
39383 622393 1529717 -332599 -5715890 -12433158 -15492771 -11898891 -4101886 2906817
39375 2906817 6767283 8599315 9986699 10949071 10344584 7036804 1255457 -4434557
39367 -4434557 -6665270 -4717417 -1174152 1666694 4025665 5938562 5018605 -111526
39359 -111526 -6003125 -7760027 -5578513 -4213739 -5906545 -7640693 -6361479 -3358630
39351 -3358630 -1606261 -1546088 -1830919 -2329347 -4012790 -6875540 -9745059 -11425734 -10992963
39342 -10992963 -8242399 -4939229 -3915693 -5417805 -6164630 -3966394 -1367304 -2106488
39334 -2106488 -5666077 -8575598 -9718457 -10192519 -8561312 -1516164 9365965 16480323
39326 16480323 14940955 8905392 5510564 5262854 2870623 -3906659 -11045151 -13908834
39318 -13908834 -11939119 -6940388 -536380 5011099 6668270 3819952 -244069 -2144208
39310 -2144208 -2399266 -3873454 -7551044 -11713649 -14275575 -14035523 -10462846 -4408128
39302 -4408128 1190192 3254193 1522995 -1660647 -4386876 -6521774 -7999174 -7613441
39294 -7613441 -4533320 -52360 3256649 3924066 2518551 329915 -2239760 -5507199
39286 -5507199 -8911113 -10550276 -9256428 -6666723 -5716286 -6817331 -7222483 -5170326
39278 -5170326 -3095833 -4850657 -10340747 -14797382 -13635096 -6943924 986579 5733045
39270 5733045 6181207 4647072 3996218 4725681 5066416 3557711 511440 -2943744 -5780990
39261 -5780990 -6845099 -5585467 -3652823 -3673775 -5444815 -5721040 -3208214 -943560 -1403593
39252 -1403593 -2174870 74515 3786492 4995125 3896679 4030089 5744362 5766855 3424357
39243 3424357 1950097 2511733 2087255 -798503 -2950662 -1644942 1214797 2762076
39235 2762076 3189670 3332745 2094652 -413939 -860034 2251966 4731910 2327952 -2491926
39226 -2491926 -4256315 -2998131 -3723449 -8218851 -12634449 -13643478 -12571042 -12276608
39218 -12276608 -13289935 -14223183 -13608304 -10621739 -5975471 -2316496 -1896687 -3984690
39210 -3984690 -6259893 -7910728 -9196165 -9148105 -6708046 -3452087 -2108897 -2767312 -3369944
39201 -3369944 -3183101 -2569941 -347266 4479186 8756324 7616558 1446149 -3897036
39193 -3897036 -4687769 -2896697 -1214148 633392 2628931 2285435 -1188015 -4402844
39185 -4402844 -4921267 -5652431 -10343656 -17103513 -20299338 -17455145 -11008664 -4548266
39177 -4548266 -442664 -48283 -2946934 -6299733 -7547882 -7506213 -8746341 -11511590 -13330015
39168 -13330015 -12199595 -8310055 -3239312 740536 1353684 -1551486 -4901880 -5174649
39160 -5174649 -1957029 2520467 6391663 8970342 9678356 8505826 7044335 6823334
39152 6823334 6804577 4572822 -63495 -4621792 -7144407 -7989495 -8279957 -8468487 -8973648
39143 -8973648 -10530615 -12892833 -14245784 -13040002 -10095453 -8033793 -8376594 -9670517
39135 -9670517 -9198360 -6512960 -3984652 -3114167 -2123385 753640 3405411 2876458 1223374
39126 1223374 3309517 8229029 8789639 2180317 -4482941 -3731672 1938068 5175648
39118 5175648 5322166 7334883 11099170 10369660 3460176 -2561777 -1404380 4414279
39110 4414279 8482105 8777063 7247462 4938117 1898653 -434707 -850773 -986597 -2919918
39101 -2919918 -5204019 -4573658 -1077198 1551660 817956 -1682007 -2892039 -1988326 -624086
39092 -624086 -482231 -1383787 -1746869 -723103 487916 -1838 -2380158 -5045507 -6664138
39083 -6664138 -6940090 -5385328 -1225677 4715584 9605077 11144474 9597575 6753009
39075 6753009 4125954 2788701 3466072 5616024 7287166 6766591 3802406 -920163
39067 -920163 -6238339 -10163261 -10752665 -8250488 -5188715 -3642558 -3386272 -3052930 -1744967
39058 -1744967 789883 3985225 6153792 6109692 5276768 6044529 7844641 7602542 4628627
39049 4628627 1792782 679252 -761741 -3665353 -5087620 -2579492 1195159 2325397
39041 2325397 1825276 3673986 8158704 11480505 11307992 8769108 5359073 1774749
39033 1774749 -348644 475116 2488626 2508486 1246400 2701164 7230478 9571472 6001641
39024 6001641 -122591 -2853633 -986307 2160715 4269510 5870326 7493810 8231537
39016 8231537 7628547 6945467 7700950 9901283 12219545 13556025 14200474 15288265 16805993
39007 16805993 16667104 13003887 7303135 3560113 3622692 4872193 3653346 -146695
38999 -146695 -3350276 -3699595 -2384219 -2256767 -4395204 -6889559 -7000677 -4309224 -1152399
38990 -1152399 383740 961728 2386343 4404362 5105027 4348623 4454516 6704346 9144493
38981 9144493 9135871 6665100 3867302 2468512 3023912 5650439 9889044 14107014 16125059
38972 16125059 14505130 9202341 1912297 -3936749 -5091395 -1552450 3213447 6097367
38964 6097367 7256397 8129712 8068905 5061797 -739022 -6315342 -8883171 -8309494 -6207121
38955 -6207121 -3840271 -1431213 1146401 3458502 4318959 2883825 136706 -1526420
38947 -1526420 -851770 893386 1846132 1849582 1628004 675193 -2120578 -6049939 -8768539
38938 -8768539 -9230122 -8750510 -8576724 -7989736 -5886685 -3089504 -1654905 -2233110 -3247967
38929 -3247967 -2804771 -700423 1676625 2971319 3028845 2623973 2468504 2693187 3039135
38920 3039135 3157655 2810682 2226982 2231238 3475244 5480213 6989400 7244561 6194895
38911 6194895 3641911 -399482 -4085759 -4172068 588020 7411171 12147883 13252869
38903 13252869 11937811 9436832 6083079 2737104 998611 1414261 2738188 3356694
38895 3356694 2511876 201596 -2787210 -4663221 -4017650 -1930469 -1288580 -3290168 -5877448
38886 -5877448 -6534970 -5513771 -5039507 -6024319 -7048109 -6715757 -5855909 -6485362 -8811121
38877 -8811121 -10392244 -9300061 -7532701 -9227620 -14733980 -18734171 -16480953 -10370856
38869 -10370856 -7289193 -10074278 -15014982 -17850627 -18315828 -17542430 -15029462 -10890988
38861 -10890988 -7866410 -7572727 -7057151 -2964811 2418246 3535683 -659138 -5593514
38853 -5593514 -7932826 -9229390 -11537261 -13405096 -12530551 -9451076 -6080330 -2779316
38845 -2779316 656160 2934757 2824471 1507676 943015 905901 71659 -885147 -55268
38836 -55268 2114076 2666791 -82022 -4739454 -9108117 -12171708 -13318152 -11726860 -7695015
38827 -7695015 -3239024 -416595 130510 -1195934 -3350476 -4432434 -2976718 -269510
38819 -269510 432612 -1893898 -4371955 -4135676 -2052967 -526891 732916 3759652 7799566
38810 7799566 9121600 6237056 2671827 2811918 6568803 10030813 10577069 9408695
38802 9408695 8985340 9678305 9951594 9018363 7937763 7850334 8231339 7851421 6861272
38793 6861272 6476538 6558475 5253252 1976676 -765594 -270302 2450990 3640382 1586761
38784 1586761 -1445726 -2531275 -1641053 -930910 -1670951 -3134686 -4077522 -4307232 -4760064
38775 -4760064 -6472679 -9484582 -12638728 -14571718 -14756275 -13253729 -9851845 -4414457
38767 -4414457 1773738 5938423 5806956 1692482 -3356342 -5478165 -2874224 2334556
38759 2334556 5559773 4099957 -188556 -3405045 -4015418 -3285289 -2203471 -515841
38751 -515841 1174054 1253626 122038 781458 4613849 8505248 8235485 3416566 -2799204
38742 -2799204 -7697765 -10707648 -12152460 -12451168 -12082005 -10678549 -6870163 -689330
38734 -689330 4863722 6839682 6202731 6286233 7867011 8444782 6424025 3267936 940424
38725 940424 -288041 -650741 138421 1553774 1953317 938448 277269 1169273 2315910
38716 2315910 2251340 1989417 3443181 6346986 8707030 9562840 9452112 8744644 7514480
38707 7514480 6806866 7915386 10049177 10571861 8374934 5618243 5086679 6771427 8165194
38698 8165194 7337588 4578707 1287816 -1516165 -3334086 -3900078 -3456021 -2790804 -2463072
38689 -2463072 -2479266 -3206013 -5652226 -9646475 -12534285 -11713386 -8480789 -7046740 -8816922
38680 -8816922 -9888704 -6064305 1246744 6406623 5993526 1699703 -2712697 -5093212
38672 -5093212 -5434529 -4625969 -3255111 -838015 3426730 8377260 10771482 9305324
38664 9305324 7288471 8458226 11113020 10021807 4028903 -2138469 -4316519 -3274290
38656 -3274290 -1364120 1177279 4222593 5493363 3458188 243714 -1156975 -751190
38648 -751190 -220518 228840 1100193 1710472 1878434 3551097 7597632 10778759 9541245
38639 9541245 5601279 4008638 6351265 9473742 10508834 9608337 7763700 5330464
38631 5330464 2992665 1367241 -271135 -2271149 -2558100 249009 2822793 890653
38623 890653 -3460833 -3756154 1029011 4645176 3446464 1755742 3696551 5495202
38615 5495202 1584299 -5558757 -8111621 -3697895 2289463 4528742 2854997 -398896
38607 -398896 -3302196 -3830315 -755424 3502655 4263006 447803 -3525657 -3225447 544942
38598 544942 3393695 2477379 -1387823 -5411013 -7349787 -7134964 -6744559 -7949981 -10182910
38589 -10182910 -11508050 -11337992 -10762475 -10495859 -10265526 -10083738 -10142073 -9485327 -7055643
38580 -7055643 -4200447 -3519338 -4667525 -4230777 -965159 1870613 1433056 -219216 584369
38571 584369 3385688 4575060 3163440 2166538 4067384 7587709 9621060 8561285
38563 8561285 5260381 2040680 865711 1361225 1077522 -991500 -2196584 279160
38555 279160 4640542 6246498 3972378 1367005 894391 771960 -774989 -1655523 805283
38546 805283 5161992 7564235 6672137 4058043 1008501 -2186218 -4687951 -5696473
38538 -5696473 -5984254 -6392781 -5754245 -3051565 -432545 -500097 -1420756 1014397 6530670
38529 6530670 10209464 9944496 9227216 10784232 12261203 11006026 8670041 7337778
38521 7337778 5011368 -426624 -5792764 -6413954 -3503774 -2382406 -4230559 -4940580
38513 -4940580 -2246473 1079969 2174963 1867523 1989609 2449854 2647273 3022388 3837054
38504 3837054 4695263 5970371 8213529 9815454 8298972 4453687 1916872 2030830
38496 2030830 2669072 2802115 3939406 5738674 4923287 857439 -2415021 -2579694 -2769475
38487 -2769475 -5159104 -5769766 -1037371 4443300 3366929 -3460621 -8549310 -8691039
38479 -8691039 -7467083 -7008159 -4751471 -121565 2499474 852073 -771070 1599162
38471 1599162 4719027 3044825 -2450390 -5682632 -4442902 -3032922 -5574158 -10572443
38463 -10572443 -13495228 -12268988 -8697226 -5824005 -5248908 -6471392 -7843467 -8018186
38455 -8018186 -6771332 -4658184 -2149892 682343 3657835 5830138 5747357 2992356
38447 2992356 -550453 -1961826 -309972 2584539 4980476 7302667 10110008 11666306
38439 11666306 9925320 6022914 3142434 2318397 2132319 2355660 4482385 7878861
38431 7878861 8867629 5592552 1216843 12418 2159563 4676758 5862152 6157045
38423 6157045 5574700 3183748 -638415 -3667998 -4385856 -3780744 -3780114 -4606846 -4631339 -2934640
38413 -2934640 -1296992 -2568621 -6691176 -9488866 -6789923 693911 7972206 10903128
38405 10903128 9240919 5139275 927461 -1447727 -1209878 35526 -334419 -2536222
38397 -2536222 -3915212 -2477604 891984 4165307 5880165 4508641 -1088165 -9123078
38389 -9123078 -15277164 -17331060 -17200323 -16934703 -15643201 -12692470 -10870630 -12747292
38381 -12747292 -15859440 -15375275 -10519670 -4857459 -966116 1634173 3580757 4231342
38373 4231342 3518863 2478373 1614637 1020889 1802770 4611532 7000248 5500526 702479
38364 702479 -2936989 -3121958 -2425555 -3781923 -6315978 -7628013 -7933215 -9581116 -13557633
38355 -13557633 -18166974 -20633177 -19289529 -15162876 -11870385 -12580379 -16384845 -18915326
38347 -18915326 -17079292 -11936675 -6717724 -3850635 -4447306 -8483464 -14075187 -18087434
38339 -18087434 -18838882 -17272284 -14815579 -11617806 -7844056 -5061390 -4804952 -6648216
38331 -6648216 -8778798 -9766149 -9223600 -7881713 -7567564 -9704151 -13123722 -14846423 -13758480
38322 -13758480 -11833561 -10799156 -9512852 -6109680 -1197761 2688687 3787464 2249214
38314 2249214 -60199 -135565 3716227 8769251 9637014 4989588 -16023 -585097 939038
38305 939038 -1240823 -7679089 -12985106 -13239698 -9871171 -5889813 -2393462 73134
38297 73134 428188 -796220 -1118520 145580 366213 -2079140 -4421337 -3194491 413750
38288 413750 2022377 128718 -2245486 -2086412 -53546 1137003 213156 -1748061 -2896280
38279 -2896280 -2339438 -851142 -128813 -848626 -1669417 -1155076 -440270 -2297618 -7086633
38270 -7086633 -11462231 -12398028 -10981583 -10351267 -11042260 -10988831 -9745894 -9504815 -11011894
38261 -11011894 -11580348 -9314637 -6859168 -7851157 -11094023 -11838474 -8519213 -4639557
38253 -4639557 -3422359 -4042457 -4529769 -5204872 -6950480 -8534716 -8432974 -7713527 -8277926
38244 -8277926 -9185934 -7570364 -3021730 1312089 2204117 -740186 -5448967 -8899530
38236 -8899530 -8527280 -4215181 781213 2519336 364716 -2788651 -3998818 -2509492
38228 -2509492 933506 4740027 6400238 4174969 -391908 -3562605 -3652978 -2307829
38220 -2307829 -1048917 958759 4432421 7656202 8637578 7858649 6814434 5245117
38212 5245117 2084051 -1923802 -4976208 -6954344 -9051893 -11064763 -11539287 -10657471
38204 -10657471 -10478294 -11733675 -12560331 -11205709 -8055931 -4192524 -59453 3251793
38196 3251793 3600089 597280 -2896959 -4296631 -4920623 -7514393 -11159921 -11860820 -8198686
38187 -8198686 -3288260 -356418 802421 1798846 2812744 3544890 4621814 5893728
38179 5893728 5402449 2536238 346753 1758726 5025568 6445816 6430725 8579642 12878883
38170 12878883 14570737 11167899 6451565 5227238 7410421 9831736 11020301 11291867
38162 11291867 10409579 8286931 6442702 6024146 5849424 4861179 4615286 6392623 7794403
38153 7794403 5855260 2067194 348611 1140653 1800036 1950459 3406736 4944822 2932094
38144 2932094 -1558916 -2110164 3713403 9537664 8763133 3849766 1957111 4068693
38136 4068693 4265538 -861061 -7436109 -9901648 -7285150 -2202554 3260373 8286832
38128 8286832 11682933 12026996 9433932 5733486 2401988 -1006103 -5584008 -10329219
38120 -10329219 -11963735 -8661363 -3104216 96983 -210176 -1196764 -1038646 -1391564 -3612002
38111 -3612002 -5598340 -4950504 -3014788 -2760024 -4201565 -5158308 -5484935 -7055050 -9900902
38102 -9900902 -11841074 -12211887 -12724724 -13937591 -13960896 -11788284 -9094181 -7288046 -5427845
38093 -5427845 -2921135 -1893826 -4345585 -8479104 -10378116 -8470903 -4211913 703817
38085 703817 5294116 8040402 7682172 5793284 5921545 8858013 10873198 8537421 3796506
38076 3796506 1803880 4170563 6871941 5412489 5596 -5505703 -8170654 -7701905
38068 -7701905 -5025079 -1431708 1037080 662019 -1786154 -3461469 -2631355 -99630
38060 -99630 2950863 6620952 10647360 12889067 11452593 7494050 4069662 2552039
38052 2552039 1706577 69658 -2175306 -3590912 -2567257 1769279 8480963 14758708
38044 14758708 18076012 18323864 16942123 14605780 11319569 8322494 7694434 9536472
38036 9536472 11276336 10670089 8314073 6419219 6172486 7195859 8762930 10473392
38028 10473392 11989062 12869794 12754710 11474418 9014493 5446063 1015260 -3367333
38020 -3367333 -5899940 -5235409 -2568654 -1175716 -2780237 -5426802 -6324418 -5614577 -5240201
38011 -5240201 -4954087 -2332170 2987571 7753443 8796923 6305497 2491489 -1003618
38003 -1003618 -3139639 -2856222 -395552 1668870 418800 -4583337 -11138746 -16387326
37995 -16387326 -18432937 -17251551 -15023472 -14514038 -15919502 -16132786 -12315025 -5489905
37987 -5489905 571450 3394872 3535106 2870339 2629750 3067604 3886240 4541418 4480947
37978 4480947 3160373 -2340 -4871126 -9562902 -11375459 -9673619 -7044566 -6617816
37970 -6617816 -8893298 -12040251 -14280066 -14525794 -11557582 -4925593 2832318 6818550
37962 6818550 4255580 -2072134 -6113929 -4684257 -742710 -62845 -4954185 -12073552
37954 -12073552 -16448649 -16450861 -14014712 -11143789 -7935454 -3802506 976564 5184646
37946 5184646 7131151 5470467 906450 -3297525 -4242171 -2540527 -634144 1368410
37938 1368410 5135995 9515664 10584890 7747047 5786371 8119882 11339604 10005387
37930 10005387 4295883 -1149801 -4202293 -6665295 -9694818 -12304466 -14364532 -16709506
37922 -16709506 -17570154 -13138709 -3414189 5915417 9601956 8390884 6522459 6008070
37914 6008070 5752855 4664550 2913045 654974 -2228620 -4889230 -5499490 -3154471
37906 -3154471 689091 3157389 2611340 362811 -821724 -186711 113519 -1577320 -3550022
37897 -3550022 -3126436 -803580 633389 733942 2099722 5988694 10043786 11531481
37889 11531481 10432115 7986782 4476483 272945 -2676918 -2495611 361497 3812244
37881 3812244 6156880 6471500 4518401 1574711 -141924 -379214 -1661785 -5382600
37873 -5382600 -8625772 -7457299 -2584305 1131251 1023661 -75446 1975700 6878717
37865 6878717 10039679 7988968 2188752 -3053043 -5511612 -6565831 -7862408 -8459732
37857 -8459732 -6905356 -4764987 -5336394 -8907081 -11933729 -11528667 -8358507 -4407346
37849 -4407346 -652608 1738997 892566 -2787675 -5458708 -4275649 -1126730 598089
37841 598089 926188 1867613 2978359 2395714 1257713 2574298 5606986 5858602 1846075
37832 1846075 -2128398 -1996526 534758 980675 -1762597 -4905427 -5824075 -4185042 -1140074
37823 -1140074 1296499 828725 -2921109 -7057110 -8147256 -6238313 -4440899 -4478099 -4437401
37814 -4437401 -1553960 4187580 10183854 14016132 15018331 13542184 10035047 5287146
37806 5287146 738385 -2311951 -3626278 -3598223 -2186404 817873 4417943 6387140
37798 6387140 5237494 1645280 -2433787 -5364102 -6288857 -5137100 -2943750 -1224243
37790 -1224243 -227477 1247476 3591656 5339746 5507376 5355739 6096795 6448319 4909857
37781 4909857 3208102 4417991 8197299 11045278 11188534 9945519 8102163 4755622
37773 4755622 814108 -271126 2568434 5651527 5768412 4925387 6718442 10372275
37765 10372275 12237059 11750948 11742300 13148058 13484525 11373652 9223551 9766354 12093497
37756 12093497 12767985 9708152 3971932 -1379357 -3613019 -2452188 -248842 726664
37748 726664 906385 2035907 3656487 3274842 432589 -1814367 -704048 2890300 6373051
37739 6373051 8861736 10790880 11577635 10230362 7784442 6729962 7766945 8961277
37731 8961277 8509369 6783532 5157086 4176963 3457526 2184498 -767773 -5923764 -11729104
37722 -11729104 -15211756 -14917222 -12078545 -8296255 -3797370 800826 3055244 1424067
37714 1424067 -1876021 -3552268 -4022160 -6332863 -10509971 -12734326 -11055532 -8218613
37706 -8218613 -6971432 -6107193 -4007678 -2971115 -5973499 -11008052 -13059341 -11073819
37698 -11073819 -8853816 -8991753 -9853797 -9248956 -7440212 -5312597 -2745364 -252582
37690 -252582 548509 -415991 -1082746 -567016 -328285 -677805 632048 4207751 6632864
37681 6632864 5270483 2726382 2974598 5198867 5596232 3969185 3997870 7012101 9708723
37672 9708723 9113499 6478149 4681377 4215105 3539249 1856779 -243094 -2341632 -5051010
37663 -5051010 -8891641 -12523343 -12956836 -8862521 -3425635 -1539466 -3377593 -3654064
37655 -3654064 841235 6173794 7034525 4681581 4307027 6289857 5991353 2103205 -1128032
37646 -1128032 -1701612 -3905486 -10998651 -18472981 -19375216 -13748871 -8122929 -6733010
37638 -6733010 -7430719 -6403196 -3554712 -1914293 -3329491 -6004045 -6350097 -3182536
37630 -3182536 612450 1671840 639641 806843 2642006 3049146 873106 -616897
37622 -616897 1144556 3782715 3890078 2447272 2735077 4755623 5628057 4512515 3347584
37613 3347584 2945663 1754993 -1150964 -4505976 -6698455 -7310022 -6907972 -6906201 -8813795
37604 -8813795 -11642548 -11276619 -5132499 3505913 8792297 9104606 7233589 4775198
37596 4775198 777393 -3908791 -5792103 -3872155 -1514603 -1021030 71757 4513837
37588 4513837 10133427 12406746 10399180 7083887 4917139 3903280 3403148 3276371
37580 3276371 3167733 2503005 1516799 1293430 2671303 5401896 7912356 7891116 4333112
37571 4333112 -664006 -3536377 -3070667 -1007411 1328988 4505464 8187725 9768872
37563 9768872 7808802 4497308 2326810 433323 -2937936 -6180441 -6035721 -2598498
37555 -2598498 898456 3000596 5285377 8365037 9921339 7920142 3410713 -1032316
37547 -1032316 -3760830 -4060924 -1752239 1881091 4312083 4345961 3463327 3529331 4234305
37538 4234305 4046354 2864008 2233564 3087135 4491859 5039495 4750749 4766913 5075650
37529 5075650 3573970 -1246731 -6893691 -8268617 -3687222 2235819 3781957 1083249
37521 1083249 -661031 1547647 4936913 5226478 1884669 -2166084 -4239773 -3796203
37513 -3796203 -1825505 360814 2222547 4301661 6650713 7170422 3471317 -3100748
37505 -3100748 -7590858 -6978519 -3665793 -1695270 -1386475 -304578 1700435 1785814 -1261860
37496 -1261860 -4591988 -4897868 -2644884 -930612 -1023734 -968870 1171217 4303009 5744252
37487 5744252 4906152 3721785 3125330 1237370 -3223051 -7392190 -7218585 -3734104 -2886056
37478 -2886056 -7775771 -13991876 -14990893 -10102563 -4563698 -2937898 -5209228 -8541591
37470 -8541591 -10057471 -8094894 -3396299 659649 1194340 -609491 -1151221 463571
37462 463571 1575729 580051 -689823 -471177 -149045 -1740872 -4424529 -5981861 -6276169
37453 -6276169 -6859793 -7971387 -8193310 -6717935 -4173295 -1669695 -578136 -2269875
37445 -2269875 -5893189 -7306622 -3241327 3452809 5864047 1222254 -5822150 -9566783
37437 -9566783 -10064094 -11083570 -13496556 -14305864 -11826497 -8477923 -7454590 -8879377
37429 -8879377 -10644646 -11626980 -12374936 -12933482 -11412407 -5686199 3247081 10257383 9982223
37420 9982223 2618242 -5411853 -8125259 -6350085 -5360652 -7062304 -7953150 -5398942
37412 -5398942 -2096760 -1883029 -4016170 -5032137 -4422881 -4475347 -5173127 -3544911 1198317
37403 1198317 5641847 6855653 6016073 5355966 4224873 885805 -3597500 -6151724
37395 -6151724 -5446165 -2486479 1570644 5566012 6981163 3590261 -3007761 -8004369
37387 -8004369 -8495622 -6263452 -4815112 -5455060 -7157471 -8572063 -8808559 -7434462 -5079422
37378 -5079422 -3379544 -3319174 -4221408 -5099587 -6082578 -7413659 -7822776 -5445345 -448163
37369 -448163 4307101 5629608 2700970 -2558112 -7395370 -10363091 -11717128 -11992439
37361 -11992439 -10869943 -8121151 -5213869 -4641302 -7193390 -10710015 -12007365 -9582593
37353 -9582593 -4517495 315519 1999850 -28790 -2985176 -3588416 -2216208 -2215854 -4429631
37344 -4429631 -5279293 -2446036 239423 -2582663 -9424004 -12575706 -7831728 69497
37336 69497 3420563 218655 -5185998 -7982185 -6966043 -3961224 -1708924 -2142777 -4943965
37327 -4943965 -7662265 -8338532 -7821628 -8557174 -11508369 -15349237 -18281613 -19440174 -18797502
37318 -18797502 -16961689 -14969561 -13125276 -10247634 -5430671 -397506 1692650 189190
37310 189190 -2150739 -3185593 -4471382 -8375153 -13215302 -14012653 -8638828 -1148111
37302 -1148111 2443865 658064 -2575205 -2866682 525657 5490624 9950379 12788029
37294 12788029 13209653 11042026 7589535 4838721 3529424 2872506 2179052 1709260 1824750
37285 1824750 2555084 4290807 7449028 10799125 11704420 9280533 6035262 4805761
37277 4805761 5046693 3953928 631449 -2782382 -3892501 -2231142 1010534 3570922
37269 3570922 2835887 -1656418 -6467711 -7730005 -6695365 -8579338 -14732393 -19617766
37261 -19617766 -18124788 -12639298 -9087850 -8407819 -6852644 -3722347 -3065104 -6462606
37253 -6462606 -9208982 -6709128 -1216350 1442520 -200109 -2305020 -1844329 -187207
37245 -187207 -265978 -2734721 -5679690 -6506919 -3752655 1444742 5381453 4910427 1110904
37236 1110904 -1488985 113593 4497709 8385801 10458383 11420997 11592200 10248570
37228 10248570 7164030 3533100 1190398 1378327 3876932 6791486 7947225 7453541
37220 7453541 8091626 11720541 15922089 16245014 11824699 6584809 4202912 4119255 3854555
37211 3854555 3071482 3086646 3975183 4946730 6546413 9240435 10335420 6336474 -830523
37202 -830523 -4081134 141391 6917913 9539354 8023915 7024583 7758417 7255745 4781585
37193 4781585 3453087 4639702 5711548 5129322 5381336 8410778 11946476 13269721
37185 13269721 13276777 13640446 13124754 10424706 7728142 7009310 5200694 -1685813 -11015356
37176 -11015356 -15689220 -13523177 -9060076 -5883712 -2998022 -59223 -6359 -3443800
37168 -3443800 -5574557 -2706888 2095120 3823958 2480182 862904 -1463760 -6780409
37160 -6780409 -13619557 -17717976 -17739229 -15546062 -11708192 -5710471 -211765 470380 -2973861
37151 -2973861 -4867705 -2857667 -1229471 -3462064 -6269530 -4890171 -581601 1873884
37143 1873884 1861118 3077094 6601554 8497732 5393011 -679863 -4482063 -2971095
37135 -2971095 2192239 6215076 5025052 -1018844 -7033674 -8447176 -5787592 -3164599
37127 -3164599 -2350700 -774270 3993701 10114454 13403622 11904362 7011564 1260424
37119 1260424 -3187257 -4685656 -2991427 -179683 1163794 1230324 2838629 7069980
37111 7069980 10721415 10056815 6242044 4431494 6943360 9848254 8163686 2747477
37103 2747477 -631410 1468596 6714730 11136994 13631282 14699504 13497815 9306576
37095 9306576 4549369 2614746 2556836 -459559 -8122222 -15534278 -17213143 -14161434
37087 -14161434 -11688804 -11542035 -10296029 -5947957 -1980499 -2378413 -5231072 -4732182
37079 -4732182 1183531 8225517 11050317 8721983 4060296 -298963 -3540053 -5567154
37071 -5567154 -6175514 -5407898 -3833503 -2360640 -2059305 -3792544 -7527728 -12139648 -15961554
37062 -15961554 -17209425 -14367888 -7632655 -212553 3614780 2888784 1087801 1708589
37054 1708589 4190359 5763755 5675509 5120174 4130954 1669259 -1359857 -2322254 -756038
37045 -756038 622081 -216583 -2156538 -3478166 -4415552 -5547888 -5811451 -4243679 -2135413
37036 -2135413 -1184528 -556370 1909797 5995441 8720726 7970498 5212913 4125315 6784125
37027 6784125 11053361 11924858 6449116 -2693987 -9974425 -13232918 -14787919 -16047552
37019 -16047552 -14527245 -8281870 -207814 5262143 7679852 9540425 11510272 12365752
37011 12365752 12405503 12931472 12988834 10692815 7638805 7800359 11519408 14556338 14076409
37002 14076409 11908269 10711614 10524414 10581647 11090957 11451646 9975919 7257715 6579966
36993 6579966 8864522 10474511 8557134 5459617 4887536 6471167 7412488 7134956 6886596
36984 6886596 6739384 6331170 6670302 7806185 6714169 1315759 -5183131 -8080219 -7695860
36975 -7695860 -7652298 -8185814 -6539057 -3299572 -2355282 -3935678 -3567177 376354 3565386
36966 3565386 2651742 344779 366728 1758198 2120916 2909672 6963541 13095156 17415275
36957 17415275 18519657 17630422 15089631 10653845 6226132 4243285 3746284 1866218
36949 1866218 -914435 -957377 2525446 5537488 4801970 1925193 116539 -488509 -1599420
36940 -1599420 -2646190 -980713 3887091 8549419 9200317 6097436 3641561 5699334
36932 5699334 11095647 14608988 12943650 8648867 6711851 8071000 8842657 6170838
36924 6170838 2157646 414235 815634 364872 -1523581 -1712292 1722129 5542912 4522498
36915 4522498 -2165237 -9823679 -13670086 -13351253 -11046164 -7226232 -1002099 6059533
36907 6059533 9887663 8859626 6220709 5622650 6191681 4484819 -8346 -4255504
36899 -4255504 -6064172 -6092940 -5284212 -3218895 -44912 2355619 2525230 1015698 -1267579
36890 -1267579 -4357496 -7472535 -7989127 -4272562 1729873 6637163 9208823 9920789
36882 9920789 8552549 5035895 1774637 1711403 3971690 4671562 2698588 1355178 2896654
36873 2896654 4884185 4496456 3432247 4723678 6603836 4333609 -1946720 -5942121
36865 -5942121 -3471973 1739946 3180327 -311445 -4680999 -6965916 -7613604 -7177103
36857 -7177103 -4782242 -895294 1526964 426004 -2847559 -5936707 -8410492 -10365491
36849 -10365491 -9988005 -5583418 414156 2577090 -1306129 -7158398 -9205065 -6469952
36841 -6469952 -3168376 -3241749 -6273104 -9145040 -10119179 -9860725 -9179555 -7791720 -5799803
36832 -5799803 -4486157 -4218208 -3164772 -334377 1314354 -1877679 -7930580 -9963163
36824 -9963163 -4776175 2697899 5895974 4468182 2353999 836929 -1755552 -4772755
36816 -4772755 -4986606 -2089477 177521 -350192 -1549533 -1423448 -1109760 -1240409 645239
36807 645239 5645632 9738115 8723735 4855658 4045819 7421418 10080193 8327633
36799 8327633 4085550 1099437 204013 143643 633010 2348064 4910482 6634246 6223601
36790 6223601 4019399 1504127 -377669 -2255734 -4990279 -7352963 -6814766 -3507676
36782 -3507676 -1145653 -1976312 -3012552 -461036 3788125 4354704 522817 -2514630
36774 -2514630 -1376854 1046561 686639 -2208199 -5259507 -8151678 -11426220 -13818243
36766 -13818243 -14262416 -14480861 -16108933 -17044965 -14414144 -9741804 -6999191 -6288672 -4023788
36757 -4023788 486154 3361451 2373741 495013 872851 1943375 824641 -1159983
36749 -1159983 -400457 2873198 4597844 3173359 1861420 3284958 4571900 987508
36741 987508 -6744270 -11926923 -9400804 -1412569 5406801 7434107 6423026 5285807
36733 5285807 4315131 2468203 112595 -1467359 -2144667 -2557674 -2251979 -227965 2696002
36724 2696002 3900088 1793365 -2588817 -6996256 -9796884 -10438158 -9564814 -8835273 -9101609
36715 -9101609 -8667703 -5305699 -454936 976490 -3580607 -10678912 -14782118 -14303224
36707 -14303224 -11731538 -9301815 -7399935 -6602572 -8045971 -11105837 -13278581 -13533330
36699 -13533330 -13822189 -15981912 -18836253 -19917458 -18688341 -16290010 -13188107 -9236832
36691 -9236832 -5616019 -4392646 -5802259 -7807416 -8855452 -9279638 -9246429 -7381674 -3069166
36682 -3069166 1435977 3316228 2739471 1955960 1522507 13009 -2624368 -4382207 -4618698
36673 -4618698 -5268420 -7171878 -8030533 -6351914 -4915161 -7000617 -10851100 -11820381 -9406987
36664 -9406987 -7969407 -9956427 -12481489 -12154856 -9711287 -7446665 -5011035 -897556
36656 -897556 3753789 6193214 6196471 6333370 8205464 10599623 11389795 9501730 5087007
36647 5087007 -580711 -5374904 -7831799 -8241162 -7241983 -4362017 277854 3951029
36639 3951029 3811376 1134605 161216 2345346 4658149 4486029 3229567 3292317 4045263
36630 4045263 3270611 1028529 -446917 87954 1921855 3967959 5394641 5295018 3830291
36621 3830291 3370267 6190664 10771996 12530721 9007697 2650008 -2355973 -4297717
36613 -4297717 -3824394 -1418581 2753203 7058294 8835615 7239380 4148239 1542991
36605 1542991 -685266 -3332632 -5604319 -5964416 -4651839 -3369042 -2422330 -260207
36597 -260207 3408164 6041675 5283229 2059156 -1023663 -3083042 -4741608 -5670077 -5033963
36588 -5033963 -3876782 -4084817 -4861787 -3402742 104347 1458008 -1720906 -5924546
36580 -5924546 -6071909 -1860136 2906054 5726711 7090153 7707823 7369385 6628871 6836212
36571 6836212 7825320 7562357 4716691 204843 -3938960 -5919023 -4816555 -1715940
36563 -1715940 72794 -1990559 -6417434 -9320351 -9063854 -7083325 -4512974 -1114074
36555 -1114074 2176538 3127552 1849233 1393018 3185923 4959576 5065884 5482488 7750622
36546 7750622 9015091 5852746 -74538 -4110391 -4858839 -4391043 -3400956 -680039 2785304
36537 2785304 3742765 1558608 -630288 -671827 231494 986520 2649546 5232898 6119642
36528 6119642 4214987 2624519 4237610 7143233 7682473 6063445 5361468 6239153 6453918
36519 6453918 5269959 4820269 6516369 8749717 8857348 5496922 -1025039 -8639139
36511 -8639139 -13586494 -13085951 -8753578 -5411661 -5693616 -7601662 -8096846 -7004608 -6012365
36502 -6012365 -5532730 -4455258 -2276081 50781 1245510 946162 96930 373724 2567849
36493 2567849 5354727 6630179 6281091 6314167 7725338 8733401 7122922 3134385 -1086829
36484 -1086829 -3915665 -5065330 -5010316 -4791500 -5529104 -6979419 -7447665 -6270533 -5342163
36475 -5342163 -6747264 -9790423 -11892671 -11561383 -8900678 -4301746 1175850 4872130
36467 4872130 4497406 898460 -3271952 -7148410 -11231339 -13823684 -11719876 -5511262
36459 -5511262 -612795 -799555 -3388799 -3282164 407764 4430570 6227566 5638580 3063391
36450 3063391 -737515 -3406053 -2691361 277978 1894856 605343 -1603107 -2428911
36442 -2428911 -1707283 -348567 741526 101946 -3355739 -7741987 -8885268 -5200278
36434 -5200278 49155 2885503 3071128 2593352 1747003 -438976 -2947316 -3103111 -363949
36425 -363949 2679419 3790618 3735369 4533273 6437755 7907876 8119283 8414539 10693205
36416 10693205 14445425 16319716 13881813 9417497 7856178 10374028 12709016 11482773
36408 11482773 9259186 10025015 11953232 9504328 2102773 -4510017 -6376127 -5559362
36400 -5559362 -4401586 -1137232 4764104 7713522 2630098 -6003080 -8312753 -1853234
36392 -1853234 5885195 8472240 7861570 8469163 9800270 9285103 8220856 9453650 11353856
36383 11353856 9597393 4374922 769831 1391019 3231907 3392118 3672432 6583793
36375 6583793 9927403 9286058 4655471 869567 1310550 4206774 5959376 5543517 4043960
36366 4043960 1822166 -1395264 -4293058 -4456275 -1840089 161724 -1291478 -4454863
36358 -4454863 -4969985 -1714397 1617030 1765195 568044 1977008 5504306 5901127 61785
36349 61785 -8506221 -13786226 -13781943 -10901170 -7713944 -5418829 -5579533 -9491914 -15008970
36340 -15008970 -17337317 -14828288 -11476054 -11505601 -13590831 -13079854 -8333579 -1781958
36332 -1781958 4195193 8774075 10337439 6818912 -196994 -5196356 -4920362 -2351718
36324 -2351718 -1921822 -2784263 -284661 6586864 12711394 12725252 7213404 1748386 746013
36315 746013 3237707 4572752 2044464 -1499250 -616482 5871893 12607514 13622659
36307 13622659 9096215 4183096 2352895 2763087 3757521 5391477 7370830 7441490 4013243
36298 4013243 -1077250 -4180741 -3426698 222824 4312389 6267527 4705870 691415
36290 691415 -3088438 -5166546 -6224652 -6626551 -4953931 -506891 4409455 6778511
36282 6778511 6462348 5597436 5289746 4908246 3980260 2719628 1103715 -631404 -1075978
36273 -1075978 661542 2832289 3083810 2354996 3755011 7102889 7843614 3111625 -3640595
36264 -3640595 -6421238 -3664914 765999 2654234 1399021 -746876 -1469315 -30781
$$ [...]
##END NTUPLES=NMR SPECTRUM
##END=
