##TITLE=31Pdec_DE-137rm_3h
, 24 sc
 25.3.2026
##JCAMPDX= 6.0         $$ Bruker NMR JCAMP-DX V2.0
##DATA TYPE= NMR SPECTRUM
##DATA CLASS= NTUPLES
##ORIGIN= UXNMR, Bruker Analytische Messtechnik GmbH
##OWNER= root
$$ XWIN-NMR		Version 3.5
$$ Wed Mar 25 14:38:40 2026 Russian Standard Time (UT+4h)  she@DPX200
##.OBSERVE FREQUENCY= 81.013821
##.OBSERVE NUCLEUS= ^31P
##.ACQUISITION MODE= SIMULTANEOUS
##.ACQUISITION SCHEME= undefined
##.AVERAGES= 24
##.DIGITISER RES= 17
##SPECTROMETER/DATA SYSTEM= spect
##.PULSE SEQUENCE= zgpg30
##.SOLVENT NAME= CDCl3
##.SHIFT REFERENCE= (INTERNAL, CDCl3, 0, 197.392)
##AUDIT TRAIL= $$ (NUMBER, WHEN, WHO, WHERE, WHAT)
$$ ##TITLE= Audit trail, XWIN-NMR		Version 3.5
$$ ##JCAMPDX= 5.01
$$ ##ORIGIN= Bruker BioSpin GmbH
$$ ##OWNER= she
$$ F:/spectra/data/she/nmr/P31/2/pdata/1/auditp.txt
$$ ##AUDIT TRAIL=  $$ (NUMBER, WHEN, WHO, WHERE, WHAT)
(   1,<2026-03-25 14:37:19.90 +0400>,<she>,<DPX200>,
      <created by zg, POWCHK disabled, PULCHK disabled
       configuration hash MD5:
       00 E9 B6 7A A2 85 ED C7 34 08 36 98 17 FE 4E 26
       data hash MD5: 32K
       16 7A DE 91 EA B0 A4 75 55 DD BC 0A DC 7A 23 8F>)
(   2,<2026-03-25 14:37:24.06 +0400>,<she>,<DPX200>,
      <Start of raw data processing
       efp BC_mod = 2 LB = 1.5 FT_mod = 6 PKNL = 1 PHC0 = 1390.204 PHC1 = 93.90066 SI = 64K 
       data hash MD5: 64K
       48 EE E1 8D 1E 96 A8 8B 56 B8 7C CF 26 2F 62 09>)
(   3,<2026-03-25 14:38:10.23 +0400>,<she>,<DPX200>,
      <pk PHC0 = -7.795888 PHC1 = 0 
       data hash MD5: 64K
       E0 A9 1B 72 EF 76 74 27 03 5E 2E FA 75 E3 88 61>)
$$ ##END=
$$ 
$$ hash MD5
$$ 31 DF 9E CC 35 DA 0F 6B 60 C3 2E FE 80 85 63 D2
##$RELAX= 
##$RELAX= 
##$RELAX= 
##$RELAX= 
##$RELAX= 
##$RELAX= 
##$RELAX= 
##$RELAX= 
$$ Bruker specific parameters
$$ --------------------------
##$DU= <F:/spectra>
##$EXPNO= 2
##$NAME= <P31>
##$PROCNO= 1
##$TYPE= <nmr>
##$USER= <she>
##$AMP= (0..31)
100 100 100 100 100 100 100 100 100 100 100 100 100 100 100 100 100 100 
100 100 100 100 100 100 100 100 100 100 100 100 100 100 
##$AQSEQ= 0
##$AQ_mod= 1
##$AUNM= <au_zg>
##$AUTOPOS= <>
##$BF1= 81.014009
##$BF2= 200.13
##$BF3= 200.13
##$BF4= 200.13
##$BF5= 200.13
##$BF6= 200.13
##$BF7= 200.13
##$BF8= 200.13
##$BYTORDA= 1
##$CFDGTYP= 0
##$CFRGTYP= 5
##$CHEMSTR= <none>
##$CNST= (0..31)
1 1 145 1 1 1 1 1 1 1 1 1 1 1 1 1 1 1 1 1 1 1 1 1 1 1 1 1 1 1 1 1 
##$CPDPRG= <waltz16>
##$CPDPRG1= <>
##$CPDPRG2= <waltz16>
##$CPDPRG3= <>
##$CPDPRG4= <mlev>
##$CPDPRG5= <mlev>
##$CPDPRG6= <mlev>
##$CPDPRG7= <mlev>
##$CPDPRG8= <mlev>
##$CPDPRGB= <>
##$CPDPRGT= <>
##$D= (0..31)
0 1 0 0 0 0 0 0 0 0.06 0 0.03 2e-05 3e-06 0 0 0.0002 0 0 0 0 0 0 0 0 0 
0 0 0 0 0 0 
##$DATE= 1774435039
##$DBL= (0..7)
120 120 120 11 120 120 24 19 
##$DBP= (0..7)
150 150 150 150 150 150 150 150 
##$DBP07= 0
##$DBPNAM0= <>
##$DBPNAM1= <>
##$DBPNAM2= <>
##$DBPNAM3= <>
##$DBPNAM4= <>
##$DBPNAM5= <>
##$DBPNAM6= <>
##$DBPNAM7= <>
##$DBPOAL= (0..7)
0.5 0.5 0.5 0.5 0.5 0.5 0.5 0.5 
##$DBPOFFS= (0..7)
$$ [...]
##$SUBNAM2= <"">
##$SUBNAM3= <"">
##$SUBNAM4= <"">
##$SUBNAM5= <"">
##$SUBNAM6= <"">
##$SUBNAM7= <"">
##$SUBNAM8= <"">
##$SUBNAM9= <"">
##$SW= 400.765351723535
##$SWIBOX= (0..15)
0 1 3 0 0 0 0 0 0 0 0 0 0 0 0 0 
##$SW_h= 32467.5324675325
##$TD= 32768
##$TD0= 1
##$TE= 0
##$TE2= 300
##$TE3= 300
##$TEG= 300
##$TL= (0..7)
0 120 53 12 22 120 120 120 
##$TP= (0..7)
150 150 150 150 150 150 150 150 
##$TP07= 0
##$TPNAME0= <>
##$TPNAME1= <>
##$TPNAME2= <>
##$TPNAME3= <>
##$TPNAME4= <>
##$TPNAME5= <>
##$TPNAME6= <>
##$TPNAME7= <>
##$TPOAL= (0..7)
0.5 0.5 0.5 0.5 0.5 0.5 0.5 0.5 
##$TPOFFS= (0..7)
0 0 0 0 0 0 0 0 
##$TUNHIN= 0
##$TUNHOUT= 0
##$TUNXOUT= 0
##$USERA1= <user>
##$USERA2= <user>
##$USERA3= <user>
##$USERA4= <user>
##$USERA5= <user>
##$V9= 5
##$VALIST= <valist>
##$VCLIST= <CCCCCCCCCCCCCCC>
##$VD= 0
##$VDLIST= <DDDDDDDDDDDDDDD>
##$VPLIST= <PPPPPPPPPPPPPPP>
##$VTLIST= <TTTTTTTTTTTTTTT>
##$WBST= 1024
##$WBSW= 4
##$XGAIN= (0..3)
0 0 0 0 
##$XL= 0
##$YL= 0
##$YMAX_a= 25580
##$YMIN_a= -27975
##$ZGOPTNS= <>
##$ZL1= 120
##$ZL2= 120
##$ZL3= 120
##$ZL4= 120
##$ABSF1= 0
##$ABSF2= 0
##$ABSG= 0
##$ABSL= 0
##$ALPHA= 0
##$AQORDER= 0
##$ASSFAC= 0
##$ASSFACI= 0
##$ASSFACX= 0
##$ASSWID= 0
##$AUNMP= <proc_1d>
##$AZFE= 0.1
##$AZFW= 0.5
##$BCFW= 0
##$BC_mod= 2
##$BYTORDP= 0
##$COROFFS= 0
##$CY= -3
##$DATMOD= 1
##$DC= 0
##$DFILT= <>
##$DTYPP= 0
##$F1P= 0
##$F2P= 0
##$FCOR= 1
##$FTSIZE= 65536
##$FT_mod= 6
##$GAMMA= 0
##$GB= 0
##$INTBC= 1
##$INTSCL= 9.790993e-09
##$ISEN= 30
##$LB= 1.5
##$LEV0= 0
##$LPBIN= 0
##$MAXI= 10000
##$MC2= 0
##$MEAN= 0
##$ME_mod= 0
##$MI= 50
##$NCOEF= 0
##$NC_proc= -6
##$NLEV= 6
##$NOISF1= 182.463
##$NOISF2= 159.3651
##$NSP= 0
##$NTH_PI= 0
##$NZP= 0
##$OFFSET= 197.3918
##$PC= 4
##$PHC0= 1382.408
##$PHC1= 93.90066
##$PH_mod= 1
##$PKNL= yes
##$PPARMOD= 0
##$PSCAL= 0
##$PSIGN= 0
##$REVERSE= no
##$SF= 81.014063255964
##$SI= 65536
##$SIGF1= 159.3651
##$SIGF2= -187.1042
##$SINO= 113.3802
##$SIOLD= 16384
##$SREGLST= <1H.CDCl3>
##$SSB= 0
##$STSI= 65536
##$STSR= 0
##$SW_p= 32467.5324675325
##$SYMM= 0
##$S_DEV= 0
##$TDeff= 32768
##$TDoff= 0
##$TI= <>
##$TILT= no
##$TM1= 0
##$TM2= 0
##$TOPLEV= 0
##$USERP1= <user>
##$USERP2= <user>
##$USERP3= <user>
##$USERP4= <user>
##$USERP5= <user>
##$WDW= 1
##$XDIM= 65536
##$YMAX_p= 416236263
##$YMIN_p= -19518796
$$ End of Bruker specific parameters
$$ ---------------------------------
##NTUPLES= NMR SPECTRUM
##VAR_NAME=  FREQUENCY,     SPECTRUM/REAL,   SPECTRUM/IMAG
##SYMBOL=    X,             R,               I
##VAR_TYPE=  INDEPENDENT,   DEPENDENT,       DEPENDENT
##VAR_FORM=  AFFN,          ASDF,            ASDF
##VAR_DIM=   65536,         65536,           65536
##UNITS=     HZ,            ARBITRARY UNITS, ARBITRARY UNITS
##FACTOR=    0.49542278885378, 1,            1
##FIRST=     15991.5117654749, 0,            0
##LAST=      -16476.0207020576, 0,           0
##MIN=       -16476.0207020576, -19518796,   0
##MAX=       15991.5117654749, 416236263,    0
$$ Real data points
##PAGE= N=1
##DATA TABLE= (X++(R..R)), XYDATA
$$ [...]
46637e57223m24290m03014j01387J63314J54835J4102J5253J79351L28763L66935
46627b63361K76074o008m34309o96817m90582R0093O51856R06412P94567L75001
46617A202926j35953l59867j33184J80325Q3163l89366p21371o12338k80238n3518
46607a219421m658n5855j29999j03095J07128L24039K81283Q6349J58719N62523
46597G013P96819N14261P5560m392J31113o1032n90375q43607n06799l5758N1590
46586d65607r1696j5813K31550K13600r8465k05716J18318M13066K16952k26458
46576H9731l74989k29706k34594m44131m06286Q415K57132n8809m98762l90911
46566b282910J70155N04055L92560L32432O54044R52517O99065L1875m53273m97249
$$ y = [-557223, -981513, -1384527, -1485914, -1322600, -1167765, -1153663, -1138410, -959059, -630296, -263361, 12713, 6705, -427604, -1124421, -1615003, -1524910, -873054, 33358, 827925, 1202926, 1066973, 707106, 573922, 754247, 837410, 448044, -273327, -885665, -1165903, -1219421, -1224079, -1279934, -1409933, -1513028, -1405900, -1081861, -800578, -714229, -555510, 7013, 803832, 1318093, 1393653, 1389261, 1520374, 1459342, 868967, 25360, -481439, -517197, -465607, -557303, -573116, -341566, -127966, -226431, -432147, -313829, 99237, 316189, 89731, -285258, -514964, -749558, -1193689, -1599975, -1591560, -1334428, -1393237, -1891999, -2282910, -2112755, -1608700, -1216140, -883708, -229664, 722853, 1421918, 1453793, 1000520, 503271]
46556E03271l72362l49107l43787j89854K4363R4463L7111N7653J97118K35136
46546a05995M5400j35442o781L18372M21075J96093N0022K93310N97091L82955
46536B056100l56372r70960r10991k95369L36468N97781M82117K22592O0460M4066
46526A265892o452k28750m32589l01668R7817L04149P7396k71395l74425l26005
46516a96030l81268l98512o3549M26610M55700j11260o03041m03426K18861N12096
46506e43819K43743j21502j56335M7559J92465J96888J33647J5868j42052k28268
46496c61806j98595j89197k59214j76633K51058P18909O55332k4989p08852p78779
46486a072766k86544K41595M57500M03596K26199j677j70304j21096J41696L69283
$$ y = [503271, 130909, -218198, -561985, -751839, -727476, -633013, -595902, -538249, -341131, -105995, -60595, -196037, -202818, 115554, 536629, 732722, 782744, 1076054, 1673145, 2056100, 1699728, 728768, -182223, -477592, -141124, 456657, 938774, 1161366, 1221826, 1265892, 1259440, 1030690, 598101, 296433, 394250, 698399, 775795, 504400, 129975, -196030, -577298, -975810, -1039359, -612749, -157049, -268309, -871350, -1274776, -1055915, -543819, -300076, -421578, -577913, -530354, -337889, -141001, -7354, 8514, -133538, -361806, -560401, -749598, -1008812, -1185445, -934387, -215478, 439854, 414865, -293987, -1072766, -1359310, -1117715, -660215, -256619, -30420, -32097, -202401, -323497, -181801, 187482]
46476A87482K98763q6492n42100p41569m96924P4494N86481O95334M06948J4393
46466C96810k28975k64763j34697N7365J04419j19115l68553k07060L79890Q25734
46456D41055O75117J85686q9249j11940k94959o92818q05858l62194J74418K18574
46446f62168j28719k89984n6482K00388J34666j35812k79014j59175J09706L24752
46436i41842L30178J58057O9226K66081N49574N11475J17629k02011j67744k9686
46426F60937j16374l13217l07969j11188M6441J55838L41819M50084K08839k07281
46416H07929k87917K8022J81132j60690n42475l77780J78677M59343J91667k65052
46406B12856n08614m93592l18220l752L61896N33580L72963Q0055r121J77656
$$ y = [187482, 486245, 399753, -142347, -883916, -1380840, -1306346, -719865, -24531, 382417, 396810, 167835, -96928, -231625, -174260, -69841, -188956, -557509, -764569, -384679, 441055, 1116172, 1301858, 1212609, 1100669, 805710, 112892, -692966, -1055160, -880742, -662168, -790887, -1080871, -1137353, -936965, -802299, -938111, -1217125, -1376300, -1266594, -941842, -611664, -453607, -384381, -118300, 431274, 942749, 1060378, 858367, 690623, 660937, 544563, 231346, -76623, -187811, -141370, 14468, 356287, 806371, 1015210, 807929, 520012, 548034, 729166, 568476, 26001, -351779, -173102, 286241, 477908, 212856, -295758, -789350, -1107570, -1111322, -749426, -215846, 157117, 237172, 228051, 405707]
46396D05707L61884K41288j56726n04022n51933l88826k39175j27838M1126J43245
46386g75270p7364m94207n61680m8394N17334N03157L6315k29072o0488J44790
46376a044879Q1218o6362q1013r0863k24736k60932M9638N45363Q43032P93975
46366E44441M85902k0562o13614r06006n12540L62555R40637O74291j18894o12708
46356B23502l91084J65355M19661K24970k8725m3663j5478k41277n36802m04973
46346f28514K07062O98095N56102K1463k89475k18144j31077k33773k77811p7226
46336c73298Q8336j18275n33675o93821m66262j27420J39769M20708O69358N68993
46326d25587O0568l33165j20587M13289N37807R4821l07736k01599J37051K25844
$$ y = [405707, 767591, 1008879, 852153, 348131, -203802, -592628, -831803, -959641, -918515, -775270, -852634, -1346841, -1908521, -1956915, -1439581, -936424, -900109, -1129181, -1189669, -1044879, -963661, -1030023, -1111036, -1201899, -1426635, -1687567, -1637929, -1092566, -249534, 544441, 1030343, 1009781, 396167, -509839, -1022379, -659824, 280813, 955104, 836210, 223502, -167582, -2227, 417434, 642404, 613679, 570016, 554538, 313261, -223541, -628514, -421452, 276643, 832745, 854208, 564733, 346589, 215512, -18261, -296072, -373298, -284962, -403237, -936912, -1630733, -2096995, -2224415, -2084646, -1663938, -994580, -425587, -365019, -698184, -818771, -405482, 132325, 227146, -80590, -282189, -145138, 80706]
46316H0706Q1864R056m81j75592m28558l95840k7504K68863J70261j72550l83478
46305i73253k62085J31674N64087P29666M86452O4731j57622j32538j55836l45133
46295d9857m08421j14659K60380K41511j96663n42637l25930L60018R45508R37681
46285A106931L74871k57094n43100m94604l53320k12203k7045J18732O1376j37445
46275c62901k19201j08680o77j0764j9340M4297M1949j19927l27514m71914n63265
46264b117937n18581j61045L78270O00427K78616j23326l3653M29191O37498L20971
46254c09569j51134l45824k55464j19754m4619L0117J21988J34300J0991j04075
46244a033043K8859M02360O35287M00563p7004k49018J2335K52037J13624k02240
$$ y = [80706, 162570, 171626, 171145, -4447, -433005, -828845, -856349, -587486, -417225, -589775, -973253, -1235338, -1103664, -539577, 190089, 676541, 741272, 583650, 451112, 295276, -49857, -458278, -572937, -312557, -71046, -267709, -810346, -1136276, -776258, 169250, 1106931, 1481802, 1224708, 681608, 187004, -166316, -378519, -405564, -286832, -225456, -362901, -582102, -690782, -691459, -702223, -721563, -677266, -635317, -755244, -1082758, -1554672, -2117937, -2636518, -2797563, -2419293, -1818866, -1540250, -1663576, -1697229, -1268038, -630540, -309569, -460703, -806527, -1061991, -1181745, -1226364, -1196247, -1074259, -939959, -928968, -1033043, -1004184, -601824, 33463, 434026, 357022, 108004, 120339, 372376, 486000, 283760]
46234B83760l47078l04481j99467r875J99199J22062k96183n53480k59623J84097
46224a181069J32836l05642m58951j48572J25326P5844L0416K63914N05230L89314
46214e71354k418l07567l08113l8693K78325L46832J19033k4175K30801N35859
46204B58530K87767l97878p46968m61619j10701j43506k16296P4477M20471L36449
46194f99274j7148j69160j29765k03502k82456r111M87431O79414M56608K62188
46184C75225L44824M08715J59652k35362m23427k86663N5683M02369N25335L21139
46174A647490k698j18961j0088L6922j02532k27438j99871j83227l26069m70866
46164D2662l90219j27152J01649J94470J67260R362k35467l29771m2325M86074
$$ y = [283760, -63318, -367799, -567266, -577141, -377942, -255880, -552063, -1105543, -1365166, -1181069, -1048233, -1353875, -1812826, -1961398, -1836072, -1760228, -1729812, -1465898, -960668, -571354, -573772, -881339, -1189452, -1228145, -949820, -602988, -483955, -508130, -277329, 258530, 546297, 148419, -598549, -1060168, -1170869, -1314375, -1530671, -1456194, -1035723, -699274, -716422, -885582, -1015347, -1218849, -1501305, -1510416, -1022985, -343571, 113037, 375225, 720049, 1128764, 1288416, 1053054, 629627, 342964, 398647, 801016, 1326351, 1647490, 1644792, 1525831, 1515743, 1552665, 1450133, 1222695, 1022824, 839597, 513528, 42662, -347557, -474709, -373060, -178590, -11330, -1968, -237435, -567206, -609531, -123457]
46154a23457P75579M97843j71500p64139r93726r13596o55488j96869M89589J140395
46144i15369J271975O71053k63366q18293o49988j01648K07165N3820k23710k43953
46134a012314j01158j77011m92492n65424p6005N96335Q16078N15880J93141J38975
46124a63995J20964p4107k35977j26820O9291L4029j69419k09188J3554K75548
46114d66120L65552K58673L3270j65534j72164k6871l3900l40850n90247l18537
46104a456728L59583Q15536O72728J88568j82628k95555k65203j86487r3460m1252
46094d84898o2213j14955j62850k21774k73927k31593n6237J53307K47505J70888
46084a036747J2600o1128M0375K10173K42845J00632l8919p9638j70718m00525
$$ y = [-123457, 652122, 1149965, 978465, 214326, -779400, -1692996, -2348484, -2545353, -2055764, -915369, 356606, 1027659, 764293, -54000, -703988, -805636, -598471, -544651, -768361, -1012314, -1113472, -1290483, -1782975, -2348399, -2424404, -1828069, -1011991, -496111, -302970, -163995, -43031, -117138, -353115, -479935, -410644, -376615, -546034, -755222, -741668, -466120, -100568, 158105, 191375, 25841, -146323, -173194, -207094, -547944, -1138191, -1456728, -1097145, -281609, 391119, 579687, 397059, 101504, -163699, -350186, -443646, -484898, -547111, -662066, -824916, -1046690, -1320617, -1552210, -1608447, -1455140, -1207635, -1036747, -1024147, -1085275, -1044900, -834727, -591882, -491250, -530169, -609807, -780525, -1181050]
46074a181050n10950k10158L21978N75524L66913M3394l4841P4172J06640j2997
46064d61375j64834k37912j61107J26216N25998O86872L01393m51079r36802o91365
46054a463995M1388N48173M47882Q0063k3979J42900J63632r9029l14382k55898
46044g33245j23666r6344K4635L98953P18997O02654J74574j40203j94512j04642
46034E27201J01608L67868L72935m8452m30436k25272K97161L63294j45630n70268
46024F10009n38468l75873l05198n4015M24916O19401K91986l8471M5245J69929
46014H49461p1644l01752k8293L78268K24743l28593n13474j95798P189j75301
46004a55194l02652q6250J47258J12377M3951J91026L41096K11744n7269j48771
$$ y = [-1181050, -1692000, -1902158, -1580180, -1004656, -637743, -594349, -629190, -555018, -448378, -461375, -626209, -864121, -1025228, -899012, -373014, 313858, 615251, 164172, -772630, -1463995, -1422607, -874434, -426552, -346489, -370468, -227568, -63936, -162965, -477347, -733245, -856911, -953255, -928620, -529667, 189330, 791984, 966558, 826355, 631843, 527201, 628809, 996677, 1369612, 1321160, 890724, 665452, 962613, 1325907, 1180277, 610009, 71541, -304332, -609530, -663545, -238629, 380772, 672758, 634287, 679532, 849461, 777817, 476065, 447772, 826040, 1050783, 722190, 208716, 12918, 20107, -155194, -457846, -544096, -396838, -284461, -240510, -49484, 291612, 503356, 446087, 297316]
45994B97316m5769K4431n5401k03630k67088j23002J85762L69615J73881k14511
45984A41604l26599n5112J83897O8998j84901k25307r7918p2447j40684m3795
45974g52264K68166N11678M34284R8000k43471m05671l73667k59075k11900k93974
45964a227894l72342j94158L21989Q62438R37684M52818o8959p3601K81820L27747
45954A247542j41328n50476m27368j08160j15936k66527n8149L19325J98510l62784
45944b65351m83371J79794P94306N58486j42725m31122k53225k25799m84217n39180
45934a292404k26222J924j16276k21044K0046L73728M83747M17153L93983L19451
45924A54086J2347l34230l63629j07412Q5054J07206J70796L13665K66965n8624
$$ y = [297316, 251547, 275978, 220577, 16947, -250141, -373143, -187381, 182234, 356115, 141604, -184995, -240107, -56210, 12788, -172113, -397420, -495338, -567785, -708469, -752264, -484098, 27580, 461864, 559864, 316393, -89278, -462945, -722020, -933920, -1227894, -1600236, -1794394, -1472405, -609967, 327717, 780535, 711576, 637975, 919795, 1247542, 1106214, 555738, 128370, 20210, -95726, -362253, -420402, -101077, 97433, -265351, -748722, -568928, 225378, 783864, 641139, 210017, -43208, -269007, -753224, -1292404, -1518626, -1516702, -1632978, -1854022, -1833976, -1460248, -976501, -559348, -165365, 154086, 166433, -167797, -531426, -638838, -553784, -446578, -275782, 37883, 304848, 246224]
45914B46224l49291l73896l52140n26259o42035k79540M25521Q39524O36590J63797
45904b11505r0707m8530Q7841J96704K47511J87656N4942K7529J53066K01577
45894H06084N74k65517l34267k68081k93785l86344l30125r6318J53343L51471
45884f62965M91319M06378l0200n30394o27715l00372M4770K17096L94637N66663
45874c0783L92700j42079m69901k29568J24808j5916m75447n61812r5763L88464
45864a115297M36192J69533o5218j20880m334K34962M16211L07509m4298k85484
45854g1104j98495L4318J54620J94757L02208L70107J49560k93335n26442k78201
45844a62007J74675L28643P1429k26855k29764j1100J77559K88822M04270M19603
$$ y = [246224, -103067, -476963, -829103, -1355362, -1997397, -2276937, -1851416, -1011892, -375302, -211505, -302212, -350742, -262901, -66197, 181314, 368970, 423912, 451441, 604507, 806084, 806658, 541141, 206874, -61207, -354992, -741336, -1071461, -1167779, -1014436, -662965, -171646, 234732, 204532, -325862, -953577, -1253949, -1209179, -992083, -597446, -30783, 361917, 219838, -250063, -479631, -354823, -370739, -846186, -1407998, -1503761, -1115297, -679105, -509572, -574790, -695670, -700004, -465042, -48831, 258678, 214380, -71104, -269599, -235281, -80661, 114096, 416304, 786411, 935971, 642636, 116194, -162007, 12668, 341311, 412740, 185885, -43879, -54979, 122580, 411402, 815672, 1235275]
45834A235275J18566m31570q39337q30677n16592j45415J72387L72230L25652
45825e39481M4940j74864o2203K74566M98907M69814L12444J39443o5410k85746
45815F12410l93910k92387l2643K26578L17655J60368j48044l68562l32439j04892
45805c55866R9050J08666j07416m23044n84303l99220K3801L64014M76682N06695
45795b90941N36083L85947l9411m60949n48623l51070j29381M6172K11406K11764
45785d29003q7835m01721k98678J27993L35856J48932R767K26552M34983J62575
45775B29421l96486o04027k42622K34802L26874M9998k11930k17368o5512M7059
45765h49791R9297J86029K69003J85761k8816m9473K92871O25137M23914k28597
$$ y = [1235275, 1353841, 922271, 82934, -747743, -1264335, -1409750, -1237363, -865133, -539481, -494541, -669405, -731608, -457042, 41865, 511679, 824123, 963566, 898156, 612410, 218500, -73887, -106530, 120048, 437703, 598071, 450027, 81465, -250974, -355866, -256816, -148150, -255566, -678610, -1262913, -1662133, -1638332, -1274318, -797636, -290941, 245142, 631089, 591678, 130729, -417894, -768964, -898345, -852173, -640767, -429003, -516838, -918559, -1217237, -1089244, -753388, -604456, -594689, -368137, 66846, 229421, -167065, -771092, -1013714, -778912, -452038, -402040, -613970, -831338, -896850, -849791, -750494, -564465, -295462, -109701, -138517, -187990, 104881, 730018, 1153932, 925335]
45755I25335o39100l64888K30808M82567K31936j35789l00768l19290l26550k40044
45745d55783N5675L68099K97050k37196p29179n77152J64151P60348O41477M5475
45735C32965l82714m19249l55152l78320k89733P9573N15521O75409M96258J95576
45725D70134j153l0159M689n6748k16194k46261j652K65930J77716k02658m00832
45714b37188j88746J39804K66713K56099K62995J86167q9573l69926m07728l10770
45704d92153l66205n62339n90404k86222J73441N03604N62560M02461K22339K36985
45694a95933M64244O68426N93901K18998k31494m36379j97352K89144M49470l8719
45684A584306o56697n59403K23128O86011K43039m01613l11731K83945M15836
$$ y = [925335, 286235, -78653, 152155, 634722, 866658, 730869, 430101, 110811, -215739, -455783, -400108, -32009, 265041, 27845, -701334, -1278486, -1114335, -353987, 287490, 332965, -49749, -468998, -824150, -1202470, -1492203, -1412630, -897109, -221700, 274558, 470134, 468981, 438822, 443511, 386763, 170569, -75692, -77344, 188586, 366302, 163644, -237188, -425934, -286130, -19417, 236682, 499677, 685844, 596271, 226345, -181383, -492153, -858358, -1420697, -2011101, -2297323, -2123882, -1620278, -1057718, -655257, -432918, -195933, 268311, 936737, 1530638, 1749636, 1518142, 1081763, 884411, 1173555, 1623025, 1584306, 927609, 368206, 591334, 1277345, 1520384, 1118771, 807040, 1090985, 1506821]
45675A506821j17019n35005l45213M921n5808m10081n67524l29481J45661N92395
45665a10333P33904M36894n3405l10294k56455j80514j79781k9652K71844L41961
45655F64169M6150j96800q7357L4663k09559n11570l16527K52514N21103K47008
45645D43794q8754m5479K03970K45320K1507j72883j13723J16068K43124Q9758
45635I42702k06142k86841J0235L99044M66323J94234m0947J4794J95916J96978
45625A886296k8371k56996k95096j97162j92350l92410n86756m46816J501K91936
45615b16224R6062k75198k59242J47636L69054J03715k26577j30352K07795K33300
45605D9969j26715l84784k40364N3610J95796K86896M95691N92660K24214m78358
$$ y = [1506821, 1389802, 854797, 509584, 514505, 458697, 48616, -518908, -848389, -702728, -110333, 623571, 1060465, 1007060, 696766, 440311, 259797, 80016, 50364, 322208, 664169, 710319, 513519, 426162, 460825, 251266, -260304, -576831, -324317, 196786, 443794, 355040, 309561, 513531, 758851, 780358, 607475, 493752, 609820, 852944, 942702, 736560, 449719, 459954, 858998, 1325321, 1519555, 1478608, 1493402, 1689318, 1886296, 1857925, 1600929, 1305833, 1108671, 916321, 523911, -62845, -509661, -508160, -216224, -120162, -395360, -654602, -506966, -137912, -34197, -260774, -391126, -183331, 49969, -76746, -461530, -701894, -648284, -452488, -165592, 330099, 922759, 1146973, 668615]
45595F68615r67908r58326o78898m06118j13960K54985N13767M93160L38612K59906
45585e96165J76121p6042l34837k86050K1530K09963J35270N9370J84528L48378
45575a57934L23473J54309L1975K2177M5990j4705k43803n42266n53187j1995
45565i45966P84483J176790R01778L26575j60036n57494q62726p69409j64729
45556b70734M49211N24823K23485J23229L55720N29231L89855N5159l44963p46755
45546A288261q86224m95903J44090L63050k0842m27238l29735O8022K41297Q0671
45536B5449j04741r2421M5573J18889P013k26989l25517j17531J44974K5073m20592
45525i20820n67222n1833O65819Q91208N64872J75947K5573j97l4809l6352j617
$$ y = [668615, -299293, -1257619, -1936517, -2342635, -2456595, -2201610, -1687843, -1194683, -856071, -596165, -420044, -496086, -830923, -1116973, -1095443, -885480, -750210, -690840, -506312, -157934, 165539, 319848, 351823, 374000, 419990, 405285, 161482, -380784, -933971, -945966, -161483, 1015307, 1917085, 2243660, 2083624, 1526130, 663404, -106005, -270734, 178477, 703300, 926785, 1050014, 1405734, 1934965, 2324820, 2379979, 2035016, 1288261, 402037, -93866, 50224, 413274, 392432, -34806, -364541, -296519, -55222, 25449, -79292, -171713, -126140, -7251, -238, -227227, -552744, -670275, -525301, -500228, -920820, -1488042, -1539875, -874056, 17152, 582024, 757971, 783544, 783347, 748538, 712186, 710569]
45514G10569m0418j78870l15841l86520l82317k59659l7580R8903M4907K9357
45504g17469L07746O71965O51366K09729j75861k29703k39258m79774o70863l84216
45494a056338K35139N77600L57603n5990j68893L6033J77356K7780j97972j50396
45484b18078J67537L81995K58726M4945J05083L46521L31322m5783l67365l10372
45474F94531q0702J9182J03530L80717N76403K30216m75197p44939j99471N77844
45464A082114P89085L73676j11861k99819k89240k37161j06071J06011K10289
45455A517023Q6646o9954M8331M46106P35430N23135j13825o01589m26081K74549
45445B419771Q23381P74728L77793J26111Q3178k2862j84075n3521M39826Q49396
$$ y = [710569, 670151, 491281, 175440, -211080, -593397, -853056, -890636, -791733, -746826, -717469, -409723, 262242, 913608, 1123337, 947476, 717773, 478515, -1259, -672122, -1056338, -821199, -243599, 114004, 58014, -110879, -74846, 102510, 130290, -67682, -218078, -50541, 331454, 590180, 635125, 740208, 1086729, 1418051, 1372268, 1004903, 694531, 613829, 633011, 736541, 1117258, 1693661, 1923877, 1448680, 703741, 504270, 1082114, 1871199, 2244875, 2133014, 1833195, 1543955, 1306794, 1200723, 1306734, 1517023, 1603669, 1533715, 1582046, 2028152, 2763582, 3286717, 3172892, 2571303, 2145222, 2419771, 3243152, 4017880, 4395673, 4521784, 4604962, 4582100, 4398025, 4344504, 4784330, 5633726]
45435E633726P98471M86464L43925M27092M48751K39335j12881m55673o34738
45426G174472m85456n9351K39831O6600l80410o03391m78637l25852l43801m05200
45416D398805m46619n83509p04465m58501R3167L08151j54934p14620o45924j44098
45406I47453K3625k76279m25167j40773Q5409j10652l08894j3082M79353M91738
45396G52731k1917m52079m04706p5200K24760M04757L77822k243n60773p59451
45386e16299l54737J78788K35162j06835k45879O4641M37988M91226L31695K17497
45376G33247R3618k07186n20953m98824j42104J60497J74046Q8210J38623K40657
45366B59831K03960J02981J54192L06436K42657j55260n60392n64163j88921J23372
$$ y = [5633726, 6432197, 6918661, 7262586, 7689678, 8138429, 8377764, 8264883, 7809210, 7174472, 6689016, 6629665, 6869496, 6936096, 6555686, 5952295, 5473658, 5147806, 4804005, 4398805, 3952186, 3368677, 2664212, 2205711, 2298878, 2607029, 2452095, 1737475, 1091551, 947453, 971078, 694799, 269632, 128859, 214268, 103616, -205278, -218360, 260993, 752731, 730814, 278735, -125971, -201171, 23589, 428346, 806168, 803925, 243152, -516299, -871036, -692248, -457086, -563921, -809800, -745159, -307171, 184055, 515750, 733247, 826865, 619679, 98726, -400098, -542202, -381705, -207659, -119449, 19174, 259831, 463791, 566772, 720964, 1027400, 1270057, 1114797, 554405, -9758, -198679, -75307]
45356g5307N1358k10349k26633N4758J88679j17406m59554k02709N50351R16324
45346D69512L69078m79351o40297l7632M86361L83172L7768L5980L07629L68685
45336A300905R0112k17966l47724l96017m34842l54550j31672M4092O1971P7845
45326c07846K22209L09934J04078k21831j99989K84880P34194O19819O9733k96108
45316A319073j74060P3011l0962m33015o82763n47408k21912J9765J05153O9222
45306e03896n5884j59261q3094J29008K10293N9771l4837K09885N98151O63184
45296A033320L05835p4986j41386l0192o6690k80601m23365l58318k04381j02017
45286c42781l7500L6881O4727q978q1993M973K24965L62848K95095J43998P3471
$$ y = [-75307, -23949, -234298, -460931, -406173, -217494, -334900, -794454, -997163, -446812, 469512, 838590, 359239, -281058, -318690, 167671, 550843, 588611, 624591, 932220, 1300905, 1391017, 1173051, 825327, 429310, -5532, -360082, -491754, -447662, -385691, -307846, -85637, 224297, 328375, 106544, -93445, 191435, 925629, 1545448, 1615181, 1319073, 1145013, 1218024, 1187062, 754047, 71284, -476124, -698036, -678271, -573118, -503896, -559780, -719041, -802135, -673127, -462834, -403063, -437900, -228015, 370136, 1033320, 1339155, 1264169, 1122783, 1092591, 1025901, 745300, 321935, -36383, -240764, -342781, -380281, -343400, -278673, -287651, -369644, -364671, -139706, 223142, 518237, 662235, 735706]
45275G35706N0711n1518j97798k19618q4573N2641R6352J17890J49506O5474j96271
45264E18502m48530m63316k70659q9539l3532l2900K1033J98303N08238P84745
45254F92345O98333J26318n38717p27228l60669Q0878K03355J15084P6345M3593
45244D09637j64095m31108m14378l6797L47563L65489N5100k11074j66945P5983
45234a70625K16234J58881J07455K13505K92620Q9356k69462l92496k12391r9809
45224f6732k47073l15092j458L55639K06230l25637n06366M602O70229P71862
45214E46204K47246l90562p13566o97548n27654l35014j18569J69758M47668M60306
45204i11731R2514l10575k49836K15886M32558N4858l71283j24807O36062J036918
$$ y = [735706, 786417, 734899, 537101, 317483, 232910, 285551, 381903, 499793, 649299, 714773, 518502, 69972, -393344, -664003, -753542, -787074, -819974, -798941, -600638, -92400, 692345, 1390678, 1516996, 978279, 251051, -109618, -28740, 174615, 289699, 366044, 409637, 245542, -185566, -599944, -636741, -289178, 76311, 131411, -79663, -246608, -170625, 45609, 204490, 311945, 525450, 818070, 907426, 637964, 245468, 33077, -66732, -313805, -628897, -630355, -274716, -68486, -394123, -900489, -895887, -225658, 546204, 793450, 402888, -310678, -1008226, -1535880, -1870894, -1989463, -1819705, -1372037, -911731, -819217, -1129792, -1379628, -1163742, -731184, -676326, -1047609, -1172416, -536354, 500564]
45194E00564O37736q0515m57989m20819k83664j57914R2596M69369P35747O90951
45184A726062L64886n4562l61475m22554k60770o8535m5618j84304k61554q3972
45174C47604K74168N24393M81032K68012J21312M2817j52835m30392m61759j28720
45164H85632J92028J54263R635K15527O32939O68513K11821j69911j23773L373
45154B680047j33975k74662j06878O9226j57009m94654l35959K25811M74674J46743
45144B093364k48326k74677j09263m4499l4253k1182k04355o09300q03784m67848
45134g24123M6514J56052j42992l14074l2400M65318P58983O81321L63465O7795
45124A325859O742J79004L58859L18993M3282l06358n51296o03677n25014m74971
$$ y = [500564, 1138300, 1057785, 599796, 178977, -104687, -262601, -170005, 299364, 1035111, 1726062, 2090948, 2036386, 1674911, 1252357, 991587, 923052, 877434, 693130, 431576, 347604, 621772, 1146165, 1627197, 1895209, 2016521, 2059338, 1906503, 1476111, 1014352, 885632, 1077660, 1231923, 1241558, 1457085, 2090024, 2758537, 2970358, 2800447, 2676674, 2680047, 2546072, 2271410, 2164532, 2233758, 2076749, 1582095, 1246136, 1471947, 1946621, 2093364, 1845038, 1570361, 1461098, 1416599, 1382346, 1361164, 1156809, 547509, -256275, -724123, -677609, -521557, -664549, -978623, -1011023, -545705, 213278, 894599, 1258064, 1325859, 1332601, 1511605, 1870464, 2189457, 2232739, 1926381, 1375085, 771408, 246394, -228577]
45114b28577m64578k43587K95519O95748L84950m01991p15365j43120N93375O80854
45104D53228K95153Q3498O9277j55194m56306k82655K75656M18228j82678q45129
45094c26922q13475j66889M95396P84953O51908K26725j62903j82531O4815J50647
45084G21724K8099J16697M57882M22982k94758r94685r00306l06730o4919k60949
45074a074963k47366J63948M33978K98734J96890M16834N47596K20130j84884
45065G70897j26560J98357J68467k51267m47351j22024K60143K07605p2340o7637
45055E18290J92518J87958k23560n04423k30981K32233K76236m820J6662M45319
45045I05432O20905J21454n75251p97371n67110l16872j18304K18823N40686M93771
$$ y = [-228577, -693155, -936742, -641223, 54525, 439475, 37484, -677881, -821001, -227626, 453228, 748381, 831879, 901156, 745962, 289656, 7001, 282657, 700885, 518207, -326922, -1140397, -1307286, -811890, -26937, 624971, 851696, 688793, 506262, 571077, 721724, 749823, 866520, 1324402, 1747384, 1452626, 457941, -442365, -749095, -814014, -1074963, -1322329, -1158381, -724403, -425669, -228779, 188055, 735651, 955781, 770897, 644337, 842694, 1011161, 759894, 312543, 190519, 450662, 658267, 585927, 518290, 710808, 898766, 675206, 170783, -60198, 172035, 448271, 443451, 460113, 905432, 1526337, 1647791, 1072540, 275169, -291941, -608813, -727117, -508294, 32392, 526163]
45035E26163J76660L0928J00245M784l04683m00398j34888O5950q7226l03928
45025c26393k82081j84530j78605k0379M21627O82757L30251k54301l57191P569
45015a61276J78298r5312l37700j69454J50965K16034M6896o1232M5218L07626
45005A20063N45684N04586R0837l53335l48003L4343J61677k77256p82584p33327
44995a037315k08822K65203M79706N58667M29425j09268p87056r25418l09298
44986a644176M55583P27873O05440N83884P41792P07645L11234j73308m57848
44977A858119n42736m92884k44012J72507M51590L14792j19055m64988n01562
44968D31771k98399j194K86875M30283L05102r111k47194k56247j60272j58688
$$ y = [526163, 702823, 733751, 833996, 838780, 534097, 133699, -1189, 64761, -22465, -326393, -608474, -793004, -971609, -991988, -570361, 112396, 442647, 188346, -168845, -161276, 17022, -78290, -415990, -585444, -434479, -218445, -171549, -232781, -187563, 120063, 665747, 1170333, 1261170, 907835, 559832, 594175, 755852, 478596, -303988, -1037315, -1246137, -980934, -501228, 57439, 486864, 377596, -409460, -1334878, -1644176, -1188593, -460720, 144720, 728604, 1470396, 2178041, 2489275, 2315967, 1858119, 1315383, 822499, 578487, 750994, 1202584, 1517376, 1398321, 933333, 431771, 133372, 132178, 419053, 849336, 1154438, 1145327, 898133, 641886, 481614, 322926]
44958C22926k69067l39708k21242J25054N63210P63346M28033k97530p85576n43346
44948b53900J67938N78369L07815k19849l70774q6933J47841J2879k67192k97939
44938b81745l7863K25926L03918K91074L30369L86509L45111K00810K1482j79445
44928A606146l84881m56370k72857P331L0485l13522o87857o68756k15103L27796
44918a027588O05284N22149K23882m1976q8767M5498J16142l2057k29904j92502
44908i9839P2635K65408K23473J26443J57046J67717r3261n33157p59361n83383
44898a056279k42198l3875M8557J55699K37917J29341r4469j40031Q2055L29467
44888e83816M14701M39157M80441L48184o1507m23243l83260j24952p6399j77617
$$ y = [322926, 53859, -285849, -507091, -382037, 181173, 944519, 1372552, 1075022, 289446, -253900, -85962, 492407, 800222, 580373, 209599, 122666, 270507, 283386, 16194, -281745, -319608, -93682, 210236, 501310, 831679, 1218188, 1563299, 1764109, 1785591, 1606146, 1221265, 764895, 492038, 499369, 529854, 216332, -471525, -1140281, -1355384, -1027588, -422304, 99845, 323727, 281751, 192984, 238482, 354624, 322567, 92663, -99839, -27204, 238204, 461677, 588120, 745166, 912883, 819622, 286465, -472896, -1056279, -1298477, -1332352, -1283795, -1128096, -890179, -760838, -855307, -995338, -913283, -583816, -169115, 270042, 750483, 1098667, 1037160, 613917, 230657, 105705, 29306, -148311]
44878a48311j4049L24669K16510m33379q00768k85105N25166O62604J39851k31546
44868d4358j13986P7139Q5494J64040L88275L95223Q0067j25715j5788j6477m00024
44857D73890o76716l33703K85934M76850K10113K3399J02308J45557L4116k5635
44847G16113j4104j36267l08359k08005P7391O7188k85479m08941k9215L31490
44837a98188J71941k04950k34209J8507J04134K3331J42546M11676L46939j46049
44827D35678n26507l80704M3059K94531L24469L43553L79730L02187J15057o1775
44817A269278k11031l82674n05807m47517k36235n6158j6663m6120j3023J28948
44807e17002K99253L45774J99634J2695K5422K26512L04599Q0835j81353j31765
$$ y = [-148311, -162360, 162309, 378819, -54560, -855328, -1140433, -615267, 47337, 187188, -44358, -158344, -81205, 4289, 168329, 556604, 951827, 1031894, 906179, 890391, 873914, 473890, -202826, -536529, -250595, 226255, 436368, 459767, 562075, 707632, 741748, 716113, 702009, 565742, 257383, 49378, 126769, 193957, -91522, -500463, -529678, -198188, -26247, -231197, -465406, -446899, -342765, -319434, -176888, 234788, 581727, 435678, -90829, -471533, -428474, -133943, 190526, 534079, 913809, 1215996, 1331053, 1269278, 1058247, 675573, 169766, -277751, -513986, -570144, -586807, -632927, -645950, -517002, -217749, 128025, 327659, 340354, 365776, 592288, 896887, 977722, 796369, 664604]
44797F64604J32203K02731j0167j52293m62J97907J48708l9069j01719o6010r9838
44786H76595j05909J03722L06109M4216n99421q99897m35801K58908L82118p6445
44776a45805m35761l27530n2813Q0292K06444M62129N75195K91255j02345j39209
44766D11852J03129J24266j87021l54512n8307L61667M24577K10799J65456L61152
44756A563058L81811j4801m70832m66247J978M19762M02549J26383J5335J43595
44746B102591J69922j13655m15555l37184J6307J56354l9167q2334L89779R48035
44736B795093Q51996R1154n07157l11016L50027O83933M33903M9293k5451J36380
44726D548155K29372K34108M07635Q34232J222456J236295R00560N42918L80117
$$ y = [664604, 796807, 999538, 989371, 837078, 836616, 1034523, 1183231, 1144162, 1042443, 976433, 876595, 770686, 874408, 1180517, 1224733, 625312, -274585, -710386, -451478, -69360, -145805, -581566, -909096, -961909, -881617, -675173, -213044, 362151, 653406, 551061, 411852, 514981, 639247, 452226, 97714, 39407, 401074, 825651, 1036450, 1201906, 1563058, 1944869, 1930068, 1459236, 992989, 994967, 1414729, 1817278, 1943661, 1958996, 2102591, 2272513, 2158858, 1743303, 1406119, 1422426, 1578780, 1539613, 1457279, 1847058, 2795093, 3647089, 3738243, 3231086, 2920070, 3270097, 3954030, 4387933, 4437226, 4411775, 4548155, 4777527, 5011635, 5419270, 6253502, 7475958, 8712253, 9612813, 10155731, 10535848]
44717A0535848L12391J51996r2674k62526k88816k66413l08267m10567m63424
44708H907548l74031k17267k41814n91289j008107j036010o19225k40594k60773
44699D318438l98527k06907J75101K30683r4971l26489k52813j98802l42153l51213
44689B552347k1697K48369N0805l81311n79720n40696n14968m23597p0602L00266
44679F19196K97465Q2617J27552L65171K93416q0813j83832R9582J54847k84650
44669A490551n67122j52867M40170L95116j73815m91633l22209j29985j70681
44660C17525j76616n738O4587j16119k63923j38412R4102K12702K82285L78424
44650F48817L12669l1126l34347k03764K16239L60138j3830m93409n30271q6248
$$ y = [10535848, 10848239, 11000235, 10907561, 10645035, 10356219, 10089806, 9781539, 9370972, 8907548, 8533517, 8316250, 8074436, 7483147, 6475040, 5439030, 4819805, 4579211, 4318438, 3919911, 3713004, 3888105, 4118788, 4023817, 3697328, 3444515, 3245713, 2903560, 2552347, 2530650, 2779019, 2829824, 2448513, 1868793, 1328097, 813129, 389532, 318930, 619196, 916661, 999278, 1126830, 1492001, 1785417, 1704604, 1520772, 1620354, 1775201, 1490551, 923429, 770562, 1210732, 1605848, 1432033, 940400, 618191, 488206, 317525, 140909, 135171, 199758, 83639, -180284, -318696, -224594, -11892, 270393, 648817, 961486, 930360, 596013, 392249, 608488, 968626, 954796, 461387, -68884, -155132]
44640a55132L78919M51853J48877k01216l07990j25140J64699K86107R2891k22209
44630E11659k30397K30481P10551N77703j63609p89279p46925l28117j70376l40067
44620g38376l31818J09879O26726P90792O31907M33987K93190J30859k9372o9438
44610A848336j0392j7514j45001k24269p4846K43431M57921L57701J946l58503
44600B078810n24608m67539k60271j6472J09307K8416j22736j07638M6922L5913
44590H00104k31911l98859j84630J12544N3774j83311l6559M66320N92408j2164
44580I77716o85243o22143J3105L79001J36335k37945k83430j39702j20092j48714
44570g31112L9135L75445N13267L55070K07199L19590N12072M48238J45440m6558
$$ y = [-155132, 223787, 675640, 824517, 623301, 315311, 190171, 354870, 640977, 733868, 511659, 281262, 511743, 1222294, 1799997, 1636388, 847109, 100184, -227933, -398309, -738376, -1070194, -960315, -333589, 457203, 1089110, 1523097, 1816287, 1947146, 1917774, 1848336, 1837944, 1820430, 1675429, 1451160, 1376314, 1619745, 2077666, 2435367, 2437313, 2078810, 1554202, 1086663, 826392, 809920, 919227, 947643, 824907, 717269, 764191, 800104, 568193, 169334, -15296, 97248, 151022, -32289, -68848, 397472, 989880, 977716, 292473, -329670, -316565, 62436, 198771, -39174, -322604, -462306, -582398, -731112, -691977, -316532, 196735, 551805, 759004, 1078594, 1590666, 2038904, 2184344, 2137786]
44560B137786K8798J09235m5497k25336o5574L39491M70112Q8792l87886l99919
44550B050002O8649N10896M89810K4120n40127q42387p03808k11652K93736M20122
44540A559361N5118m72497o45067k58611L40830O11145L95879K3831j71053k00702
44530A238234j93549r6607J33245K68936J11394r6168K2058L24139K98262j16842
44520A893102l92967k41166m4584j85195m24979l50414m5041J26024J05424O1685
44510E01889l9341k97063m77926k48437K69625O15659O09048M52028K92400J19659
44500A797541M6598K23417M53007L45209q6277m02340l68280j73930K8080L09490
44490B172515N67390M64663P719k98446j74392M887j30729k92770k9315M53637
$$ y = [2137786, 2166584, 2275819, 2230322, 2004986, 1939412, 2278903, 2749015, 2837807, 2449921, 2050002, 2118651, 2629547, 3119357, 3143477, 2603350, 1760963, 1057155, 845503, 1139239, 1559361, 1614479, 1141982, 496915, 238304, 579134, 1190279, 1586158, 1609989, 1438936, 1238234, 1044685, 948078, 1081323, 1350259, 1461653, 1365485, 1387543, 1711682, 2009944, 1893102, 1500135, 1258969, 1214385, 1029190, 604211, 253797, 208756, 334780, 440204, 501889, 462548, 165485, -312441, -560878, -291253, 324406, 933454, 1385482, 1677882, 1797541, 1844139, 2067556, 2520563, 2865772, 2779495, 2377155, 2008875, 1834945, 1863025, 2172515, 2739905, 3204568, 3212287, 2913841, 2739449, 2744336, 2613607, 2320837, 2291522, 2745159]
44480B745159N47527J69216j38312m2443J45265R323l77139o07322m59998q2643
44470A908633K12702K08180p4634l84670m40192j85542J54436K88743J25304j63223
44460A649737l30533l17733k79259l15734k98727j00081J29926J64403R9622K18300
44450F19921M74575N30598L67582L62211N62747M47365k07823p47793n14869R0280
44440A984794J48187m04743p38681m25257M8544K08243K50089M42377N49262L18118
44430B380933J6537k3877J0614j98088m77660m71467k94509l11185m48479l25985
44420a43166K9832K05423J23814J48307L81930M55943K08021J1853J20586J68736
44410A711279k40626p96410q20199j93445M87107O46706K94370j54702l45806
$$ y = [2745159, 3292686, 3461902, 3323590, 3281147, 3426412, 3435735, 3058596, 2451274, 1991276, 1908633, 2121335, 2329515, 2254881, 1870211, 1430019, 1244477, 1398913, 1687656, 1812960, 1649737, 1319204, 1001471, 722212, 406478, 107751, 7670, 137596, 301999, 401621, 619921, 1094496, 1625094, 1992676, 2354887, 2917634, 3364999, 3157176, 2409383, 1894514, 1984794, 2132981, 1728238, 989557, 564300, 612844, 821087, 1071176, 1513553, 2062815, 2380933, 2397470, 2373593, 2384207, 2186119, 1708459, 1236992, 942483, 631298, 182819, -143166, -113334, 92089, 215903, 364210, 746140, 1202083, 1410104, 1421957, 1542543, 1711279, 1470653, 674243, -145956, -339401, 147706, 794412, 1088782, 934080, 588274]
44401E88274k24279P240J04220J1035j37949k32244k41351m6889M77284J064651
44391A369992J088748L28749n70079q18628m60997j47575j01522N4081M29766
44382A172535N39312J11862l51824k68138J86994L83760J15450k73486m53770
44373A162695l86006j40433J75518L63635L19645K11999K20252K23810M3247j71348
44363B023014j59303j2178N504k3423J67934M05913K09192l70678o48575k75933
44353A321467K37991L00667L8777q7186m1468p0812j13692O9434L29099K61423
44343B245700j02106k49218P6095N06738N68340K43216j32293k85348j79756L4689
44333B726057J26237j8349k30175k41940n2678R3441J15158K05405M24511M71862
$$ y = [588274, 363995, 371235, 475455, 486490, 348541, 116297, -125054, -171943, 305341, 1369992, 2458740, 2787489, 2217410, 1398782, 937785, 790210, 688688, 742769, 1172535, 1711847, 1823709, 1471885, 1203747, 1390741, 1774501, 1889951, 1616465, 1162695, 776689, 636256, 811774, 1175409, 1495054, 1707053, 1927305, 2151115, 2194362, 2023014, 1863711, 1851533, 1857037, 1833614, 2001548, 2407461, 2616653, 2245975, 1597400, 1321467, 1559458, 1860125, 1898902, 1811716, 1770248, 1699436, 1585744, 1655178, 1984277, 2245700, 2143594, 1894376, 1970471, 2477209, 3045549, 3288765, 3156472, 2871124, 2691368, 2726057, 2852294, 2833945, 2603770, 2361830, 2309152, 2402593, 2517751, 2723156, 3147667, 3619529]
44323C619529J06596l90534m77658l5365M61663N06426J19840k41793k41819q514
44313C418371Q3326j02737k99819j94910J47369L57297K30957m9406k15587k41343
44303C133518k26797j24202J62045M57273M12809K2699k33535j80L91508L11149
44293D306287k65699o33558k76982M27222P08254L65739j22702l25143k65311
44284C918107j04996J51808M73231O48769N49240L20747J46998L9303J9177K24838
44274F387222N97268P48974M79229J75027K89365O11677N57228R6066j75439L4705
44264I801322K75152Q9950k76166k89064P8017L85066L98108L14985L54714M62786
44254A1594870M82664L85490K55329J96088K89756N15634O94573O60060N22069
$$ y = [3619529, 3726125, 3335591, 2857933, 2822568, 3284231, 3790657, 3910497, 3668704, 3426885, 3418371, 3501697, 3398960, 3099141, 2904231, 3051600, 3408897, 3639854, 3590448, 3374861, 3133518, 2906721, 2782519, 2944564, 3401837, 3814646, 3837345, 3603810, 3603630, 3995138, 4306287, 4040588, 3407030, 3130048, 3557270, 4265524, 4631263, 4508561, 4183418, 3918107, 3813111, 3964919, 4438150, 5086919, 5636159, 5956906, 6103904, 6143207, 6162384, 6387222, 6984490, 7733464, 8212693, 8387720, 8677085, 9288762, 9845990, 9942056, 9766617, 9801322, 10076474, 10166424, 9890258, 9601194, 9679211, 10064277, 10462385, 10777370, 11132084, 11594870, 12077534, 12463024, 12718353, 12914441, 13204197, 13719831, 14414404, 15074464, 15596533]
44245A5596533O02936J012644J411203J354720Q46267L78217L76428P41993J059846
44236B3380787J143071J161137J269576J397820J501843J744846K195047K552263
44228C6346390K485232K121254J860406J765195J528919J083573Q04236R19753
44220D8914958J097711R27050N49789M34928O48045P30324L31378l37962p94444
44211E2501777q32662o60320n88129p10671q89445r83422j034105j176222j390446
44202D4236355j458757j237070q96137p70893r64243j201063j154753q84375q07112
44193C4861952j131329j437315j098533j65266N03382K27939o34853j173584j062668
44184B8889725p59603o52360n77779l15688m3218p196j08653j13361p352J09614
$$ y = [15596533, 16199469, 17212113, 18623316, 19978036, 20824303, 21202520, 21578948, 22320941, 23380787, 24523858, 25684995, 26954571, 28352391, 29854234, 31599080, 33794127, 36346390, 38831622, 40952876, 42813282, 44578477, 46107396, 47190969, 47995205, 48914958, 50012669, 50939719, 51489508, 51924436, 52572481, 53302805, 53634183, 53296221, 52501777, 51669115, 51008795, 50420666, 49709995, 48820550, 47837128, 46803023, 45626801, 44236355, 42777598, 41540528, 40644391, 39873498, 38909255, 37708192, 36553439, 35669064, 34861952, 33730623, 32293308, 31194775, 31029509, 31532891, 31760830, 31125977, 29952393, 28889725, 28130122, 27477762, 26899983, 26584295, 26541077, 26533881, 26425228, 26311867, 26304515, 26414129]
44174B6414129K30012L11589K20204L0427P7896M46293P26827O00397L20064K45688
44164B9623526K58397J05223j7423J89080M61068L30806o393Q5955O28506R49615
44154C2608360P73785O39322R71011J408624J431617J098969P59411M93312K60020
44145D0444431J78151K13941k5609o89245j191187q92144q2646K88895j69608
44136C8074979q54982j000133n35855n265Q3901l22532q87317j248922j350633
44127C1953241j372861j358284j124354o47618k54306k03894l33094l89331m64512
44118B5804987p37776j006765r25011n92348m53326o41957q50167q39430o72029
44109A9086178m32933j50068j0735j95002m37501k64795K05694K67049l19764
$$ y = [26414129, 26644141, 26955730, 27175934, 27206361, 27284257, 27730550, 28457377, 29057774, 29377838, 29623526, 29881923, 29987146, 29969723, 30158803, 30619871, 30950677, 30944284, 31030239, 31658745, 32608360, 33382145, 34021467, 34992478, 36401102, 37832719, 38931688, 39691099, 40184411, 40444431, 40622582, 40836523, 40810914, 40121669, 38930482, 38038338, 37955692, 38244587, 38074979, 37219997, 36219864, 35684009, 35678744, 35762645, 35440113, 34552796, 33303874, 31953241, 30580380, 29222096, 28097742, 27450124, 27195818, 26991924, 26658830, 26269499, 25804987, 25067211, 24060446, 23135435, 22543087, 22089761, 21447804, 20597637, 19758207, 19086178, 18653245, 18503177, 18492442, 18297440, 17859939, 17595144, 17800838, 18067887, 17748123]
44100A7748123q32088n74389J08331L63154N6686j65225Q0831M42744M66666J81083
44090A7875916j23986k98404l02747r5716K09888L14145J03304j09662K5059L66477
44080A7964274M24089K7660m03084l75328O0389L93827K94646l5839k05366j36069
44070A8009199n7859j04518j68951j76306k34129l75981l87646j24234J56603
44061A6536178Q5262k46025l33650L9950M62529M27553q027l47577l16364j30800
44051A6169029j13037k72619l67597k48151k4208P1276p9354l71013n83549n92527
44041A3588250m59210l21389k66628l35975n25160o76548n13146j87M13893K31241
44031A1135141l94637p41784m45046K3968P5555j50534j11034K04449K70709o1468
$$ y = [17748123, 16916035, 16341646, 16449977, 16813131, 16869817, 16704592, 16785423, 17228167, 17694833, 17875916, 17751930, 17453526, 17150779, 17055063, 17264951, 17579096, 17682400, 17572738, 17597797, 17964274, 18388363, 18416023, 18012939, 17637611, 17698000, 18091827, 18386473, 18350634, 18145268, 18009199, 17951340, 17846822, 17677871, 17501565, 17267436, 16891455, 16503809, 16379575, 16536178, 16621440, 16375415, 16041765, 16081715, 16544244, 16971797, 16963770, 16616193, 16299829, 16169029, 16055992, 15783373, 15415776, 15167625, 15143417, 15214693, 15135339, 14764326, 14180777, 13588250, 13129040, 12807651, 12541023, 12205048, 11679888, 11003340, 10490194, 10490007, 10903900, 11135141, 10740504, 9998720, 9553674, 9577642, 9653197, 9502663, 9391629, 9596078, 9866787, 9805319]
44021I805319k93522j11295R8385p6491l73498l25912o8078q3534l58494m14314
44011G798566j29906Q8474L8807L4392K70586M02426R3132m01582n81159l81730
44001G232006j50997j05083j33169n3819J84246M85568O16634L52331k16177o67039
43991G544501p10919m92104k59656M08L31172M68384J41756m29388p36990n97985
43981E259179k21094J99625N31329M77048j36354q40779q79675k07337M02896
43972D584838M16395J33944j5021j39862l99048m25186R2102O33657M33575l22927
43962D992467o57054j87354L66740K85614j88582l70408j29308J13455J11593
43953D337163L5938P6733J93888K84780L25721K96974J60774l5696j72596k10116
$$ y = [9805319, 9511797, 9400502, 9498887, 9422396, 9048898, 8722986, 8654908, 8571374, 8212880, 7798566, 7668660, 7757134, 7795941, 7830333, 8100919, 8503345, 8596477, 8194895, 7613736, 7232006, 7081009, 6975926, 6842757, 6788938, 6973184, 7458752, 8075386, 8427717, 8211540, 7544501, 6833582, 6341478, 6081822, 6082230, 6413402, 6881786, 7023542, 6594154, 5857164, 5259179, 5038085, 5237710, 5769039, 6246087, 6109733, 5268954, 4389279, 4181942, 4584838, 5001233, 5135177, 5120156, 4980294, 4581246, 4156060, 4248162, 4881819, 5315394, 4992467, 4335413, 4148059, 4514799, 4800413, 4611831, 4241423, 4112115, 4225570, 4337163, 4373101, 4449834, 4643722, 4928502, 5254223, 5551197, 5711971, 5676275, 5503679, 5293563]
43943E293563k27006k84721l38232l00493j34312J19627L51589M36069L37566
43934E253650J48694k1395j47641k19393j69395j7789k644l16430o96617n88909
43924C222131J06029P22715N85073r8114m97692k69958Q8665J00957j3614J29913
43914D076105L27319J26709l22078m10979l2940K40972O8821j77657r5714J18940
43904C919498J04108m4971l5549O5002R016j19780l6809K52711M98971N88544
43894E200741N05280J34940m38444o80420k18453M70712O22815L02163K16260
43885F115594M70230M00224j79764m98334l1236O29595P13302M01395L15875M21912
43875H758793K51267j36937k51796m9955N1322m0878k6953P8905j04005n70717
$$ y = [5293563, 5066557, 4781836, 4443604, 4143111, 4008799, 4128426, 4480015, 4916084, 5253650, 5402344, 5380949, 5233308, 5013915, 4844520, 4826731, 4824087, 4507657, 3811040, 3222131, 3328160, 4050875, 4635948, 4537834, 4040142, 3770184, 3858849, 3959806, 3946192, 4076105, 4403424, 4530133, 4208055, 3797076, 3764136, 4005108, 4073929, 3896272, 3800558, 3919498, 4023606, 3978635, 3943086, 4008088, 4017104, 3897324, 3860515, 4113226, 4612197, 5200741, 5706021, 5840961, 5402517, 4722097, 4503644, 4974356, 5597171, 5899334, 6115594, 6585824, 6986048, 6806284, 6307950, 6276714, 6906309, 7619611, 8021006, 8336881, 8758793, 9010060, 8873123, 8621327, 8571372, 8622694, 8581816, 8554863, 8633768, 8529763, 7959046]
43865G959046p95861n42354k13909j56705j44421J20486M30163L77587k9244l79926
43855F624862l37312Q1152N36806N93865J36753l68524l17451K50032O54736M86111
43845H341030J02778P728J34302J12024o9109r6572J19977L42013L85766K95555
43835I675492J65208N9513R5232L43868O34484O75679M31014K00636K39116L98669
43825A2918911K81606k28718o85685n02424K82831Q88834O82454J8719j92601
43816A3463927L06252Q37895Q10343M95793M92437Q42069J113704J093052R46506
43807B0401978Q50737Q55224J017363J317484J506551J368303J090118J075317
43799B9483075J422826J865306K178092K378025K555053K772986L115317L594747
$$ y = [7959046, 7163185, 6620831, 6406922, 6250217, 6105796, 6226282, 6656445, 7034032, 7004788, 6624862, 6287550, 6368702, 6905508, 7499373, 7636126, 7267602, 6950151, 7200183, 7854919, 8341030, 8443808, 8451536, 8585838, 8697862, 8628753, 8532181, 8652158, 8994171, 9379937, 9675492, 9840700, 9900213, 9995445, 10339313, 10973797, 11649476, 12080490, 12281126, 12520242, 12918911, 13200517, 12971799, 12286114, 11783690, 12066521, 12955355, 13637809, 13656528, 13463927, 13770179, 14608074, 15418417, 15914210, 16406647, 17248716, 18362420, 19455472, 20401978, 21252715, 22107939, 23125302, 24442786, 25949337, 27317640, 28407758, 29483075, 30905901, 32771207, 34949299, 37327324, 39882377, 42655363, 45770680, 49365427]
43791D9365427M053027M360572M640092N082018N666428O319384P180627Q393096
43783I5060671R784879J1139977J2634861J4557466J6723254J8720385K0686230
43776A99307723K3200879K6283819K9072487L0664134L0682304K8773928K4245950
43769C92231224J6788480P216559k964471j2453809k0293468k5636277k8119474
43762C26768764k8373259k7562152k6349545k4655632k2332819j9612304j6878019
43755A61005034j4431912j2539650j1311787j0444539r440721q220177p201009
43748H7415239o650003o276529n665886m836815m112210l627669l248855k885371
43740E0111901k618649k504249k445079k331425k183273k055606j865607j457117
$$ y = [49365427, 53418454, 57779026, 62419118, 67501136, 73167564, 79486948, 86667575, 95060671, 104845550, 115985527, 128620388, 143177854, 159901108, 178621493, 199307723, 222508602, 248792421, 277864908, 308529042, 339211346, 367985274, 392231224, 409019704, 416236263, 413271792, 400817983, 380524515, 354888238, 326768764, 298395505, 270833353, 244483808, 219828176, 197495357, 177883053, 161005034, 146573122, 134033472, 122721685, 112277146, 102836425, 94616248, 87415239, 80765236, 74488707, 68822821, 63986006, 59873796, 56246127, 52997272, 50111901, 47493252, 44989003, 42543924, 40212499, 38029226, 35973620, 34108013, 32650896]
43732C2650896q92419n58293p99111j440184j870325j692833j134480o89071n36398
43723B3037782n14151n07293n65674o71591o79193n44410m12328m15454n27555
43714A8200133o30459n96189l54665n2922m3041m34412p50440m31794L14991O51205
43704A5872407K31771k99808k34874K50343N15286M43022M13500N05531L97594
43695A8094772O0421r1677R8150K28661l741l23075l74094k91291l55559m14482
43685A6628085j58059K10193J40739m10197q02329n53666K6923L09292J87317
43676A5578298J37654N16178J078609J281067R12205L00583p6139n6314J96384
43667A9868525N10464Q18120R86308Q42388M91830L35368N65824Q93263J004898
$$ y = [32650896, 31758477, 31200184, 30401073, 28960889, 27090564, 25397731, 24263251, 23574180, 23037782, 22523631, 22016338, 21450664, 20779073, 20099880, 19555470, 19143142, 18727688, 18200133, 17569674, 16973485, 16618820, 16565898, 16522857, 16088445, 15338005, 14906211, 15221202, 15872407, 16104178, 15804370, 15569496, 15819839, 16335125, 16778147, 17191647, 17697178, 18094772, 18155193, 18063516, 18161666, 18390327, 18386586, 18063511, 17689417, 17398126, 17042567, 16628085, 16470026, 16680219, 16820958, 16410761, 15608432, 15054766, 15081689, 15390981, 15578298, 15715952, 16232130, 17310739, 18591806, 19504011, 19804594, 19728455, 19672141, 19868525, 20378989, 21197109, 22183417, 23025805, 23517635, 23853003, 24418827, 25312090, 26316988]
43658B6316988J005339J057758R13240L36106k37331j66138L37831M05246j46285
43649B9822754n27269l26115k13266p12563j151070p40929l1240j34994q94705
43640B5090603j099515m68915r1542n92093j122115q29709k84839n05182j277371
43631A8819322j512839r29487l53150l86070o63485o19157l07177j48912k99332
43622A3599713n68619p25209o61361m15325j71012j39451l70082p20946r72058
43613H855650r15537m91307J7534J15584l29173p99694p26966k44545K3304j44198
43603E360652l23126j62409Q7367j1059m23249o79801m63927M4782M06565L92439
43593D228234J68205J677j22105l93909o90781n60618P5252N73197L57545k06279
$$ y = [26316988, 27322327, 28380085, 29293325, 29629431, 29392100, 29225962, 29563793, 29969039, 29822754, 29295485, 28969370, 28756104, 28043541, 26892471, 26151542, 26120302, 25985308, 25090603, 23991088, 23522173, 23430631, 22838538, 21716423, 20886714, 20601875, 20096693, 18819322, 17306483, 16376996, 16023846, 15637776, 14974291, 14355134, 14047957, 13899045, 13599713, 13031094, 12305885, 11644524, 11229199, 11058187, 10918736, 10548654, 9827708, 8855650, 7940113, 7448806, 7466340, 7581924, 7252751, 6453057, 5726091, 5481546, 5504850, 5360652, 5037526, 4875117, 4962484, 4951425, 4528176, 3848375, 3384448, 3429230, 3835795, 4228234, 4396439, 4398116, 4276011, 3882102, 3191321, 2630703, 2705955, 3279152, 3636697, 3430418]
43583C430418k94383J69741M69617K70563Q7739L31280N91781L43750j90992m53298
43573D756216m17225m30715m61490j75829L27962N13680K01203j66489j74296
43564C973017R2227L53276M87691M13024K8523m79757o39273k95517Q0363K0829
43554D034403k55695j94725K28966M66796K08104k15385l68851k78794k21698
43545C403121k31450j37146M6721R5259o2433k06000j08451K16232N95686Q64372
43535D475911Q86026N79147M1598m43847o33761n15417k52438l4598L406j33510
43525C972517k40360j04481J61776J83071j54875m73643m06758j16363q254j06619
43515B706011r0075J39863L45005M09299M88119O04254M95419M3756m77010p80874
$$ y = [3430418, 3136035, 3305776, 3775393, 4045956, 4133695, 4464975, 5056756, 5400506, 5209514, 4756216, 4338991, 3908276, 3446786, 3270957, 3598919, 4112599, 4313802, 4147313, 3973017, 4065244, 4418520, 4906211, 5319235, 5347758, 4868001, 4228728, 3933211, 4013574, 4034403, 3778708, 3583983, 3812949, 4279745, 4487849, 4272464, 3903613, 3624819, 3403121, 3171671, 3034525, 3081246, 3176505, 3114072, 2908072, 2799621, 3015853, 3611539, 4475911, 5361937, 5941084, 5982682, 5538835, 4905074, 4389657, 4137219, 4102621, 4106027, 3972517, 3732157, 3627676, 3789452, 3972523, 3817648, 3344005, 2937247, 2820884, 2812630, 2706011, 2615936, 2755799, 3100804, 3510103, 3998222, 4602476, 5097895, 5141651, 4664641, 3883767]
43505C883767q90321q72621n90931k8071M14344L30267j17180l95854l03247j28224
43495A301929j34138k00134n0548L70901Q32028J006350P42188K36107j24366
43486C980317j93845k18137m05456n44995l32956P0740J92570p8583l54018l40443
43476A775194j91013j19663k6813K35712M95452M70910K04999j5375r6007j87221
43466B546175k99737j91230K11892N17022K69768l94857p86140m53707K54553
43457A673739O35917N00204K89651L47616M50642K62642o6688j21563J10198J93019
43447D275377j03177m47332l90916M5449M00172L08209q8905k70344R7085O97897
43437D523515Q19699J98047n69366p05890k03642K64053K82434Q1692n8252k63655
$$ y = [3883767, 2993446, 2120825, 1529894, 1501823, 1916167, 2246434, 2129254, 1733400, 1430153, 1301929, 1167791, 967657, 917109, 1288010, 2120038, 3126388, 3868576, 4104683, 3980317, 3786472, 3568335, 3162879, 2617884, 2284928, 2355668, 2548238, 2469655, 2115637, 1775194, 1584181, 1464518, 1437705, 1673417, 2168869, 2639779, 2844778, 2829403, 2733396, 2546175, 2246438, 2055208, 2267100, 2784122, 3053890, 2659033, 1872893, 1419186, 1673739, 2309656, 2809860, 3099511, 3447127, 3897769, 4160411, 4093723, 3972160, 4082358, 4275377, 4172200, 3724868, 3333952, 3379401, 3779573, 4087782, 3998877, 3728533, 3825618, 4523515, 5343214, 5541261, 4971895, 4266005, 4062363, 4326416, 4608850, 4690542, 4632290, 4368635]
43427D368635o68162r74643p99880k28648L12353N72831N78291L70150k4401m37641
43417C068885o62826o80595n81619l59020j5660K21959R3438l08808n93450n13772
43407c31468j58127K60716N76222O54154M48444Q8791k58649n67001p99583p22368
43397h08869j96000M10849N10284O8094k81570l5104N78841R59223Q17351L21171
43387B344270j93854m40308k89295J14181M28146M19180J18889l02575o21607
43378A577027n67378q0551M09465L74718n0187j71614K23136M91897J48992l27311
43368B028194k53878J65351K12952j88472m67316l89610k73680k54161j06661
43359D72719J23600P8913j69335q8848L58424M82164m4465n65100m02085J71229
$$ y = [4368635, 3700473, 2725830, 1925950, 1697302, 2009655, 2582486, 3160777, 3530927, 3506526, 3068885, 2406059, 1725464, 1143845, 784825, 769165, 991124, 1084562, 775754, 182304, -331468, -489595, -228879, 347343, 1001497, 1449941, 1538732, 1280083, 713082, -86501, -808869, -1004869, -594020, -83736, -15642, -297212, -332316, 246525, 1205748, 2023099, 2344270, 2150416, 1710108, 1420813, 1534994, 1963140, 2382320, 2501209, 2198634, 1577027, 1009649, 929098, 1338563, 1713281, 1663094, 1491480, 1714616, 2206513, 2355505, 2028194, 1774316, 1939667, 2152619, 1964147, 1496831, 1107221, 833541, 579380, 472719, 596319, 675232, 505897, 417049, 775473, 1257637, 1213172, 648072, 245987, 417216]
43349D17216M68913L70101J63977j06021m76232o16359k50276K36745K76707j6327
43339D68444j13523K5033M0827o049K67554O93969O26623O822m39285k97401j8580
43328A254434o6229k03768n7446J94646J91899J4294m3529N784k0877p6986n500
43317A186722J43737K14146J62046l2216l96157p08141n63164L9471N29534M82127
43307A058105J48896k4077j2997j20L4928P4149j69274p16718r43673l55058N49420
43296c56419Q45950M16314o2963j96264j98806k06441k6633L00369L70893O9118
43286I55118j91341r0432J89033L46507L32799J92955m6634k22926j83352j48078
43276A133649m42331q16054o29497J31085O70806M96909Q2573L8723K17954J44004
$$ y = [417216, 886129, 1256230, 1420207, 1314186, 837954, 221595, -28681, 208064, 484771, 468444, 354921, 379954, 420781, 414732, 682286, 1376255, 2002878, 2009700, 1570415, 1273014, 1254434, 1188205, 984437, 926991, 1121637, 1313536, 1327830, 1284301, 1290085, 1269208, 1192222, 1186722, 1330459, 1544605, 1706651, 1674435, 1278278, 570137, 6973, 46444, 575978, 1058105, 1207001, 1182924, 1169927, 1169807, 1204735, 1278884, 1109610, 392892, -550781, -905839, -356419, 489531, 905845, 842882, 646618, 447812, 241371, 214738, 515107, 886000, 955118, 763777, 673345, 862378, 1208885, 1541684, 1734639, 1688005, 1465079, 1281727, 1133649, 691318, -124736, -754233, -623148, 47658, 544567, 627140, 665863, 883817, 1027821]
43266A027821j62768l51944l52663k68470l304M42397O19651K11095k80870j31006
43256G49939M52703N31273j60016p64504n24835J81541M51655O5267m13265n18118
43246E1640l70192k81727k68197j36330J36035L38706L37986K63344K85383L36668
43236F93316K35000K0079p2096J5323P0058k5321j06235l9875L8830j93k4059
43225H04827R8324J92810M0225k26517l03760j76282p1913m1234P8825L04199
43215F99504M28408L48673K13218J92798K93426M09906M09547K02751j10195k53519
43205B834517j26021k415j40487l54757l25120j79362l04728o27106o10613q4909
43195G8999M24432M13166K8676k84625m04605m72356n02758m09281k29369j6425
$$ y = [1027821, 865053, 513109, 160446, -108024, -111328, 331069, 950720, 1161815, 880945, 749939, 1202642, 1733915, 1573899, 809395, 284560, 466101, 917756, 983023, 569758, 51640, -318552, -600279, -868476, -1004806, -868771, -530065, -192079, 71265, 356648, 693316, 928316, 948395, 876299, 891622, 961680, 936359, 830124, 790249, 829079, 828886, 804827, 903151, 1095961, 1136186, 909669, 605909, 429627, 357714, 316480, 395305, 699504, 1127912, 1476585, 1689803, 1882601, 2176027, 2585933, 2995480, 3198231, 3088036, 2834517, 2708496, 2706081, 2565594, 2210837, 1885717, 1706355, 1401627, 774521, 163908, 78999, 503431, 916597, 945273, 660648, 256043, -216313, -719071, -1128352, -1357721, -1374146]
43185a374146L17488P43596Q83921M22185l37134p10915m55437j0009J31056j5511
43175d04906r0799J22374N18471P89386O27407J107o62667p81842k65648L22165
43165A75048M26551J39879o0238k0258J0551p2573n3785J39910K19880Q989k06791
43154G07163j06270J48957J81181m365p6814P3097K40220L09475L54226L32942
43144B159812R1435k78879m65280l87697k62920j68860K6439K22037P4842l85762
43134F25167o40526m29058j12370N310J54547M85023N54630L3524n64632n64818
43124d53203j72830o2683k15326n3835M00085M70188K2105k03462K44783Q13003
43114G88825Q13526L89026J25243J58064J52501j03337m67352o49418m54429j3470
$$ y = [-1374146, -1056658, -313062, 570859, 993044, 655910, -55005, -510442, -520451, -389395, -404906, -495705, -373331, 145140, 934526, 1561933, 1563040, 900373, 118531, -147117, 175048, 601599, 741478, 681240, 660982, 671533, 598960, 545175, 685085, 904965, 913954, 707163, 600893, 749850, 931031, 926666, 849852, 922949, 1163169, 1472644, 1826870, 2159812, 2251247, 1972368, 1507088, 1119391, 856471, 687611, 714050, 936087, 1010929, 625167, -15359, -444417, -556787, -551477, -396930, 88093, 642723, 676247, 111615, -453203, -626033, -688716, -904042, -957877, -557792, -87604, -65499, -268961, -24178, 788825, 1602351, 1991377, 2116620, 2274684, 2427185, 2323848, 1856496, 1207078, 752649, 739179]
43104G39179J76139k18088p52976o12899K42545Q83118O19490j27570n26409l98214
43094B4315j26060O9831K23899K75325J54103N4282J77543L33460J87305k04702
43084A169301m62827m01161j80845l0265m8706j81668k12346N7194M68779O00054
43074G77510L54728J37045K27221L63926K34778j8285j38567j96383k83163j82747
43064A276063J65430K98159q2951m40126j20135N51256O81916J48701k94452j96376
43054A987485J01794K09367J56172o923l54638o47544m28217K02342N32904K27448
43044A980190k37399l94265m23200o03220p08916m30021M5926L34619L97938L86052
43034C47704K69672K9327r2154P3198K90985L01701K50704L53518M09083J11509
$$ y = [739179, 915318, 697230, -55746, -668645, -426100, 457018, 1076508, 948938, 422529, 24315, -101745, -31914, 191985, 467310, 621413, 675695, 853238, 1186698, 1374003, 1169301, 706474, 305313, 124468, 94203, 45497, -136171, -348517, -291323, 177456, 777510, 1132238, 1269283, 1496504, 1860430, 2095208, 2076923, 1938356, 1741973, 1458810, 1276063, 1441493, 1739652, 1656701, 1216575, 1096440, 1647696, 2329612, 2478313, 2183861, 1987485, 2089279, 2298646, 2454818, 2447895, 2093257, 1445713, 1017496, 1219838, 1752742, 1980190, 1742791, 1348526, 925326, 322106, -386810, -816831, -770905, -436286, -38348, 347704, 617376, 646703, 554549, 627747, 918732, 1220433, 1471137, 1824655, 2233738, 2345247]
43024B345247l39744m28439o0537K98715K33965j90669o19643p62487n47897j31666
43014b03155K13921L26050K53279J09033m3911j24371n6753N2892p21j65895j39206
43003B21163J42236L37258K20205K3118O554L5483r0067k04710p5215J34737J25568
42992H76330k0581k4517N7485m1736k42397j67809K39657N63735M44138k7274
42982A657031m68084n49689k33404J42805J41986k18499m27892k29373l1527j80686
42972c97332k73051J65224O92793N18027j43460k82199K97175O48677K48520j85322
42962A289052L768K71644j22825p39696o21770J21886M86689J52916j60900L414
42952F84178J70598j21309m95878l57258J89691N51548M78201K45795J66431K50526
$$ y = [2345247, 2005503, 1577064, 1516527, 1815242, 2049207, 1858538, 1238895, 476408, -71489, -203155, 10766, 336816, 590095, 699128, 655217, 530846, 474093, 526985, 526264, 360369, 221163, 363399, 700657, 920862, 943980, 950534, 986017, 895950, 691240, 616025, 750762, 876330, 855749, 831232, 888717, 846981, 604584, 436775, 676432, 1240167, 1684305, 1657031, 1188947, 639258, 405854, 548659, 690645, 472146, 44254, -185119, -216646, -397332, -670383, -505159, 187634, 705661, 562201, 280002, 577177, 1225854, 1474374, 1289052, 1292820, 1564464, 1441639, 701943, 80173, 202059, 688748, 841664, 680764, 684178, 854776, 733467, 237589, -119669, 70022, 621570, 1099771, 1345566, 1511997, 1762523]
42942A762523K93278J04934k76254n28600l67802L1223J94400J3042r6307J27389
42932A257826L43469J69827j70908k30106q8044j50921l36711j49001L74260M99252
42922A518943j11160p61014o67962q3081J41539j91300m77794l14568L9185K68756
42912f38456M32732N75029M78418J29936m8151J64998L21820m4914o12479o63986
42902I4947j32970L21336K68481k785o0491P1723J12635j5548j76192k66732k73366
42891e8962j96497n1490J34432L52299N24032M40557J7379m16676l95503O9008
42881D18579M63089M53244K55712J77402J50720o900j61970l9346L21540N78314
42871B610384M80240O5596m21231o63689m97324j53014n5392k14264j29777M26297
$$ y = [1762523, 2055801, 2160735, 1884481, 1355881, 988079, 1019302, 1213702, 1226744, 1130437, 1257826, 1601295, 1771122, 1600214, 1370108, 1282064, 1131143, 794432, 645431, 1019691, 1518943, 1407783, 646769, -21193, -104274, 37265, -154035, -631829, -946397, -907212, -638456, -205724, 369305, 847723, 977659, 929508, 1094506, 1416326, 1371412, 758933, 94947, -38023, 283313, 551794, 549009, 488518, 560241, 672876, 657328, 481136, 214404, -58962, -255459, -306949, -172517, 179782, 703814, 1144371, 1161750, 745074, 349571, 418579, 881668, 1334912, 1590624, 1768026, 1918746, 1911846, 1749876, 1710530, 2032070, 2610384, 3090624, 3156220, 2734989, 2071300, 1573976, 1420962, 1365570, 1151306, 1021529, 1447826]
42861A447826Q88589N99104k22386p34367n75062j78387k8340j26526k57226k98981
42851E14244j60335J80053M67422L90408O9476q5995l9007j36585l92961l78599
42841D28121k3298J28452j88328m49420k01384J71434J43210l6776J30425L96124
42831D98560J78470k97188k41934L73504P06790L77928j0241L6350J63753l3944
42821A752048k47966p4607J98684Q4178k60828l36197j38397n2284j08501J1119
42811H27249L07208L95579J41247j30672j46354j5862M6669L0028N1099J74470
42801A680661L46525L83066J09901l29069m86972j80612J72405J15785j66296
42792A645394j74622P6027J10874j70232l16621r4526J31513J7491k30766k56087
$$ y = [1447826, 2336415, 2935519, 2713133, 1978766, 1403704, 1225317, 1196977, 1070451, 813225, 514244, 353909, 533962, 1001384, 1391792, 1461268, 1375273, 1336266, 1199681, 806720, 428121, 404823, 533275, 344947, -104473, -305857, -134423, 8787, -27989, 102436, 498560, 677030, 379842, 137908, 511412, 1218202, 1596130, 1585889, 1622239, 1785992, 1752048, 1504082, 1429475, 1628159, 1712337, 1451509, 1115312, 976915, 924631, 816130, 827249, 1134457, 1530036, 1671283, 1540611, 1394257, 1378395, 1425064, 1455092, 1506191, 1680661, 2027186, 2410252, 2520153, 2191084, 1704112, 1523500, 1695905, 1811690, 1645394, 1470772, 1546799, 1657673, 1487441, 1170820, 1076294, 1207807, 1225298, 994532, 738445]
42782G38445j24791j65071m39144o55709n14105m961N30016O37532K52095r7286
42772A57021J02219N82714N93875q890n28335m38703m4666J80546L25830O18991
42762A540602P61835L40240l65128o26613k50942K26552L19921J02187j01213
42753A947441j39649p5332n9633k11122m42594m79698k29474K6983L7188m1638
42743C32472K8418R0544j33809m66498m44757j869M63066O40603N15812J13050
42733A137032m62000p72730m07996L51891P54633N50069K17589J21636M1271k39750
42723A291645m70214m07195k53133k30379j60361J21732L45902K64798J60402
42714F63197L65104N84347L04765l07135n55710k26770J60401J82131J8218n5584
$$ y = [738445, 613654, 448583, 9439, -646270, -1160375, -1165336, -635320, 2212, 254307, 157021, 259240, 841954, 1435829, 1426939, 898604, 459901, 415235, 595781, 921611, 1540602, 2302437, 2642677, 2277549, 1650936, 1399994, 1626546, 1946467, 2048654, 1947441, 1807792, 1732460, 1672827, 1461705, 1019111, 539413, 309939, 336922, 374110, 332472, 360890, 451434, 317625, -148873, -593630, -595499, -132433, 508170, 1023982, 1137032, 675032, -97698, -505694, -153803, 600830, 1150899, 1368488, 1490124, 1531395, 1291645, 821431, 414236, 161103, -69276, -229637, -107905, 237997, 502795, 663197, 1028301, 1612648, 1917413, 1610278, 1054568, 827798, 988199, 1170330, 1188548, 1132964]
42704A132964j61766m73247p43870n99244j15573K68151L49893L40161M22496
42695D19965M64782L15359J35211J79550L72599L94465J78844J9873J02509K35072
42685B818229K23342K02599L12535L23328l043l74777k96553J42152L42065Q5719
42675C775596j95821j65128k1954J5553J05033L09555K61835k28218o60657m90841
42665B704953K7990K21675j8844k30263k06903k01496l15697l01849p7788Q1012
42655A682790J6149q7379r9982j55752k86478k43384Q9938M38208N16492L83132
42645B253734K02390m0959l37409m54814k64452l9801q2467k24959j02297J78536
42635A087502J04682m32078q26308n25858J77088M88378J43883k90676k31510
$$ y = [1132964, 971198, 497951, -245919, -845163, -960736, -692585, -342692, -2531, 419965, 884747, 1200106, 1335317, 1514867, 1887466, 2281931, 2460775, 2480648, 2583157, 2818229, 3041571, 3244170, 3556705, 3880033, 3876990, 3502213, 3205660, 3347812, 3689877, 3775596, 3579775, 3414647, 3392693, 3408246, 3513279, 3822834, 4084669, 3856451, 3195794, 2704953, 2732943, 2954618, 2935774, 2705511, 2498608, 2297112, 1981415, 1679566, 1601778, 1682790, 1698939, 1611560, 1511578, 1355826, 1069348, 825964, 915902, 1354110, 1870602, 2253734, 2456124, 2415165, 2077756, 1622942, 1358490, 1318689, 1236222, 1011263, 908966, 1087502, 1192184, 760106, -66202, -592060, -414972, 73406, 217289, -73387, -304897]
42626c04897J69836L52917J89469Q3275K59666L98419J62440k47497l70233j16485
42616E76910J86603K61406R5500k09079m81618m43141J2081M84912M09399j72168
42606G20805n49487k62738K62535L18077j03427l57462j01986K61135K40641k5258
42596D02835l3994K82406M41741J47983k35699k03986J47485K65200n7415m10419
42586G46137l61710L0949M35426O48475N95104K38920k37398m20762j49142J95693
42576A721692J88855m1866p8554J08601J84563O0533P065J25924J49543r6840
42566B329516l74545l50477k5762K77824K35156j84723o09379n51789p104M04497
42556A143214J91649k99000l51484R1288M06193K43874r7375l07662m45369n06425
$$ y = [-304897, -135061, 217856, 407325, 490600, 750266, 1148685, 1311125, 1063628, 693395, 576910, 763513, 1024919, 1120419, 911340, 429722, -13419, -1338, 483574, 892973, 720805, 171318, -91420, 171115, 489192, 385765, 28303, -73683, 187452, 428093, 402835, 368841, 651247, 1092988, 1240971, 1005272, 801286, 948771, 1213971, 1156556, 746137, 384427, 415376, 850802, 1499277, 2094381, 2333301, 2095903, 1675141, 1525999, 1721692, 1910547, 1868681, 1790127, 1898728, 2083291, 2143824, 2150889, 2276813, 2426356, 2329516, 1954971, 1604494, 1578732, 1856556, 2091712, 1906989, 1297610, 745821, 738717, 1143214, 1334863, 1035863, 684379, 775667, 1181860, 1425734, 1328359, 1020697, 575328, 68903]
42546F8903k32047L57779P73056P23995N02096L81461J70589k44457m55088j59898
42536A886389K19933J58242j15766k4949L83217N74358M44446L68287M19685K91132
42526D604974J7125K1083K78826J76169m67582q97896m56094L76248N88548M1408
42516D282809l92535q1607N45201O58934J28078m07833m27247j22841k3198k87997
42506C871764o09385o89942n38608k87592R912K88305L90955K46257l316j70046
42496B508304k11220j74811r8874m5068p9127j47277j32354n9443l0507L0666
42486A560289K36966L47866J0731n03488m22726L67668R38643N94826p6768j36575
42476B917432K61646K67354j71369k81169J29083L24049p3592m33700j77681L17949
$$ y = [68903, -163144, 194635, 967691, 1691686, 2193782, 2575243, 2745832, 2501375, 2046287, 1886389, 2106322, 2264564, 2148798, 2123849, 2507066, 3081424, 3525870, 3894157, 4313842, 4604974, 4622099, 4643182, 4922008, 5098177, 4630595, 3732699, 3276605, 3652853, 4241401, 4282809, 3890274, 3808667, 4353868, 5012802, 5140880, 4733047, 4305800, 4182959, 4159761, 3871764, 3262379, 2572437, 2033829, 1746237, 1756149, 2044454, 2435409, 2681666, 2678350, 2508304, 2297084, 2122273, 2023399, 1978331, 1899204, 1751927, 1619573, 1560130, 1529623, 1560289, 1797255, 2145121, 2155852, 1652364, 1229638, 1597306, 2535949, 3130775, 3054007, 2917432, 3179078, 3446432, 3275063, 2993894, 3122977, 3447026, 3373434, 2939734, 2762053, 3080002]
42466C080002M06286J31895m9736l7722k8470m6180j6096l1333j42683j51621
42456C114342L1684J27323n4411k22620q7699R6983l2845k58716r1934L82364
42446C004471N74276K84059k5270N1621L31464M06138J91437q7894k32749k11313
42436D286240j03271l2224q4388k33713l83614m66166m50140l16523j10005N6691
42426B162887J39457K22132L50588M11770K89132M3419j67303k55702k15885r5817
42416B884678l6245j65349l51529k65316J59862N32012M61284M4264l12249l87287
42406B564125k56402o7556O0739M5206l9072M3098L72696O96943P52368O02245
42396D774390M48309L03855J10260j1720O6788K01377J66383J6223k0354J15727
$$ y = [3080002, 3486288, 3618183, 3568447, 3530725, 3502255, 3456075, 3439979, 3408646, 3265963, 3114342, 3146026, 3273349, 3218938, 2996318, 2908619, 3005602, 2972757, 2714041, 2622107, 3004471, 3578747, 3862806, 3837536, 3889157, 4220621, 4626759, 4818196, 4730302, 4497553, 4286240, 4182969, 4150745, 4066357, 3832644, 3449030, 2982864, 2532724, 2216201, 2106196, 2162887, 2302344, 2524476, 2875064, 3286834, 3575966, 3619385, 3452082, 3196380, 2980495, 2884678, 2848433, 2683084, 2331555, 2066239, 2226101, 2758113, 3219397, 3263661, 2951412, 2564125, 2307723, 2240167, 2300906, 2346112, 2307040, 2350138, 2722834, 3419777, 4172145, 4774390, 5222699, 5526554, 5636814, 5625094, 5691882, 5893259, 6059642, 6075865, 6055511, 6171238]
42386F171238L37890O20825Q93023R12753O08791L77573O31703J164927J383396
42377A3102119J096537O75105M86990N79240Q54532J136076J103640O04022j108
42368A9637153k23160j23330j34913l02366k93335j57876l82324j025335j462811
42359A5531703j284143q72559p51502q54358q28368o46142n12575m77233m85772
42350H819051n57234o48761o15420m95547n01506n69948l60442R9751K92125J2764
42340E474833k61568j90337j51440m87243p47940l72534L26129O15236M53155
42331D658291L63321M30096K44035k38442n66536n45146m16999k67866O2415M08941
42321D132110L16710j97590n43807l97842o8642J38448L26889N51077N28341J14554
$$ y = [6171238, 6509128, 7129953, 8022976, 8935729, 9544520, 9922093, 10553796, 11718723, 13102119, 14198656, 14873761, 15360751, 15939991, 16794523, 17930599, 19034239, 19638261, 19637153, 19413993, 19290663, 19155750, 18853384, 18560049, 18402173, 18019849, 16994514, 15531703, 14247560, 13375001, 12623499, 11769141, 10940773, 10294631, 9782056, 9304823, 8819051, 8261817, 7613056, 6997636, 6502089, 6000583, 5430635, 5070193, 5169944, 5462069, 5474833, 5213265, 5022928, 4871488, 4384245, 3636305, 3263771, 3589900, 4205136, 4658291, 5021612, 5451708, 5695743, 5457301, 4890765, 4345619, 3928620, 3660754, 3723169, 4132110, 4448820, 4251230, 3707423, 3309581, 3240939, 3379387, 3706276, 4257353, 4785694, 4900248]
42311D900248l90031o66629o94717m82348R722M83510M23762j14271m13558j29757
42301B925931J78176k7887m22880m58328k81467l18526l92223o5230M21807M19075
42291A978448k5571j77480J99081M72304K01449j50425J8239M95663N90284J29888
42281C731880l74423m77886k88770j19779L6656M27135R99333J240035P60992
42272E935173r0493n35991l06964O9211M9813k48603m18218m09521l86948k43162
42262C414297J91741O18280N39788M7569k42484j16735n5859l94448p15401m50789
42252B835959K59970P15344M99232j21725n72130n23039j11320K53828K95646
42243C531765Q7744j62128m11394o66757p06692k92630L32379N54577J44236m17763
$$ y = [4900248, 4510217, 3843588, 3148871, 2666523, 2676245, 3159755, 3583517, 3469246, 3055688, 2925931, 3104107, 3076220, 2653340, 2195012, 1913545, 1595019, 1202796, 1137566, 1559373, 1978448, 1952877, 1775397, 1974478, 2446782, 2648231, 2497806, 2516045, 3011708, 3601992, 3731880, 3357457, 2879571, 2590801, 2471022, 2507678, 2934813, 3934146, 5174181, 5935173, 5844680, 5308689, 5001725, 5070936, 5120749, 4872146, 4453928, 4044407, 3657459, 3414297, 3606038, 4224318, 4764106, 4811675, 4569191, 4452456, 4396597, 4002149, 3286748, 2835959, 3095929, 3811273, 4310505, 4188780, 3616650, 3093611, 2982291, 3236119, 3531765, 3619509, 3457381, 3045987, 2379230, 1672538, 1379908, 1712287, 2266864, 2411100, 1993337]
42233A993337n41106j90280K23600L76643K69972J09200R8597K38362K87254Q3488
42223B949067j57483j45743l2391j91429n10602m59270L0513L73185K65093J65899
42213B286839M48621O95325M05006j22986k83093j29619j22536k23309l5084L37010
42203C256174L72999L7406j69404q0373m3670j55125m9615L62225O44151N66594
42193D741362M47160M79241L47465j28229n31196m47591o0038K47935M33172N49091
42183F078372M25017M8197j52177R7465M05947L34362J71555M84105J157134J550885
42173A0600862J477717J364734J476241J609397J626370J692419J826973J745141
42165B3419854J373374J080255J129003J266911J146721Q46206O33686M38853
$$ y = [1993337, 1452231, 1261951, 1485551, 1862194, 2132166, 2241366, 2339963, 2578325, 2865579, 2949067, 2791584, 2645841, 2613450, 2422021, 1911419, 1452149, 1482662, 1855847, 2120940, 2286839, 2735460, 3430785, 3835791, 3712805, 3429712, 3300093, 3177557, 2954248, 2919164, 3256174, 3629173, 3666579, 3497175, 3416802, 3373132, 3218007, 3168392, 3530617, 4174768, 4741362, 5188522, 5667763, 6015228, 5886999, 5355803, 4908212, 4848174, 5096109, 5529281, 6078372, 6503389, 6551586, 6399409, 6496874, 6902821, 7237183, 7408738, 7892843, 9049977, 10600862, 12078579, 13443313, 14919554, 16528951, 18155321, 19847740, 21674713, 23419854, 24793228, 25873483, 27002486, 28269397, 29416118, 30262324, 30896010, 31334863]
42157C1334863n8474q74591j589785j831355j664224j397495j173477r37822p51322
42148B1056318q53919j267019j543684j237063n67380k43522n26669q65189p02295
42139A3249578k82275k49459o80174j006808q49171m52636k19789j98876k03731
42130I106659j49095n9990O7212K13256K41858L1453l05317m49462j96108K64757
42120H765223M90195K97446K3235O4831K66116J34148l23995m82841k6125N12491
42110I720724N13283J21833j59218l18912o33691r10288o93331j25336J45837
42101G660901o0232k65021j72994j7995M1069J66649L04098J06866l38920m18972
42091G005449L4467L57525P9024l21873k18055J82947K76864K0832j85892k19709
$$ y = [31334863, 31276389, 30401798, 28812013, 26980658, 25316434, 23918939, 22745462, 21807640, 21056318, 20202399, 18935380, 17391696, 16154633, 15587253, 15343731, 14817062, 13951873, 13249578, 12967303, 12717844, 12037670, 11030862, 10181691, 9729055, 9509266, 9310390, 9106659, 8957564, 8897574, 8964786, 9178042, 9419900, 9451353, 9146036, 8696574, 8500466, 8765223, 9255418, 9552864, 9576099, 9640930, 9907046, 10041194, 9717199, 9234358, 9208233, 9720724, 10234007, 10355840, 10196622, 9877710, 9244019, 8333731, 7640400, 7515064, 7660901, 7600669, 7335648, 7162654, 7144659, 7185728, 7352377, 7656475, 7763341, 7424421, 7005449, 7039916, 7397441, 7476465, 7154592, 6936537, 7119484, 7396348, 7417180, 7231288, 7011579]
42081G011579k13869j18095J36912K98036J66589M6551K63901N31365L92031R920
42071H524920j36563q6591k07802m01790k82093J1891J2899j54141N2272M95326
42061G828328M13944k71213o95902m22355j13027l48289o68558m55095N704J26212
42051E399749O6671L03334O02520L78011j72099k47616K63058N69396K02104l49906
42041G015222n14582m50355n47395o64261m35761k4753M9097k43684l34056P2243
42031C921715M81088K94128k94183n44474k36238L4850k13606o08261n05883K2381
42021B351517L49310K76404K27457M20527M89770J72467j81132j50929J22264
42012D077655K34908R8797j57939n12613q35627p09657j3419N84816L62028l71568
$$ y = [7011579, 6797710, 6679615, 6816527, 7114563, 7281152, 7327703, 7591604, 8122969, 8515000, 8524920, 8388357, 8301766, 8093964, 7692174, 7410081, 7421972, 7434871, 7280730, 7333002, 7828328, 8242272, 7971059, 7275157, 6852802, 6739775, 6391486, 5722928, 5267833, 5273537, 5399749, 5466420, 5769754, 6372274, 6750285, 6578186, 6330570, 6593628, 7163024, 7365128, 7015222, 6500640, 6050285, 5502890, 4838629, 4402868, 4378115, 4427212, 4183528, 3849472, 3921715, 4402803, 4696931, 4402748, 3858274, 3622036, 3656886, 3443280, 2835019, 2329136, 2351517, 2700827, 2977231, 3204688, 3625215, 4114985, 4287452, 4106320, 3955391, 4077655, 4312563, 4411360, 4253421, 3740808, 2905181, 2195524, 2182105, 2766921, 3128949, 2757381]
42002B757381o02718k1342O10737O37900L53754L23871M65109L27412p9384l12533
41992D460187j95527J2927J20647K31588L96333M05432J21677k18893k62347J4805
41982E086829K96999L13934O8000k86886n90666o65390l83995R9612L66237J96266
41972D500940j02119q6204J96440L03947P6557j87903k82991l57517m61552l15262
41962C284336J46866M42565J99512k11367k26838J1255o9148m70445n99648k51683
41952B255405N8431q2959m05274m40012j35498K63532N66221O31292L58486q6242
41942B983382l29447k51795j08944q7912j00827j21630k86230m97071m08453k4098
41932G66975J93815P2095K6589K77319L83039M9954k13878Q1370M76735K72299
$$ y = [2757381, 2154663, 2133321, 2744058, 3381958, 3735712, 4059583, 4524692, 4852104, 4772720, 4460187, 4264660, 4277587, 4398234, 4629822, 5026155, 5431587, 5553264, 5334371, 5072024, 5086829, 5383828, 5697762, 5765762, 5478876, 4888210, 4222820, 3838825, 3938437, 4304674, 4500940, 4398821, 4312617, 4509057, 4813004, 4889561, 4701658, 4418667, 4061150, 3599598, 3284336, 3431202, 3873767, 4073279, 3861912, 3635074, 3646329, 3577181, 3106736, 2507088, 2255405, 2313836, 2230877, 1825603, 1385591, 1250093, 1513625, 2079846, 2711138, 3069624, 2983382, 2653935, 2402140, 2293196, 2205284, 2104457, 1982827, 1696597, 1199526, 791073, 766975, 960790, 1032885, 1059474, 1336793, 1719832, 1769786, 1555908, 1637278, 2114013, 2386312]
41922B386312k56392k96666J01453J08625m26442o62732j43021M60484L99358
41913A670979j00290l27174n6301M30412Q41287R83943P64168M13398L42927N14800
41903E478149M21740l9673k61492J00433M54250J72179l54619l04043K77036N56799
41893F500759J50551m78096q18937q37422o45067k75934O5915N9789k53638m53232
41883C014688l20462p3589N7970J09188J45688J29059J01480J51422J41970j48918
41873C308496n73838p14562m86300k01488J0568L16080O14374M92889j1654k41323
41863B513242J07884M25387J07146m73259n37638p2092K57306J36725j15480k04782
41853B144439j76991q5567J04132K33973O8805k38541k44070J40451M97647M81242
$$ y = [2386312, 2129920, 1833254, 1934707, 2043332, 1616890, 954158, 811137, 1271621, 1670979, 1570689, 1243515, 1187214, 1617626, 2458913, 3442856, 4207024, 4620422, 4963349, 5478149, 5899889, 5860216, 5598724, 5699157, 6153407, 6325586, 5970967, 5666924, 5943960, 6500759, 6651310, 6173214, 5354277, 4516855, 3871788, 3595854, 3661769, 3721558, 3467920, 3014688, 2694226, 2620637, 2678607, 2787795, 2933483, 3062542, 3164022, 3315444, 3457414, 3308496, 2734658, 2020096, 1533796, 1332308, 1342876, 1658956, 2273330, 2766219, 2754565, 2513242, 2621126, 3046513, 3153659, 2680400, 2142762, 2070670, 2327976, 2464701, 2349221, 2144439, 1967448, 1881881, 1986013, 2219986, 2288791, 2050250, 1806180, 1946631, 2444278, 2925520]
41843B925520J70550k07703n20708o18264l79998R149J87433J13676P4610J41070
41833A895335P2791j17344l5088L98459O30589K53184l21195m38534j53651o8359
41823B116187l84145o53499m78045j7906K89932K29908n4334k24969l2746M11030
41813A201413O91984N78496L36541L42790N23927N00999K15452K6061J34706K76850
41803D829219J37070k01550m22914m15838l44570l63365m25471l80501j87772
41794B224308K857K0714o8244Q789L44605O27676N00769O3227k24129j12989J99011
41783C586594M18760M77314M34133L21699K11167K13326K61846Q7252m05824q78339
41773D727928q83556l91172J85315M57501M27288L92934N82939Q89640R46623
$$ y = [2925520, 3096070, 2888367, 2367659, 1749395, 1369397, 1378546, 1565979, 1679655, 1754265, 1895335, 1968126, 1850782, 1815694, 2214153, 2844742, 3097926, 2776731, 2338197, 2184546, 2116187, 1732042, 1078543, 600498, 582592, 872524, 1102432, 1048098, 823129, 790383, 1201413, 1893397, 2471893, 2808434, 3151224, 3675151, 4176150, 4391602, 4417663, 4552369, 4829219, 4966289, 4764739, 4341825, 3925987, 3581417, 3218052, 2792581, 2412080, 2224308, 2227165, 2247879, 2179635, 2188424, 2533029, 3160705, 3661474, 3724701, 3500572, 3387583, 3586594, 4005354, 4482668, 4916801, 5238500, 5449667, 5662993, 5924839, 6012091, 5606267, 4727928, 3844372, 3453200, 3638515, 4096016, 4523304, 4916238, 5499177, 6388817, 7335440]
41764G335440N20973j64007o02847n45290k41855r4096k01166l61641l95318l02819
41754D947374j73357q8972j05946k23934l77120n06432n93316n87781m13865j27846
41744A748805N6552L2850k2378R3127K69735K21209q0752l34940k99870n6732
41734A627606J70872K79131K77581J70466l2173k60237m24176m60396l14888R143
41724A042929L40582M15845J76579j06365j35118N6183J79659Q4604q8590j50804
41714A815504j01272m7140L317J45221L94338N95694N60376K73735o6099k36746
41704C336928k13807j76227k75477m37338m43615j98809J42983L29861K45154
41695B309653k3626k91590m11284l42403j50917N3138K00221K83623K98716K04290
$$ y = [7335440, 7856413, 7692406, 7089559, 6544269, 6302414, 6208318, 6007152, 5645511, 5250193, 4947374, 4774017, 4685045, 4579099, 4355165, 3978045, 3471613, 2878297, 2290516, 1876651, 1748805, 1805357, 1838207, 1815829, 1908956, 2178691, 2399900, 2319148, 1984208, 1684338, 1627606, 1798478, 2077609, 2355190, 2525656, 2493483, 2233246, 1809070, 1348674, 1033786, 1042929, 1383511, 1799356, 1975935, 1869570, 1734452, 1790635, 1970294, 2054898, 1966308, 1815504, 1714232, 1667092, 1670409, 1815630, 2209968, 2805662, 3366038, 3639773, 3573674, 3336928, 3123121, 2946894, 2671417, 2234079, 1790464, 1591655, 1734638, 2064499, 2309653, 2286027, 1994437, 1583153, 1240750, 1089833, 1142971, 1343192, 1626815, 1925531, 2129821]
41685B129821j4891k75040m39755m42748l29403j78730k2296J47179L06630L62990
41675A243757K17289q9038l25020k79047l5195J04500L9964J9657K01461K87543
41665A385871o3167n74652n65739J08344P83529Q67023N66574M10940M29843K96548
41655C645114K1238q9062o4667k51379o04013o09846j13832L38811K97198M3303
41645B612865J9342N6359k59153p30229p22048j43743L47570K44826j97335m43847
41635G84607l64052j70194J7658K19174L64667L10072M8333k58832m20746l02270
41625B28417J12728O08866Q03743N02986n2220m24244m20635j90466L2823J22109
41615A324107M4050j50000k98476k41410L815K73421M52337N13839L97754O3557
$$ y = [2129821, 2114930, 1839890, 1400135, 957387, 627984, 449254, 426958, 574137, 880767, 1243757, 1461046, 1372008, 1046988, 767941, 732746, 837246, 877210, 896867, 1098328, 1385871, 1322704, 748052, 182313, 290657, 1074186, 1941209, 2507783, 2918723, 3348566, 3645114, 3666352, 3577290, 3512623, 3261244, 2657231, 2047385, 1933553, 2272364, 2569562, 2612865, 2632207, 2688566, 2429413, 1699184, 977136, 833393, 1180963, 1425789, 1228454, 784607, 420555, 250361, 268019, 487193, 851860, 1161932, 1210265, 951433, 530687, 228417, 341145, 950011, 1753754, 2256740, 2204520, 1780276, 1359641, 1169175, 1201998, 1324107, 1368157, 1218157, 919681, 678271, 682086, 955507, 1407844, 1921683, 2319437, 2382994]
41605B382994k82042k54221K26116O78377N47145j06705o49856o37509k81319
41596A622980n0868o0089j00661j26787l26334o56584o83451j52988N06804O33488
41586F05510K16445p5323J64989N42848N27716K58356K05779K90308n955o52058
41576B078615r14269m58925M7333p0715m52855l32138J86181L28054k7169j69486
41566B14626J94493M52334J82268j36656n9424l2421n44005j030308n86195N58120
41556g87168J243407R63409L38567m126j29712k12220j08830J55134J96229n0161
41546A604529r2405K77296N08392J36720m27442n03808j17711J81566J51040k8728
41536A689449k02386l08616k25513O171M2205k64980n17957l75563j52641k69066
$$ y = [2382994, 2100952, 1846731, 2072847, 2751224, 3298369, 3191664, 2541808, 1904299, 1622980, 1572112, 1512023, 1411362, 1284575, 958241, 301657, -381794, -534782, -27978, 605510, 821955, 746632, 911621, 1454469, 1982185, 2240541, 2446320, 2736628, 2730673, 2078615, 1164346, 705421, 752754, 682039, 229184, -102954, 83227, 411281, 384112, 214626, 409119, 861453, 1043721, 907065, 847641, 815220, 271215, -759093, -1345288, -787168, 456239, 1419648, 1758215, 1754089, 1624377, 1412157, 1303327, 1458461, 1654690, 1604529, 1512124, 1789420, 2297812, 2434532, 2007090, 1503282, 1385571, 1567137, 1718177, 1689449, 1487063, 1178447, 952934, 959105, 1001310, 736330, 218373, -157190, -309831, -578897]
41526e78897m57395k11903K49639K77314r7859j92713J84223M71698L68683K67415
41516B80205M11482M23568P5013j92389l1023J34762j89973o55802n43674J06223
41506a81608N10290K25497l35104n31127k30430J98617L58392J53595k16106m87708
41496e35692n45774m08985j16980K17539L45694J43593j02817L59L67070N19922
41486a16071L08346J07451J86711L40606L42955L10635L47153K56487o6856l50277
41476A667140l73110l08195l11388j91144J30775K76422P782k57554q7633J92970
41466G46065K4410m14576m90638j65526K1102p0542k4270K65232L57484Q5779
41456C34520r9014J03214L31276J72251j98982l50019j89402Q6653L33414M49607
$$ y = [-578897, -1036292, -1248195, -998556, -721242, -819101, -1011814, -827591, -355893, 12790, 280205, 691687, 1115255, 1190268, 997879, 966856, 1101618, 911645, 255843, -287831, -181608, 328682, 554179, 219075, -312052, -542482, -343865, 14527, 168122, -47984, -535692, -1081466, -1490451, -1607431, -1389892, -1044198, -900605, -1003422, -1003063, -635993, -116071, 192275, 299726, 486437, 827043, 1169998, 1480633, 1827786, 2084273, 2017417, 1667140, 1294030, 985835, 674447, 483303, 614078, 890500, 898282, 640728, 553095, 746065, 770475, 355899, -134739, -300265, -279163, -349705, -373975, -108743, 248741, 334520, 235506, 338720, 669996, 842247, 643265, 293246, 103844, 190497, 523911, 973518]
41446I73518K94574j08018m63775n00408k29856J44547L80012K63763j63765m70467
41436A20125l02798K4691q6778n20563m88787K14937P29326L53306l64872m16055
41426g37468K35043P45886O80409M23306L42487K65076k6756l40570m09954l16706
41416H60753k78490k46818l576M40027P74288P34928L85935K215k71572n36010
41406A861680q61362j020433o97690L3191O52024P07683K63656k25803l59374
41397C53572r3776K35989K05658k04160m61179j09117N29724O98595K49606j90458
41387A214454k06813j14204j92611p6137N44596J144976R91266K07040m75126
41378C037441p68617r19545r43280n95723p5316O2004j97619k64123M2880J76993
$$ y = [973518, 1268092, 1160074, 696299, 195891, -33965, 110582, 490594, 754357, 590592, 120125, -182673, -157982, -244760, -765323, -1254110, -1039173, -309847, 43459, -321413, -737468, -502425, 243461, 923870, 1347176, 1689663, 1954739, 1927983, 1587413, 1177459, 860753, 582263, 335445, 331869, 771896, 1546184, 2281112, 2667047, 2669262, 2397690, 1861680, 1000318, -20115, -717805, -684614, -32590, 675093, 938749, 712946, 353572, 259796, 495785, 701443, 497283, 36104, -73013, 456711, 1155306, 1404912, 1214454, 1007641, 893437, 700826, 624689, 1169285, 2314261, 3305527, 3512567, 3037441, 2268824, 1349279, 405999, -189724, -265040, -203036, -400655, -664778, -621898, -444905]
41368d44905j45206l81149n2355M32787M28116M7077j23215K5360J23023J04676
41358A4209L11176P64123R21536L95072m41096q28732m71404J83454M70316J96566
41348A515220k43182m09134l22446k83911l19279j36774L24291O64530N38646
41339A327961J24747j52857j51209k2198R7397J41202K4504k19159l39583j78452
41329F52353L8874l957k35122l07401j20230P9428R5282p638r5863j11264j1720
41318b7258J87375L01572J46502j66813l35988k69173j38590l8374J15623K99622
41308G4498L08542Q7955j28379j56354j07844j56619k74470l52725l80616l37297
41298a423309j06797L02515O21092O10226L67288J57674P0842K5772k0170p6762
$$ y = [-444905, -590111, -971260, -1023615, -590828, -162712, -115635, -238850, -213490, -90467, 14209, 325385, 1089508, 2011044, 2406116, 1965020, 1136288, 664884, 848338, 1318654, 1515220, 1272038, 862904, 540458, 256547, -62732, -199506, 124785, 789315, 1327961, 1452708, 1299851, 1148642, 1126444, 1223841, 1365043, 1389547, 1170388, 830805, 652353, 691227, 687270, 452148, 144747, 24517, 103945, 199227, 191589, 95726, -15538, -27258, 160117, 461689, 608191, 441378, 105390, -163783, -302373, -340747, -225124, 74498, 383040, 470995, 342616, 186262, 78418, -78201, -352671, -705396, -1086012, -1423309, -1530106, -1227591, -606499, 3727, 371015, 528689, 599531, 625303, 605133, 528371]
41288E28371k08315l92565m17283j70513Q7804N2411j22336k7019L05704L58105
41278e636p0233m40118j68987N33551R15504O44501J40127o1038O3406J52906
41268A703983P29k31493k69251o3926J49463J20746j01818k04636k2678J86161
41258A267280N4926l54400n68809l13002J37288L42275K24264N757j92675l94277
41248B08627m94953l08280N6467J79394j34434n30145n25391j11025K85871L48476
41238a025393J68435L8540J32604L80471N25133L47822l4512k04633K0538K29633
41228E78638o7610o32151o77018K5076P09154O07909l8895m20605k93521r7363
41218c06386p8530K3917L11905L84537q969m37492l37262J91712N58068M73281
$$ y = [528371, 320056, -72509, -489792, -660305, -572501, -520090, -642426, -669445, -363741, -5636, -75869, -515987, -684974, -151423, 764081, 1408582, 1548709, 1487671, 1551077, 1703983, 1704712, 1473219, 1203968, 1140042, 1289505, 1410251, 1308433, 1103797, 1081119, 1267280, 1322206, 967806, 398997, 85995, 223283, 565558, 789822, 795579, 602904, 208627, -286326, -594606, -538139, -358745, -493179, -1023324, -1548715, -1659740, -1373869, -1025393, -856958, -818418, -685814, -305343, 219790, 567612, 533100, 328467, 349005, 578638, 511028, -121123, -798141, -773065, -63911, 543998, 505103, 84498, -209023, -306386, -384916, -360999, -49094, 335443, 326474, -111018, -448280, -256568, 301500, 774781]
41208G74781J74353n0499j69422k38842k49707j96866q2563J53356N00421P17866
41198A332878N68664J92630m4774q0329j91084m38039m63964o8727L40313K23315
41188A370883l28149o62016l89577J54033L63329Q5629k57800k16129J68765M66894
41178G55862M30339K76467L02245M04543K52749j41562l83255k86913j59793l05284
41168A145398n41429m90206j41988J72518K51772J69434K0497j81260l44661l00247
41158b40172l9131K06479J97209p2751l81773m74471k78211K7767K05417K16998
41148f32639J72204N4568k29185m81101k78003L74407Q30436O09553R7827j2483
41138E05584K68324L38728j1554l48946l39787j62959p3893q4369k05375m79114
$$ y = [774781, 949134, 898635, 729213, 490371, 240664, 43798, -38765, 114591, 615012, 1332878, 1901542, 2094172, 2049398, 1969069, 1777985, 1339946, 875982, 807255, 1147568, 1370883, 1042734, 380718, -8859, 145174, 508503, 594132, 336332, 120203, 288968, 755862, 1186201, 1462668, 1764913, 2169456, 2422205, 2280643, 1897388, 1610475, 1450682, 1145398, 603969, 113763, -28225, 144293, 396065, 565499, 585996, 404736, 60075, -240172, -279303, -72824, 124385, 51634, -330139, -804610, -1082821, -1055054, -849637, -632639, -460435, -405867, -635052, -1116153, -1394156, -1019749, -189313, 420240, 518067, 505584, 773908, 1112636, 1101082, 752136, 412349, 249390, 175497, 91128, -114247, -593361]
41128e93361o06315j19548P90462J182844N21923n18543q75419l84790K15515
41119c87232L00425j00968n86744p52354l99962K40028O08517M49669J59854J88118
41109b80649L66552K81225L7756O8176L28329L38235O078k29193j63089j16578
41099F36842k88879l99372k33315k9385j9891n1501M193p5893l66555l96042K04665
41088a015133R39889R46809J54925o14538p23842l77620r2855O763R1418J58628
41078e25556M7118j86894k38732K7619L32790L05987j8015k14081l0356K55400
41068b44720K34051j8362m5649K73954N08471L28882K0268L3471L03246L99503
41058A793115J82632j09334l26540n16249n97998m07095j22029j55421m58002
$$ y = [-593361, -1199676, -1319224, -528762, 654082, 1176005, 657462, -217957, -602747, -387232, -86807, -187775, -774519, -1526873, -1926835, -1686807, -1078290, -628621, -468767, -280649, 85903, 367128, 404884, 473060, 801389, 1139624, 1145702, 916509, 753420, 636842, 347963, -51409, -284724, -314109, -334000, -385501, -381308, -457201, -823756, -1219798, -1015133, -75244, 871565, 1026490, 411952, -311890, -689510, -782365, -775602, -684184, -525556, -478438, -665332, -904064, -876445, -543655, -237668, -255683, -469764, -500120, -244720, -10669, -29031, -74680, 199274, 707745, 1036627, 1056895, 1090366, 1393612, 1793115, 1975747, 1866413, 1539873, 1023624, 425626, 18531, -103498, -258919, -716921]
41049g16921m25325K20621R12161R87722N73131K33760P9322j78914m85175m66715
41039G33667j97246k13120n95361p18951k46114K58786J95623j17867N686M92985
41029d01912O69686L81066J77119L31213M05702M3965m07602m48674j71522m6142
41019E32899k18572l93766k82871J00603M97040N93516K93376j02615j73590Q8184
41009I34204K89299K56306K55671M14395L82648o7927n15559m44247m1165R2440
40999A556065j60693l77831l49227l30489n02097o50066n02848o0393M69808Q07550
40989a00221P19210K89365k9192M4786K01200N1501j79485m0458K65788J22323
40979A344817m30221o71228l62586j13797l25044n56760l46478O3583K87934M37252
$$ y = [-716921, -1142246, -921625, -9464, 978258, 1551389, 1785149, 1864471, 1685557, 1200382, 733667, 536421, 323301, -272060, -991011, -1237125, -978339, -782716, -900583, -894897, -401912, 267774, 648840, 825959, 1157172, 1562874, 1606839, 1199237, 750563, 579041, 532899, 314327, -79439, -362310, -261707, 235333, 828849, 1122225, 1019610, 846020, 934204, 1223503, 1479809, 1735480, 2149875, 2532523, 2464596, 1949037, 1504790, 1463625, 1556065, 1395372, 1017541, 668314, 337825, -164272, -814338, -1317186, -1377579, -907771, -100221, 618989, 908354, 879162, 923948, 1125148, 1176649, 997164, 956706, 1222494, 1344817, 914596, 243368, -119218, -233015, -558059, -1114819, -1461297, -1397714, -1109780, -672528]
40969f72528O72396P13848L69516K4242K3706P9764j17940k42693L2967K79946
40959A163224p933m54664m10348r5878j47570l75217j15330L87397K25659n22478
40949c53138p06706N6992P18245M51515j67221k91139p3796k1831K2936L47524
40939a6619N41658J67739l11494k35815R5806l5180m56605m04810R8828K82453
40929b74039j1544r1157L22837O32353M51409K20412L08622L32092q8780n66946
40919A235259n54326k00646M67L2960K18218N23417N98690L69124R2215r3165
40909B222213k47762l25490j85313R5658K39320J01693k28650n82539p34592m40075
40899h5537K22109O72665L99222l35570p42597m73318M5616K86571K14251P1148
$$ y = [-672528, -132, 713716, 1083232, 1107474, 1131180, 1210944, 1093004, 850311, 883278, 1163224, 1155291, 700627, 290279, 194401, 46831, -328386, -443716, -56319, 169340, -353138, -1059844, -1002852, -284607, 166908, -313, -291452, -365248, -387079, -364143, -16619, 525039, 692778, 381284, 145469, 241275, 206095, -250510, -655320, -556492, -274039, -285583, -376740, -53903, 578450, 1029859, 1250271, 1558893, 1890985, 1802205, 1235259, 680933, 480287, 480754, 513714, 731932, 1255349, 1854039, 2223163, 2315378, 2222213, 1974451, 1648961, 1463648, 1559306, 1798626, 1900319, 1671669, 1089130, 354538, -85537, 136572, 809237, 1208459, 872889, 130292, -343026, -297410, -10839, 203412, 274560]
$$ [...]
##END NTUPLES=NMR SPECTRUM
##END=
