##TITLE=31Pdec_DE-137_3_TFA
 ,64 sc
 6.4.2026
##JCAMPDX= 6.0         $$ Bruker NMR JCAMP-DX V2.0
##DATA TYPE= NMR SPECTRUM
##DATA CLASS= NTUPLES
##ORIGIN= UXNMR, Bruker Analytische Messtechnik GmbH
##OWNER= root
$$ XWIN-NMR		Version 3.5
$$ Mon Apr  6 16:21:33 2026 Russian Standard Time (UT+4h)  she@DPX200
##.OBSERVE FREQUENCY= 81.013821
##.OBSERVE NUCLEUS= ^31P
##.ACQUISITION MODE= SIMULTANEOUS
##.ACQUISITION SCHEME= undefined
##.AVERAGES= 64
##.DIGITISER RES= 17
##SPECTROMETER/DATA SYSTEM= spect
##.PULSE SEQUENCE= zgpg30
##.SOLVENT NAME= CDCl3
##.SHIFT REFERENCE= (INTERNAL, CDCl3, 0, 197.392)
##AUDIT TRAIL= $$ (NUMBER, WHEN, WHO, WHERE, WHAT)
$$ ##TITLE= Audit trail, XWIN-NMR		Version 3.5
$$ ##JCAMPDX= 5.01
$$ ##ORIGIN= Bruker BioSpin GmbH
$$ ##OWNER= she
$$ F:/spectra/data/she/nmr/P31/2/pdata/1/auditp.txt
$$ ##AUDIT TRAIL=  $$ (NUMBER, WHEN, WHO, WHERE, WHAT)
(   1,<2026-04-06 16:20:43.00 +0400>,<she>,<DPX200>,
      <continue with go, POWCHK disabled, PULCHK disabled
       configuration hash MD5:
       00 E9 B6 7A A2 85 ED C7 34 08 36 98 17 FE 4E 26
       data hash MD5: 32K
       46 F0 F3 4B 87 AF AE BF 01 7E 91 5D A8 18 FB 18>)
(   2,<2026-04-06 16:20:44.53 +0400>,<she>,<DPX200>,
      <Start of raw data processing
       efp BC_mod = 2 LB = 1.5 FT_mod = 6 PKNL = 1 PHC0 = 1398.106 PHC1 = 116.9007 SI = 64K 
       data hash MD5: 64K
       43 8C 21 4B A9 42 FE 42 A7 64 BE 67 3E 13 54 74>)
(   3,<2026-04-06 16:21:00.78 +0400>,<she>,<DPX200>,
      <pk PHC0 = -1.211126 PHC1 = 0 
       data hash MD5: 64K
       B2 6A C7 4D 77 26 CC 64 D3 9D AA C2 1D 9D 83 BA>)
(   4,<2026-04-06 16:21:06.25 +0400>,<she>,<DPX200>,
      <abs ABSG = 5 
       data hash MD5: 64K
       0C 4D 59 66 FE 33 78 4F 01 D1 1A 0C CE 42 5A FB>)
$$ ##END=
$$ 
$$ hash MD5
$$ 3E 80 69 B9 23 A6 F3 51 EE 72 7E 1F BF D1 3D 4B
##$RELAX= 
##$RELAX= 
##$RELAX= 
##$RELAX= 
##$RELAX= 
##$RELAX= 
##$RELAX= 
##$RELAX= 
$$ Bruker specific parameters
$$ --------------------------
##$DU= <F:/spectra>
##$EXPNO= 2
##$NAME= <P31>
##$PROCNO= 1
##$TYPE= <nmr>
##$USER= <she>
##$AMP= (0..31)
100 100 100 100 100 100 100 100 100 100 100 100 100 100 100 100 100 100 
100 100 100 100 100 100 100 100 100 100 100 100 100 100 
##$AQSEQ= 0
##$AQ_mod= 1
##$AUNM= <au_zg>
##$AUTOPOS= <>
##$BF1= 81.014009
##$BF2= 200.13
##$BF3= 200.13
##$BF4= 200.13
##$BF5= 200.13
##$BF6= 200.13
##$BF7= 200.13
##$BF8= 200.13
##$BYTORDA= 1
##$CFDGTYP= 0
##$CFRGTYP= 5
##$CHEMSTR= <none>
##$CNST= (0..31)
1 1 145 1 1 1 1 1 1 1 1 1 1 1 1 1 1 1 1 1 1 1 1 1 1 1 1 1 1 1 1 1 
##$CPDPRG= <waltz16>
##$CPDPRG1= <>
##$CPDPRG2= <waltz16>
##$CPDPRG3= <>
##$CPDPRG4= <mlev>
##$CPDPRG5= <mlev>
##$CPDPRG6= <mlev>
##$CPDPRG7= <mlev>
##$CPDPRG8= <mlev>
##$CPDPRGB= <>
##$CPDPRGT= <>
##$D= (0..31)
0 1 0 0 0 0 0 0 0 0.06 0 0.03 2e-05 3e-06 0 0 0.0002 0 0 0 0 0 0 0 0 0 
0 0 0 0 0 0 
##$DATE= 1775477935
##$DBL= (0..7)
120 120 120 11 120 120 24 19 
##$DBP= (0..7)
150 150 150 150 150 150 150 150 
##$DBP07= 0
##$DBPNAM0= <>
##$DBPNAM1= <>
$$ [...]
##$SUBNAM3= <"">
##$SUBNAM4= <"">
##$SUBNAM5= <"">
##$SUBNAM6= <"">
##$SUBNAM7= <"">
##$SUBNAM8= <"">
##$SUBNAM9= <"">
##$SW= 400.765351723535
##$SWIBOX= (0..15)
0 1 3 0 0 0 0 0 0 0 0 0 0 0 0 0 
##$SW_h= 32467.5324675325
##$TD= 32768
##$TD0= 1
##$TE= 0
##$TE2= 300
##$TE3= 300
##$TEG= 300
##$TL= (0..7)
0 120 53 12 22 120 120 120 
##$TP= (0..7)
150 150 150 150 150 150 150 150 
##$TP07= 0
##$TPNAME0= <>
##$TPNAME1= <>
##$TPNAME2= <>
##$TPNAME3= <>
##$TPNAME4= <>
##$TPNAME5= <>
##$TPNAME6= <>
##$TPNAME7= <>
##$TPOAL= (0..7)
0.5 0.5 0.5 0.5 0.5 0.5 0.5 0.5 
##$TPOFFS= (0..7)
0 0 0 0 0 0 0 0 
##$TUNHIN= 0
##$TUNHOUT= 0
##$TUNXOUT= 0
##$USERA1= <user>
##$USERA2= <user>
##$USERA3= <user>
##$USERA4= <user>
##$USERA5= <user>
##$V9= 5
##$VALIST= <valist>
##$VCLIST= <CCCCCCCCCCCCCCC>
##$VD= 0
##$VDLIST= <DDDDDDDDDDDDDDD>
##$VPLIST= <PPPPPPPPPPPPPPP>
##$VTLIST= <TTTTTTTTTTTTTTT>
##$WBST= 1024
##$WBSW= 4
##$XGAIN= (0..3)
0 0 0 0 
##$XL= 0
##$YL= 0
##$YMAX_a= 5306
##$YMIN_a= -14615
##$ZGOPTNS= <>
##$ZL1= 120
##$ZL2= 120
##$ZL3= 120
##$ZL4= 120
##$ABSF1= 197.3918
##$ABSF2= -203.3724
##$ABSG= 5
##$ABSL= 3
##$ALPHA= 0
##$AQORDER= 0
##$ASSFAC= 0
##$ASSFACI= 0
##$ASSFACX= 0
##$ASSWID= 0
##$AUNMP= <proc_1d>
##$AZFE= 0.1
##$AZFW= 0.5
##$BCFW= 0
##$BC_mod= 2
##$BYTORDP= 0
##$COROFFS= 0
##$CY= -3
##$DATMOD= 1
##$DC= 0
##$DFILT= <>
##$DTYPP= 0
##$F1P= 0
##$F2P= 0
##$FCOR= 1
##$FTSIZE= 65536
##$FT_mod= 6
##$GAMMA= 0
##$GB= 0
##$INTBC= 1
##$INTSCL= 9.790993e-09
##$ISEN= 30
##$LB= 1.5
##$LEV0= 0
##$LPBIN= 0
##$MAXI= 10000
##$MC2= 0
##$MEAN= 0
##$ME_mod= 0
##$MI= 50
##$NCOEF= 0
##$NC_proc= -9
##$NLEV= 6
##$NOISF1= 182.463
##$NOISF2= 159.3651
##$NSP= 0
##$NTH_PI= 0
##$NZP= 0
##$OFFSET= 197.3918
##$PC= 4
##$PHC0= 1396.895
##$PHC1= 116.9007
##$PH_mod= 1
##$PKNL= yes
##$PPARMOD= 0
##$PSCAL= 0
##$PSIGN= 0
##$REVERSE= no
##$SF= 81.014063255964
##$SI= 65536
##$SIGF1= 159.3651
##$SIGF2= -187.1042
##$SINO= 113.3802
##$SIOLD= 16384
##$SREGLST= <1H.CDCl3>
##$SSB= 0
##$STSI= 65536
##$STSR= 0
##$SW_p= 32467.5324675325
##$SYMM= 0
##$S_DEV= 0
##$TDeff= 32768
##$TDoff= 0
##$TI= <>
##$TILT= no
##$TM1= 0
##$TM2= 0
##$TOPLEV= 0
##$USERP1= <user>
##$USERP2= <user>
##$USERP3= <user>
##$USERP4= <user>
##$USERP5= <user>
##$WDW= 1
##$XDIM= 65536
##$YMAX_p= 483051750
##$YMIN_p= -67982231
$$ End of Bruker specific parameters
$$ ---------------------------------
##NTUPLES= NMR SPECTRUM
##VAR_NAME=  FREQUENCY,     SPECTRUM/REAL,   SPECTRUM/IMAG
##SYMBOL=    X,             R,               I
##VAR_TYPE=  INDEPENDENT,   DEPENDENT,       DEPENDENT
##VAR_FORM=  AFFN,          ASDF,            ASDF
##VAR_DIM=   65536,         65536,           65536
##UNITS=     HZ,            ARBITRARY UNITS, ARBITRARY UNITS
##FACTOR=    0.49542278885378, 1,            1
##FIRST=     15991.5117654749, 0,            0
##LAST=      -16476.0207020576, 0,           0
##MIN=       -16476.0207020576, -67982231,   0
##MAX=       15991.5117654749, 483051750,    0
$$ Real data points
##PAGE= N=1
##DATA TABLE= (X++(R..R)), XYDATA
$$ [...]
##PAGE= N=2
##DATA TABLE= (X++(I..I)), XYDATA
7360d433185O324217L462675l84943j972784k290510k740861j863653J197774
7352b701270L102729K77748m815750n729639q49477L812866K648553k018169l753853
7343a0026262j112595J562977J734098J931896M096871N405220K922762r69910
7335E545057j838412Q8192O80497j374742k776640j064781J601473J673021r47441
7326A586224l021480k024056J135942L368672K984329J631207J929264L407792
7318A0997894K680920j539495n825443o326717l851861k068096j899835q69897
7310h702530K224746N020657M749491J651216j645225k935353k142045r90405
7302b769448j105481k156096k570043k196650k411597k888029j082196L134290
$$ y = [-4433185, 1891032, 5353707, 4968764, 2995980, 705470, -2035391, -3899044, -2701270, 401459, 679207, -4136543, -9866182, -10715659, -6902793, -4254240, -6272409, -10026262, -11138857, -9575880, -7841782, -5909886, -1813015, 3592205, 6514967, 5545057, 3706645, 3794837, 4475334, 3100592, 323952, -740829, 860644, 2533665, 1586224, -1435256, -3459312, -2323370, 1045302, 4029631, 5660838, 7590102, 10997894, 13678814, 12139319, 6313876, -12841, -3864702, -5932798, -7832633, -8702530, -6477784, -1457127, 3292364, 4943580, 3298355, 363002, -1779043, -2769448, -3874929, -6031025, -8601068, -10797718, -13209315, -16097344, -17179540, -14045250]
7294a4045250N453418L064824j95353P89145M007894L121653k042131m435209
7286d281009n90062L826442K476721k650653m956423k481693J022622K164840
7278e469215Q76839j549742l713910l843802j280238J942289L273406K916638
7270f847735K744853K752229J331150j219694k442701j482907m82807j220602
7262f868214k567804k640287j602680n56385R12005L703163O308792N719329K075984
7253D483903N8333L413324R096025R524503J276162j0297336j6189556j2337244
7245a0971886k378150O616641R664443O364987K03331m380421n511185m729100
7237e121340l912758k428653J041517M701934M489855m34091n306339m829255
$$ y = [-14045250, -8591832, -5527008, -5722361, -4933216, -925322, 2196331, 154200, -4281009, -4871071, -1044629, 1432092, -1218561, -6174984, -8656677, -7634055, -5469215, -4592376, -6142118, -9856028, -13699830, -14980068, -13037779, -9764373, -6847735, -4102882, -1350653, -19503, -1239197, -3681898, -5164805, -5647612, -6868214, -9436018, -12076305, -13678985, -14235370, -13323365, -9620202, -3311410, 2407919, 4483903, 4542236, 7955560, 17051585, 26576088, 27852250, 17554914, 1365358, -10971886, -13350036, -6733395, 2931048, 9296035, 9499366, 5118945, -392240, -5121340, -9034098, -11462751, -10421234, -5719300, -1229445, -1663536, -6969875, -11799130]
7229a1799130L39189M248467K939858q41836j526673J880242M628076K729415
7221B597608j869314m313133l038677l91860J492357K204267J392236o29743j069259
7212c625518K191255N728042M156124q66775j814204K481314L541752l161666
7204H630324r141439n120492L923467N900262k4138l373745M42707M353886K708378
7195H299210n36834o60498j40146k411489m821623l634852o57321N47628N13933
7186c501992R23321N8113l586712o745622n685177k246481o76820q19708P38747
7177b1542331M416278O805530N119640l63200o676105r040100m443838L293714
7169b2430412O032724J922798j348540J838143N806839K642600m359044n405936
$$ y = [-11799130, -11459941, -7211474, -4271616, -5113452, -6640125, -4759883, -131807, 2597608, 728294, -3584839, -6623516, -7015376, -5523019, -3318752, -1926516, -2556259, -3625518, -1434263, 4293779, 8449903, 7583128, 5768924, 8250238, 11791990, 8630324, -511115, -5631607, -1708140, 4192122, 4167984, 794239, 1236946, 5590832, 8299210, 7762376, 7101878, 6961732, 4550243, -271380, -3906232, -4563553, -4015925, -3501992, -2578671, -2520558, -6107270, -12852892, -18538069, -20784550, -21461370, -22281078, -21542331, -17126053, -10320523, -5200883, -5564083, -12240188, -21280288, -25724126, -22430412, -16397688, -14474890, -15823430, -13985287, -8178448, -5535848, -9894892, -15300828]
7161a5300828p7059J683946m583031j0456771o987942K718803Q741388P682340
7153a6579154M874166N006856O023738L589004j617216m019382n46451M536917
7145A268478M468396j330303o654498o828252l860678j981778j987947k383657
7137a9290239k465778j467226J779967N426385M956817L23649k126051P75951
7129a2086525L156862K8309k801304K296489J0289516R175313j367533q675551
7121A5576n565399R70978K561639N97703l13708j038875l635407n167875k428781
7112a4004149J930399L564504K668701J527104K84753m89118J942127O725047
7104D149368P270088R09285m490826j115664N853645N017442l712378q416591
$$ y = [-15300828, -15377887, -13693941, -18276972, -28733743, -35721685, -33002882, -24261494, -16579154, -11704988, -6698132, -674394, 2914610, 1297394, -2721988, -3268439, 1268478, 5736874, 4406571, -2247927, -9076179, -12936857, -14918635, -16906582, -19290239, -21756017, -23223243, -21443276, -16016891, -11060074, -10736425, -12862476, -12086525, -8929663, -8901354, -11702658, -9406169, 883347, 10058660, 8691127, 15576, -5549823, -4578845, -2017206, -1419503, -1733211, -2772086, -6407493, -11575368, -14004149, -12073750, -8509246, -5840545, -4313441, -4028688, -4517806, -2575679, 4149368, 11419456, 12328741, 7837915, 6722251, 12575896, 17593338, 13880960, 5464369]
7096E464369k835631M707996L860169l514626p295020l149935L355113N463173
7088F055608K937203n1935j334998k262138l794108m261328k475875p24638j596923
7079g509132k956492j78851O163576R280071M973352k185635m533924n04193M977243
7070G526015P049125M544662j137469p073969r495474o747773j641285J319165
7062e657003P84867r64076j492228l05709J685585L032437K714817J401031P04002
7053A903723N80623m41913j686223k07177L925664N872922K630921j886308k262216
7044H430016O63705J886282n0492k230011k836824k605418j633266N08259J885872
7035D018123J7203l523954m654328k830534j195101q83789m7109J261107N29788
$$ y = [5464369, 2628738, 7336734, 11196903, 7682277, 387257, -2762678, 592435, 6055608, 8992811, 8940876, 7605878, 5343740, 1549632, -2711696, -5187571, -5912209, -7509132, -10465624, -10644475, -4480899, 4799172, 9772524, 7586889, 3052965, 2548772, 7526015, 14575140, 19119802, 17982333, 10908364, 1412890, -5334883, -6976168, -5657003, -4872136, -5836212, -7328440, -7634149, -5948564, -2916127, -201310, 1199721, 1903723, 2484346, 2042433, 356210, 149033, 4074697, 9947619, 12578540, 10692232, 8430016, 9093721, 10980003, 10929511, 8699500, 5862676, 3257258, 1623992, 2132251, 4018123, 4035326, 511372, -4142956, -6973490, -8168591, -9052380, -9099489, -7838382, -7308594]
7026g308594j896895k267409J62167J390991l64119j212797J643866M615305L570855
7017a666630Q90241J304130L532568K191108k982898n949629l339019O75369R00079
7008d444681j545888k071241l46300o15322m318387o749033l407220L162590O513975
6999a3821507N085839L533983M776667N373069J515993m188468o190938l925232
6991g840594j406938l0491K814364P425391R441058O145479J008852j234432j131557
6982A5191132k530363n761384o743769l042056K267684M212543J839980j191703
6974D242064j592383k36164n0305j551025k697304k693181k909960l392301j899094
6965a2779653J721760L675094J709095p48261J16230J984840L03236l415442l334726
$$ y = [-7308594, -9205489, -11472898, -11310731, -9919740, -10283859, -11496656, -9852790, -5237485, -1666630, -776389, 527741, 4060309, 6251417, 3268519, -2681110, -6020129, -5344760, -4444681, -5990569, -8061810, -8408110, -9023432, -13341819, -20090852, -23498072, -20335482, -13821507, -8735668, -5201685, -425018, 4948051, 6464044, 2275576, -3915362, -7840594, -9247532, -9278023, -6463659, 961732, 10402790, 16548269, 17557121, 16322689, 15191132, 12660769, 6899385, 155616, -2886440, -618756, 3593787, 5433767, 4242064, 2649681, 2413517, 2363212, 812187, -1885117, -4578298, -7488258, -10880559, -12779653, -11057893, -7382799, -5673704, -6421965, -6305735, -4320895, -4017659, -7433101, -10767827]
6956a0767827J285843M720312L475455M30811j136269k001615l222916l009989
6948a0226195l16346K398222K706112J302585l08054j781282k122877J69312L643194
6939d535329M655705K784700Q42517j144478n552214r402301n316627N998883
6931a1669144J2826257Q038626l10317j638247J412802l14294o019508o881571
6923d555396j251329L787810M692366M097503J925090m205985r041819l159605
6915g711365J0203879J4531617K625082j1350525j1049577m6755N748312J369865
6907D320533l428727j277068L281536K922181k176744o514349o709871l725057
6899a3307566m50671P92541k04096j376940m66655K567400N521030N800427K406475
$$ y = [-10767827, -9481984, -4761672, -1286217, -855406, -1991675, -3993290, -7216206, -10226195, -10542541, -8144319, -5438207, -4135622, -4443676, -6224958, -8347835, -8178523, -4535329, 120376, 2905076, 3747593, 2603115, -2949099, -12351400, -17668027, -11669144, 1157113, 9195739, 8885422, 7247175, 8659977, 8345683, 2326175, -4555396, -5806725, -2018915, 2673451, 6770954, 8696044, 4490059, -4551760, -7711365, 2492514, 17024131, 19649213, 8298688, -2750889, -2797644, 2950668, 4320533, 891806, -385262, 2896274, 5818455, 3641711, -2872638, -9582509, -13307566, -13758237, -12965696, -13169792, -14546732, -15013387, -12445987, -6924957, -1124530, 1281945]
6890A281945k527090m492676j295589L241531L513108j19951k292388j537122
6882d228232k052936m848550m490469J116589M968883J450893l729539k338616
6874a4151977K713805K400530k947870m364368K49331K811859q09269m148761
6866a8246720j739563K139629J990887L88298J994121M628314L636649M53476
6858d754909n39730j41076j954432m500202l281269N95333J343732j996311m029392
6849a9258256k025723P3539j133217k971780j547078K205931M805912N407225
6841a4443447N349379M876282L534266K240724K046557K002888R07470J30333
6833F644452J770046M435170M020868o03924n328861n795602k872775j041813
$$ y = [1281945, -1245145, -5737821, -7033410, -3791879, -278771, -398722, -2691110, -4228232, -6281168, -11129718, -15620187, -14503598, -9534715, -8083822, -11813361, -14151977, -11438172, -9037642, -11985512, -16349880, -16100549, -13288690, -14097959, -18246720, -19986283, -17846654, -15855767, -15467469, -13473348, -8845034, -5208385, -4754909, -5294639, -5435715, -7390147, -11890349, -15171618, -14576285, -13232553, -15228864, -19258256, -21283979, -21210440, -22343657, -25315437, -26862515, -24656584, -19850672, -14443447, -9094068, -4217786, -683520, 1557204, 3603761, 5606649, 6514119, 6644452, 8414498, 12849668, 16870536, 16266612, 10937751, 5142149, 2269374, 1227561]
6825A227561k158058l314381j442808K121671L414944J083900k242362l604037
6817d913570k657087o52054J336191K095925K17709l811525o730167n660216j431398
6808b2206192K797905N229626N850378M351132N79600l027271k665680J833382
6800g257120N463912L450432k836110p099243n071987R73211N030238M004786
6792c341881O11856p30271L07324L45927j680350k162455J516239N787774N080789
6783E734952j92328m088671l508426j793071k760923n069608m890650j414772
6775a7983497K956713O081055P290452O421520L878804R83548j301513l189071
6767E138011m467940l581842j46479K894704K160023j343158k627549J207603
$$ y = [1227561, -930497, -4244878, -5687686, -3566015, -151071, 932829, -1309533, -4913570, -7570657, -8222711, -6886520, -4790595, -4572886, -8384411, -15114578, -20774794, -22206192, -19408287, -14178661, -8328283, -3977151, -3397551, -6424822, -9090502, -7257120, -1793208, 1657224, -1178886, -8278129, -13350116, -12376905, -7346667, -3341881, -2730025, -3460296, -3152972, -2807045, -4487395, -6649850, -5133611, 654163, 5734952, 5542624, 1453953, -2054473, -3847544, -6608467, -11678075, -16568725, -17983497, -15026784, -8945729, -1655277, 4766243, 8645047, 9628595, 8327082, 5138011, 670071, -2911771, -3058250, -163546, 1996477, 653319, -1974230, -766627]
6759g66627O763983P671283K144411m077196l889934K281091O331879K693430
6751A9152320m192859o046859k104948R61337l14789k136376j356046p04731k634546
6742F22503m060414k434532j904136o648151j1698510q406006K205550R528032
6734b2795664P661162K506752K183068O292148Q483064N726275R67315j623817
6726I400303j006044N21163m6081l130858n727178m807733j060966K416660M265082
6717H24348N261062N390350L615079L41700k743281m896671n576684k786232L775728
6708C205399R060714P466554J061538k773635k243921k936572p176687r163095
6700c499705m609222J562997K679420Q2817p45597M30323j19907k353163k884862
$$ y = [-766627, 5997356, 13668639, 15813050, 11735854, 7845920, 10127011, 16458890, 19152320, 14959461, 8912602, 6807654, 7768991, 7454202, 5317826, 3961780, 3257049, 622503, -3437911, -5872443, -7776579, -14424730, -26123240, -34529246, -32323696, -22795664, -15134502, -12627750, -10444682, -4152534, 4330530, 10056805, 11024120, 9400303, 8394259, 8915422, 8869341, 5738483, 11305, -4796428, -5857394, -3440734, 824348, 6085410, 11475760, 15090839, 15432539, 12689258, 7792587, 2215903, -570329, 3205399, 12266113, 19732667, 20794205, 18020570, 15776649, 12840077, 5663390, -3499705, -8108927, -6545930, -3866510, -3783693, -4529290, -4098967, -4218874, -6572037, -9456899]
6691i456899j514076q79586o85870J346891L309952N98887n702355q298264l461069
6682b4742389M027144P957446P801172O008304K949125j405987m188644k743131
6674d336960N98059J122061j516251l077059j383869P44025O05335J28839K301422
6665d814398N346491M575861l26664m169560l636250j700399k043028k936971
6657i704918r93476J993878J661062j080531j296066J189600J401163j266427
6649h095715q57890M639764Q052738L505293l971968n668236j398064K167739
6641a626339J823458k41563k167586l564139l029512n42429P6553k827793l559185
6632a5658535K536314Q745089M874505n983214r701667j265203Q466876R585003
$$ y = [-9456899, -10970975, -11850561, -12536431, -11189540, -7879588, -7280701, -12983056, -21281320, -24742389, -20715245, -12757799, -4956627, 1051677, 4000802, 2594815, -1593829, -4336960, -3738901, -2616840, -4133091, -7210150, -8594019, -7849994, -7244659, -7115820, -4814398, 532093, 5107954, 4781290, 611730, -3024520, -4724919, -6767947, -9704918, -10698394, -8704516, -7043454, -8123985, -9420051, -8230451, -6829288, -8095715, -8953605, -4313841, 3738897, 7244190, 3272222, -2396014, -3794078, -1626339, 197119, -44444, -2212030, -5776169, -8805681, -9348110, -9271557, -12099350, -15658535, -13122221, -4377132, 497373, -5485841, -15187508, -16452711, -7985835, 1599168]
6624A599168O110396O233886Q595515O392178o98599o806005q759693p911042
6616D755804n347785j240056K393677L184533J952997J335871K057117L127152
6608A2219310L739826K571597j947123p751651q823080k600778N105986O863158
6600I377245K938178n14149n18567M66377L09864J27363R85988J599283L26195
6591A5097777k923813p086861j0275458r973706n125681J781764O299038N912570
6583f294370J809538k562140m185199k849092j309483j882088l156025k245571
6575b2674430K53644J036888k17853l05565J638705K670411J888827K325801M646238
6566h737334M719908Q61272k242848j104778O94461o85674k169842M17912M247694
$$ y = [1599168, 7709564, 13943450, 22538965, 28931143, 28232544, 21426539, 12666846, 4755804, -591981, -1832037, 561640, 3746173, 5699170, 7035041, 9092158, 12219310, 15959136, 18530733, 16583610, 8831959, 8879, -2591899, 2514087, 9377245, 12315423, 11801274, 11282707, 11749084, 12058948, 12186311, 13172299, 14771582, 15097777, 12173964, 5087103, -5188355, -15162061, -20287742, -18505978, -12206940, -6294370, -4484832, -7046972, -11232171, -14081263, -15390746, -17272834, -20428859, -22674430, -22420786, -21383898, -21601751, -21907316, -20268611, -17598200, -15709373, -13383572, -8737334, -4017426, -3156154, -5399002, -6503780, -5809319, -6494993, -8664835, -8246923, -3999229]
6557c999229M132295J235701J7685J67051j019303j821193K71062J537510k318807
6548a797228o418618k823104N399241P365074J331977l209321j703198o98278
6540b553455m342490o400894j673718M514361N279250K552478J297627M15220
6532i11621k908188n587136l312226J444624L374448K636175K451990K054705
6524g57229p78585l208351r90100L274918L132515j300187l197946L52264M251052
6515G78351L366993q33329l693867l338216j127458J052280K172466K273598K105518
6506B756336J746966K22528k287233l308308j224639J708433J836324j344174
6498A06233n032459o280876l610689K521091Q598864R573605M360408k024681
$$ y = [-3999229, 133066, 1368767, 1386452, 1553503, 534200, -1286993, -1015931, 521579, -1797228, -8215846, -11038950, -5639709, 1725365, 3057342, -151979, -1855177, -2553455, -6895945, -13296839, -14970557, -10456196, -5176946, -2624468, -1326841, -911621, -3819809, -9406945, -12719171, -11274547, -7900099, -5263924, -2811934, -757229, -1535814, -4744165, -5734265, -2459347, 673168, -627019, -3824965, -3472701, 778351, 4145344, 3312015, -381852, -3720068, -4847526, -3795246, -1622780, 650818, 2756336, 4503302, 4725830, 2438597, -869711, -2094350, -385917, 1450407, 106233, -4926226, -11207102, -14817791, -12296700, -3697836, 5875769, 10236177, 8211496]
6490H211496m468979l557144k312206k33193M579507R382114Q716533K364081
6482B2682209l627155m707571k624701j514317k624893m150619l924908j570954
6474b062909M44853j371377o449288q437339k316532P653558J1646124O285084
6466E392174j406527l322262L82137L375518J660419k649987m810663k732649
6458d111840J223734L278584K665862J752380J509055l17983m633971p796847
6450f431026o525714l303850k296303k103346J605479P336312Q338125K658726
6442g21597l614452n031287l158259j912015j702364j326012j215822j291225
6434a9973033O90973N020003P453216M516058j091751l964504k889103r64044
$$ y = [8211496, 3742517, 185373, -2126833, -2360026, 2219481, 11601595, 20318128, 22682209, 19055054, 14347483, 11722782, 10208465, 7583572, 3432953, -491955, -2062909, -1618056, -2989433, -9438721, -17876060, -20192592, -12539034, -892910, 5392174, 3985647, 663385, 1045522, 4421040, 6081459, 3431472, -1379191, -4111840, -2888106, 390478, 3056340, 4808720, 6317775, 5999792, 1365821, -6431026, -12956740, -16260590, -18556893, -20660239, -19054760, -11718448, -3380323, -721597, -4336049, -9367336, -12525595, -14437610, -16139974, -17465986, -18681808, -19973033, -19282060, -14262057, -6808841, -2292783, -3384534, -7349038, -10238141, -11202185]
6426a1202185n19822j164674j723680j269287R63381M423919O815597O542965
6418B866214M568955K585394R46117l46938p37624p27801k034630m402110m906801
6409b189224k532629m99606j315964k475312n56264K976574M072519K166384k34811
6400e88333k285871m490839m929061j081348M593949O034453J641634l299070
6392d404486l755841q31223J218088O61665j014321j736912m37906K169796L385292
6383d745848J162148k335596k578758P71982K422123j117947n553867l867948
6375a5843711L975124J0089001P742015j241323r025548j0038637n643965j406025
6367b1393069r06707k697084k989821k46932L779353O658675P179369N037876
$$ y = [-11202185, -11722007, -12886681, -14610361, -15879648, -14916267, -10492348, -3676751, 2866214, 7435169, 10020563, 10966680, 10619742, 9882118, 9154317, 7119687, 2717577, -2189224, -4721853, -5221459, -6537423, -9012735, -9568999, -6592425, -2519906, -353522, -588333, -2874204, -7365043, -12294104, -13375452, -8781503, -2747050, -1105416, -4404486, -8160327, -8991550, -7773462, -7111797, -8126118, -9863030, -10300936, -8131140, -4745848, -3583700, -5919296, -8498054, -7726072, -5303949, -6421896, -11975763, -15843711, -11868587, -1779586, 5962429, 4721106, -4304442, -14343079, -19987044, -21393069, -22299776, -24996860, -27986681, -28233613, -24454260, -17795585, -10616216, -5578340]
6359e578340J047275j912296q15324L299875N506339L247616o6002l94591M83615
6350D818167j960613o826597p888821k540837M281221P136107O638451N898342
6342I555420M413691K28269m293989m413167k77057K805154J946140n1285k45905
6333I667271J19106r14689k216019k280336k490134m117476m706193j516432L179891
6324e275011M512095J827104j008126j732158j988930l239769m378945m425160
6316a5708900m135833l673303j693995J898937N025831O448478O934737O305181
6308A401133K708621l219941o861029n217095j439535n07858k414122l220553
6300a8770379j472515M60382J111819K057098M442175O473625N915073L050906
$$ y = [-5578340, -4531065, -6443361, -7258685, -3958810, 1547529, 4795145, 4729143, 4334552, 4818167, 2857554, -3969043, -11857864, -14398701, -10117480, -2981373, 3657078, 9555420, 13969111, 14197380, 9903391, 5490224, 5213167, 8018321, 9964461, 9913176, 9667271, 9786377, 8871688, 6655669, 4375333, 1885199, -2232277, -6938470, -8454902, -5275011, -762916, 1064188, 56062, -1676096, -3665026, -6904795, -11283740, -15708900, -19844733, -23518036, -25212031, -23313094, -18287263, -11838785, -4904048, 1401133, 4109754, 889813, -5971216, -11188311, -12627846, -13135704, -15549826, -18770379, -20242894, -19782512, -18670693, -16613595, -12171420, -5697795, 217278, 3268184]
6292C268184k61740k856499m078838k895460M89859K726966k1587o359592r169265
6283a9157972l692745N222321P902993K104989m120019l773808l1106M32884j380014
6274a6492477L71370M689977M087477k378621n637633k90756O159505M135986
6266e355172l884170p751898m450479l02196K37868N6352K684933O451899P589242
6257d723621N190061J332901j102190k41411K616158K996520j571379p077037
6249b579998p398919k614357J240685O18057j828677k508040j381008L2095J156172
6240a5263990J467738N56391R2191K133991M717352L397345j608462m517828k164279
6231a1189551J659463K584186J494241N30257j752802o224115q264274l398393
$$ y = [3268184, 3006444, 149945, -3928893, -6824353, -6334494, -3607528, -3629115, -9988707, -19157972, -22850717, -17628396, -9725403, -7620414, -11740433, -15514241, -15545347, -15112463, -16492477, -16121107, -11431130, -7343653, -9722274, -15359907, -15650663, -9491158, -5355172, -9239342, -16991240, -21441719, -21743915, -21506047, -21449695, -18764762, -12312863, -4723621, 466440, 1799341, 697151, 455740, 3071898, 6068418, 4497039, -2579998, -9978917, -12593274, -11352589, -10734532, -12563209, -15071249, -16452257, -16420162, -15263990, -13796252, -13239861, -13147670, -11013679, -6296327, -2898982, -4507444, -9025272, -11189551, -9530088, -6945902, -5451661, -4921404, -6674206, -12898321, -21162595, -24560988]
6223b4560988M354040O341020R64197m616997m934052k285198m94033J484267
6215b3747744N539415Q214703M531149l091835n660379Q41853R163492R655455
6207E446109K723236k465622j007564J830795j86163m640283m924524p24118K398464
6198a549670K461405L030915N031333L746187k884672q933507q138502k726261
6190i962772M56178l08129r95817P26709K738201K922573K095448J891251K586379
6181B150021L209722J881601k903182q990916j0463073m430517L628858N794821
6173a0122665J990269q21357N93234K033236L84978p64713K027623M968874K493775
6164B783254l402058n541591k017672J821011K071471J035097J370733R41605
$$ y = [-24560988, -20206948, -13865928, -12901731, -17518728, -22452780, -24737978, -25232011, -23747744, -18208329, -9993626, -5462477, -8554312, -14214691, -13372838, -4209346, 5446109, 8169345, 5703723, 4696159, 6526954, 6340791, 1700508, -3224016, -3948134, -1549670, 911735, 3942650, 8973983, 12720170, 9835498, 901991, -7236511, -9962772, -9506594, -9814723, -10810540, -10083831, -7345630, -4423057, -2327609, -436358, 2150021, 5359743, 7241344, 4338162, -4652754, -15115827, -19546344, -15917486, -10122665, -8132396, -8953753, -8360519, -6327283, -5942305, -6707018, -4679395, 289479, 2783254, -618804, -6160395, -8178067, -6357056, -4285585, -3250488, -1879755, -938150]
6156i38150k541540n550951k799887M036040P018787K285290m603275n838374
6148h932060q37469M279180M766497J684770j027605j018137J211121L378850
6140C505147L188780L78794k665665l306145j489524P75958K051648K064193N72254
6131E075440k096299l839853k704725j3537J003802j92475j063333m86564l11926
6122d629470j475903k028501p15086P19211R03781J328691K775999K345745k288376
6113c063909p794806q413077l344038K578940N083060M217603K317632J250481
6105g168114J788407L237355L526952J530524j091249k190466k310400l160228
6097e837219l938081k339884J093704K938642J592443q26977j816562j088979
$$ y = [-938150, -3479690, -9030641, -11830528, -7794488, -775701, 1509589, -3093686, -8932060, -9769529, -5490349, -723852, 960918, -66687, -1084824, 126297, 3505147, 6693927, 7072721, 4407056, 1100911, -388613, 387345, 2438993, 4503186, 5075440, 2979141, -860712, -3565437, -3578974, -2575172, -2767647, -3830980, -4317544, -4629470, -6105373, -8133874, -8848960, -8129749, -7225968, -5897277, -3121278, -775533, -3063909, -10858715, -19271792, -22615830, -20036890, -14953830, -10736227, -8418595, -7168114, -5379707, -2142352, 1384600, 2915124, 1823875, -366591, -2676991, -5837219, -9775300, -12115184, -11021480, -8082838, -6490395, -7317372, -9133934, -10222913]
6089a0222913P20534L240733N307500N183315L084471J473394J589949J475245
6081A1852228j184791n606243q599051p892311m010055L62712K427924J526864
6073a1122723l94840j228431j108616j139339o66278J715210M714860N015832
6065d214325K130522m58932m64037m9905j523026k546514N02120N783521P164160
6056F323584K650613k595415l751887l142545n671105r732002q219894P56249
6048b3382402R422133R647429L001432k464931k732477k46244K272406M335113
6040a47541M172831o16060p033449p590860p19812N266047L231840k630787l610624
6031i678415M41440K201710p41143k535125R75305N818412O303860K963159M64582
$$ y = [-10222913, -9502379, -6261646, -954146, 4229169, 7313640, 8787034, 10376983, 11852228, 10667437, 5061194, -3537857, -11430168, -15440223, -15077511, -12649587, -11122723, -11517563, -12745994, -13854610, -14993949, -15660227, -13945017, -9230157, -4214325, -2083803, -2542735, -3006772, -3056677, -4579703, -7126217, -6624097, -840576, 6323584, 8974197, 6378782, 2626895, -515650, -6186755, -15918757, -24138651, -23382402, -13960269, -4312840, -1311408, -3776339, -6508816, -6755060, -4482654, -147541, 4025290, 3409230, -3624219, -11215079, -11934891, -6668844, -3437004, -6067791, -9678415, -9236975, -7035265, -7776408, -10311533, -9336228, -3517816, 2786044, 5749203, 6213785]
6022F213785N34122O08717j418332l984222m148032j924608o89490k355461l797003
6013a0960524j142533L111583K273774m039042p536839k974164L612238M027484
6005a3628023J28637o28346J943593J452985l018399m925220j048716L990962
5997a5732527N623880M452155J876771k224670n498531l863648J348227L705407
5989a0312936J391631m34734O12466P7832l875542n189791J76018O113778M972858
5980f468420j070487m110238j889335J417605K715740K455115J855516K138692
5972b955812M048093N007285Q53141o316928p712064r6863P478921N577455k365345
5963C517883o075501l151375M99496J485429J528069J218842o40977k434928j544547
$$ y = [6213785, 6747907, 7356624, 5938292, 1954070, -2193962, -4118570, -4808060, -7163521, -10960524, -12103057, -8991474, -6717700, -10756742, -18293581, -21267745, -17655507, -13628023, -13499386, -14127732, -12184139, -10731154, -13749553, -18674773, -19723489, -15732527, -10108647, -5656492, -3779721, -6004391, -11502922, -15366570, -14018343, -10312936, -8921305, -9356039, -8743573, -8665741, -12541283, -17731074, -17555056, -11441278, -6468420, -7538907, -11649145, -13538480, -12120875, -9405135, -6950020, -5094504, -2955812, 1092281, 6099566, 6952707, 635779, -7076285, -7173148, 305773, 5883228, 3517883, -2557618, -5708993, -5209497, -3724068, -2195999, -977157, -1618134, -4053062, -5597609]
5954e597609K90098k13363j525625l74471J197818p10686l664829k467212R65124
5945a2100755M53963k853042j676709M490005P803156M794089Q57405k08070j446192
5936A13850m334482m565920o08874K054065J50097j732261J37333J794510p08822
5927g700504l659974k145897J852270M240486N988643Q705807Q480692K024925
5919A7786448n218418n417051o2146K642530J59599k604543k885608l278647m836200
5910c714036m500108j400257N60296q57393k188985K74451M741973O694522M728353
5901D338816R08281k641319m829592m679974k012802J275721K664164J925001
5893c051704J119357J372259J190911r50198l612457l990283k123408r75429j747975
$$ y = [-5597609, -5307511, -5520874, -7046499, -7420970, -6223152, -6933838, -10598667, -13065879, -12100755, -11646792, -14499834, -16176543, -11686538, -3883382, 910707, 1768112, 1560042, 113850, -4220632, -8786552, -9395426, -7341361, -7191264, -8923525, -8786192, -6991682, -7700504, -11360478, -13506375, -11654105, -7413619, -1424976, 7280831, 15761523, 17786448, 12568030, 7150979, 7088833, 9731363, 9890962, 7286419, 4400811, 1122164, -3714036, -8214144, -9614401, -9054105, -9911498, -12100483, -11826032, -7084059, -389537, 4338816, 5247097, 2605778, -2223814, -6903788, -8916590, -7640869, -4976705, -3051704, -1932347, -560088, 630823, -319375, -3931832, -7922115, -10045523, -11020952, -12768927]
5884a2768927k020401k14846J127453m93370k676615j430108K427289M681204
5876a1368321M343392L863875L435980Q04700l047564m186308k842900l719468
5868a2716614o903200n448978L668348J2458594J1933477M738533P67159K817688
5860A1315007M140674l9204n670709o759122l945901k488985m146760m960279
5852a2555279j326980M448368O742746L896027J36293m70002J132728K297264
5844D301165L365577N075075M368712j327989p424231o718214l22862L286770
5836D604003Q36577j984631j169817m05718k827761m829407l225740j437724k612162
5827a3052380l044299R35333N293127M676826J441610Q05124J487931p35294l837505
$$ y = [-12768927, -14789328, -15004174, -13876721, -14370091, -17046706, -18476814, -16049525, -11368321, -7024929, -3161054, 274926, 1079626, -1967938, -6154246, -8997146, -12716614, -19619814, -25068792, -21400444, -8941850, 2991627, 7730160, 8497319, 11315007, 15455681, 15416477, 9745768, 2986646, -959255, -3448240, -7595000, -12555279, -13882259, -9433891, -2691145, 1204882, 1341175, 871173, 2003901, 4301165, 7666742, 12741817, 17110529, 15782540, 8358309, 1640095, 1317233, 4604003, 5440580, 3455949, 2286132, 1880414, -947347, -5776754, -9002494, -10440218, -13052380, -16096679, -15161346, -9868219, -5191393, -3749783, -2944659, -1456728, -2192022, -6029527]
5818f029527k537654J817650K761012j046030m524936m349509j808276J435083
5810a4282187M247136M197443R25236p87535K314719N209459K100751k652545
5802A272477o34314O005827P179326J561743j326534K515587N102290N82557m968958
5793A7290001m111430K13842M99015l950861p824687p448101k712644M311849
5785c733016Q782610N903947j949520o071410l004955N60747j332682m726277
5777e570556l347084O47417J119080j173539m74580L407105M561763Q56958k635690
5768b609126j480803K074857L010255K04222k881609k781129P2187K186981J726437
5759d77728J045267K569452L795365P36806m230478m111211J708611N057144J217908
$$ y = [-6029527, -8567181, -6749531, -3988519, -5034549, -9559485, -13908994, -15717270, -14282187, -10035051, -5837608, -4912372, -5699907, -3385188, 1824271, 3925022, 1272477, 638163, 6643990, 13823316, 15385059, 14058525, 16574112, 21676402, 22258959, 17290001, 13178571, 13392413, 13891428, 9940567, 2115880, -5332221, -8044865, -3733016, 5049594, 10953541, 9004021, 2932611, -72344, 488403, -844279, -5570556, -8917640, -8270223, -7151143, -8324682, -8799262, -5392157, -830394, 26564, -2609126, -4089929, -2015072, 995183, 1199405, -1682204, -4463333, -4391146, -2204165, -477728, 567539, 3136991, 6932356, 7669162, 3438684, -672527, 1036084, 6093228, 7311136]
5750G311136l118476j72310O013420N073396l790728r920475n850446L087130
5742a367353O497751J787549m123566m148551Q35157L987227J681132j684335
5734C465011j69851M333393M042958l086385r349388p545353k49770N052873N926942
5725B420430N341033N172747M510119K819653M80212k742045o376528p861580
5717C764041n570223j585421J291148L160944M936227N331459L105017l45753
5709A4087439l533833o740812q510763n067461K559385O287423J926865k908328
5701a900085L11251O903883N723127k820496p039137k280754K757442R30394k830957
5692b45332j288526L327330M111796L38553l036570l140371j052674J539587L302023
$$ y = [7311136, 4192660, 4020350, 10033770, 15107166, 11316438, 1395963, -4454483, -1367353, 5130398, 6917947, 2794381, -1354170, -519013, 3468214, 5149346, 3465011, 3295160, 7628553, 11671511, 8585126, -764262, -8309615, -8559385, -3506512, 2420430, 7761463, 12934210, 17444329, 20263982, 20744194, 18002149, 11625621, 3764041, -1806182, -3391603, -2100455, 1060489, 5996716, 11328175, 14433192, 14087439, 10553606, 3812794, -4697969, -9765430, -7206045, -918622, 1008243, -1900085, -1588834, 5315049, 11038176, 8217680, 1178543, -1102211, 1655231, 2585625, -245332, -1533858, 1793472, 5905268, 6243821, 3207251, 66880, -985794, 553793, 3855816]
5683C855816K981447J312223Q29212J415107o36033o310670j0379872q031240
5675a4964010j946249J428329M40626j067101r8751K347607L761239K717046m56006
5666g837270l411899l150599N17476M196935N086001L820126J556620k454879
5658a677489p306617p861681q11060Q393087J0276696L289497l830618l012616
5650b540801L713307P797871M439371l057272p756460o092239q60369K034624
5642b321968J13235k878294j929648K355588M520572J998884j236870m67265L136787
5633C291021M565691K079254j079525j826581r43209p54767j543094j838741q59234
5624A090815P76057J843714J012739k281914o237161p278569m044168K86288J791097
$$ y = [3855816, 6837263, 8149486, 8978698, 10393805, 9757772, 3447102, -6932770, -14964010, -16910259, -15481930, -15041304, -16108405, -16207156, -13859549, -10098310, -7381264, -7837270, -11249169, -14399768, -13882292, -9685357, -4599356, -779230, 777390, -1677489, -8984106, -16845787, -17656847, -9263760, 1012936, 4302433, 471815, -2540801, 1172506, 8970377, 13409748, 10352476, 2596016, -3496223, -4356592, -2321968, -2208733, -5087027, -7016675, -4661087, -140515, 1858369, 621499, 154234, 3291021, 7856712, 9935966, 8856441, 7029860, 6086651, 5331884, 3788790, 1950049, 1090815, 1866872, 3710586, 4723325, 2441411, -3795750, -11074319, -15118487, -14832199, -13041102]
5615a3041102J043647J728902M328071M794678Q15322l837596l877294M34509
5607g610863L783602K738750o25794k501002k327855k217022k422701o0217O236657
5598e006445J2085743J1004889K719309n493233p502156m988193k586735l79507
5590a46328L505604O030768K707968k919365j959650N995546J0345958M513135
5582B8073636m599777p601211n603979n018855n684641l211372Q96201J051286
5574a698712k268824l134143l77100J196601J37507P68651M728569P347376M929594
5565A1629519j06574l569984m074791j786548K416103N130614K853122k213197
5557A0278264l645645L65153M493613M108364P26034k042905l154564k868861
$$ y = [-13041102, -11997455, -10268553, -5940482, -1145804, -330482, -4168078, -8045372, -7610863, -3827261, -1088511, -1714305, -4215307, -6543162, -8760184, -11182885, -11243102, -5006445, 7079298, 18084187, 20803496, 15310263, 7808107, 2819914, 233179, -146328, 3359276, 9390044, 12098012, 9178647, 7218997, 13214543, 23560501, 28073636, 23473859, 15872648, 10268669, 5249814, -434827, -3646199, -2749998, -1698712, -3967536, -7101679, -7478779, -6282178, -6144671, -5376020, -647451, 6699925, 11629519, 11522945, 7952961, 3878170, 2091622, 4507725, 9638339, 12491461, 10278264, 6632619, 6997772, 11491385, 15599749, 16325783, 14282878, 11128314, 8259453]
5549H259453j402023o04457k597743n374538m400848K86553L699130L595513K752394
5540D213434K431587L75672k738018k275134J821428K982604j379520m646131
5532G85922j545845L202612L050157r8507r18065k58541j731806l328534r90199
5523a832806K636764J499973l671889o242358l530554J139829M949312P289507
5515B237778O243471N70949n374493n758960k182542j642570n467811p406682
5507a8780860l830465J022427K156276L75135p86661L733K297552N213239O462784
5498e866840L701163j466458m170340k370316Q38622J991662J039147o10897k429200
5489i343457l727028l115343m87574K326936L553707K704636M13146j152294P33136
$$ y = [8259453, 6857430, 6252973, 3655230, -1719308, -6120156, -5833603, -2134473, 1461040, 4213434, 6645021, 7020693, 4282675, 2007541, 3828969, 6811573, 5432053, 785922, -759923, 2442689, 5492846, 5394339, 4476274, 4217733, 2485927, -842607, -1832806, 803958, 2303931, -1367958, -7610316, -11140870, -10001041, -5051729, 2237778, 8481249, 9052198, 3677705, -2081255, -4263797, -5906367, -11374178, -18780860, -22611325, -21588898, -19432622, -19057487, -19844148, -19840415, -17542863, -12329624, -5866840, -2165677, -3632135, -7802475, -10172791, -9334169, -7342507, -6303360, -6914257, -9343457, -13070485, -16185828, -16673402, -14346466, -10792759, -8088123, -7674977, -8827271, -8094135]
5480h094135N294285P255222L524505j470469j909116L19762j076258n936755
5472b092959p676762m235857j075156j649976k602696j213381j86536j047814
5464b1781137K57391N897644J0179030P207539J04511l708747k941012j673580
5456f458361r24193J763360N231398M495476j039919n037156k620167K748054
5448a841508M046798K6126l658625k251041J924383K479399k869894r147022r875390
5439b1166774m504888J627014L879142K545562O34200m7299L23111R32791J332742
5430a4444399J767951K656354L253712J992443n22296q08757K495276M965627
5422A355911J932110l704385m729650o10395J151284l531638q790239p399350
$$ y = [-8094135, -2799850, 4455372, 7979877, 6509408, 4600292, 4920054, 3843796, -2092959, -9769721, -14005578, -15080734, -16730710, -19333406, -20546787, -20733323, -21781137, -21523746, -15626102, -5447072, 1760467, 1864978, -1843769, -4784781, -6458361, -7382554, -5619194, -387796, 4107680, 3067761, -1969395, -4589562, -1841508, 2205290, 2231416, -1427209, -3678250, -1753867, 725532, -2144362, -11291384, -21166774, -25671662, -24044648, -20165506, -17619944, -16985744, -17033043, -16709932, -15777141, -14444399, -12676448, -10020094, -6766382, -4773939, -5296235, -6104992, -3609716, 1355911, 3288021, -416364, -5146014, -5756409, -4605125, -8136763, -16927002, -24326352]
5414b4326352q22705M054923M495561L085252J848431M77884n81386J0139J481518
5405a0276735J411150n08108k013428j827509j091045p11639M51073L521615O925408
5396d119218P252300L167322k213907m167121j962130J59810j022958l012152
5388e918054j712824J854058L281083J962594J245201J602744l06773m598917
5380b590888o334958l259940J91224k02082k578490l435443l003970k390943j96019
5371b3801509L729048N712394L946097K193564L198159L491969K81521j991235
5363c239992R38324M223783J034381n173754n141184J727429P362366Q344817
5355A0076170Q688911R037059M251011n439948j1199789q151160k608382j623917
$$ y = [-24326352, -25149057, -21094134, -16598573, -13513321, -11664890, -11187006, -11768392, -11758253, -10276735, -8865585, -9373693, -11387121, -13214630, -14305675, -15017314, -14566241, -11044626, -4119218, 3133082, 6300404, 4086497, -80624, -2042754, -1882944, -2905902, -5918054, -7630878, -5776820, -2495737, -533143, 712058, 2314802, 2008029, -2590888, -8925846, -12185786, -11994562, -12196644, -14775134, -18210577, -21214547, -23605490, -23801509, -20072461, -14360067, -10413970, -8220406, -5022247, -1530278, -1248757, -3239992, -2301668, 1922115, 2956496, -2217258, -7358442, -5631013, 1731353, 10076170, 18765081, 27802140, 32053151, 26613203, 15413414, 7262254, 4653872, 3029955]
5347C029955l035571j811890N98380K73786j050933P55581M188209M213421M58370
5338G619308k657673k818076j803379j308953r27815R1744J976427M325911M855139
5329I352633P15481o250017q820501k994478N451682P660655K855598k127552
5321E843501k788749r29743O47367J707048K139231Q64274j347355j791109m7580
5312D296885Q85795r03550l303415l189523m16451K307502K288838n89305l102062
5303a725286j470442L428628N616660J767437k898530j253126M789498O354043
5295A4608882P88267m384442l038844Q85932P06076k644322l464411p96742J190136
5286C850532L89823j468152l241485n172957n681356k698680J411788J474644
$$ y = [3029955, -5616, -1817506, -1219126, -945340, -1996273, -1240692, 2947517, 7160938, 7619308, 4961635, 2143559, 340180, -968773, -1896588, -1804844, 171583, 4497494, 9352633, 10068114, 3818097, -5002404, -7996882, -2545200, 5115455, 7971053, 5843501, 3054752, 2125009, 2772376, 4479424, 6618655, 7482929, 6135574, 4344465, 4296885, 5182680, 4279130, 975715, -2213808, -2630259, -322757, 1966081, 1376776, -1725286, -3195728, 232900, 5849560, 7616997, 4718467, 3465341, 8254839, 14608882, 15397149, 11012707, 7973863, 8859795, 9565871, 6921549, 3457138, 2660396, 3850532, 4240355, 2772203, -469282, -5642239, -11323595, -14022275, -12610487, -11135843]
5278a1135843k650234m599515p5267P135013J0484873Q736200N379190K458922
5270A5733339q80755m387525n288035k319105J217376Q19249l173978n192399
5262c471833j508847L837682L317352l653624q548743m654989L350899N536977
5254e795126M45450l542224q96857L567431K890533j610258k933249J431818O763321
5245C20839P731460M140735Q15r55899J186614K682451Q17434j679297k4959M231280
5235A8451473L320660n137511j2009578q082613K162932N942746j89177o586092
5227b127160n387382p12798j37924k852149k372105K846893P759444Q272143N290353
5218A0579315J429247k098852m670913n572660n227728m865938m104268j051861
$$ y = [-11135843, -13786077, -18385592, -18460859, -11325846, -840973, 7895227, 13274417, 15733339, 14852584, 10465059, 5177024, 2857919, 4075295, 4894544, 1720566, -3471833, -4980680, -1142998, 2174354, -1479270, -10028013, -14683002, -11332103, -5795126, -5349676, -8891900, -9788757, -6221326, -3330793, -4941051, -7874300, -6442482, 320839, 8052299, 12193034, 12193849, 11237950, 12424564, 15107015, 15924449, 14245152, 14220193, 18451473, 21772133, 16634622, 4625044, -3457569, -1294637, 4648109, 4458932, -2127160, -7514542, -8227340, -8365264, -11217413, -13589518, -10742625, -2983181, 5288962, 10579315, 12008562, 9909710, 5238797, -333863, -5561591, -10427529, -14531797, -15583658]
5210a5583658L873360O385614L142340k809594m601313k65067M234163K908088
5202b716067k019717l582015o8409L592692M298325M575539O121608N769149J770203
5193A7741308j437822j27149J675896j463545o653931o818825k209986L68890
5185A074836j162875k046716n4714J437637J104998K153122M811618M404867K43558
5176A1966331j368528K539993N507405J401611n858308q472698n718734k569119
5168b572047j371230r56472q64727q07178J378564O041427Q548096M779891k453359
5159A1722965o897858o343600k788828J598411M487074L138215j049193j739179
5151B128007L279798O705308J950584n620062n888035P67207M645378J680094
$$ y = [-15583658, -11710298, -5324684, -2182344, -4991938, -9593251, -9858318, -5624155, -2716067, -4735784, -8317799, -8386208, -4793516, -495191, 4080348, 10201956, 15971105, 17741308, 16303486, 16176337, 17852233, 16388688, 9734757, 2915932, 705946, 1074836, -88039, -2134755, -2189469, -751832, 353166, 2506288, 7317906, 11722773, 11966331, 10597803, 13137796, 18645201, 20046812, 14188504, 5715806, -2928, -2572047, -3943277, -4899749, -5764476, -6571654, -5193090, 848337, 9396433, 14176324, 11722965, 4825107, -1518493, -4307321, -2708910, 1778164, 4916379, 3867186, 2128007, 5407805, 12113113, 14063697, 8443635, 2555600, 3322807, 7968185, 9648279]
5143I648279k262035k301848p16575l70895O4535J546096J836986J71776o30461
5134F985858P25104J545462M1666j664348j431009r7599Q97845J147112l24680
5125G825411m083128p056628n080723L32082K855253M40052j696064P14348M892048
5116h57349O005143L764624P08455k319973n295031o365884l813354O53831L265018
5107d254520K320566l63082j508918N18218L845221M756816K289104k68022j86568
5098G148815P03913k64447j589753n67619J173711L92425j465626p45548J086276
5089E872147n48304m632555n283253j601579P77694n98857j249069J711875M135515
5080a416386J526962m036050o899759l991353L426573J0114542R146039n18742
$$ y = [9648279, 7386244, 5084396, 4367821, 3996926, 4061461, 5607557, 7444543, 7616319, 6985858, 7710962, 9256424, 9298090, 7633742, 6202733, 6105134, 7002979, 8150091, 7825411, 3742283, -3314345, -8395068, -8062986, -5207733, -4767681, -6463745, -5749397, -857349, 5147794, 8912418, 9620873, 7300900, 2005869, -4360015, -8173369, -7519538, -4254520, -1933954, -2297036, -3805954, -3287736, 557485, 5314301, 7603405, 7335383, 7148815, 7852728, 7588281, 5998528, 5430909, 6604620, 6997045, 5531419, 4785871, 5872147, 5323843, 691288, -4591965, -6193544, -5415850, -6014707, -7263776, -5551901, -1416386, 110576, -3925474, -10825233, -14816586, -11390013, -1275471, 7870568, 7351826]
5072G351826r256929o817964L071951O946578J036474m111795j088511L794267
5064I25897K840582p85477p90608J082445K9642k718775l807040m439223n590129
5055a3252686l109552M322403Q930652M538774k451163k394083K726064M138647
5047C449056J250006L62812J761325M0061m123317m147060M29337K797198O26638
5038B446056r84650L24206N48406k138983m034478l463128l386377l894929m25489
5029a5009366O973132J0353590M623437m409962p457303k693771M465512Q312623
5021E157892O202096r37266p933123q593760k732540K864613K780906r59018l369529
5012g519729l335793k850380k463362j106737J212112L431266N039928N619116
$$ y = [7351826, -1905103, -8723067, -5651116, 1295462, 2331936, -1779859, -2868370, 925897, 3766479, 2981002, 2190394, 3272839, 3302481, 583706, -3223334, -7662557, -13252686, -16362238, -12039835, -3109183, 1429591, -1021572, -3415655, -689591, 3449056, 4699062, 5061874, 6823199, 6863260, 2739943, -1407117, -977780, 1819418, 2446056, 1461406, 1785612, 2334018, 195035, -3839443, -7302571, -10688948, -14583877, -15009366, -8036234, 2317356, 6940793, 2530831, -4926472, -7620243, -3154731, 5157892, 11359988, 10422722, 2489599, -6104161, -8836701, -5972088, -3191182, -4150200, -7519729, -10855522, -13705902, -16169264, -17276001, -16063889, -12632623, -7592695, -1973579]
5004a973579M109794O32282j998546q22946L259216N684072L157460k217638m848418
4995D981697k176588J985376K450457j63304p65974J758617K363400j843243o034610
4986B555828m442996J092660M180710K744258j98321k533531m459748n037870
4978f099010k655598J135644K712280J509463L93595R99824K172331K943459L735701
4969F847689M403320L763341J322226k124504n035731n379112k323696J222247
4961B695780Q37848k941298m174404M1195M949008N223157K328530Q38288J543470
4952A1341574K531743L245017L267468J008564k630349l885949k803531m106159
4944G968378p568688n684502L264786Q968465M105098l502143l916682j234716
$$ y = [-1973579, 2136215, 2768497, 769951, -52995, 3206221, 8890293, 12047753, 9830115, 4981697, 2805109, 4790485, 7240942, 7077638, 6311664, 8070281, 10433681, 8590438, 2555828, -1887168, -794508, 3386202, 6130460, 5932139, 3398608, -1061140, -6099010, -8754608, -7618964, -4906684, -3397221, -3003626, -2003802, 168529, 3111988, 6847689, 11251009, 15014350, 16336576, 14212072, 9176341, 3797229, 1473533, 2695780, 3533628, 592330, -3582074, -3540879, 1408129, 6631286, 8959816, 9798104, 11341574, 13873317, 17118334, 20385802, 21394366, 18764017, 14878068, 12074537, 7968378, 399690, -5284812, -2020026, 6948439, 11053537, 7551394, 3634712, 2399996]
4936B399996m064191q098566l639510N323059O546587Q78375N94434P056251P826262
4927A4822697j478271r091858n912460J648020L717038N33817j883351p83946
4919A571686K993004O651257N633135q30209n269620j460524M472628L175905
4911A6937262j422282J543881R927110J0961589K480484m955768o906773q647486
4903A9918017r812719m267931L560240K224094m762059j761354J0920108J4794060
4895C0812456M386431l327169J487634O623828K481036k057041J87558J553649
4887D2148382j658881r4888P738217R499877M238908O344086J4409161R142307
4879I1767169n824823j454098K1772289K6134714J0214952K8764782R0048380
$$ y = [2399996, -1664195, -9762761, -13402271, -8079212, -1532625, -654250, -59816, 6996435, 14822697, 13344426, 4252568, -1659892, -11872, 3705166, 4238983, 2355632, 1571686, 4564690, 11215947, 16849082, 16018873, 10749253, 9288729, 13761357, 16937262, 15514980, 17058861, 26985971, 37947560, 40428044, 35472276, 28565503, 19918017, 10105298, 5837367, 9397607, 11621701, 6859642, 5098288, 16018396, 30812456, 35198887, 31871718, 33359352, 39983180, 42464216, 40407175, 40594733, 42148382, 40489501, 40394613, 48132830, 57632707, 61871615, 68215701, 82624862, 91767169, 85942346, 84488248, 106260537, 132395251, 142610203, 171374985, 261423365]
4872B61423365R7145053k5915130j91071273k30658517j15159571J3779017L9830540
4865a50626516K133906o776909J9701916L0262794J7254770J2992023J9212143
4858e5845873J0044955j0707229j3451113L586075J3148047P287276M543983J0612898
4850c0780981J0231572m94764p346144n955924o921918j0879396o205798N752282
4842e2601071R476478K891550J328092R348117J2507574L648832m746863k759029
4834b0906320J905814L13158k965818j267407J830471J047561p23411O83473K844317
4825a7238162K362597P69317P0742n16054l26967K816470O308722M294508k632700
4816d091527p107509n675499j890979J679493N636056P506877L231700l802175
$$ y = [261423365, 358568418, 332653288, 141582015, -89076502, -204236073, -190457056, -150626516, -148492610, -155269519, -135567603, -105304809, -88050039, -75058016, -55845873, -45800918, -56508147, -69959260, -66373185, -53225138, -45937862, -41393879, -30780981, -20549409, -21044173, -28390317, -34346241, -41268159, -52147555, -58353353, -52601071, -43124593, -40233043, -38904951, -29556834, -17049260, -13400428, -18147291, -20906320, -19000506, -18687348, -21653166, -22920573, -21090102, -20042541, -20765952, -20082479, -17238162, -14875565, -14106248, -14035506, -14551560, -14878527, -12062057, -5753335, -1458827, -4091527, -11199036, -16874535, -18765514, -17086021, -11449965, -3943088, -711388, -4513563]
4808d513563n111693k55443K267620q39077l091041o76815J072839j992543n617065
4799a8756781n309115l436222l077894k173165J264741M594376N581881O024930
4791a5287249O832168N658919K528667J200643J967888K92167m151661m974844
4783e933302J82880M410117K325854j454512q58635J647367P71645j923296k011297
4774b843179j205680l959723q037329o791201K08976O054814O150761L143776
4766g278785J494722J782312J697561k30016k927760l600314o99846L275585L911833
4757b574708Q33616j471746n88294j28787l454125p057368n136615J399419N915187
4748a2263421N328620L140213K712069K587612N19856j948747k186222j214644
$$ y = [-4513563, -9625256, -9880699, -7613079, -8452156, -11543197, -12220012, -11147173, -13139716, -18756781, -24065896, -27502118, -30580012, -32753177, -31488436, -26894060, -21312179, -15287249, -8455081, -2796162, -267495, 933148, 2901036, 3193203, -958458, -5933302, -5750422, -1340305, 985549, -468963, -1327598, 319769, 1091414, -831882, -2843179, -4048859, -8008582, -16045911, -22837112, -22628136, -16573322, -10422561, -7278785, -5784063, -4001751, -2304190, -2534206, -5461966, -9062280, -9762126, -6486541, -2574708, -1741092, -3212838, -3801132, -3929919, -7384044, -14441412, -19578027, -18178608, -12263421, -6934801, -3794588, -1082519, 1505093, 2024949, 76202, -2110020, -3324664]
4740c324664k006742m022634l319764J220481N214199M404338M38631j901728
4732c297883j437531q04141r64768k18826J035933k50400l817515m657889n07128
4723a4920148L864440L582589N67212q83057j188551k811453m204260k660678
4715a8653906l16172o97196j663481J101617N402368N086234L62342k450423j348464
4706a3177081n17390j101047J129042O636719R011579M619907j707492m458027
4698D36210m542357m830338m795337l808885l962486n146376k891308L981616
4690b5559261Q802413N686233j640293n302019l866298j732151r91470J15500
4682b4487346K394019M591383O033109O301951L758757j761538o306156n658659
$$ y = [-3324664, -5331406, -9354040, -12673804, -11453323, -6239124, -1834786, -1396155, -3297883, -4735414, -5539555, -6504323, -6723149, -5687216, -5937616, -9755131, -14413020, -14920148, -11055708, -7473119, -6905907, -7788964, -8977515, -11788968, -15993228, -18653906, -18970078, -19667274, -21330755, -20229138, -14826770, -9740536, -9378194, -11828617, -13177081, -13694471, -14795518, -13666476, -7029757, 1981822, 6601729, 4894237, 436210, -4106147, -8936485, -13731822, -17540707, -21503193, -26649569, -29540877, -25559261, -16756848, -11070615, -12710908, -18012927, -21879225, -23611376, -24602846, -24487346, -22093327, -17501944, -11468835, -5166884, -1408127, -3169665, -9475821, -15134480]
4674a5134480p16184M014535N783636M753025J883765j271044k583600j978365
4666e248712k000967l394601l025603R54067N227584O016197M222489K152765
4658D903219q97211n010422n759497l41526N470761L752958l921638q589587o769472
4649a7162415l558775k664914j410034K186631M631215K933995k36070j299613
4641a6579980j183317k068314k548399k95513L184974M557818L554034K307589
4633i071108J434349K93948j27447J656483M087463L702427J89633k671302j972009
4624b477563Q34650K562618K486396K361765L337727M340293L393001N252l529605
4615A3314534l542874R09159N298617L361233n036143j2158462j1156272m581334
$$ y = [-15134480, -15850664, -11836129, -6052493, -1299468, 584297, -686747, -3270347, -5248712, -7249679, -10644280, -13669883, -12715816, -7488232, -1472035, 2750454, 4903219, 4006008, -1004414, -6763911, -7105437, -1634676, 2118282, -1803356, -10392943, -17162415, -20721190, -23386104, -24796138, -22609507, -17978292, -15044297, -15280367, -16579980, -17763297, -19831611, -22380010, -22675523, -19490549, -14932731, -11378697, -9071108, -7636759, -7342811, -7470258, -5813775, -1726312, 1976115, 2165748, -505554, -2477563, -1642913, 919705, 3406101, 5767866, 9105593, 13445886, 16838887, 16844139, 13314534, 9771660, 10680819, 15979436, 19340669, 14304526, 2146064, -9010208, -13591542]
4607a3591542l89693q19189o12647L243248O257978L992595n39081j931569q80446
4598e270346j796265m581700n153384k871290j060743m20452J811701N630080
4590a3712399P310373N775372M048018L046141R3480m459449n596068j593235
4582e087767K461664K576148J261090J130329l81385m557285o006267q46824M863015
4573d587282L173199k928265l821729J494022L998295j097720p602241q264872
4565a9636593m088109k18623J775439L495548N370637O297566N443800K437637
4557H77302k056257n071214l769797j61874K85802l616897o273271k996976L256886
4548a9526296O120370M110740R93073m43212r62796j573799j277458P75707L099624
$$ y = [-13591542, -13981235, -14800424, -15413071, -12169823, -5911845, -1919250, -2458331, -4389900, -5270346, -7066611, -11648311, -16801695, -19672985, -20733728, -21154180, -19342479, -13712399, -6402026, -626654, 3421364, 6467505, 6560985, 2101536, -3494532, -5087767, -2626103, -49955, 1211135, 2341464, 1960079, -2597206, -8603473, -9450297, -4587282, -1414083, -4342348, -8164077, -6670055, -2671760, -3769480, -11371721, -19636593, -23724702, -23943325, -22167886, -18672338, -13301701, -7004135, -1560335, 877302, -1178955, -6250169, -10019966, -10181840, -9896038, -13512935, -19786206, -22783182, -19526296, -13405926, -9295186, -8302113, -8745325, -9708121, -11281920, -12559378, -11783671, -8684047]
4539h684047L273443O97055k786425m491876k808505J678898O202258P331957
4531D12758L601963k840587p682579q065372m527326O76670N849472R357179Q546036
4522E328214K158467o128430r679941n903078P07823L904848K370775k45452k88150
4513g774924K452384M960766L486327k752786r357767j0145734m147032K686871
4505b0591895M341519J392722r59247M30004M077456O468828N197515P52324l240480
4496b131254l028549O66438K952038R89400k530013l768432k709740j467240n20145
4487a1547497N65886J219351J403305K456694L881111K705820q96307j601948
4479a813585L015039O657136K463044o343438j0702878q150388l789468p89083
$$ y = [-8684047, -5410604, -4713549, -7499974, -11991850, -14800355, -13121457, -6919199, 412758, 4014721, 1174134, -6508445, -14573817, -19101143, -18424473, -12575001, -3217822, 5328214, 7486681, 1358251, -8321690, -14224768, -13516945, -9612097, -7241322, -7486774, -7774924, -5322540, -361774, 3124553, 371767, -8986000, -19131734, -23278766, -20591895, -16250376, -14857654, -15816901, -15386897, -11309441, -4840613, 356902, 1109226, -2131254, -5159803, -4493365, -1541327, -551927, -3081940, -6850372, -9560112, -11027352, -11547497, -10981611, -9762260, -8358955, -5902261, -2021150, 684670, -211637, -1813585, 1201454, 7858590, 10321634, 3978196, -6724682, -14875070, -18664538, -19453621]
4471a9453621J882466K975983p00554o108152m878698M415819J2392858J1270291
4463A796392M603355O8769j424821l584063o269418n905083k254947J047193K159806
4454i762817K739366M008592M604303K788246j384355o169718q879698p008979
4446a9065060l77015P739091J2611287J1530606N566396j390087n537432o111072
4438D966714n276788m623017l278432q94339o6024k582976n165849l276177J777345
4429a8419543M289277K452889K05003M63803J800422K874059M765604P012228
4421E443742O423742K291467j743209l266811l931338m630624l239450j7119N42869
4412b126731k803929m472269q53864K946683J284143k425688j855398R05100o57489
$$ y = [-19453621, -17571155, -14595172, -15295726, -21403878, -26282576, -21866757, -9473899, 1796392, 6399747, 6468516, 5043695, 1459632, -4809786, -10714869, -12969816, -11922623, -9762817, -7023451, -3014859, 1589444, 4377690, 2993335, -3176383, -12056081, -19065060, -19442075, -11702984, 908303, 12438909, 18005305, 16615218, 11077786, 4966714, -310074, -4933091, -8211523, -9105862, -9171886, -11754862, -16920711, -20196888, -18419543, -14130266, -11677377, -11472374, -11008571, -9208149, -6334090, -1568486, 5443742, 11867484, 14158951, 12415742, 9148931, 5217593, 586969, -2652481, -2669600, -2126731, -4930660, -9402929, -10256793, -7310110, -6025967, -8451655, -10307053, -9401953, -10059442]
4403a0059442m872107l741179K654327M365214k721475q904403m170480P233289
4395b0216256J2726163P830896j32545k905476K46853M716010O201192L183580
4387A1650417k761092p707341q371415n175327j193093J613589L313623L687962
4379d942677J826790j277057k388742J2917L156777L200922j7481l083252k998558
4370f510361M32938N204090Q193091O581664O99476m808130n259275j597615P84540
4361C720418p51513l091632k710909q63110j070338l586422n073628k894547K094694
4352a4226987O304015O082594J152896l887266l817611M16165K260172j330533
4344g046555n078091k960343K730163M512806N5686n258332n516222l20374N973121
$$ y = [-10059442, -14931549, -18672728, -16018401, -11653187, -14374662, -23279065, -27449545, -20216256, -7490093, 340803, 208258, -2697218, -2450365, 2265645, 8466837, 11650417, 8889325, 1181984, -7189431, -12364758, -13557851, -11944262, -8630639, -4942677, -3115887, -4392944, -6781686, -6768769, -3611992, -411070, -428551, -3511803, -6510361, -6077423, -873333, 7319758, 13901422, 14600898, 9792768, 4533493, 2935878, 3720418, 2968905, -122727, -2833636, -3696746, -4767084, -8353506, -13427134, -16321681, -14226987, -7922972, -1840378, -687482, -4574748, -8392359, -7976194, -5716022, -7046555, -12124646, -15084989, -12354826, -7842020, -7786334, -13044666, -18560888, -18881262, -12908141]
4335a2908141Q189110M340698j788721l550140O59151M837208L737566L89364
4327C906095O71939L627737L416160r34648m429146m262012k788825k052612j025081
4318c870393R18598K485998K907689K067925r70962n418259o624713j766047M452013
4309e818151N802353L748800L527538L958978L35871m681132l989949P39314P22841
4300D346463m147354m106284K907768N990059o52818p124170l538911M658014
4292a667233O656867K532666o79312j839817m056119n575347k651664J919173
4284e360786K129691j771448m457943l724543j396118J065662K648538K061503
4276h805444J221876M317370R139969O670653m674094j2687863p720058K357237
$$ y = [-12908141, -4719031, -378333, -2167054, -5717194, -5058043, -220835, 3516731, 3906095, 4578034, 8205771, 11621931, 10687283, 6258137, 1996125, -792700, -2845312, -3870393, -2951795, -465797, 2441892, 4509817, 3538855, -1879404, -8504117, -10270164, -5818151, -15798, 3733002, 7260540, 11219518, 11555389, 6874257, 2884308, 3623622, 4346463, 199109, -3907175, -999407, 4990652, 4337834, -2786336, -6325247, -1667233, 4989634, 7522300, 6842988, 5003171, 947052, -4628295, -7279959, -5360786, -3231095, -5002543, -9460486, -13185029, -14581147, -13515485, -10866947, -8805444, -7583568, -3266198, 5873771, 12544424, 7870330, -4817533, -12537591, -10180354]
4268a0180354L829882k786005o142124k780206J70916j205164l003559k330499
4260b4427113o53389J619717N125252O623162K521362l234404k903816L772316
4252a1556913R357761R080482M752280j78255l008417j426680K869606L416861
4244A3306725j731090m900253p83885K791804l245496j2354570j0713855J105500
4236a6525120Q978372O368248O42471j815751l049677m471059l096734O04976
4228a2364274K151820K114654N077260Q699200N498402l167690p111339l365795
4220b467762o3913j727588k966700k23666K169748J714438K299879M966539M830653
4211H531628J123965j43011K858533M496256K438856J030648J241148j354692
$$ y = [-10180354, -6350472, -9136477, -15278601, -18058807, -17887891, -19093055, -22096614, -24427113, -25080502, -23460785, -18335533, -11712371, -9191009, -12425413, -15329229, -11556913, -2199152, 6881330, 11633610, 11455355, 8446938, 7020258, 9889864, 13306725, 11575635, 6675382, 5891497, 8683301, 5437805, -6916765, -17630620, -16525120, -7546748, -1178500, -536029, -2351780, -5401457, -9872516, -12969250, -12364274, -10212454, -8097800, -3020540, 5678660, 11177062, 8009372, 898033, -2467762, -2531675, -4259263, -7225963, -7449629, -5279881, -3565443, -1265564, 3700975, 8531628, 9655593, 9512582, 12371115, 16867371, 19306227, 20336875, 21578023, 20223331]
4203B0223331n896003n713701j352708j119938n327598m013458N114064J0822844
4195A2736833O239345j189965l717876l728170m058916j691189K592495K114468
4187I297025k209883r60561N777734O246401r91997k082320O659022R204451k414118
4178B8525754j1829369n016654O587948P132503J967342K822941M580393j728277
4170C3042581p637755j360418R219389R380546K163200n79511j09914k981183
4162D1136935l381289N260684J3215679J0334467N400190Q146622R010995R53031
4154I0077314M92342J7474210K8306595J6951559J4297412M3342908N0437097
4147B61379437l3134130j64428345k08807351j12204347K1537292O7527484K9251830
$$ y = [20223331, 14327328, 8613627, 7260919, 6140981, 813383, -3200075, 1913989, 12736833, 18976178, 17786213, 14068337, 10340167, 6281251, 4590062, 7182557, 9297025, 7087142, 6126581, 11904315, 18150716, 17158719, 15076399, 21735421, 30939872, 28525754, 16696385, 11679731, 18267679, 25400182, 27367524, 30190465, 34770858, 33042581, 25404826, 24044408, 33263797, 42644343, 44807543, 44228032, 44118118, 41136935, 37755646, 43016330, 56232009, 66566476, 71966666, 80113288, 89124283, 90077314, 90569656, 108043866, 136350461, 153302020, 167599432, 210942340, 261379437, 228245307, 63816962, -144990389, -257194736, -235657444, -168129960, -138878130]
4140a38878130m140941M423436J7845821J1370159N247239J2723679J6549948
4133g4858789P855960K982641R511850J1708016J550157o148062j201768N230366
4125d3369629K635622k279810j749300n92553l408630m306907J081336O790221
4117d5199650P503900O498018O582467M514053l94221l014234k211899l346612
4109b9068178p129957o639613N25596P216582P873239N449059L768815J882768
4101a6121689p67181j871575j582464k672915m078927k242654R58522O20624j352058
4092b9110317P66081M335248J512627n038709l779206N785420R811611K126435
4084a3590810n110820r75049P081082O299682j493293m989289j422706K119799
$$ y = [-138878130, -143019071, -138595635, -120749814, -109379655, -104132416, -91408737, -74858789, -67002829, -64020188, -54508338, -42800322, -41250165, -47398227, -48599995, -43369629, -40734007, -43013817, -44763117, -45355670, -48764300, -53071207, -51989871, -45199650, -37695750, -31197732, -24615265, -20101212, -20495433, -23509667, -25721566, -29068178, -36198135, -42837748, -42312152, -35095570, -27222331, -21773272, -18004457, -16121689, -16888870, -18760445, -20342909, -23015824, -27094751, -29337405, -28378883, -27758259, -29110317, -28344236, -24008988, -22496361, -27535070, -31314276, -25528856, -15717245, -13590810, -18701630, -19676679, -12595597, -6295915, -7789208, -12778497, -14201203, -12081404]
4076a2081404J447275p86514k000218k571120k632231j678755o06303m87478q44081
4067b2240829j284778j992546j237048L013486P487054N766939j319439m408544
4059a6215705J235090Q192309P861085K395309r39880j642972m251963q472539
4051a1839266r197222m963330L33068L629569N271366N881585N193601L758051
4043a932578K402768O40552j745559k973000j761753J27620L88414o40147j500773
4034f994456k095512k525181k064271j227924j622346j874113J833818Q353560
4026h216425J0002102L051477n041788n059400R21228K965844k172953p334876
4018a0884791n917516j31522L436498K009610j663724l136962m71737M031587
$$ y = [-12081404, -10634129, -11420643, -13420861, -15991981, -18624212, -20302967, -20909270, -21396748, -22240829, -23525607, -25518153, -26755201, -23741715, -16254661, -10487722, -11807161, -16215705, -14980615, -6788306, 1072779, 3468088, 2528208, 885236, -3366727, -11839266, -21036488, -25999818, -25666750, -22037181, -16765815, -10884230, -5690629, -1932578, 470190, 1110742, -634817, -3607817, -5369570, -5241950, -4853536, -5493683, -6994456, -9089968, -11615149, -13679420, -14907344, -16529690, -18403803, -16569985, -8216425, 1785677, 4837154, -204634, -5264034, -4342806, -1376962, -3549915, -10884791, -16802307, -16933829, -13497331, -11487721, -13151445, -16288407, -16760144, -12728557]
4010a2728557O198209M757829K283983N25258j991242n436206n812674r93070
4002a3196470L714361J844638m340216o601466k604510J721571K430222L166409
3994a3865461P475838J1264436Q029551j239927q426671q110068l253791k39654
3986h365747r04212j634298N12511L496636L474686M30274k143493k538034k386986
3977a0058663k587996j587795P74100J754696N55130O67670L855007N700779K004075
3968A077003l651115m730791j996654k008119o011921p715571l533174J792498
3960b6777844K837110J133793J180380L095558L740154K338605O82998m71337
3952a2240583j324420o11678K917977P079064P794858M332565J65468j871724
$$ y = [-12728557, -6530348, -1772519, 511464, 1036722, -954520, -6390726, -12203400, -13196470, -9482109, -7637471, -11977687, -18579153, -21183663, -19462092, -17031870, -13865461, -6389623, 4874813, 12904364, 11664437, 3237766, -4872302, -8126093, -8365747, -9269959, -10904257, -10391746, -6895110, -3420424, -2990150, -5133643, -7671677, -10058663, -12646659, -14234454, -13460354, -11705658, -11150528, -10482858, -6627851, -927072, 1077003, -2574112, -7304903, -9301557, -11309676, -17321597, -25037168, -28570342, -26777844, -23940734, -22806941, -21626561, -18531003, -14790849, -12452244, -11769246, -12240583, -13565003, -14176681, -11258704, -4179640, 3615218, 7947783, 8113251, 6241527]
3944F241527k676906m170568n814379n614612l335294q59530K66324J39617n91038
3935a6414859j626268k377710j810231J23165J984573K983095M441547P258351
3927e438337Q844024N453297k170781q297390q461573l998548O72003K826768
3919a0570537K202240k17227k075900q40717K422743K919177j375871n603472
3911a3139564m039730J964253O359085O947042O458532O021823L414874j444571
3903A2541744m669890l910137j389661K67156J136636J194266j164033n311927
3895a305846p197622m903987j733860p56363j50238K390432M549340L453283J585109
3886d069752K973664N643414M059747j700053n380837l615020K1484J229350K41816
$$ y = [6241527, 3564621, -605947, -6420326, -12034938, -15370232, -16229762, -15963438, -15823821, -16414859, -18041127, -20418837, -22229068, -22105903, -20121330, -17138235, -12696688, -5438337, 3405687, 8858984, 6688203, -1609187, -10070760, -14069308, -13397305, -10570537, -8368297, -8585524, -10661424, -11502141, -9079398, -6160221, -7536092, -13139564, -17179294, -15215041, -8855956, -1908914, 4549618, 10571441, 13986315, 12541744, 7871854, 3961717, 2572056, 2839212, 3975848, 5170114, 4006081, -1305846, -8503468, -13407455, -15141315, -15897678, -16047916, -13657484, -9108144, -5654861, -4069752, -1096088, 4547326, 8607073, 6907020, 1526183, -2088837, -2067353, -838003, -596187]
3877e96187q59212j546913j435544N28736L173370L096272n9016k024195l43064
3868f5753J399381o71821m242950m580811k110281j069628k144951j851683J076322
3859a4262175L813082M432380M006719K783435q64330n730454o625855j153127
3851a3600325N700550P198311K712894l182399p072643q346718o386274r32090
3843b3908694M870121O269017K966497q2279N31453K238630J174134j396718q59946
3834h197785L597658P313994O151005J145945m066768p598482q752567n822885
3826a6229885J299289P318404N727931j775591n337825J27253O788054M318288
3818B235918m881028q542711j912718O066796O152008P61421j960140j6274K419570
$$ y = [-596187, -1455399, -3002312, -4437856, -3909120, -735750, 2360522, 2301506, 277311, -65753, 1333628, 661807, -3581143, -8161954, -10272235, -11341863, -13486814, -15338497, -14262175, -10449093, -6016713, -2009994, 773441, -90889, -5821343, -12447198, -13600325, -7899775, -701464, 2011430, -1170969, -8243612, -16590330, -22976604, -23908694, -19038573, -12769556, -9803059, -9885338, -9353885, -7115255, -5941121, -7337839, -8197785, -4600127, 2713867, 8864872, 10010817, 5944049, -1654433, -10407000, -16229885, -14930596, -7612192, -1884261, -3659852, -8997677, -8870424, -2082370, 2235918, -2645110, -11187821, -13100539, -7033743, -881735, -120314, -2080454, -2096728, 322842]
3809C22842K812743J838287m83683m245895o420643l622792K132537M938927K258940
3800d68737k898483o471182o549891l177041J192949K098802k036615o544551
3792b4854749o118192k144330L08840P69629K484194M824201L984093R29775P16231
3783a9100308L167211K623472j262918j544723L722645O334232O88059o523361
3775a1895691o645653k294540j753177n145386n478463p86610L700276M755070
3767b5544174M723876N496977N406363L278423P44658m30175P5175K020487M009801
3758b18589L218673r90807m896077n223911l624387k540090k27965M686196P432617
3749b384340L203547l571581m431065k3961J012603l655767o542108l074126J560452
$$ y = [322842, 3135585, 4973872, 4490189, 244294, -6176349, -9799141, -7666604, -2727677, -468737, -3367220, -9838402, -16388293, -19565334, -18372385, -16273583, -18310198, -24854749, -30972941, -33117271, -32808431, -32038802, -29554608, -24730407, -20746314, -19816539, -19100308, -15933097, -13309625, -14572543, -16117266, -12394621, -6060389, -5372330, -11895691, -18541344, -20835884, -22589061, -27734447, -33212910, -33999520, -30299244, -25544174, -20820298, -15323321, -9916958, -6638535, -5893877, -6324052, -6248877, -4228390, -218589, 3000084, 2009277, -2886800, -8110711, -11735098, -14275188, -14503153, -9816957, -2384340, 819207, -2752374, -7183439, -7207400, -6194797, -9850564, -16392672, -19466798, -17906346]
3740a7906346K154407J642783M222439P269389O286997K709793O90158J59561
3732G229181j104286j924584j39172K030319Q76195k247872k870532q10346j19870
3723I19033j931513k863256j404511o94329k648640l611210L34676O163086O725467
3714I88803Q79073l660859k35856P079941Q301738J073438o205501o165570j590218
3705D64989Q66670O78194J285390K079201R4071k593133j432785J440132o01194
3696B281535o762145q445990l024396J672410Q03153O78522O694622J1943779
3688E841490P455308k443134o009070j963145p6802m440644p409909k985167L364336
3679h666737L561501j189692l794879k455292j610687l014578k528804K317286
$$ y = [-17906346, -15751939, -14109156, -9886717, -2617328, 3669669, 6379462, 7069620, 7229181, 6124895, 4200311, 4061139, 6091458, 6967653, 4719781, 1849249, 1038903, 919033, -1012480, -3875736, -5280247, -5974576, -8623216, -12234426, -11899750, -5736664, 988803, 1867876, -1792983, -2028839, 5051102, 13352840, 14426278, 8220777, 2055207, 464989, 1331659, 2009853, 3295243, 5374444, 5468515, 2875382, 1442597, 2882729, 2281535, -4480610, -12926600, -15950996, -14278586, -13475433, -12796911, -6102289, 5841490, 13296798, 10853664, 4844594, 2881449, 2804647, -1635997, -9045906, -12031073, -8666737, -5105236, -6294928, -10089807, -12545099, -14155786, -17170364, -19699168, -17381882]
3671a7381882O586908M124289k765317n361247q77474L079859N991m837654k013397
3662a9439924O948658J0794807M819385l271381o002533n534853o004296n129464
3654b2819601l13504L831464K183808j692221j228988K325030L177465J720954
3646a2815593K943533O275039O336260K999959J638220L180422K682170j202552
3638A2037458l687832k474539j074759j450248q11177J787911K862168J320869
3630H509851R47692K962448K971417r86708l985298k168324Q17656N3717l316218
3621E806233n671811o748168o969496l899710L020762Q273891O641481P77173
3613A230355k799917k425950j015262L5665J259335J576304m63211l277785m258281
$$ y = [-17381882, -10794974, -6670685, -9436002, -14797249, -15674723, -12594864, -12588873, -17426527, -19439924, -12491266, -1696459, 3122926, -148455, -6150988, -11685841, -17690137, -22819601, -23133105, -19301641, -17117833, -18810054, -20039042, -17714012, -14536547, -12815593, -9872060, -3597021, 2739239, 5739198, 7377418, 10557840, 13240010, 12037458, 8349626, 5875087, 4800328, 3350080, 2538903, 4326814, 7188982, 8509851, 9457543, 12419991, 15391408, 14404700, 10419402, 8251078, 9068734, 9122451, 5806233, 134422, -6613746, -13583242, -17482952, -14462190, -6188299, 453182, 1230355, -1569562, -3995512, -5010774, -4975109, -3715774, -2139470, -2602681, -5880466, -10138747]
3604a0138747l492941k040491P22417M111983M041746j009421n343843l360690
3596a6509987J501350J995667j300330j651970J769227K437371k012488n451136
3588a9222296l250081Q09925J525229J4477p4735P99151K34307p19425Q01254
3579a9082194M384751O836101O455852L875655J10981l439557m465005k065727
3571g389143J182807J741591r48914m588676o943285p056859m866494j451543
3563c0320516J292747K640335L506859L896404K039323k011999m267665j332455
3555b4556967M390856P212861M920886o9966n143937q920201q747271k149695
3547c3063434P473710J1571556O494035p43716j205692M018454O083461J475072
$$ y = [-10138747, -13631688, -15672179, -14949762, -10837779, -6796033, -7805454, -13149297, -16509987, -15008637, -13012970, -14313300, -15965270, -14196043, -11758672, -13771160, -19222296, -22472377, -21662452, -20137223, -20122746, -20197481, -19398330, -19164023, -19883448, -19082194, -14697443, -7861342, -1405490, 2470165, 2581146, -858411, -5323416, -7389143, -6206336, -4464745, -5413659, -10002335, -16945620, -24002479, -28868973, -30320516, -29027769, -26387434, -22880575, -18984171, -16944848, -18956847, -23224512, -24556967, -20166111, -12953250, -8032364, -8102330, -13246267, -22166468, -30913739, -33063434, -25589724, -14018168, -7524133, -8267849, -9473541, -5455087, 628374, 2103446]
3539B103446l657691l539976p45450k90939r33265J592214N492213M262421k824728
3530A458245q281760o688936j855928j06427r24379O34255M901505O854824M149391
3521A40790O31005K41667J365852J2781l617345n047627j910962K180237J901683
3512d101919k415989m209655R62400Q374314Q992225J374034n594416l982668
3504f01674L082699O420509K952519k259321m611373m630903l665061q39187L350010
3495h01782N234243L035580m601j009869k414299p056552j1323252r230557k310752
3486b5881841J171151j967079n070709j817501M468940O867063N923569P278649
3478i027758R961995O030558n781538j4292712r707786K309888P930676L370341
$$ y = [2103446, -1554245, -5094221, -5839671, -6130610, -7063875, -5471661, 20552, 4282973, 1458245, -6823515, -13512451, -15368379, -15474806, -16399185, -15764930, -10863425, -4008601, 140790, 771795, 1013462, 2379314, 2392095, -1225250, -6272877, -8183839, -6003602, -4101919, -6517908, -10727563, -9765163, -1390849, 7601376, 8975410, 3380994, -601674, 2481025, 8901534, 11854053, 9594732, 4983359, 352456, -3312605, -4151792, -801782, 4432461, 7468041, 7463440, 6453571, 4039272, -3017280, -14340532, -23571089, -25881841, -24710690, -26677769, -31748478, -33565979, -29097039, -22229976, -16306407, -9027758, 934237, 6964795, 1183257, -13109455, -22817241, -20507353, -12576677, -9206336]
3470i206336k657135l738348l484340n961471p219656k224972N667363Q933680
3462a9891215O166729K027006n35581j952041j802278P67262L216109K236719
3454i767290j01908J161570N238382N974545J900140r36011J343275M370337K972246
3445A2155286r11766k606114k470707l609833m965746k962368J270869K365719
3437a734660j121061m025502j758207L490773O163618M804963L276547M698076
3429A3794547O615138M184699k408004o779693m509400J50870l80187o294608
3421D373362j0113206p370936j982858R01391J771259L078343L815459K547140
3413b980046J753392L580524M395424j99249o922473q016699k280700L448662
$$ y = [-9206336, -11863471, -15601819, -19086159, -25047630, -32267286, -34492258, -28824895, -19891215, -13724486, -11697480, -12233061, -14185102, -15987380, -15220118, -12004009, -9767290, -9869198, -8707628, -3469246, 2505299, 4405439, 3469428, 4812703, 9183040, 12155286, 11243520, 8637406, 6166699, 2556866, -2408880, -5371248, -4100379, -1734660, -2855721, -6881223, -8639430, -5148657, 1014961, 5819924, 9096471, 13794547, 20409685, 24594384, 22186380, 15406687, 10897287, 11048157, 10667970, 4373362, -5739844, -13110780, -15093638, -14192247, -12420988, -9342645, -5527186, -2980046, -1226654, 2353870, 6749294, 6550045, -372428, -8389127, -10669827, -7221165]
3405g221165M182972K122193J014329R82826J088923J981000L247795K302128
3397I701001j260078l823290l097140j755920k459163k643472J265883O590983
3389B518804O492075o39746q065455q361780j594236N715459Q079497N630455
3381I775073J838663j173003l647634n391125m464049j19807M491026M960207
3373F269351P85519m077510n932333m838161l217712k745292l092796k480590
3365a9329524O63388N481459Q625685P916067N107378K870351L69997m679790
3357G025011j0335524j1358937o517713o23309K086442K463240K711012K633608
3349a1916170K150659L150054N432598M887663j80581m663821l503134K88959
$$ y = [-7221165, -3038193, -916000, 98329, 1081155, 2170078, 4151078, 7398873, 9701001, 8440923, 4617633, 1520493, -235427, -2694590, -5338062, -4072179, 2518804, 9010879, 8371133, 305678, -8056102, -9650338, -3934879, 4144618, 9775073, 11613736, 10440733, 6793099, 1401974, -3062075, -3181882, 1309144, 6269351, 7054870, 2977360, -2954973, -7793134, -11010846, -13756138, -16848934, -19329524, -18666136, -13184677, -4558992, 3357075, 8464453, 11334804, 11704801, 7025011, -3310513, -14669450, -21187163, -21810472, -19724030, -17260790, -14549778, -11916170, -9765511, -6615457, -1182859, 3704804, 3524223, -1139598, -4642732, -4353773]
3341d353773K34448l347311m268048o83071K464092J751208l94040j310590k102472
3332a2009557l374431k317452K151643N457313L012867k757985n318910k603585
3324a7760097J036634J037669k175686m361590k028259M122819R299093Q901105
3316a928312L629031r61289j101561P86361J29751l207411n217191l744774j040492
3307a2655887R0737J47952J559722M598815O096333K741115m343523r238312p060714
3298a8063762o1050M471250L120457K28938J011747M032124M159379O80544k308901
3289b729274k665343k262597k108102o27069J797680J696171j502175l025494
3281a1426203J05674L607354K184624k078554l176884q52858l48313k967835l640939
$$ y = [-4353773, -4119325, -7466636, -11734684, -12417755, -9953663, -8202455, -8596495, -9907085, -12009557, -15383988, -17701440, -15549797, -10092484, -7079617, -9837602, -15156512, -17760097, -16723463, -15685794, -17861480, -22223070, -24251329, -20128510, -10829417, -1928312, 1700719, 739430, -362131, 424230, 553981, -2653430, -7870621, -11615395, -12655887, -12565150, -12417198, -10857476, -6258661, -162328, 2578787, -1764736, -11003048, -18063762, -18124812, -13653562, -10533105, -10304167, -9292420, -5260296, -1100917, -420373, -2729274, -5394617, -7657214, -9765316, -10392385, -8594705, -6898534, -8400709, -11426203, -11320529, -7713175, -5528551, -7607105, -10783989, -11636847, -11985160, -14952995, -18593934]
3272a8593934N20559N219775N572547K961967J545188J632402Q68709n85115o66467
3263a524369K12911j51372j218177n7587L405536N266041K907209j458130l840409
3254C541653k961166n43233J168633J100386k66790j562439k304736l552244n438355
3245a0818291n254573p98793N013124O610242L208719j57458j24281Q01971l24897
3236a844237j692092n69673J343982J040959m2749J314717L363679J154849n044138
3227i74703q765073n984797L3809M147320N129320M070381J447199j236055p84026
3218b916625K945756M733827P41166m714291m037295K937457Q097082N426646
3210A3213723k035527p022619o344327k351552J289406K761521K294004J311178
$$ y = [-18593934, -18073375, -12853600, -7281053, -4319086, -2773898, -1141496, -272787, -857902, -1524369, -1311458, -1462830, -2681007, -2738594, 666942, 5932983, 8840192, 7382062, 3541653, 580487, 37254, 1205887, 2306273, 2039483, 477044, -1827692, -5379936, -10818291, -16072864, -16871657, -11858533, -5248291, -2039572, -2197030, -2321311, -1519340, -1844237, -3536329, -4106002, -2762020, -1721061, -1763810, -449093, 2914586, 4069435, -974703, -9739776, -15724573, -15690764, -11543444, -6414124, -2343743, -896544, -2132599, -2916625, 29131, 4762958, 5504124, 789833, -3247462, -310005, 7787077, 13213723, 11178196, 4155577, -2188750, -4540302, -3250896, -489375, 1804629, 3115807]
3202C115807J105965J365393N19003j899585m179431m407393k547767J39707K636195
3193d152106M235167M249811K831918J130862m83376l144622o920281q929498
3185a1182125o561292j852182M90212l22875l3696L688309O618215L661053k970227
3176h464608n707343j691875L358487K956737j907991n198829m318599k424592
3168b3398613k606182l385718j555907K777426O293679O881112N907945N763099
3160c323159O633358O710633M864189J912455o89026k285962k761409j939718
3152I121361k39792Q23189J51347j192428j195050J83885R81032M46177K47316
3143I327037J314070J472098j580294o084915p658878m834548p89749R64051M93639
$$ y = [3115807, 4221772, 5587165, 6106168, 4206583, 27152, -4380241, -6928008, -6788301, -4152106, 83061, 4332872, 7164790, 8295652, 7812276, 4667654, -2252627, -11182125, -17743417, -19595599, -19105387, -19428262, -19461958, -15773649, -9155434, -5494381, -8464608, -14171951, -15863826, -12505339, -9548602, -11456593, -16655422, -20974021, -23398613, -26004795, -29390513, -30946420, -28168994, -21875315, -14994203, -9086258, -3323159, 3310199, 10020832, 14885021, 16797476, 16108450, 13822488, 11061079, 9121361, 8881569, 9704758, 9856105, 8663677, 7468627, 7652512, 8633544, 9079721, 9327037, 10641107, 12113205, 10532911, 4447996, -3210882, -8045430, -8835179, -7871128, -7377489]
3134g377489J0444L48476N87614K55454Q1374N53552J014618N83378p42260k229712
3124f914551l131902k930519j394059Q99309K273389J181978j783042l934793
3116a5734190l461205j684100r84610j008632Q33936M739196P066218N243386
3108d990001J892732J304419L125424K978804p03412l982894k901038J044317
3100b231649L117655J500981j152741j818757n61016N27597K00498j184665k828147
3091d430244l957499l412447o34489K205994J154688m284220q329707m727525
3083b6415449M853683J1968381J1578747O993161L277516P99343j471595j468447
3075A0115340J687841L040424j540641o782521m310225L566147N576586j768149
$$ y = [-7377489, -7367045, -7018569, -6430955, -6175501, -6094127, -5540575, -4525957, -3942579, -4684839, -6914551, -10046453, -12976972, -14371031, -13471722, -11198333, -10016355, -11799397, -15734190, -19195395, -20879495, -21864105, -22872737, -22038801, -17299605, -10233387, -4990001, -3097269, -1792850, 1332574, 4311378, 3607966, -374928, -3275966, -2231649, 886006, 2386987, 1234246, -584511, -1145527, -617930, -417432, -1602097, -4430244, -8387743, -11800190, -12434679, -10228685, -9073997, -13358217, -21687924, -26415449, -21561766, -9593385, 1985362, 8978523, 12256039, 13055382, 11583787, 10115340, 11803181, 14843605, 13302964, 6520443, 2210218, 5776365, 11352951, 9584802]
3067I584802q449145n583118K518486O304421M094335P96256j063808j999517
3059F202712j111346K066462L873174J014213l392497m123073j932713j286015
3051A310917k281825j527163O58889R82673j2077Q66671K186804m21325n307020
3042c543456n749579r15892K377416P00431j581777j580712k692826n984299n668416
3033b4639110P28470N697348K794358k513281j775661K408222J488314l691248
3025a9502588l885513L188242R292121Q728336N252454L311634J274935k458980
3017E200641m245277j434371K035594J806073P0355O82308J477762j881595p139695
3008c428205p734482l047544N47794l14354j306275J910847O619082P300560L304831
$$ y = [9584802, 1135657, -4447461, -1928975, 4375446, 8469781, 9266037, 8202229, 6202712, 5091366, 7157828, 11031002, 12045215, 8652718, 4529645, 2596932, 1310917, -970908, -2498071, -1839182, -856509, -868586, -1915, 2184889, 1763564, -3543456, -9293035, -10208927, -7831511, -7131080, -8712857, -10293569, -12986395, -18970694, -24639110, -23910640, -18213292, -15418934, -17932215, -19707876, -17299654, -15811340, -19502588, -23388101, -20199859, -10907738, -2179402, 3073052, 6384686, 7659621, 5200641, 955364, -479007, 1556587, 3362660, 3433015, 4115323, 5593085, 3711490, -3428205, -11162687, -14210231, -13662437, -13976791, -15283066, -13372219, -6753137, 547423, 3852254]
2999C852254j624131m895328o101761m391494M89970M968994M149505j420039
2991d972030n416366l879918j95877M33058j611477j828198J519066N519035O694263
2982c738444M047252j055169n255032m687646N88247M791488K948658j767431
2974d128077j991058L023280O366344M001096k06479k415690m975768r941212
2966a0267564j2309769o662471K859857O635592K545775j765955P1739N577829
2958a3314967Q145328M887070j708890o565692n408076J596229Q705385R730263
2950F066650M748188p18956k889302k892531l014569l628440m419565n145008
2942a1893533m516784j609041J359615J360188j77400J117398N258429P341701
$$ y = [3852254, 2228123, -2667205, -8768966, -13160460, -12670490, -7701496, -3551991, -4972030, -10388396, -14268314, -14464191, -14031133, -15642610, -17470808, -15951742, -10432707, -3738444, 308808, -746361, -6001393, -10689039, -10100792, -5309304, -2360646, -4128077, -6119135, -3095855, 3270489, 7271585, 7065106, 4649416, -326352, -10267564, -22577333, -29239804, -26379947, -19744355, -17198580, -18964535, -18892796, -13314967, -5169639, -282569, -1991459, -8557151, -13965227, -12368998, -3663613, 6066650, 10814838, 10095882, 7206580, 4314049, 1299480, -2328960, -6748525, -11893533, -16410317, -18019358, -16659743, -15299555, -15476955, -14359557, -9101128, -1759427]
2934a759427N578468M028878M763411L505797k491718p791376o129650n60640
2926h56257N93918m182895q286868o891449j783924L733513Q517252J0952949
2918A796239Q434581J921507l424290m659631m296145m728978l656030J132101
2910g480646N762111M293109k429996p013695n256409j239886n04581j660781
2902a5530774J066519P994989J1501292N571485n285160j0596254o549290J71289
2894a1655904K075014J40899M16877M478060P800437O682391K429419j780039
2886A0587154m482706n285004l886194j504893q09804k527012l972120k665813
2878a4546392K94297K170175K244673J698883J347499J512813K748792M418513
$$ y = [-1759427, 3819041, 7847919, 12611330, 16117127, 13625409, 5834033, -295617, -856257, -262339, -4445234, -12732102, -19623551, -21407475, -17673962, -9156710, 1796239, 10230820, 12152327, 8728037, 4068406, -227739, -4956717, -8612747, -7480646, -1718535, 2574574, 144578, -6869117, -12125526, -13365412, -13869993, -15530774, -14464255, -6469266, 5032026, 10603511, 5318351, -5277903, -11827193, -11655904, -9580890, -9439991, -9023114, -4545054, 3255383, 9937774, 12367193, 10587154, 6104448, 819444, -3066750, -4571643, -5381447, -7908459, -11880579, -14546392, -14252095, -12081920, -9837247, -8138364, -6790865, -5278052, -2529260, 1889253]
2870A889253L870813j46043m092467k984009K733484O881000N083227k22275l819607
2861I193376m223221l877576m596993n566720n381835l775828j263278J155371
2853a8336704J854783l3633k659039k619802R25535M679068N057986K673886J291363
2844g166557K690276M558638M122343K057026J097482J754857J784184M9892j631544
2835I316597j817473k219622m588773o533168m183389J377619M610926L345197
2827f92086J614538K472454K731722q75062m345853j552044N321157P675927K855928
2818A5206681k610052l663854l278674m919112n449428j358556L190301J645399
2810a237295m548485p780945m981682r5749L242073N114044N505507L356678J94566
$$ y = [1889253, 5760066, 5614023, 1521556, -1462453, 1271031, 8152031, 13235258, 13012983, 9193376, 4970155, 1092579, -3504414, -9071134, -14452969, -18228797, -19492075, -18336704, -16481921, -16515554, -19174593, -21794395, -20868860, -16189792, -11131806, -8457920, -7166557, -4476281, 82357, 4204700, 6261726, 7359208, 9114065, 10898249, 10948141, 9316597, 7499124, 5279502, 690729, -5842439, -10025828, -8648209, -4037283, -692086, 922452, 3394906, 6126628, 5251566, 905713, -646331, 4674826, 12350753, 15206681, 12596629, 8932775, 5654101, 734989, -4714439, -6072995, -2882694, -1237295, -5785780, -13566725, -18548407, -18644156, -15402083, -10288039, -4782532, -1425854, -1231288]
2801a231288r04954p32717k677236n445077l739840K152413M823798J094886k402871
2792i062886l3027L246137R3066o682368q232968l223026J579456L048827M971797
2783a4294992Q584828Q566090K098092m822582n092058j04453L214994J974972
2775A24891q64695k408226k779044k520196j216201M36423L24229j827652l054600
2766a3785071q36710L072351M496923K140447r52639j670620o48025l82442j022210
2757i587996m77310J595169K644502R92411j370686j227260J962336N814661P494802
2748G840629N434614O8665n767625q430898o927962l913271k344319k492767l095519
2739a9628453l421818k777918j86870L445753M967388L101330Q43631J092633
$$ y = [-1231288, -2136242, -2868959, -5546195, -10991272, -14731112, -12578699, -7754901, -6660015, -9062886, -9095913, -5849776, -5756710, -12439078, -20672046, -23895072, -22315616, -19266789, -14294992, -5710164, 2855926, 4954018, 131436, -4960622, -5065075, -1850081, 124891, -739804, -3148030, -5927074, -8447270, -9663471, -9227048, -8902819, -10730471, -13785071, -14621781, -11549430, -7052507, -4912060, -5864699, -7535319, -8183344, -8565786, -9587996, -10065306, -8470137, -5825635, -4833224, -6203910, -7431170, -5468834, 345827, 7840629, 13275243, 13343908, 7576283, -854615, -7782577, -11695848, -14040167, -16532934, -19628453, -23050271, -25828189, -26015059, -22569306, -17601918, -14500588, -13656957, -12564324]
2731a2564324K114521P88460j525038n78001M151818Q536941R299735O778647
2723A7002759K386942k827614o695817o647936l000535R60285K612118J666247
2715E456449j092600l914862l888510j87300L277910K413104p39952r78991J497802
2706A843050J428319k296417m354630j764211J491625J634787R74137K642990
2698A599650M641307L849921J850766J839336K970919K481321P18358l86573j317696
2689A8247309l031036l457728o21979K750625K467015q23399l073510l168921
2681I288376l128158l057071r10501K757542M294346J939797j949323m201437
2673E033571l943348k477518k043753m020935o678579o318282k443449Q67219
$$ y = [-12564324, -10449803, -9661343, -11186381, -11764382, -7612564, 924377, 10224112, 17002759, 19389701, 16562087, 9866270, 3218334, 217799, 1178084, 3790202, 5456449, 4363849, 448987, -3439523, -3626823, -348913, 2064191, 1324239, 345248, 1843050, 3271369, 974952, -3379678, -5143889, -3652264, -2017477, -1043340, 1599650, 6240957, 10090878, 11941644, 13780980, 16751899, 19233220, 19951578, 19565005, 18247309, 15216273, 11758545, 11136566, 13887191, 16354206, 15530807, 12457297, 9288376, 6160218, 3103147, 2192646, 4950188, 9244534, 11184331, 9235008, 5033571, 1090223, -1387295, -3431048, -7451983, -14130562, -20448844, -22892293, -22025074]
2665b2025074J213110J867440N591024Q322028M903742j613825l317801J030272
2657d029084M677425L124365q30790l109729l386999k706090j342453n13697j616491
2648i733543k828218j089149K137214K414129J01177L93040M328827O347963L254965
2639E326405n97330l56896K472932L594240J585420k899840q681131j1969051
2631a1525251q138983J011590P104094N897609K680220L081776M678812K950752
2623G740619l63133j377215j582584m151191o655481m820991n50757J038009J85594
2614a0537130Q96816K717137J521577k426873m213265j914487J440207L210437
2606i305581L149640J090911k024274k361444J850374N558937L392058j468197
$$ y = [-22025074, -20811964, -18944524, -13353500, -5031472, -127730, -1741555, -5059356, -4029084, 648341, 3772706, 2941916, -167813, -3554812, -6260902, -7603355, -8117052, -9733543, -12561761, -13650910, -11513696, -9099567, -8998390, -8605350, -4276523, 2071440, 5326405, 4729075, 4372179, 6845111, 10439351, 12024771, 9124931, 443800, -11525251, -19664234, -18652644, -11548550, -5650941, -2970721, 111055, 4789867, 7740619, 7377486, 6000271, 4417687, 266496, -6388985, -11209976, -11760733, -10722724, -10537130, -9640314, -6923177, -5401600, -7828473, -12041738, -13956225, -12516018, -9305581, -6155941, -5065030, -7089304, -9450748, -7600374, -2041437, 1350621, -117576]
2598a17576k255638Q7120m75668l049793r82126N120542O854595K151188j385364
2589E947280k77220p58776n814370q048422k380684M322815M390117J083104M65638
2580a070518J39240l739604n884933k74678O540118L476403o927881j1357421
2572a9099274n579149J175820K389508K517419O012905Q920184O426707P38215
2564C502335l467052n240621n153306k674050O94924J129014j304934j401368
2556a3915058K996816O919414N879379K277057K69462p03219k795752m668439
2548c740340m330207l344625l593354l286532p07599J549847R28229J21790K566591
2539a3836200N694614M697935P97423p13043O01761R9260l323901n130263k958221
$$ y = [-117576, -2373214, -2286094, -2761762, -5811555, -6793681, -1673139, 5181456, 7332644, 5947280, 5670060, 4911284, -903086, -8951508, -11332192, -7009377, -2619260, -1536156, -1070518, -931278, -4670882, -10555815, -10830493, -4290375, -813972, -7741853, -19099274, -24678423, -23502603, -21113095, -18595676, -12582771, -3662587, 2764120, 3502335, 35283, -5205338, -10358644, -13032694, -12337770, -11208756, -12513690, -13915058, -10918242, -3998828, 1880551, 4157608, 4427070, 3723851, 928099, -3740340, -8070547, -11415172, -15008526, -18295058, -19002657, -17452810, -16524581, -16402791, -13836200, -8141586, -3443651, -2646228, -3359271, -2757510, -2658250, -5982151, -11112414, -14070635]
2530a4070635m19287o36674j202306J026672M097423L974816R73277r02245k21524
2521g380483j43008l416089p688285p635447j526554N824044P901324L796433
2513a0268065j228750k782734k336457l490850n855057n913456k648131J371647
2505c3151853M218523O358493P742181O618861K720838r23897j174761J648292
2497e943323M563613N134820L077347j91242k798419l825543l667115k665320
2489f315182m08832K430840L130225K37699l199525k808786J135582M080747L377203
2480A659971P80466j216478j953549j281187N26792J260703o14894j744447K241406
2471c41217P940919O416821l063614r386419n017715K387173J686381m665218
$$ y = [-14070635, -14489922, -15126596, -16328902, -15302230, -11204807, -7229991, -6256714, -7158959, -7380483, -7523491, -10939580, -18627865, -26263312, -27789866, -21965822, -14064498, -10268065, -11496815, -14279549, -16616006, -20106856, -25961913, -31875369, -34523500, -33151853, -28933330, -22574837, -14832656, -8213795, -5492957, -6416854, -7591615, -5943323, -1379710, 3755110, 6832457, 6641215, 3842796, 17253, -3649862, -6315182, -6724014, -4293174, -1162949, -925250, -4124775, -6933561, -5797979, -1717232, 1659971, 2440437, 1223959, -729590, -2010777, -1483985, -223282, -838176, -2582623, -341217, 7599702, 14016523, 10952909, 1566490, -3451225, -1064052, 622329, -4042889]
2463d042889n656447p2891K401503j823647m561529l97113M222211K332509k228527
2454i826820k314415Q11810J635848R81900L314232O759297N306477j85395k303238
2445D179696J010632L330241N29709l085406k838638j073837j770397l114010
2437b832010j075081K979612L775620m44587o341298r956281r139498l397536
2429b6431059M417076P848272L291052l793919m215679K992270R049620P208176
2421C65809R22178k529083k005640j673875l103092l462821j095096J646780K166216
2412h768624J089064M86518P58883Q87053M49826k08689j187557k921682m775574
2403a4190782m824046j741911L356567P626212R189375Q501018O638247L279005
$$ y = [-4042889, -9699336, -9772227, -7370724, -9194371, -13755900, -14153013, -9930802, -7598293, -9826820, -12141235, -11329425, -9693577, -8711677, -5397445, 1361852, 6668329, 6482934, 4179696, 5190328, 8520569, 9050278, 5964872, 3126234, 2052397, 282000, -2832010, -3907091, -927479, 2848141, 2403554, -3937744, -13894025, -23033523, -26431059, -22013983, -14165711, -10874659, -14668578, -18884257, -15891987, -6842367, 365809, 1287987, -1241096, -3246736, -4920611, -8023703, -11486524, -12581620, -10934840, -8768624, -7679560, -7193042, -6434159, -5547106, -5097280, -5305969, -6493526, -9415208, -14190782, -19014828, -20756739, -17400172, -9773960, -584585, 7916433, 14554680, 17833685]
2395A7833685k074488p262021q213003l671893K430488M916418K698605j303563
$$ y = [17833685, 15759197, 8497176, 284173, -3387720, -957232, 3959186, 6657791, 5354228]
$$ [...]
##END NTUPLES=NMR SPECTRUM
##END=
