##TITLE=31Pdec_DE-137_2
, 24 sc
 30.3.2026
##JCAMPDX= 6.0         $$ Bruker NMR JCAMP-DX V2.0
##DATA TYPE= NMR SPECTRUM
##DATA CLASS= NTUPLES
##ORIGIN= UXNMR, Bruker Analytische Messtechnik GmbH
##OWNER= root
$$ XWIN-NMR		Version 3.5
$$ Mon Mar 30 15:57:15 2026 Russian Standard Time (UT+4h)  she@DPX200
##.OBSERVE FREQUENCY= 81.013821
##.OBSERVE NUCLEUS= ^31P
##.ACQUISITION MODE= SIMULTANEOUS
##.ACQUISITION SCHEME= undefined
##.AVERAGES= 24
##.DIGITISER RES= 17
##SPECTROMETER/DATA SYSTEM= spect
##.PULSE SEQUENCE= zgpg30
##.SOLVENT NAME= DMSO
##.SHIFT REFERENCE= (INTERNAL, DMSO, 0, 197.392)
##AUDIT TRAIL= $$ (NUMBER, WHEN, WHO, WHERE, WHAT)
$$ ##TITLE= Audit trail, XWIN-NMR		Version 3.5
$$ ##JCAMPDX= 5.01
$$ ##ORIGIN= Bruker BioSpin GmbH
$$ ##OWNER= she
$$ F:/spectra/data/she/nmr/P31/2/pdata/1/auditp.txt
$$ ##AUDIT TRAIL=  $$ (NUMBER, WHEN, WHO, WHERE, WHAT)
(   1,<2026-03-30 15:55:27.56 +0400>,<she>,<DPX200>,
      <created by zg, POWCHK disabled, PULCHK disabled
       configuration hash MD5:
       00 E9 B6 7A A2 85 ED C7 34 08 36 98 17 FE 4E 26
       data hash MD5: 32K
       DD 74 D7 DA 00 43 6C 32 F8 5F 07 C2 3B 57 3A 4D>)
(   2,<2026-03-30 15:55:32.90 +0400>,<she>,<DPX200>,
      <Start of raw data processing
       efp BC_mod = 2 LB = 1.5 FT_mod = 6 PKNL = 1 PHC0 = 1439.209 PHC1 = -72.69934 SI = 64K 
       data hash MD5: 64K
       6A 58 3F 44 ED 96 10 A9 17 91 21 1F 87 88 4E D9>)
(   3,<2026-03-30 15:56:22.01 +0400>,<she>,<DPX200>,
      <pk PHC0 = 11.94925 PHC1 = 0 
       data hash MD5: 64K
       1E D1 A9 24 C3 BD 50 53 C8 59 53 CA D7 08 2B D5>)
(   4,<2026-03-30 15:56:26.78 +0400>,<she>,<DPX200>,
      <abs ABSG = 5 
       data hash MD5: 64K
       54 03 BD 98 C2 25 22 1F CB E6 16 E9 B9 DA CE BD>)
(   5,<2026-03-30 15:56:43.81 +0400>,<she>,<DPX200>,
      <pk PHC0 = 1.001868 PHC1 = 0 
       data hash MD5: 64K
       35 00 E0 4A F5 2F 72 8B 88 4B 90 3B BB 94 EC 21>)
$$ ##END=
$$ 
$$ hash MD5
$$ BB 6C 4A AA 13 FB 54 46 CA 0D D8 10 54 6B AC 92
##$RELAX= 
##$RELAX= 
##$RELAX= 
##$RELAX= 
##$RELAX= 
##$RELAX= 
##$RELAX= 
##$RELAX= 
$$ Bruker specific parameters
$$ --------------------------
##$DU= <F:/spectra>
##$EXPNO= 2
##$NAME= <P31>
##$PROCNO= 1
##$TYPE= <nmr>
##$USER= <she>
##$AMP= (0..31)
100 100 100 100 100 100 100 100 100 100 100 100 100 100 100 100 100 100 
100 100 100 100 100 100 100 100 100 100 100 100 100 100 
##$AQSEQ= 0
##$AQ_mod= 1
##$AUNM= <au_zg>
##$AUTOPOS= <>
##$BF1= 81.014009
##$BF2= 200.13
##$BF3= 200.13
##$BF4= 200.13
##$BF5= 200.13
##$BF6= 200.13
##$BF7= 200.13
##$BF8= 200.13
##$BYTORDA= 1
##$CFDGTYP= 0
##$CFRGTYP= 5
##$CHEMSTR= <none>
##$CNST= (0..31)
1 1 145 1 1 1 1 1 1 1 1 1 1 1 1 1 1 1 1 1 1 1 1 1 1 1 1 1 1 1 1 1 
##$CPDPRG= <waltz16>
##$CPDPRG1= <>
##$CPDPRG2= <waltz16>
##$CPDPRG3= <>
##$CPDPRG4= <mlev>
##$CPDPRG5= <mlev>
##$CPDPRG6= <mlev>
##$CPDPRG7= <mlev>
##$CPDPRG8= <mlev>
##$CPDPRGB= <>
##$CPDPRGT= <>
##$D= (0..31)
0 1 0 0 0 0 0 0 0 0.06 0 0.03 2e-05 3e-06 0 0 0.0002 0 0 0 0 0 0 0 0 0 
0 0 0 0 0 0 
$$ [...]
##$SUBNAM3= <"">
##$SUBNAM4= <"">
##$SUBNAM5= <"">
##$SUBNAM6= <"">
##$SUBNAM7= <"">
##$SUBNAM8= <"">
##$SUBNAM9= <"">
##$SW= 400.765351723535
##$SWIBOX= (0..15)
0 1 3 0 0 0 0 0 0 0 0 0 0 0 0 0 
##$SW_h= 32467.5324675325
##$TD= 32768
##$TD0= 1
##$TE= 0
##$TE2= 300
##$TE3= 300
##$TEG= 300
##$TL= (0..7)
0 120 53 12 22 120 120 120 
##$TP= (0..7)
150 150 150 150 150 150 150 150 
##$TP07= 0
##$TPNAME0= <>
##$TPNAME1= <>
##$TPNAME2= <>
##$TPNAME3= <>
##$TPNAME4= <>
##$TPNAME5= <>
##$TPNAME6= <>
##$TPNAME7= <>
##$TPOAL= (0..7)
0.5 0.5 0.5 0.5 0.5 0.5 0.5 0.5 
##$TPOFFS= (0..7)
0 0 0 0 0 0 0 0 
##$TUNHIN= 0
##$TUNHOUT= 0
##$TUNXOUT= 0
##$USERA1= <user>
##$USERA2= <user>
##$USERA3= <user>
##$USERA4= <user>
##$USERA5= <user>
##$V9= 5
##$VALIST= <valist>
##$VCLIST= <CCCCCCCCCCCCCCC>
##$VD= 0
##$VDLIST= <DDDDDDDDDDDDDDD>
##$VPLIST= <PPPPPPPPPPPPPPP>
##$VTLIST= <TTTTTTTTTTTTTTT>
##$WBST= 1024
##$WBSW= 4
##$XGAIN= (0..3)
0 0 0 0 
##$XL= 0
##$YL= 0
##$YMAX_a= 34040
##$YMIN_a= -33961
##$ZGOPTNS= <>
##$ZL1= 120
##$ZL2= 120
##$ZL3= 120
##$ZL4= 120
##$ABSF1= 197.3918
##$ABSF2= -203.3724
##$ABSG= 5
##$ABSL= 3
##$ALPHA= 0
##$AQORDER= 0
##$ASSFAC= 0
##$ASSFACI= 0
##$ASSFACX= 0
##$ASSWID= 0
##$AUNMP= <proc_1d>
##$AZFE= 0.1
##$AZFW= 0.5
##$BCFW= 0
##$BC_mod= 2
##$BYTORDP= 0
##$COROFFS= 0
##$CY= -3
##$DATMOD= 1
##$DC= 0
##$DFILT= <>
##$DTYPP= 0
##$F1P= 0
##$F2P= 0
##$FCOR= 1
##$FTSIZE= 65536
##$FT_mod= 6
##$GAMMA= 0
##$GB= 0
##$INTBC= 1
##$INTSCL= 9.790993e-09
##$ISEN= 30
##$LB= 1.5
##$LEV0= 0
##$LPBIN= 0
##$MAXI= 10000
##$MC2= 0
##$MEAN= 0
##$ME_mod= 0
##$MI= 50
##$NCOEF= 0
##$NC_proc= -5
##$NLEV= 6
##$NOISF1= 182.463
##$NOISF2= 159.3651
##$NSP= 0
##$NTH_PI= 0
##$NZP= 0
##$OFFSET= 197.3918
##$PC= 4
##$PHC0= 1452.16
##$PHC1= -72.69934
##$PH_mod= 1
##$PKNL= yes
##$PPARMOD= 0
##$PSCAL= 0
##$PSIGN= 0
##$REVERSE= no
##$SF= 81.014063255964
##$SI= 65536
##$SIGF1= 159.3651
##$SIGF2= -187.1042
##$SINO= 113.3802
##$SIOLD= 16384
##$SREGLST= <1H.CDCl3>
##$SSB= 0
##$STSI= 65536
##$STSR= 0
##$SW_p= 32467.5324675325
##$SYMM= 0
##$S_DEV= 0
##$TDeff= 32768
##$TDoff= 0
##$TI= <>
##$TILT= no
##$TM1= 0
##$TM2= 0
##$TOPLEV= 0
##$USERP1= <user>
##$USERP2= <user>
##$USERP3= <user>
##$USERP4= <user>
##$USERP5= <user>
##$WDW= 1
##$XDIM= 65536
##$YMAX_p= 409490446
##$YMIN_p= -4540185
$$ End of Bruker specific parameters
$$ ---------------------------------
##NTUPLES= NMR SPECTRUM
##VAR_NAME=  FREQUENCY,     SPECTRUM/REAL,   SPECTRUM/IMAG
##SYMBOL=    X,             R,               I
##VAR_TYPE=  INDEPENDENT,   DEPENDENT,       DEPENDENT
##VAR_FORM=  AFFN,          ASDF,            ASDF
##VAR_DIM=   65536,         65536,           65536
##UNITS=     HZ,            ARBITRARY UNITS, ARBITRARY UNITS
##FACTOR=    0.49542278885378, 1,            1
##FIRST=     15991.5117654749, 0,            0
##LAST=      -16476.0207020576, 0,           0
##MIN=       -16476.0207020576, -4540185,    0
##MAX=       15991.5117654749, 409490446,    0
$$ Real data points
##PAGE= N=1
##DATA TABLE= (X++(R..R)), XYDATA
$$ [...]
44516e21951k6448J70509L11187J72511j39402k90296j34144J28526K46049K08610
44506A25151J47289R2980R592l4837N1745J72267J32872m3387j20391j3109P4397
44495E94569l5041k36354l17750k23858l2021J71459K73492J56059j23714l13543
44485h6702k59323q8850J2758N1918J09309J40890P9069O91R277N8446O0226N3354
44473A41063R4279J02547m218j37058j75704j59921j66382j42351n7233m6933
44463e51911j68524j93095O0610L49325L09849J6269j46485p5928m285m808R5194
44452c13789K71829K38896n0226k53149j59426J5497M0412M754K7578j0637j71269
44441c59530k11327M6641L53134L67664J50012n638m1636j01070j70293j18766
$$ y = [-521951, -548399, -377890, -66703, 105808, -33594, -323890, -458034, -329508, -83459, 125151, 272440, 365420, 375012, 340175, 391920, 564187, 697059, 653672, 533281, 520172, 594569, 559528, 323174, 5424, -218434, -250455, -78996, 194496, 350555, 226841, -86702, -346025, -434875, -422117, -370199, -260890, -120000, -40931, -40240, -30963, 27483, 87709, 141063, 235342, 337889, 333671, 196613, 20909, -139012, -305394, -447745, -504978, -551911, -720435, -913530, -852920, -503595, -193746, -177477, -323962, -399890, -404175, -408983, -313789, -41960, 196936, 146710, -106439, -265865, -250368, -209956, -205202, -177624, -188261, -359530, -570857, -524216, -171082, 196582, 346594, 340956, 299320, 198250, 27957, -90809]
44431i0809q070j4264r1207m3526R0599O9418j18461j84598Q013K15618J70489
44420C202n6217j92983j11300R1647K37103K04647K5871j14047o9865O1877P4406
44409A54341k5707l2776R0624J13737q3341k75172k18650j2325R7592J05080J66108
44398G9511K43471J45710r7757k11433q3465P7013R7623R3420J89142K25234m267
44387G54202l62032m95722l06948l7232J07263J63190J99684J57588K3081m6953
44377A56121N0125J55915O4044j48594k09406m0587J35390J13813l2522r2174
44367A52125n175Q8985N3040q6436j92097j80375r0739l22O8629J15692J03311
44356B6638L0755K2695J88730L88835L29309l3318l72893m03157k25924j00070
$$ y = [-90809, -98879, -113143, -204350, -247876, -157277, -87859, -206320, -390918, -382905, -167287, 3202, -53015, -245998, -357298, -265651, -28548, 176099, 201970, 87923, 18058, 79935, 154341, 128634, 95858, 186482, 300219, 216878, -58294, -276944, -289269, -191677, -86597, 79511, 322982, 468692, 370935, 159502, 76037, 153050, 250673, 344093, 533235, 758469, 754202, 392170, -103552, -410500, -447732, -340469, -177279, 22405, 179993, 203074, 156121, 206246, 362161, 426205, 277611, 68205, 27618, 163008, 276821, 244299, 152125, 146950, 235935, 288975, 202539, 10442, -169933, -260672, -260994, -192365, -76673, 26638, 57393, 80088, 268818, 657653, 986962, 953644, 580751, 177594, -48330, -148400]
44346a48400m5281P5033K12155J86000K9951l7809R68p0691k86645l64771j39237
44335e88727J53179K16868J01693M1315P1780O2071k476k5809j8500o4287j03176
44324a56069J4352K44540L38219J67357j05040k46116k05281p6858O2850J82649
44314B20603K37460J83351L7162j26989k30989k31649j42697l6024J4199P484
44304f8089N059K7965J4790p5881j54655p1519J76323L72572L00833K1852j69136
44293C80114r6162R2066J49273N6001k5077l8443p6774j45714j17099J9808Q0462
44282B78455j7579p9117O4535K39780J60049j23618k72011j46759J4630k1097
44272I7268j59853j71716l7144P0674N8796J320j6058Q188O0111J53064K61674
$$ y = [-148400, -193681, -118648, 93507, 279507, 309458, 271649, 272617, 201926, -84719, -449490, -588727, -435548, -218680, -116987, -75672, -3892, 58179, 55703, 29894, 11394, -52893, -156069, -141717, 102823, 441042, 608399, 503359, 257243, 51962, -24896, 37954, 220603, 458063, 641414, 678576, 551587, 320598, 88949, -53748, -89772, -75573, -68089, -63030, -35065, -20275, -96156, -250811, -322330, -146007, 226565, 527398, 549250, 380114, 283952, 376018, 525291, 581292, 556215, 517772, 440998, 295284, 178185, 197993, 278455, 260876, 181759, 246294, 486074, 646123, 522505, 250494, 103735, 118365, 97268, -62585, -234301, -271445, -200771, -141975, -140655, -156713, -148525, -88414, 64650, 326324]
44261C26324L00352K18816O3353r1713k09213k45237j28952J19647L17349K93312
44251I64038J10117k9985q1764j74394l08084k75225j7766J63379p253l35032
44241H031l75679k9965L64535N11454M33951K56193J5961k09554k67824j61337
44231E45766q7917j23672j02114M5704R6577r9383k97194j85879J33072L01339
44221B26299K19289R1132K8993n3113j52343j11119Q3911K07247J18397k7577
44211F31116k5362Q2527R5370n2295k15477k30424j07744k2476j07659k64481
44201b16905k56793l6667J48736Q9331p9143q3901O8894J29191R078j13195j09650
44190d51024n7982k0358P3702K14059K18497J2344j90857j62227L4896J76563
$$ y = [326324, 626676, 845492, 908845, 817132, 607919, 362682, 233730, 353377, 670726, 964038, 1074155, 1044170, 962406, 788012, 479928, 204703, 186937, 350316, 343063, 8031, -367648, -397613, -33078, 478376, 912327, 1168520, 1184481, 974927, 707103, 545766, 457849, 334177, 232063, 277767, 374344, 274961, -22233, -208112, -75040, 226299, 445588, 536720, 565713, 512600, 360257, 249138, 333049, 540296, 658693, 631116, 605754, 688281, 783651, 731356, 515879, 285455, 177711, 155235, 47576, -216905, -473698, -510365, -361629, -272298, -351441, -435342, -366448, -237257, -228179, -341374, -451024, -509006, -529364, -455662, -241603, -23106, -10762, -201619, -363846, -328950, -152387]
44180a52387J88420J51461J07247M3417J804K6103N0437m158p3322m9420J4195
44169C03797j4978r1663l3082J57992K29428L2744k42227l21411j95936n7579
44159b32915R676P7485J59754J65221Q9914O4157J32066J53143L5510q3939m6975
44148E23097N9459L8089r3534j31256j3141J01888R9731L8072l3550j56375k90240
44137A42240k84690j33588m0930r7432j16634L0301J46935K2126j87595j82103
44127g01370J3904J25524Q6033Q7456J96174K43489J37156j998p5203j27696j71985
44116a88516j23123J3703R7491O3220o173o2223j45578k20422j71076j3047J08763
44105f46981J71589K81664L86449K71354n5053k66948j67358L7968Q9635M0393
$$ y = [-152387, 36033, 187494, 294741, 338158, 339962, 366065, 416502, 412344, 339022, 289602, 303797, 288819, 197156, 164074, 322066, 551494, 584238, 342011, 20600, -175336, -232915, -223239, -145754, 14000, 179221, 269135, 333292, 465358, 618501, 654011, 570072, 523097, 582556, 620645, 527111, 395855, 382714, 484602, 584333, 622405, 588855, 432480, 142240, -142450, -276038, -316968, -414400, -531034, -500733, -353798, -331672, -519267, -701370, -687466, -561942, -475909, -388453, -192279, 51210, 188366, 186368, 111165, -16531, -188516, -311639, -297936, -200445, -137225, -143398, -205621, -351199, -571621, -742697, -755744, -646981, -475392, -193728, 192721, 464075, 409022, 142074, -25284, 12684, 102319, 142712]
44095A42712N6308Q2213l4166k38941l35498k51362o2912J31778K17431R4687
44085a97750j27497j45056J49595M64413M97173L36133K30185J56410o2934l42717
44075I57955l89592j46438J19340J81935O8851r2523k15140k34909j49776p3410
44065B6293q8489r6170J6439J46191J24523P640l0294q148n8544j09262K4836
44054d4985K51661K54849j9764k61413k54370j27704m9151J8129J14694J28427
44044A0373J3045p4269k2997N2139L5960N201L6252L1210q2388j69345r7377L7684
44032b24512Q6633Q7456J35492J65085P4965n1456o6544l187K955m6999m7025
44021A12863J1144M4287K4487k9921j24305k05092j29565J08162K58096J33304
$$ y = [142712, 199020, 281233, 247067, 8126, -327372, -578734, -641646, -509868, -292437, -197750, -325247, -470303, -320708, 143705, 640878, 977011, 1207196, 1363606, 1300672, 957955, 568363, 421925, 541265, 723200, 792051, 699528, 484388, 249479, 99703, 26293, -62196, -158366, -141927, 4264, 128787, 136427, 106133, 97985, 39441, -69821, -44985, 206676, 461525, 441761, 180348, -74022, -201726, -250877, -232748, -118054, 10373, 23418, -50851, -73848, -21709, 14251, 19452, 55704, 86914, 4526, -164819, -262196, -224512, -137879, -50423, 85069, 250154, 325119, 273663, 207119, 203932, 206887, 159888, 112863, 124007, 168294, 192781, 162860, 38555, -166537, -296102, -187940, 70156, 203460]
44011B03460q6965j19849j0819k562q3435l2847J26871J27113n8593j25761M8120
44000a5267J89857J07127Q021R5629J81062K6263k00117j88456j4384P746j24659
43989G2822j27034L8223Q7022p8137j94390r4316L4864K0239p201Q3826J33020
43978c1062k1133k02349j59300J6284O0379j3334J7644J49034J45716l9662j86316
43967b64099j74968j20110q4452J5894J38627P9057j53510k34369J4324L34646
43957d48960M15000L03952K06083J12772o9151k16520j46021N0023J29973P2164
43947D09315K8129j27j21344k55771k04933m330J08649P8863O9095J00781M937
43936B13264k05320k62481o8424J25944J17247L2297L9542O1638q084n8626J3285
$$ y = [203460, 116495, -3354, -14173, -16735, -100170, -133017, -6146, 120967, 62374, -63387, -15267, 174590, 281717, 289738, 385367, 566429, 592692, 392575, 204119, 189735, 197481, 72822, -54212, -15989, 71033, -7104, -201494, -295810, -260946, -240707, -247908, -164082, -31062, -52195, -254544, -413844, -397560, -337181, -350515, -332871, -183837, -38121, -77783, -264099, -439067, -559177, -643629, -627735, -489108, -410051, -563561, -797930, -783606, -448960, -33960, 269992, 476075, 588847, 519696, 303176, 157155, 207178, 337151, 409315, 437444, 437317, 315973, 60202, -144731, -149061, -40412, 38451, 107546, 208327, 213264, 7944, -254537, -322961, -197017, -79770, -47473, -7931, 53707, 45623, -13003, 282]
43925B82M3433j47556l94833l78408q5406J90591K67171K35263K10241J58585
43915I9363K9444j06939j29667m668J70148K23087N7341k07614l18442j78847
43905c66794L5358J29138J27954J41167J22904l6029k53812l08056j37600P3276
43895d72494J32757M1499o2528p0497l866R891j02767k13593j20070J35408K51140
43884d75120Q5269j07667m8275J47095J79953N6524L6304J67198K19378Q8480
43874C49139o5181j33716k05787l00675k52248P87K53469L12858K31501J32532
43864C22679J5102j19528j58186o4611O232m5856q9013j0079N0996n5802j87224
43853c35290j17344P5821J28524K1798q549J23282K26574J49279k8391j70096
$$ y = [282, 43715, -103841, -498674, -877082, -962488, -771897, -504726, -269463, -59222, 99363, 128807, 21868, -107799, -112467, 57681, 280768, 338109, 130495, -187947, -366794, -331436, -202298, -74344, 66823, 189727, 153698, -100114, -408170, -545770, -472494, -339737, -298238, -360766, -431263, -435129, -425238, -528005, -741598, -861668, -726260, -475120, -389851, -497518, -545793, -398698, -218745, -162221, -125917, 41281, 260659, 349139, 283958, 150242, -55545, -356220, -608468, -607681, -354212, -41354, 190147, 322679, 337781, 218253, 60067, -4544, 1688, -44168, -133181, -143260, -92264, -148066, -335290, -452634, -376813, -248289, -226491, -235040, -111758, 114816, 264095, 235704, 65608]
43843F5608k31412j73378M7986L12460L59616J10829j84988k47848q0962J15343
43833I3254K06281J73098K8765j56037k22727q1040J38597K17271J08620l9060
43823D67022r2181n4000N549L8506L7064L7812R3172J75717J58238j8962k11691
43812F36246k26923q2189L3370M3722N9359J35080J42303j0851j80853j66181
43802C83083l728P3513m3904k07698k26695j06273k131J1986L6147J71099L15608
43791D01007K47573o3195l46977l55782j95454j49449k29385j69845R2150K45929
43781e23428Q7058j10154J5423L38430M14933J38611j35901j39017p710L8276
43771A16521L5676J15676K19716J78768l7689k95242m34870l60104r6732J63179
$$ y = [65608, -165804, -339182, -291196, 21264, 380880, 491709, 306721, 58873, -22089, 93254, 299535, 472633, 501398, 345361, 122634, 41594, 180191, 397462, 506082, 467022, 374841, 320841, 326390, 364896, 401960, 439772, 532944, 708661, 866899, 847937, 636246, 409323, 327134, 360504, 404226, 463585, 598665, 740968, 730117, 549264, 383083, 379355, 452868, 408964, 201266, -25429, -131702, -133833, -121847, -85700, 85399, 401007, 648580, 585385, 238408, -117374, -312828, -462277, -691662, -861507, -769357, -523428, -436370, -546524, -531101, -192671, 222262, 360873, 224972, 85955, 78245, 116521, 152197, 267873, 487589, 666357, 628668, 333426, -101444, -461548, -558280, -395101]
43761c95101K05851N6070m2812L2969J41463J40323Q8718O5025L271j18511j39922
43750C7344J4116J21038j9765k16056j42315J35080K34596L4358j69099j26546
43740i7249M2996J07462N2955J2391L0127M5157K2723K448M9744J76945K71570
43729G17269J58001j69229m46491m25295j90467j6145K5227P9552J83573K01944
43719A17939J09822N7341Q8372N9478p6093j63137j27431j05107j61549j40994
43709c41359M0359J97364J64328N7338M2094N2328l1100j17496p6721J470j1062
43698b2457L142K09593M61238M57004J94294m2611j03216q2379m7102K9566O0984
43687A118056r8378l40876l62039j14810Q8431M0490q1960n6619L8494K4141n2674
$$ y = [-395101, -189250, -133180, -175992, -143023, -1560, 138763, 227481, 292506, 295777, 177266, 37344, 51460, 172498, 152733, -63323, -205638, -70558, 164038, 198396, 29297, -97249, -54253, 53209, 106164, 118555, 148682, 193839, 216562, 219010, 268754, 445699, 717269, 875270, 706041, 259550, -165745, -356212, -372357, -347130, -267578, -84005, 117939, 227761, 285102, 373474, 432952, 356859, 193722, 66291, -38816, -200365, -341359, -301000, -103636, 60692, 118030, 160124, 212452, 181352, 63856, -12865, -11395, -22457, -19315, 190278, 651516, 1108520, 1302814, 1260203, 1156987, 1074608, 1027506, 1057072, 1118056, 1019678, 678802, 316763, 201953, 290384, 330874, 248914, 192295, 230789, 254930, 202256]
43676B02256k8962Q0544J26073O9248n741n9570j07599j15315l4535Q9373J59577
43665C75349J37914L8309j07416k01459j22358P4837J41527l4876k29841j92239
43655a20253m985R6566J14552J86299K10296k0047l28709k66811J73712M19248
43645D59868J34271k45484j75946J55474J59225k08336m16675k35692l6141r0509
43635d99945j35585Q4009L02598J67250j41778j77192Q1946K55818J90804J17165
43625B45090J74633J92611M0352j42864k01403j73297j17405J4702J90037K19427
43615D41883M4237j16893r6238m6622j56548k81879j55972J38979K37361L2231
43605D0539j45501M623L22317L93116Q6325k77399l07632M398K87475K27963q4627
$$ y = [202256, 173294, 253838, 379911, 449159, 443418, 383848, 276249, 160934, 126399, 215772, 375349, 513263, 551572, 444156, 242697, 120339, 195176, 336703, 301827, 71986, -120253, -125238, -28672, 85880, 272179, 482475, 462428, 133719, -133092, 40620, 459868, 594139, 348655, 172709, 328183, 487408, 279072, -137603, -373295, -409436, -499945, -635530, -551521, -248923, -81673, -223451, -400643, -318697, -62879, 127925, 245090, 419723, 612334, 652686, 509822, 308419, 135122, 17717, 32419, 222456, 441883, 486120, 369227, 272989, 226367, 69819, -212060, -368032, -229053, 8308, 40539, -104962, -100339, 221978, 615094, 701419, 424020, 116388, 120786, 408261, 636224, 551597]
43594E51597l13853k98056j72731j02420q6777p9079r4471r2676N3955L14869
43584c19642L96698J01887l24559m46622j78413J53597K61476J80333Q7547N4194
43574c3504M7830L2827m268m0429m670J36568K93997L47111K87112J66065k8731
43563A199908k97271m82802m02089j14359J17079J38214K4928r0025j36299p4647
43553a17363O1027J09978k1224j43382j0820K64282L29598J37640J5586J06998
43543G32320J35082q8584k94041j85847N3557M9434j80317k96561j78026l4551
43533b87534k6640q3500r9392n4917O0327K24118K88497J22588j56160k89294
43523c01907k03370m4369P4887J49806J41105j044j67975j81774o8494j2487k8792
$$ y = [551597, 237744, -60312, -233043, -335463, -422240, -501319, -595790, -688466, -634511, -319642, 77056, 178943, -145616, -592238, -770651, -617054, -355578, -175245, -87698, -33504, 14326, 47153, 42885, 2456, -2214, 134354, 428351, 775462, 1062574, 1228639, 1199908, 902637, 419835, 17746, -96613, 20466, 158680, 183608, 93583, -42716, -117363, -56336, 53642, 32418, -110964, -121784, 142498, 472096, 609736, 625322, 732320, 867402, 778818, 484777, 298930, 352487, 401921, 221604, -74957, -252983, -287534, -314174, -397674, -497066, -551983, -491656, -267538, 20959, 143547, -12613, -301907, -505277, -549646, -474759, -324953, -183848, -184892, -352867, -534641, -603135, -615622, -644414]
43512f44414N5101K47149L07893J27232q2281j19896q3278j28319j52140L5169
43502d37784L46109M73829K79364o6066l07456l27593j65757M2297J41645Q5325
43492F3913j2991k9379L48m1786j41827j46846J2946K07854K64504J64347K9760
43481C70843m2282o6381r5214j23214j07510n8523l9336n5655k1569J01934J97630
43470F0723J24360o8610j75750r2494O7306J35696P6566k5696p7519m1197L8011
43459B1396N1180m7933j36882o0749J17757J59288j1651j74570j18041P8033J96230
43448G4058J79714J14037K6546r9729j84855j36646m7934r6636k41148k34665
43438f47258k817K05514J67693R980l137J12152Q6081j65291l61935k34480Q3518
$$ y = [-644414, -589313, -342164, -34271, 92961, 10680, -109216, -192494, -320813, -472953, -437784, -91675, 382154, 661518, 595452, 287996, -39597, -205354, -163057, -21412, 63913, 50922, 21543, 21891, -19895, -161722, -308568, -295622, -87768, 176736, 341083, 370843, 328561, 262180, 166966, 43752, -63758, -122281, -161617, -217272, -238841, -136907, 60723, 185083, 116473, -59277, -151771, -84465, 51231, 127797, 102101, 24582, -16615, 21396, 72576, 24643, -112239, -172988, -55231, 104057, 92406, -82164, -200205, -122172, 74058, 253772, 367809, 394355, 294626, 109771, -26875, -74809, -171445, -412593, -647258, -650075, -444561, -276868, -266888, -270025, -157873, -71792, -237083, -599018, -833498, -749980]
43427g49980K22975P4769r3335m6197J01510J09473q385l8056P6138J60833J05311
43416h4944O715k5683j4067J0945Q1958J48640O0816j66459k63151n7963K41706
43405f1487L22233J72226N091q4912j36648j13944K1463J08374k2764j99115r3621
43394h3104K31849L52322J25630q3659L061J41614k314k90993l37672r7251J26079
43383H5562J55944Q9660J6529q4498j56120o8774J24254J89793N6576o4855o342
43372C37729J09111P7643p8388j70902j22057k8382J3657K0676N3241J11063J24625
43361D48016L7519j00300j40597M084K06197K13610n5189l74946m51654k59652
43351d72912m9255k0442r1706n4543J15523K24125J44343J2381M0528K06212K67084
$$ y = [-749980, -527005, -452236, -545571, -591768, -490258, -380785, -389170, -427226, -351088, -190255, -84944, -78229, -103912, -117979, -107034, -25076, 123564, 184380, 17921, -245230, -303193, -61487, 260746, 432972, 438063, 353151, 216503, 102559, 124022, 232396, 209632, 10517, -83104, 148745, 501067, 626697, 543038, 546099, 687713, 685399, 394406, 56734, -40517, 85562, 241506, 331166, 347695, 263197, 107077, 38303, 162557, 352350, 408926, 344071, 337729, 446840, 524483, 446095, 275193, 153136, 124754, 138411, 159087, 212328, 323391, 448016, 485535, 385235, 244638, 248722, 454919, 668529, 613340, 238394, -213260, -472912, -522167, -542609, -634315, -688858, -573335, -349210, -204867, -192486, -151958, 54254, 321338]
43340C21338Q4105k03560l65631l25828j61477K5700J44823J16335m2680j83026
43330e89901j72551l9654J08971K39864L55674L85339K59929N6096q4313j45477
43320C73977j93643j82215r263K20519K30229l9095k82523k24788Q259J01630
43310C087J0798k9661Q1162J43103k2848k76785l32487j31115J12413K07119J78618
43299e6596J33533P2817n2276j79451j73938k1218J39212J91024J45871N2777
43289B51755p0890j72379j61578n3869R740k5379l0418P8731J67418R9177j4698
43278G7610O966J02043P8476l5953l3630J12745K12774J85695J38196Q6122r1583
43267H39461l39404l78096j13997J79979K55981K02949J82462J19690r1986k95447
$$ y = [321338, 405443, 201883, -163748, -489576, -651053, -625353, -480530, -364195, -406875, -589901, -762452, -802106, -693135, -453271, -97597, 287742, 547671, 603767, 519454, 373977, 180334, -1881, -11144, 209375, 439604, 400509, 117986, -106802, -98543, 3087, 13885, -15776, 65386, 208489, 185641, -91144, -423631, -554746, -442333, -235214, -56596, 76937, 149754, 97478, -81973, -255911, -277129, -137917, 53107, 198978, 251755, 180865, 8486, -153092, -206961, -197221, -222600, -253018, -174287, -6869, 92308, 77610, 84576, 186619, 265095, 229142, 195512, 308257, 521031, 706726, 844922, 931044, 839461, 500057, 121961, 7964, 187943, 443924, 646873, 829335, 949025, 857039, 561592]
43257E61592k69620q8141j0457j08431k33958k73499k21867q8765O6773J02602
43247e63771r444o4516Q8324K70892K32878N3764l253O5963M3421q6421j04892
43236g7055L6616J22585M6660k8420K5600J11452J18362Q2069L9005n0363j46092
43225B80419j24203j1321Q119r6385j28174N69J18551J01670O2836Q6373M6142
43214C44596j18532k07370p5423Q7963N7713o1966o4996m0645j85459l47723j71682
43203g83524L08997O11102M38862P1781m3180J41220L03101K09454n1056k51209
43193I55548k88587k31378j74865j21325k7205O9035N7360p2519j62490p3766
43183g0192J15801K01909J11504k6769o3795N424P8176Q4982N4662M8347N9094
$$ y = [561592, 291972, 203831, 193374, 84943, -149015, -422514, -644381, -733146, -666373, -563771, -573215, -637731, -549407, -278515, -45637, 8127, 4874, 70837, 114258, 27837, -77055, -40439, 82146, 128806, 100386, 125986, 237438, 355800, 437869, 476874, 426511, 280419, 156216, 144895, 153014, 56629, -71545, -70976, 47575, 149245, 212081, 298454, 344596, 226064, 18694, -56729, 31234, 88947, 26981, -38015, -78660, -264119, -611842, -783524, -474527, 136575, 575437, 647218, 604038, 745258, 1048359, 1257813, 1206757, 955548, 666961, 435583, 260718, 139393, 112188, 181223, 238583, 166064, 3574, -70192, 45609, 247518, 359022, 332253, 268458, 273882, 352058, 437040, 491702, 540049, 599143]
43172E99143K1436o5683r9534k6999M0444j3692j06125p9327K0159J2080q4633
43161B17269o0048J02587J47676l5375k08355j64021k8606K2969P2878K11433
43151B78407K43599j3162l32528l52038j11766M6375J7149q738M3720N9861N4268
43140g4853J66175L11753K35080k6887j18303Q3263K55736J27781j50164l08657
43130E00924l23718k77237j38414Q1332J90412P1964j08483j52877j02120o7674
43120c25891j408J40015J96702L2849j89363k25739j16033p3170j14044p8635
43110g54717N0246J26229J18111J50331K47436K65180J23406p1150j80427j71527
43100i6882p0668Q5019K17162K39171J53712M6467j7218l0687j6678k6486j10645
$$ y = [599143, 620579, 554896, 455362, 428363, 468807, 455115, 348990, 269663, 289822, 301902, 217269, 157221, 259808, 407484, 372109, 163754, -267, -28873, -5904, 66974, 278407, 522006, 508844, 176316, -175722, -287488, -241113, -223964, -232702, -188982, -129121, -74853, 91322, 403075, 638155, 611268, 492965, 576228, 831964, 959745, 809581, 500924, 177206, -100031, -238445, -157113, 33299, 105263, -3220, -156097, -258217, -325891, -327299, -187284, 9418, 42267, -147096, -372835, -488868, -562038, -676082, -754717, -704471, -578242, -460131, -309800, -62364, 202816, 326222, 255072, 74645, -96882, -167550, -82531, 134631, 373802, 527514, 573981, 556763, 526076, 509398, 482912, 372267]
43089C72267k16426k00699m3922N6371n1077k16692j85265K5349J52848P0080
43079b37166p6861j20979o6171J1225P4300Q1202j7152j62478j90869j9960K43180
43068d81729M15317L90027J85338o2148j60779l9928J36033J45505q154j25140
43058C94342j06744n5245n5305l7372O8570J91174K19613J41529J1545j20299
43048F51808j95418j63640o5957r392k6657n9331q8169j42383j65503n0882J38226
43037a77298J79784J9598j02034J7418K50805L34736K10545J3429j41353j90930
43027D14700p9549J23979J87630J1782j51480k5116K43867K62026k7146k67246
43017F93447k24277o6014q353q64N9569P2570p1780k34109k08585l9916O9717
$$ y = [372267, 155841, -44858, -88780, -32409, -83486, -300178, -485443, -460094, -307246, -237166, -314027, -435006, -501177, -489952, -415652, -334450, -351602, -514080, -704949, -724909, -481729, -66412, 323615, 508953, 446805, 286026, 246098, 382131, 527636, 519482, 394342, 287598, 232353, 177048, 139676, 208246, 399420, 619033, 760562, 772107, 651808, 456390, 292750, 226793, 217401, 190744, 131413, 43244, -99139, -264642, -315524, -177298, 2486, 22084, -79950, -62532, 188273, 523009, 733554, 746983, 605630, 414700, 335151, 459130, 646760, 658542, 507062, 481946, 725813, 987839, 960693, 693447, 469170, 403156, 394803, 393939, 453508, 526078, 454298, 220189, 11604, -28312, 41405]
43006D1405P2038O6692O2437j6998j24273j20076j6891K4302l4579m8528M8669
42995d5802J22193O2567l7308m2139K3715N0029J4168k7184m0872k2433K8680
42984H5614O6773J7134r4441j28145k7646P6975O2730m453p868J2581m4239j23692
42972a08677q6051M7099J08259L9016m8734p7053r3642j25855j08147j6421O1662
42961d08544O0498L2716M9336R4633J14483R6237O6893P5529J73804L25144L56505
42950A037234J33818k17537m16521l62893k13493j11103l0356N6848P0827j5304
42940f8480p6518j4801J01192J66850J64750Q2965j02976k73170k09572O2137
42930a67623K08836N1217j48727r7777O7389M3515j09587q9626J04684J63175
$$ y = [41405, 113443, 180135, 242572, 225574, 101301, -18775, -35666, -11364, -45943, -94471, -45802, 76391, 138958, 101650, 59511, 83226, 133255, 147423, 120239, 79367, 56934, 85614, 152387, 169521, 75080, -53065, -80711, -3736, 58994, 54541, 46673, 59254, 15015, -108677, -194728, -147629, -39370, -354, -49088, -126141, -219783, -345638, -453785, -470206, -408544, -348046, -315330, -265994, -171361, -56878, 39359, 106252, 181781, 355585, 680729, 1037234, 1171052, 953515, 536994, 174101, -39392, -150495, -180851, -124003, -53176, -68480, -144998, -159799, -58607, 108243, 272993, 355958, 252982, -20188, -229760, -167623, 41213, 92430, -56297, -154074, -86685, -43170, -152757, -242383, -137699, 25476]
42920B5476j2890j67350j26026k6190q774N766R9278J78343J59712J14039R6415
42909C37799L7898p7657j34805j00788j04681j77002j41225P1599K29842J36434
42899G7414l9776j7985J58846K14573P4454o6188p8899n3691q6450j22106p5639
42888a5447K7919R2105M7611j00480k54289k73292j25267M3951P9528J0850k9073
42877d95884k0518m5973r0654l1651J39762K46390J62246O297j5251R8732J35555
42866H9051l2521k39795k06253R1382L36877K40199q3038k33748k6774K87754
42856B23134L57621J39369j28930k46306j97522o1331P0357J10003N0184J0546
42846C27125Q7300J73306O7823k26369m56185m10256j44568J26217K55333K30520
$$ y = [25476, 12586, -154764, -280790, -306980, -315754, -309988, -210710, -32367, 127345, 241384, 337799, 375697, 298040, 163235, 62447, -42234, -219236, -360461, -288862, -59020, 77414, 37638, 19653, 178499, 393072, 467526, 401338, 322439, 268748, 182298, 60192, -15447, 12472, 104577, 152188, 51708, -202581, -475873, -601140, -557189, -477661, -466811, -495884, -516402, -562375, -653029, -684680, -544918, -298528, -136282, -129985, -145236, -46504, 89051, 56530, -183265, -389518, -298136, 38741, 278940, 195902, -37846, -64620, 223134, 580755, 720124, 591194, 344888, 147366, 86035, 156392, 266395, 316579, 327125, 414425, 587731, 655554, 429185, -27000, -437256, -581824, -455607, -200274, 30246]
42836C0246J22646M6892R1665J97830J74075o9371l49387l86352j41737J32325
42826a51168K01647J00512J6563K2929L6814J823k2715J8828P5559O8139K249
42815C71180n6807p1605l9749L2531J02589R1991j4454j20519j36829q1539J0853
42804H7642J76593L87186M33799J56462k53420m08654k01416Q6627J78534Q3733
42794G27086o9743k35966l58596k98746l4038K23711K75758J77648R4003N0265
42784E51382j7878r9806j57815k21283k81453k26046l9033R0040M7746K0087J95319
42773a38740M04681L56657J06438m4558l7078p0375j60049r1764J21422J47806
42763E94440j35551l84262k79200J9519J65330J22235Q2697Q6612M0892o630O0736
$$ y = [30246, 152892, 199784, 291449, 489279, 663354, 593983, 244596, -141756, -283493, -151168, 50479, 150991, 167554, 190483, 227297, 229120, 206405, 225233, 300792, 368931, 371180, 314373, 242768, 203019, 235550, 338139, 430130, 415676, 295157, 158328, 76789, 87642, 264235, 651421, 1085220, 1241682, 988262, 579608, 378192, 464819, 643353, 727086, 657343, 421377, 62781, -235965, -270003, -46292, 229466, 407114, 501117, 551382, 533504, 433698, 275883, 54600, -226853, -452899, -491932, -401892, -354146, -334059, -138740, 265941, 622598, 729036, 684478, 647400, 577025, 416976, 325212, 446634, 594440, 458889, 74627, -204573, -185054, -19724, 102511, 185208, 271820, 312712, 306082, 366818]
42752C66818J41731K3841k19215k50762K7739K81152K00339o8484j67980m8813
42742B86366K2883p4193j39298j4125J22561J9293k34157l00322o2453K35405
42732a38040L44211K83490J81496N9082q3335j41163n3026N0834K7432o0909r0543
42721C79529j18241k48837l57608k25665P5977K22805Q8536r8849j14460j0083
42711d06896N7537N4205J1379p6178j75317j78223m3872J36153K72037L49734
42701E59L38019J85859l6261j59703j37069p5317k2995O7140J27599q601k86285
42690g055l88701j67242J28407K08212R6774l4164j34059j69722j1966L10571
42680a68945M67424K31258j52582k94445j86234q6492m8434O8174K21531K08663
$$ y = [366818, 508549, 532390, 313175, 62413, 90152, 371304, 571643, 503159, 335179, 286366, 309249, 235056, 95758, 81633, 204194, 223487, -10670, -310992, -373445, -138040, 206171, 489661, 671157, 730239, 646904, 505741, 452715, 503549, 530981, 470072, 379529, 261288, 12451, -345157, -570822, -494845, -272040, -183504, -282353, -396813, -406896, -349359, -295154, -283775, -359953, -535270, -713493, -757365, -621212, -349175, 559, 338578, 524437, 488176, 328473, 191404, 116087, 93092, 160232, 287831, 279230, -7055, -395756, -562998, -434591, -226379, -129605, -163769, -297828, -467550, -479516, -168945, 298479, 529737, 377155, 82710, -103524, -190016, -238450, -170276, 51255, 259918]
42670B59918K5140j35792k09988k63177k21043L1900L12576L02831P1150J1299
42660A84814J99237K61669K3517j73634m2205J75566J27763q6144j49303p3388
42650D47892j08933k63310l01842j64538l0147K2023J02908K42648L02291K13738
42640D62730Q5591O358o8005j60596j74889m2553J42213K21644J50864L1952M115
42629F59424R6762J66387L7702k43175m03183k95871j32854j80396l37761k83340
42619i16305M700J93811J16289J5613J17562K51853J57513n6204p9441Q5803J32742
42608B3936m1365j70458n2451J39533J41491j5637r8702j6698J15056J70443J08066
42597C03214n8065k27190k22855q565J74361R1433j08977o3501K45374L92141
$$ y = [259918, 285058, 149266, -60722, -323899, -544942, -513042, -200466, 102365, 173515, 184814, 384051, 645720, 669237, 495603, 453398, 628964, 756727, 670583, 521280, 447892, 338959, 75649, -226193, -390731, -420878, -398855, -295947, -53299, 248992, 462730, 548321, 554679, 486674, 326078, 151189, 108636, 250849, 472493, 623357, 655309, 659424, 756186, 922573, 960275, 717100, 313917, 18046, -114808, -295204, -632965, -916305, -911605, -717794, -601505, -585892, -468330, -216477, -58964, -115168, -194609, -108806, 23936, -17429, -187887, -240338, -100805, 40686, 25049, -73653, -90351, 24705, 195148, 303214, 245149, 17959, -204896, -213461, -39100, 52333, -56644, -120145, 125229, 517370]
42587E17370R8279l45590m67766k38094k9307n0907j18054p348K10759L08962
42577a21696K17592P0588N404K4916N1787N5118Q5658J79428K61339K12141L4562
42566A076837j38856k32749l04163l65769k87307k0381K08874J48379j00739j88406
42556b04280M619K23365K21090O7261k0259K9006J26381J71008R9962q8686k59022
42545C70445k01823J01771L75697L37943L3940k29838k35941m0102J50642J83562
42535H46296O0320r5472j69553j70936j78658j90078j26082n74N8013J5745J3871
42524F2892J33974K21254R5169j58005k68263j12708J70244L58658L27875J10102
42514I41192j09860j21006O9786J94775O1936j63840k00993p6251n2289j72402
$$ y = [517370, 615649, 270059, -197707, -435801, -465108, -516015, -634069, -641417, -430658, -121696, 95896, 166484, 171888, 196804, 248591, 303709, 389367, 568795, 830134, 1042275, 1076837, 937981, 705232, 401069, 35300, -252007, -272388, -63514, 84865, -15874, -204280, -199661, 23704, 244794, 312055, 291796, 320802, 447183, 618191, 718153, 629467, 370445, 168622, 270393, 646090, 984033, 1017973, 788135, 552194, 512092, 662734, 846296, 906616, 811144, 641591, 470655, 291997, 101919, -24163, -24737, 33276, 49021, 62892, 196866, 418120, 513289, 355284, 87021, -25687, 144557, 503215, 831090, 941192, 831332, 710326, 780112, 974887, 1036823, 872983, 671990, 595739, 543450, 371048]
42504C71048j86516J2414J82301J07882p5423j37496j23320k06602l13482j97662
42494e66856J38678L84673L35640J33449k087p3071j81287k65087j74335M3693
42484b26590J39649j7658k58005l14754j28029J17170K00994P7219p9908k2604
42474e12516K99341N97888M97952o997m82491n48802l15607j48423j25704l935
42464g49294L00935N14517L98592R4515r5567q4818J7189J35473K33635K12048
42454I77225L2836j28421q1966P3629P7085r6413k12361j65449j19754j77515
42444A78896j69940M9529K97928K73952j7938k68841k70634j36387q0066j19535
42434b63036r3902P9063K61032K43265N716k35009k63664j01653N7691J09395
$$ y = [371048, 184532, 196946, 379247, 487129, 411706, 274210, 150890, -55712, -369194, -566856, -428178, -43505, 292135, 425584, 423497, 350426, 169139, -95948, -270283, -226590, -86941, -104599, -362604, -677358, -805387, -688217, -487223, -410004, -489912, -512516, -213175, 384713, 882665, 875668, 393177, -155625, -471232, -619655, -745359, -749294, -448359, 66158, 464750, 559265, 463698, 378880, 396069, 531542, 765177, 977225, 1010061, 881640, 799674, 873303, 950388, 853975, 641614, 476165, 356411, 178896, 8956, 58485, 356413, 630365, 612427, 343586, 72952, -63435, -143501, -263036, -356938, -277875, -16843, 226422, 232138, -2871, -266535, -368188, -310497, -201102]
42424b01102J27191J88242K29459J54379Q861n3365K6593J23657P7995r9450k23379
42413C59081j57352K859M2971p9832j72516q3871P4957J06961K9879K4814J25418
42402B73369J60582L6670j07949j06861K2369J56289K25195J97186K9480k27252
42392F59078l62786k07073J19810K89494J26531j91553l33972j77127P8223J55550
42382A56175K4875r8651p8280l7330j16597j95125o5460J91027K77260J31768
42372A89662J5345P6814J34733L3731p9563n2180k2988j41460k20919k2556K78839
42361A89458L05461O7607o2333M6336J17891k3436j80168j62607r0712j06577
42351A00920q0131J40854L98763M08051J41194j79124l63949l56809j74855N8425
$$ y = [-201102, -73911, 114331, 343790, 498169, 507030, 453665, 480258, 603915, 681910, 582460, 359081, 201729, 204588, 247559, 167727, -4789, -88660, -13703, 93258, 123137, 147951, 273369, 433951, 470621, 362672, 255811, 278180, 434469, 659664, 856850, 886330, 659078, 296292, 89219, 209029, 498523, 625054, 433501, 99529, -77598, 625, 156175, 181050, 82399, 4119, -33211, -149808, -344933, -410393, -219366, 57894, 189662, 205007, 281821, 416554, 450285, 370722, 318542, 295554, 154094, -66825, -89381, 189458, 494919, 562526, 500193, 546529, 664420, 640984, 460816, 298209, 207497, 100920, 20789, 161643, 560406, 968457, 1109651, 930527, 566578, 209769, 34914, 93339]
42341I3339J33819J314j08826k42J68860J07820j52971k94193j63107O0765J71872
42330A8450J72433J47442J15434Q2424P6406N5314o7687k41143k75228j09009
42320b5164P2618R6544M2240R2103K40992L06223J84300k9089j64808j38385M658
42309F82232J31286J25225R186o0325J7510J31940P9869j56901l43680k57339
42299C59003K7473J96915N9841k16984l07284j23925J01206J60685J40662K22336
42289F19928L41010K65066p591j74146l2532K27008K73283N1062k01694k76050
42279A085344j86057p2786l5891o0924m2046J09406L33491M46712L56740J92243
42269B126232J41845K19074K76092K08892O1789l8628K1763K72774O04168Q25610
$$ y = [93339, 227158, 228472, 119646, 119404, 288264, 396084, 243113, -51080, -214187, -153422, 18450, 190883, 338325, 453759, 536183, 612589, 667903, 600216, 359073, 83845, -25164, 47454, 143998, 186238, 278341, 519333, 825556, 1009856, 980767, 815959, 677574, 682232, 813518, 938743, 947929, 887604, 905114, 1037054, 1116923, 960022, 616342, 359003, 386476, 583391, 643232, 426248, 118964, -4961, 96245, 256930, 397592, 619928, 960938, 1226004, 1218413, 1044267, 1011735, 1238743, 1512026, 1563088, 1361394, 1085344, 899287, 826501, 790610, 729686, 687640, 797046, 1130537, 1577249, 1933989, 2126232, 2268077, 2487151, 2763243, 2972135, 3033924, 2995296, 3017059, 3289833, 3894001, 4719611]
42259D719611Q56993Q08390Q07262Q31433P95391O83802M75196P4414m83984q92512
42249H675996q99112p06066p29811r79793j034479p06522l49200l08945m15526
42240B546542l10515k1674J44340J13874P0879N0608j03043l63223m71295l51193
42230A305300k42482k76895k31843O8648L63041K75266j07518l14000j28440J54243
42220H65320J86885K1167n9218K8648J16648Q6290K481n4335r5916j05994J7307
42209A009283K75410M43419K93603r8372m16620m58670k89725n9847J54629K85750
42199A138860K37295L4840j15970o2688Q4432J11262J624p0346j6853N2921K0950
42188A416327o5091o3887O8680K01838J48406j07942l15095j97060J57169L11778
$$ y = [4719611, 5576604, 6384994, 7192256, 8023689, 8819080, 9502882, 9978078, 10052492, 9568508, 8675996, 7776884, 7070818, 6341007, 5361214, 4326735, 3620213, 3271013, 2962068, 2546542, 2236027, 2214353, 2358693, 2472567, 2543446, 2594054, 2491011, 2127788, 1656493, 1305300, 1062818, 785923, 554080, 622728, 985769, 1261035, 1153517, 839517, 711077, 865320, 1052205, 1073372, 1014154, 1042802, 1159450, 1245740, 1248221, 1193886, 1097970, 991976, 1009283, 1284693, 1728112, 2021715, 1923343, 1506723, 1048053, 758328, 698481, 853110, 1138860, 1376155, 1410995, 1295025, 1232337, 1316769, 1428031, 1429655, 1359309, 1342456, 1395377, 1416327, 1351236, 1287349, 1356029, 1557867, 1706273, 1598331, 1283236, 1086176, 1243345, 1555123]
42178A555123K9019l60876l62551J7209K99456K05879k7209q2352J2103O1174
42168A346975M3813L6257j4849j76705l03935j94095Q0756K37437J62801J8666
42158A237121l6965k7200k0721o487K8452L7824J311l1092k1208J9910Q4261J49156
42146A414362J18585p0897k82265k92215j06378L0401n77l0483P9525J80527Q7642
42135A128227q5523q6067R1970K31902K47102K51955K85409K17066j1060k54347
42125B016634l58489l25175k24208r7622j3444m8813j36971r2175J13007K51102
42115A083846J41277r3336k03093j19984M9169K09051K96162K32431M2840p4374
42105A563989J6043J61416J25094o8634k08489k32356k34963k01538l4477J65128
$$ y = [1555123, 1584142, 1223266, 860715, 877924, 1177380, 1383259, 1356050, 1273698, 1285801, 1346975, 1390788, 1427045, 1412196, 1235491, 931556, 737461, 818217, 1055654, 1218455, 1237121, 1200156, 1172956, 1152235, 1145748, 1174200, 1212024, 1213335, 1182243, 1161035, 1180945, 1265206, 1414362, 1532947, 1462050, 1179785, 887570, 781192, 811593, 811016, 780533, 860058, 1040585, 1128227, 1042704, 956637, 1048607, 1280509, 1527611, 1779566, 2064975, 2282041, 2270981, 2016634, 1658145, 1332970, 1108762, 1011140, 997696, 948883, 811912, 719737, 832744, 1083846, 1225123, 1131787, 928694, 808710, 857879, 1066930, 1363092, 1595523, 1638363, 1563989, 1580032, 1741448, 1866542, 1797908, 1589419, 1357063, 1122100, 920562, 886085, 1051213]
42095A051213J66760N211k5992J33759J78144m4257k25193p5068J93737J97928
42085A556242k3257j25166l3140K132j08139j35667O3061L04922L61568K52100
42075B114656J34471Q0849O9042O1994J1833j01850j84359r6480J39604L24606
42065B554366L18945J83225M7032m0782q4966q0174k9949M5566J36356K06023
42055C255642J68871K3057n1139R6951L22964L56744K12727J54767K31418J81376
42045D953378q1569k36214l7077K60434K64209K3998j00658k0237Q425j46403
42035D888286k97031k70864j44305m0479O2555J88724K27974J11179q189P7859
42025D795709L35633N07456M29104K37230K28352N37088R70179J182913J056701
$$ y = [1051213, 1217973, 1223184, 1197192, 1330951, 1509095, 1464838, 1239645, 1164577, 1358314, 1556242, 1532985, 1407819, 1374679, 1376811, 1268672, 1133005, 1196066, 1500988, 1862556, 2114656, 2249127, 2329976, 2399018, 2461012, 2472845, 2370995, 2186636, 2090156, 2229760, 2554366, 2873311, 3056536, 3103568, 3062786, 2977820, 2897646, 2867697, 2913263, 3049619, 3255642, 3424513, 3447570, 3396431, 3493382, 3816346, 4173090, 4385817, 4540584, 4772002, 4953378, 4871809, 4635595, 4598518, 4858952, 5123161, 5147159, 5046501, 5026264, 5034689, 4888286, 4591255, 4320391, 4176086, 4135607, 4198162, 4386886, 4614860, 4726039, 4717850, 4795709, 5131342, 5638798, 6067902, 6305132, 6533484, 7070572, 8040751, 9223664, 10280365]
42016A0280365Q78718J064231J685513K378148K785734L002493L415108M098210
42008B9588520M536260M074020K576086N26940j445120k959907l854219m079608
42000B8962972l801590l387428l064304k712538k193312j705206j514345j464640
41992I119609j155828n88083k10563k56541m43900m81367m61560n23145n10888
41983D487734k88920p3099r4357j91453j11384J7595p4824k78643k73431r8390
41973C020828q2381k57124l09514j31036L7162O7251J15953K26287J76559j07364
41963B756621l53022l41093j90747p4152M2559J83957J96332K3079j09740j5130
41953B118664J69735K32547J98511J78850J30378N378o0473M2058J77689J95492
$$ y = [10280365, 11159083, 12223314, 13908827, 16286975, 19072709, 22075202, 25490310, 29588520, 34124780, 38198800, 40774886, 41301826, 39856706, 36896799, 33042580, 28962972, 25161382, 21773954, 18709650, 15997112, 13803800, 12098594, 10584249, 9119609, 7963781, 7375698, 7165135, 6908594, 6464694, 5983327, 5521767, 4998622, 4487734, 4198814, 4125715, 4031358, 3839905, 3728521, 3746116, 3671292, 3392649, 3119218, 3020828, 2938447, 2681323, 2371809, 2240773, 2277935, 2345186, 2461139, 2687426, 2863985, 2756621, 2403599, 2062506, 1871759, 1797607, 1840166, 2024123, 2220455, 2243534, 2133794, 2118664, 2288399, 2520946, 2719457, 2898307, 3028685, 3034063, 2973590, 3015648, 3193337, 3388829]
41943C388829J85246K50768K32993k6100l14827l09687r5183m9684k57122m10369
41933B594864l20513j56848r1587l6842J09967K23735J49809l1711j23482p8374
41923B239018N308O8477J20347J29851L1850j44499k51326j74619K4780J66332
41913B215519J43159K0506p4175j00161q3152j2925J15370J93169R8466q7347
41903B428429j47634n3537n845p7239o4253J45844L10603J83504o4960p8892J53198
41892B729218L15701K48256R6279m226q3439j45467j02144L0547J09138J03711
41882C297574J37495K21891J90272o513j64409j17115K4280N9345l1004j34382
41872C477434j90139j91302j17286J2196J03118R9768M7952j1456r6187j72593
$$ y = [3388829, 3574075, 3824843, 4057836, 4031736, 3716909, 3407222, 3312039, 3262355, 3005233, 2594864, 2274351, 2117503, 2025916, 1989074, 2099041, 2322776, 2472585, 2440874, 2317392, 2239018, 2244326, 2312803, 2433150, 2563001, 2594851, 2450352, 2199026, 2024407, 2049187, 2215519, 2358678, 2379184, 2305009, 2204848, 2121696, 2108771, 2224141, 2417310, 2515776, 2428429, 2280795, 2227258, 2221413, 2144174, 2079921, 2225765, 2536368, 2719872, 2654912, 2576020, 2729218, 3044919, 3293175, 3389454, 3385228, 3301789, 3156322, 3054178, 3084725, 3193863, 3297574, 3435069, 3656960, 3847232, 3840719, 3676310, 3559195, 3583475, 3642820, 3611816, 3477434, 3287295, 3095993, 2978707, 2990903, 3094021, 3193789, 3241741, 3230285, 3134098, 2961505]
41862B961505j36288J3152J20480R2799K6026J2060j7602j13550j29287Q5428
41852B914723M07286N48194L95567Q9867j88565l56847l90056k98059j43245J7907
41842B996772J85502L32751L56745K36923J50585K51635L95944L05087m863j94692
41832E012389o3707J82328K56252K00878K73755N13911O60778N40320L41968L77990
41822H296862O56085Q58662P67038N59905N79909Q85352J193701J270020J202146
41813A6269680J208515J310445J343717J231912J086225J027559J046314J089449
41805B5613816J185590J402537J730125K089025K453779K898716L476058M061579
41797D4911225M362261M099779L185693J739190L559j716026l110666l986805
$$ y = [2961505, 2825217, 2838369, 2958849, 3051648, 3077674, 3089734, 3072132, 2958582, 2829295, 2914723, 3322009, 3870203, 4265770, 4355637, 4167072, 3810225, 3420169, 3122110, 2978865, 2996772, 3182274, 3515025, 3871770, 4108693, 4259278, 4510913, 4906857, 5211944, 5207081, 5012389, 4948682, 5131010, 5387262, 5588140, 5861895, 6375806, 7036584, 7576904, 7918872, 8296862, 8952947, 9811609, 10578647, 11138552, 11718461, 12603813, 13797514, 15067534, 16269680, 17478195, 18788640, 20132357, 21364269, 22450494, 23478053, 24524367, 25613816, 26799406, 28201943, 29932068, 32021093, 34474872, 37373588, 40849646, 44911225, 49273486, 53373265, 56558958, 58298148, 58301707, 56585681, 53475015, 49488210]
41789D9488210m351830m335145m050715l604290l165881k867049k624251k248807
41781B2240242j780681j508495j546836j604629j374191r85049q01617q61881
41773A1776863q35460n55061k73846k68865m44066n21771m47669l71636l27838
41764G730651j90838N1561K11338J64891L7376P430M7992J5095o6134K699K63890
41753H275951M34813K18001k80827o12154m91272j14728J09827M4741r6941j04960
41743G382451m0303r0123k64377l61064k31146J6703J39127N3067p5728o5138
41733F463469M6912R1726M5727O5661K18728L36108K45497L3124p6508k7950N2035
41722G494529J09417K24332L92604M57008L52842K42921K67893L11802K00182
$$ y = [49488210, 45136380, 40801235, 36750520, 33146230, 29980349, 27113300, 24489049, 22240242, 20459561, 18951066, 17404230, 15799601, 14425410, 13440361, 12638744, 11776863, 10941403, 10386342, 10112496, 9843631, 9399565, 8877794, 8430125, 8058489, 7730651, 7539813, 7591374, 7802712, 7967603, 8004979, 8012409, 8060401, 8075496, 8009362, 8012061, 8275951, 8710764, 8928765, 8647938, 8035784, 7544512, 7429784, 7539611, 7584352, 7487411, 7382451, 7342148, 7252025, 6987648, 6626584, 6395438, 6412141, 6551268, 6604335, 6528607, 6463469, 6510381, 6602107, 6647834, 6713495, 6932223, 7268331, 7513828, 7546952, 7470444, 7442494, 7494529, 7603946, 7828278, 8220882, 8677890, 9030732, 9273653, 9541546, 9853348, 10053530]
41713A0053530K1657K4255K32732M07689M03637L28246K74642J47397q5932j97367
41703A1610486p926K53367K12423q2486j99489K2928K13571L3920l01928l62749
41693A1392117j51133o2528k68057m96767m78541k97701j87644k11574k93687
41684H944485l81539m19544l10743p4931O7550n4225k98672l61559j46934J53615
41674G117503L17168K86715J34657l3209j29516j45171j61915k31832k81910k37225
41664F635265j86053k74862m58649n25577l97872k43999k21477k51325j58701
41655C916750N7942K21720K01354M2861j09406j54508j02586m5844n7800j04623
41645C865860q8243L648M9326m9601k07472k33559o6577J45012K19748J41403
$$ y = [10053530, 10075187, 10099442, 10332174, 10739863, 11143500, 11471746, 11746388, 11893785, 11807853, 11610486, 11602560, 11855927, 12068350, 11985864, 11786375, 11809303, 12022874, 12056794, 11754866, 11392117, 11240984, 11178456, 10910399, 10413632, 9935091, 9637390, 9449746, 9238172, 8944485, 8562946, 8143402, 7832659, 7757728, 7825278, 7771053, 7472381, 7110822, 6963888, 7117503, 7434671, 7721386, 7856043, 7822834, 7693318, 7548147, 7386232, 7154400, 6872490, 6635265, 6449212, 6174350, 5715701, 5190124, 4792252, 4548253, 4326776, 4075451, 3916750, 3974692, 4196412, 4397766, 4440627, 4331221, 4176713, 4074127, 4028283, 3970483, 3865860, 3777617, 3781265, 3830591, 3780990, 3573518, 3339959, 3273382, 3418394, 3638142, 3779545]
41635C779545L8834Q596K4016K3272K2769R1779K37207L72174M11965L60126K77974
41624E648257K04015J39788R9233J31036K73337M86861O41825O01584L53914M9715
41614H629565j25946j14945J3385J84953L59700M64227M12847K45895J45366K40557
41604A0455604M75398P34586J010077J341378J655957J781267J590479J068987
41596B0113733L00219n23118j143337j419023j433650j336959j152842q67782
41588A2537241o13580n56424o34316o22830m78423l95197m61864m89129l04358
41579G981120k8357J12659J14442J40144K19254K08725N4499p9712n927K56858
41569H973705M98148N22510L19728O0325o5190j8873O7099M0814j18526k90589
$$ y = [3779545, 3818379, 3826975, 3850991, 3874263, 3897032, 3988811, 4226018, 4598192, 5010157, 5370283, 5648257, 5852272, 5992060, 6091293, 6222329, 6495666, 6982527, 7624352, 8225936, 8579850, 8629565, 8503619, 8388674, 8402059, 8587012, 8946712, 9410939, 9823786, 10069681, 10215047, 10455604, 10931002, 11665588, 12675665, 14017043, 15673000, 17454267, 19044746, 20113733, 20413952, 19890834, 18747497, 17328474, 15894824, 14557865, 13405023, 12537241, 11923661, 11367237, 10732921, 10110091, 9631668, 9236471, 8774607, 8285478, 7981120, 7952763, 8065422, 8179864, 8320008, 8539262, 8747987, 8802486, 8722774, 8716847, 8973705, 9471853, 9994363, 10314091, 10374416, 10309226, 10290353, 10357452, 10398266, 10279740, 9989151]
41559I989151l22330j63734N2762R6172j08863l27832k50074R7505L27945J73579
41549I564281j56116k38205M5165M23311O13243N88114M70618L49963K78384L11791
41539A2250549M45600N76309O11129N77166N62126N91166O33959P02459Q48742
41530A7799205J051337J187604J181732J138106J243150J529678J825660J988790
41522B8945262K117791K431909K977244L580468M104906M613599N218591N914043
41514E9903813O693552P729028R243856J1244059J3584911J6329531J9806974
41507A44535724K4191317K9220146L4457861L9446568M3000416M2417646L4394140
41500C91663818J7826628m036982k4784763l8766257m4218203m3067900l8459986
$$ y = [9989151, 9666821, 9503087, 9555849, 9652021, 9543158, 9215326, 8965252, 9062757, 9390702, 9564281, 9408165, 9169960, 9215125, 9638436, 10251679, 10839793, 11310411, 11660374, 11938758, 12250549, 12696149, 13272458, 13883587, 14460753, 15022879, 15614045, 16248004, 16950463, 17799205, 18850542, 20038146, 21219878, 22357984, 23601134, 25130812, 26956472, 28945262, 31063053, 33494962, 36472206, 40052674, 44157580, 48771179, 53989770, 59903813, 66597365, 74326393, 83570249, 94814308, 108399219, 124728750, 144535724, 168727041, 197947187, 232405048, 271851616, 314852032, 357269678, 391663818, 409490446, 405453464, 380668701, 341902444, 297684241, 254616341, 216156355]
41493B16156355l2769054k7266093k2529275j8660230j5429455j2618477j0239456
41486G6644315q372236o959261n890258n140155m662900m255289l705196l040616
41478C4618404k492847k214663k124492k021198j781836j448589j166451j035088
41470B0333240j014442r95545r35922q58886p58800o30865n75436o98702q80532
41461A2984110q38897n13887j98489j56960k89702l44903k98741l03675l73861
41452I664995l71826k59635j32022j7873J32053K58784K19279L6926p4197l284
41442I453200J11936J12744M0829M1379J67062L66334N66330O90103O83533N97722
41432A2831172N62643O20947O77091O60532O19893N77324M26755J17757j63212
$$ y = [216156355, 183387301, 156121208, 133591933, 114931703, 99502248, 86883771, 76644315, 68272079, 61312818, 55422560, 50282405, 45619505, 41364216, 37659020, 34618404, 32125557, 29910894, 27786402, 25765204, 23983368, 22534779, 21368328, 20333240, 19318798, 18323253, 17387331, 16528445, 15769645, 15138780, 14563344, 13864642, 12984110, 12145213, 11631326, 11432837, 11275877, 10986175, 10641272, 10342531, 10038856, 9664995, 9293169, 9033534, 8901512, 8883639, 9015692, 9274476, 9493755, 9530681, 9456484, 9453200, 9565136, 9677880, 9718709, 9760088, 9927150, 10293484, 10859814, 11549917, 12233450, 12831172, 13393815, 14014762, 14691853, 15352385, 15972278, 16549602, 16976357, 17094114, 16930902]
41423A6930902j84498q327N7972j18356l10672k70541r8751j00024l33006n18849
41413A5045850m38204k26817j51571k34948k86291k31617j97883k68438l60573
41404A2649508l99662m29449m63497l96375j79859M9831J41394J10642N6677L3432
41394A1172642J01915L30370O02699O30566L53994J21413K10877L80092K41690
41385A4146258q7545j66542J5447j0370m07570p18598n61085j99697r8278k43583
41375A1668437k97730j85850j16275j31081l3248K39132M83353N29210M35055
41366A2591003L35457K77252K62862L17331M54295O49702Q59291J014123J052023
41357A7813339J029100J123334J421277J776667K002670K126328K304284K542796
$$ y = [16930902, 16746404, 16738077, 16796049, 16677693, 16367021, 16096480, 15997729, 15897705, 15564699, 15045850, 14607646, 14380829, 14229258, 13994310, 13708019, 13476402, 13278519, 13010081, 12649508, 12249846, 11820397, 11356900, 10960525, 10780666, 10830497, 10971891, 11082533, 11139210, 11172642, 11274557, 11604927, 12207626, 12838192, 13192186, 13313599, 13524476, 13904568, 14146258, 14058713, 13892171, 13907618, 13897248, 13489678, 12771080, 12209995, 12010298, 11912020, 11668437, 11370707, 11184857, 11068582, 10937501, 10904253, 11143385, 11626738, 12155948, 12591003, 12926460, 13203712, 13466574, 13783905, 14238200, 14887902, 15747193, 16761316, 17813339, 18842439, 19965773, 21387050, 23163717, 25166387, 27292715, 29596999, 32139795]
41349C2139795K658344K492800K048468J461012R65461Q17079J078786J524315
41341D5186060J900072K229418K699927L327965L952582M519553N123030N747386
41333G4685993O194768O307017O047011N325462L994724K116433L1216j948346
41325A02754278l739784n305171o485574p166394p421173p335924o873662o092426
41317E2334170n307428m785621m403714l872037l210696k715109k479331k260792
41309B3299442j876438j462723j224538j142794j079722j006860r60839q90213
41301A3655315p21677n16683m06437l96458l61400k20533j6108J63663K42568
41292A1422250J66133l2216j92363j82764r3339j32059l10036l95590k50059l9804
$$ y = [32139795, 34798139, 37290939, 39339407, 40800419, 41765880, 42582959, 43661745, 45186060, 47086132, 49315550, 52015477, 55343442, 59296024, 63815577, 68938607, 74685993, 80880761, 87187778, 93234789, 98560251, 102554975, 104671408, 104702624, 102754278, 99014494, 93709323, 87223749, 80057355, 72636182, 65300258, 58426596, 52334170, 47026742, 42241121, 37837407, 33965370, 30754674, 28039565, 25560234, 23299442, 21423004, 19960281, 18735743, 17592949, 16513227, 15506367, 14545528, 13655315, 12933638, 12416955, 12010518, 11614060, 11252660, 11032127, 11016019, 11179682, 11422250, 11588383, 11556167, 11363804, 11181040, 11087701, 10955642, 10645606, 10250016, 9999957, 9960153]
41282I960153J5259m0521j4973R7291J25069L8349J2109J15580J56254l9830l54400
41271A0070340n42902n68357n97344p11809p92993p05694m77987k64037j96414
41262E212803k85864m14006m32927l21590k16420k28789k82012k26138p5929k290
41252B726838q1570j86087j67940m1079Q1155J38124J37766R0668R888o1380q3616
41241B562767n5610J4770J16464J75264P9388j51163l07441k33266o4419n8592
41231B078162k08892k40975n0018R8399k5807k11951r4121K56402L82072J28673
41221B111944q3872J14726M53360L88806j01218m84612m06175p6197J44759J99556
41211B261077K05519J66362N9189J0913J25836K58368K01158J6607n2312N5163
$$ y = [9960153, 9975412, 9934891, 9919918, 10017209, 10142278, 10180627, 10192736, 10308316, 10464570, 10424740, 10070340, 9527438, 8959081, 8361737, 7649928, 6856935, 6151241, 5673254, 5409217, 5212803, 4926939, 4512933, 4080006, 3758416, 3541996, 3313207, 3031195, 2805057, 2729128, 2726838, 2645268, 2459181, 2291241, 2250162, 2331317, 2469441, 2607207, 2697875, 2707763, 2646383, 2562767, 2507157, 2521927, 2638391, 2813655, 2893043, 2741880, 2434439, 2201173, 2136754, 2078162, 1869270, 1628295, 1578277, 1676676, 1650869, 1438918, 1344797, 1601199, 1983271, 2111944, 2028072, 2142798, 2596158, 2984964, 2883746, 2399134, 1992959, 1916762, 2061521, 2261077, 2466596, 2632958, 2692147, 2703060, 2828896, 3087264, 3288422, 3305029, 3252717, 3307880]
41201C307880J74325K03281K03893K12352J70098P9314L1098L0185k9003j57576
41191D225847k21625j71062j51052k82861m70932n40510m59615l13402j46424
41182A468364M6467K14973K48889R6941j41725k61551j32627J18098J84025n3131
41172A788723l09305k30702J03992K52856Q012l34017l98700j88909M0563J50493
41162H83006J57551P4024o4397j19362j5640R2092J8642j59997k20297j29496
41152E16126m5903k6517K1423J00585Q0216o6256j97351k30913k29589k01250
41142b79429m0950K21799L38242J70673o2781o9340J12118J95862P0583q3664
41132E73113r5212j6264J7517j1077l1691k3762k4384m2548m8692l7195l1871
$$ y = [3307880, 3482205, 3685486, 3889379, 4101731, 4271829, 4351143, 4382241, 4412426, 4383423, 4225847, 4004222, 3833160, 3682108, 3399247, 2928315, 2387805, 1928190, 1614788, 1468364, 1514831, 1729804, 1978693, 2075634, 1933909, 1672358, 1539731, 1657829, 1841854, 1788723, 1479418, 1248716, 1352708, 1605564, 1613576, 1279559, 880859, 691950, 732513, 883006, 1040557, 1114581, 1050184, 930822, 915182, 1007274, 1025916, 865919, 645622, 516126, 470223, 443706, 465129, 565714, 645930, 579674, 382323, 151410, -78179, -279429, -320379, -98580, 239662, 410335, 347554, 278214, 390332, 586194, 656777, 573113, 477901, 461637, 479154, 468077, 436386, 412624, 388240, 345692, 297000, 259805, 227934]
41121B27934k1179N1703J93501K90542K03415m9810k61173k36719r921K01071
41111E89364K36202J34470L5040J0004K4701J1332n5723j28013j11334K9227J81784
41100I57054J79359J7679j03560l2641J22147J51468N4871J9594R3771R1182q7887
41089A463037k41508j58413J8615j7547k47380l39422k04232j85882m92322p31172
41079a136226l79368M20480R44178P85253K93256J675j9190p676j5625P3223J83049
41068A143029R3083j53852k23849K7796L01420K28524j58593m84559m67724j74170
41058A31105J15394J93687R2501P067N4176J31935Q0728o2302j07142o602O8958
41047F99505J2297m9704J2026R5423N0964l2572L2361J72764J17335j54964l12353
$$ y = [227934, 206755, 258458, 451959, 742501, 945916, 896106, 634933, 398214, 388293, 589364, 825566, 960036, 995076, 1005080, 1029781, 1041113, 985390, 857377, 746043, 775270, 957054, 1136413, 1154092, 1050532, 1017891, 1140038, 1291506, 1346377, 1365971, 1459742, 1550924, 1463037, 1221529, 1063116, 1081731, 1064184, 816804, 477382, 273150, 87268, -405054, -1136226, -1515594, -1095114, -150936, 634317, 927573, 929248, 910058, 902382, 886757, 959980, 1143029, 1236112, 1082260, 858411, 886207, 1187627, 1416151, 1257558, 772999, 305275, 131105, 246499, 440186, 532687, 539754, 593930, 725865, 806593, 744291, 637149, 630547, 699505, 711802, 662098, 674124, 769547, 820511, 787939, 820300, 993064, 1110399, 955435, 643082]
41036F43082j42638J14488J15824q1820j42072P180O5429j52003m00009l48776
41026c21315n7353J19372J6460j67405j87109n5945L9671J1555m3189J0090J72213
41015d62955K95153K40067N1307p6298l9779L9535J2252n6525K688J60307K02144
41004C67896O5912n4090j6801N8083J9401o6687o9058l7756r1575j69896j17642
40993a12213M5530J51016J35519P2752n847j07802j30150L9493K62739K50525
40983F01562j5697k11163j17947Q3569J14159j9085j15774r8768l9990J7479O7237
40972B65582M3054r9050k40870k09738j2632J70493K12309J39137K8107p4288
40962B22104j35152j41268j23601j02248m0142O5543J08190J5974q0536N360K15054
$$ y = [643082, 500444, 614932, 730756, 648936, 506864, 514044, 579473, 427470, 27461, -321315, -378668, -259296, -242836, -410241, -597350, -653295, -613624, -602069, -645258, -635168, -462955, -167802, 72265, 123572, 47274, 7495, 47030, 59282, 2757, 5445, 165752, 367896, 433808, 379718, 362917, 421000, 440401, 373714, 304656, 266900, 175325, 5429, -112213, -66683, 84333, 219852, 292604, 286757, 178955, 48805, 88298, 351037, 601562, 585865, 374702, 256755, 340324, 454483, 435398, 319624, 220856, 180866, 198345, 265582, 308636, 209586, -31284, -241022, -253654, -83161, 129148, 268285, 296392, 222104, 86952, -54316, -177917, -280165, -320307, -254764, -146574, -130600, -211136, -205776, 9278]
40951I278K84070J28125p120J00091L04573K88180J6588k03825j36934R7167K27818
40940A108011J84425J01890N5401k4666j58677k20724j38023n0338j13357k29382
40930E14560j72740M0817J36202j3882j83416j29186M8715Q1942m7041j02215
40920A73756J8182J34151Q4868k5997j6027P7656N3452j45738l36066l35013j84076
40909e00852n6226j5275K2666J03726J39502N4118o8593q5765J2239J19232J80514
40898i4714K11754J75811P244k14071k80408j18639J01044J91231J46599M4485
40888A70336q7970j88871j10840J68231M05997L58673R7620j15840j79407j71659
40878C46270j17417J2999J11291J6993j82001k02698J1582J74342O6447j67411
$$ y = [9278, 293348, 421473, 414353, 514444, 819017, 1107197, 1123785, 919960, 783026, 880193, 1108011, 1292436, 1394326, 1449727, 1425061, 1266384, 1045660, 907637, 857299, 743942, 514560, 341820, 382637, 518839, 504957, 321541, 192355, 241070, 323012, 275971, 173756, 191938, 326089, 410957, 384960, 368933, 446589, 500041, 354303, 18237, -316776, -500852, -557078, -572353, -549687, -445961, -306459, -252341, -320934, -406699, -394460, -275228, -94714, 117040, 292851, 300095, 86024, -194384, -313023, -211979, -20748, 125851, 170336, 82366, -106505, -217345, -49114, 356883, 715556, 813176, 697336, 517929, 346270, 228853, 241852, 353143, 370136, 188135, -14563, -2981, 171361, 237808, 70397]
40868G0397k74189k36573j79625j03624O4734K49597K80885J50580K9768K0539
40858G2489M7250K7355R060O0274J14985M4421j34116k24104q4552J57034K26054
40847C16150L8704j92427k39970j28269j4540P5893K14393L34931K62605o25k19199
40836D47646k18989p9086L3531O1341J4945j00639k14566j91725k5837R3443K7581
40825a52355j11966j36307l7779O2257J20086J65349J68115P7448m8952j02434
40815C462q3647p5998q8404n4427K8492P9298M9134l6061j29426j73712r8013
40804e79302Q9394K35681J86615j3010j60804j34002j173R4113Q4157J8555J2166
40793a67610J32464K99660L46489K15078K0153j23934k27004l07650k95217j63490
$$ y = [70397, -203792, -440365, -619990, -723614, -658880, -409283, -128398, 22182, 51950, 72489, 119739, 147094, 156154, 216428, 331413, 375834, 241718, 17614, -66938, 90096, 316150, 354854, 162427, -77543, -205812, -220352, -144459, 69934, 404865, 667470, 666845, 447646, 228657, 149571, 183102, 244443, 259388, 158749, -55817, -247542, -273379, -179936, -152355, -264321, -400628, -438407, -376150, -256064, -90715, 77400, 154848, 105896, 3462, -80185, -156183, -244587, -299014, -270522, -191224, -142090, -178151, -307577, -481289, -579302, -489908, -254227, -67612, -80622, -241426, -375428, -376601, -282488, -198331, -179776, -167610, -35146, 264514, 611003, 826081, 846234, 722300, 495296, 187646, -107571, -271061]
40783b71061l3100l934j0649J0547l6306k04906l00445j29884J57206K63106J92775
40772c66651J95988L08374L01336J08750m6150l0182J1762m5287j13961j17077
40762B06902j18735j11225L2171K47339K39657n0650k60275j31101P7077J7487
40752A48647j73612j31628J07690J81426J8172o2835J01680K69814J98784j9442
40742F38696j68051k04840k01373j66595p9731J6460O5085O2515K5729k4984l3485
40731g0574L7925J14039Q4797k0482p3125o1154r9490j94119j77792L4156K72331
40720a53488L08870J27238r8512k15837j95199p8136Q1315K27652L02745K54430
40710E61078P6874j36789k42044k05745j58429k01100k39587j35038N9197J73865
$$ y = [-271061, -304161, -308095, -318744, -308197, -344503, -549409, -849854, -979738, -822532, -559426, -366651, -170663, 137711, 439047, 547797, 501647, 471465, 483227, 437940, 323979, 206902, 88167, -23058, 9113, 256452, 496109, 445459, 185184, 54083, 131160, 148647, -24965, -156593, -48903, 132523, 150695, 87860, 189540, 459354, 658138, 638696, 470645, 265805, 64432, -102163, -181894, -165434, -100349, -37834, -12105, -37089, -70574, -32649, 81390, 166187, 145705, 72580, 11426, -88064, -282183, -459975, -425819, -153488, 155382, 282620, 184108, -31729, -226928, -305064, -223749, 3903, 306648, 561078, 637952, 501163, 259119, 53374, -105055, -306155, -545742, -680780, -621583, -447718]
40700d47718J73706J40206O0014j28441k91072j81098J72002M21608L62031J86899
40690D68137J51284K05598J54244l709j05336p9709P691P7115O2515p5386k38640
40679F23804k29107l1834R7493q811j64826j37346l3100r2073k37736j86940M9950
40668c50526J52255M152j26538l1511J27250J16555n927l1052O9567J49828J26897
40657B00950M7240k5955o7504o7429k6088O0360K16269M02290M35737J63956k56839
40646A082987m57342l06313o1968K9134M8205J47716K18277Q1800j51659k32914
40636C97923j77113j87088k27761n2445L03340M34161J29813k82468l77496j70465
40626b09599K5248P5686P6979O4806j7065j11360r7227l4258q6291j95225j23847
$$ y = [-447718, -274012, -133806, -73792, -202233, -493305, -674403, -502401, -80793, 281238, 468137, 619421, 825019, 979263, 975554, 870218, 790509, 798200, 875315, 937830, 862444, 623804, 394697, 362863, 460356, 451545, 286719, 149373, 116273, 24200, -213536, -400476, -350526, -198271, -194119, -320657, -352168, -224918, -108363, -114290, -145342, -75775, 74053, 200950, 248190, 222235, 154731, 87302, 61214, 121574, 337843, 740133, 1175870, 1339826, 1082987, 625645, 319332, 257364, 286498, 334703, 482419, 700696, 782496, 630837, 397923, 220810, 33722, -194039, -246484, 56856, 491017, 620830, 338362, -39134, -209599, -184351, -108665, -31686, 33120, 16055, -95305, -192532, -226790, -313081, -508306, -632153]
40615f32153J20215K17272L0827j30800K1577K81679K47470o0016k34548r5637
40605b34114R1233O1660r1037j40786o8690q97L0106Q0627J44359J53644Q0952
40594A07057m9435j82372k06437k7068K48238L37593J31404j12559q5692J59140
40584C19869K99718J81444m0593j71091j86911j62187j47896j60812j67398p2131
40574c07988J51046L30685K63152R999j50095j00500k8111j09551k36335j86330
40564c64028M9240K53144K45466N8971j22354j40260K12J44904J63723Q7219K0505
40553C96742j5663m8877l1580P3243J30466j9231k56078k84511q1695M0698p7538
40542a74024j94257p1536J47457K05376J36825J29531J70352J29291M7226L3619
$$ y = [-632153, -511938, -294666, -263839, -394639, -373062, -91383, 156087, 96071, -138477, -234114, -142881, -81221, -172258, -313044, -381734, -382631, -352525, -271898, -127539, 26105, 107057, 57622, -124750, -331187, -358255, -110017, 227576, 358980, 246421, 160729, 319869, 619587, 801031, 760438, 589347, 402436, 240249, 92353, -68459, -235857, -307988, -156942, 173743, 436895, 446894, 296799, 196299, 168188, 58637, -177698, -364028, -314788, -61644, 183822, 242793, 120439, -19821, -19609, 125295, 289018, 376237, 396742, 381079, 332202, 300622, 373865, 504331, 485100, 229022, -55489, -137184, -96486, -174024, -368281, -439817, -292360, -86984, 49841, 179372, 349724, 479015, 526241, 559860]
40532E59860N897j45963k49916p2155K27796K65143L9257n0359J43884K84363
40522A007807J16862j31796j53396j3432O2174O4651O7629l7022l27161n53262
40512A03054m15232l7875J71819R1272k2075J4204R1526R8873J13517J85990J93569
40501E88642O3389n9127l5363K5323o7769k77232l77591k65005o7936N5800J05456
40490c11413J77563K92103L34448J71799j73163m75498m85304j86021J63543K91926
40480b00017J89127O4207O1993J14535Q9266j3528q8632r6410r8096j20149r1739
40469a89443K9818J54812J64885O8073l7636j09840j62597j58266m5348Q9133
40459a96409O8059j15895k38948j39646N8980J41545R4661N4329N1655k337j19075
$$ y = [559860, 565757, 419794, 169878, 97723, 325519, 590662, 629919, 579560, 723444, 1007807, 1124669, 992873, 839477, 826045, 888219, 952870, 1020499, 983477, 656316, 103054, -312178, -350053, -178234, -86962, -109037, -94833, -3307, 95566, 209083, 395073, 588642, 652031, 592904, 557541, 582864, 515095, 237863, -139728, -404733, -472669, -416869, -311413, -133850, 158253, 492701, 664500, 491337, 15839, -469465, -655486, -491943, -200017, -10890, 53317, 115310, 229845, 319111, 305583, 216951, 120541, 22445, -97704, -189443, -159625, -4813, 160072, 228145, 190509, 80669, -81928, -240194, -285542, -196409, -128350, -244245, -483193, -622839, -563859, -422314, -327653, -273324, -221669, -224006, -343081]
40448c43081k01759k04907j60467n0251J68842L94907M28256K46825N6515r371
40438C25509n6680j84104k57642j14126J40717K50640J61254N3542N4022J03857
40428D76989J18382R2531J8839j24805k53507k10525o932J26799M0100j18567
40418A59304j18584K4330J04355M5812k1171l191J5067p0761k15444k94765k64317
40407f39365j73624p6623L418N1337N8115L2100r283l8473q392J03522K28673
40396d68595K51952J57275O2365O0830R7323O8051j6337o3110n7571q1707j65713
40385a55237k14256j22081Q5109K59528K66586J12190m7442m4883J17116K50899
40375E07529J93166m720j52979j55109q4799n0707p4810j12942j18911o8233K7009
$$ y = [-343081, -544840, -749747, -910214, -960465, -791623, -396716, 31540, 278365, 334880, 325509, 268829, 84725, -172917, -287043, -146326, 104314, 265568, 319110, 373132, 476989, 595371, 687902, 706741, 581936, 328429, 117904, 110972, 237771, 277871, 159304, 40720, 65050, 169405, 215217, 194046, 190855, 205922, 135161, -80283, -375048, -639365, -812989, -889612, -886194, -834857, -776742, -744642, -753925, -792398, -800790, -697268, -468595, -216643, -59368, 2997, 63827, 161150, 229201, 212864, 149754, 92183, 10476, -155237, -369493, -491574, -406465, -146937, 119649, 231839, 184397, 139514, 256630, 507529, 700695, 695975, 542996, 387887, 303088, 252381, 177571, 64629, -54282, -122515, -95506]
40364i5506J15248J53706J43697Q3491n4342k25157k71436j10932R6093J38299
40354b6839P1850J33166L32684L93056J73101r8943j64011q3263n9066r7563q7417
40343D86755o7892j45133k27641j28693R6340J90044Q5040j0151K3356K1481j62418
40332A61088l68501l22293j4255K65852K49123l4423k83723k23477Q7036K82874
40322b00699J23295j76378k16286L4141K12239J18990j0344N9686J56133k508
40312I8269k99501l56600j02239J37778J43915Q5472J81681L32357K84911K8398
40302E34441j89542k00300r8300o5465j34469j90294j44467l1185O5977J22048
40292c31556J66714K01591J81173Q5694l8597j35968j89826j85081q5087Q7714
$$ y = [-95506, 19742, 173448, 317145, 400636, 346294, 121137, -150299, -261231, -165138, -26839, 45011, 178177, 510861, 903917, 1077018, 978075, 814064, 730801, 671735, 574172, 486755, 418863, 273730, 46089, -82604, 13736, 203780, 288820, 278669, 302025, 323506, 161088, -207413, -529706, -543961, -278109, -28986, -63409, -347132, -570609, -483573, -200699, -77404, -253782, -470068, -435927, -223688, -104698, -115042, -55356, 100777, 98269, -201232, -557832, -660071, -522293, -378378, -292906, -111225, 221132, 506043, 534441, 344899, 144599, 46299, -19166, -153635, -343929, -488396, -519581, -453604, -331556, -164842, 36749, 217922, 303616, 265019, 129051, -60775, -245856, -330943, -243229]
40282b43229J95662J06838j30745l20450l35889k29530j00383M7150K32204L57159
40272d21213K76249K3446j47831m2487K16974L17950J37721j12754j61419M926
40262I1562J67602J56192R170j14614j02027K2690J10645K0855k01647l34466
40252a74038k43613o3404J0491J6887J22443K79070K57421M7083p3054K1237P7023
40241B77546j11900l22868k41273J4939P1635r8463j49283M9839K01528Q7813
40231b20487p0489q24J52281O6669k05877k81902k0663K66222K67665P5654l0014
40220a765r795m0632j46409j24920R8530K76590J62837j18170k36903j19686L629
40209b56694N696K9475J53890J80425k8596k27617j11466J75760K14684m0313
$$ y = [-243229, -47567, 59271, -71474, -391924, -727813, -957343, -1057726, -1010576, -778372, -421213, -144964, -121518, -269349, -311836, -94862, 223088, 360809, 248055, 86636, 91562, 259164, 415356, 424526, 309912, 207885, 230575, 341220, 362075, 160428, -174038, -417651, -481055, -470564, -453677, -331234, -52164, 205257, 252340, 179286, 200523, 277546, 165646, -157222, -398495, -383556, -311921, -410384, -559667, -509828, -308300, -220487, -290976, -291800, -139519, -72850, -278727, -560629, -581292, -315070, -47405, 28249, -1765, -11560, -52192, -198601, -323521, -224991, 51599, 214436, 96266, -140637, -260323, -256694, -250998, -221523, -67633, 112792, 84196, -143421, -254887, -79127, 135557, 95244]
40199I5244j68879P2135L70095L23345J3055j61955n4865J10125J18724L671j08681
40188F12014j75871j98473j42241J3644K05397L10332K42178M0544j29625j32298
40178F45601l5410l3734j57591k06364p1477M9364m6887k00722j04157J84423
40168B3046K71982J9242k32542j65941P1885J55077P2311M2901R0167L6137j17486
40157B66779j37069M9524J90740P4202j66897k70193j96796q8355k957J00037
40147a80985J84194J52569K4116q1699j32400j88208k23030j32816M2811J14203
40137d21245M3444M6501K43720L92709J98289k18704m27683k50977K9934R0612
40127b73400l3944r1272M063J03237P6346k5209o9838j2241P2025P8644j2369
$$ y = [95244, -73635, -1500, 368595, 691940, 704995, 543040, 488175, 598300, 717024, 720695, 612014, 436143, 237670, 95429, 109073, 314470, 624802, 866980, 907524, 777899, 645601, 610191, 576457, 418866, 212502, 141025, 190389, 143502, -57220, -161377, 23046, 295028, 314270, 81728, -84213, -12328, 142749, 215060, 257961, 348128, 384265, 266779, 129710, 179234, 369974, 444176, 277279, 7086, -189710, -278065, -281022, -180985, 3209, 155778, 179894, 98195, -34205, -222413, -445443, -578259, -535448, -421245, -377801, -331300, -87580, 305129, 503418, 284714, -142969, -393946, -364012, -273400, -307344, -398616, -394553, -291316, -214970, -240179, -310017, -322258, -250233, -171589, -183958]
40116a83958j06077r1388K1660R9454L7810j22969k58021k82631j82986J7517
40106a051589K52864M05901L85714K25028N1854m7595r9835j66528k36105k30697
40096e10988j15849L2377R8839O1317J3427L8297J00306J10121O9683P6843J74060
40085A48433K63808K21726N5968r7896j33092q4494p3649j57434k55472k46410
40075c58512j23651r416K288l6844j3504Q8889J75892J58373K6877j57680k85308
40064e32596k50142o7563R2641Q4739k6094n9301K3640Q8287N4989J5354P7969
40053d98077K10854K90011K28721L9279j56862j93894m2066J04164N5678r1501
40043e3693r1863O6431J61838J28821J41832K35015J77989r8755k86266j59649
$$ y = [-183958, -290035, -381423, -359763, -260309, -222499, -345468, -603489, -886120, -1069106, -1051589, -798725, -392824, -7110, 217918, 269772, 222177, 122342, -44186, -280291, -510988, -626837, -594460, -495621, -434304, -420877, -382580, -282274, -172153, -102470, -25627, 148433, 412241, 633967, 689935, 592039, 458947, 374453, 300804, 143370, -112102, -358512, -482163, -491579, -489291, -526135, -539639, -450750, -274858, -116485, -89608, -247288, -532596, -782738, -850301, -757660, -672921, -699015, -758316, -734676, -646389, -591400, -576046, -498077, -287223, 2788, 231509, 270788, 113926, -79968, -122034, -17870, 37808, -53693, -145556, -79125, 82713, 211534, 353366, 588381, 766370, 667615, 381349, 221700]
40033B21700L7881p673j59034r1452J20779J34807m8124q0986J18268K24623P0321
40022E41110p8485J6499J89643J77580J5631j01311j30150j32894j00135k2809
40012C74679J1411l0121k4852Q7556J43860j336k12016k49605j09853J4536K8817
40001C3076P127J9757N2434O8451L2224q1945k07369j91062N080J94392J83547
39990A15712K4809p8840n2476j108l0830j32465k09243j50001O0491K54540K20314
39979B0903n122j32111q091J58732J10278q9133j71216k2905K46668M67485M71156
39968A046644J56409l05364n00176k45918J24265K04311N0205l5222m0399j48627
39958C06128k60682j21767J28796P8613k43438l30549j6321K26191N3328k06709
$$ y = [221700, 259581, 251908, 92874, 1422, 122201, 257008, 208884, 127898, 246166, 470789, 541110, 462625, 479124, 668767, 846347, 861978, 760667, 630517, 497623, 397488, 374679, 386090, 355969, 331117, 418673, 562533, 561197, 349181, 99576, -10277, 4259, 33076, 40203, 59960, 112394, 180845, 213069, 131124, -76245, -267307, -262227, -67835, 115712, 140521, 61681, 9205, 8097, -22733, -155198, -364441, -514442, -453951, -199411, 20903, 15781, -116330, -124421, 34311, 144589, 55456, -115760, -138665, 108003, 575488, 1046644, 1203053, 897689, 397513, 151595, 275860, 480171, 530376, 495154, 454755, 306128, 45446, -76321, 52475, 131088, -112350, -442899, -459220, -233029, -179701, -386410]
39948c86410j39702Q3624P4689r0581o8055J09592J08620r8411j90952m1047J35651
39937e02982J86694J89680J66327L431k40480k81667j5922K78832L01942J01061
39927A86916n3978j8638J23154J94703Q9258j14209j81988J0020K62654K75875
39917G73767O7583n7431K4069Q9267l4335j84129j47639l429M3063q095k1045
39906E41646o28m7949j15395o0197Q1334J15707O989n7264K6436J12433N1146
39895F54258p7380j18234r6614j39623k15277j50961P4585K39560J67821j9097
39885C19038p3378K3100M0438j47194l50334l02475j2225K48552K70134J01282
39875A16938o8784j10368k0543J04032J24947k0452k19842k81401j62142j3446
$$ y = [-386410, -526112, -442488, -367799, -458380, -526435, -416843, -308223, -406634, -597586, -638633, -502982, -316288, -126608, 39719, 43150, -197330, -478997, -494919, -216087, 85855, 186916, 132938, 114300, 237454, 432157, 521415, 407206, 225218, 235238, 497892, 773767, 841350, 783919, 807988, 897255, 862920, 678791, 531152, 527723, 570786, 562691, 541646, 541018, 493069, 377674, 317477, 398811, 514518, 521507, 464243, 490679, 603112, 654258, 576878, 458644, 362030, 222407, 7130, -143831, -69246, 170314, 338135, 319038, 245660, 268760, 309198, 162004, -188330, -490805, -503030, -254478, 15656, 116938, 48154, -62214, -82757, 21275, 146222, 125770, -94072, -375473, -537615, -551061]
39865e51061L9132M7948R9388J37367O6553m5221l6841Q8309J38089K956j82054
39854a95435k14492o7362J17732K06645J67090M5249o7668p6086L5616J66205
39844A17494J96039J09044k0870j25588j63116q8119R4059K54694K42874R0108
39834G06619j612O0056J01435p8316l85136m98787k62459J27563L60221L35259
39824D64843J91696R0330N5201J2295q1062j73506j85436j25387r5934j50799
39814B241k03641j59171q2933j07393j84569j06681J74055M19022M09450K36314
39804C96694J33463J34518Q7765m5492j20028n3567L3323r073j63389k87532k74382
39793a67700j24632P2627J93953J68563M1149p8217j16973o4297N3225J50802
$$ y = [-551061, -511929, -463981, -364593, -227226, -160673, -205894, -242735, -154426, -16337, -13381, -195435, -409927, -477289, -359557, -152912, 14178, 59427, -8241, -84327, -48711, 117494, 313533, 422577, 401707, 276119, 113003, 24884, 118943, 373637, 616511, 706619, 705007, 765063, 866498, 788182, 403046, -95741, -358200, -230637, 129584, 464843, 656539, 746869, 802070, 814365, 733303, 559797, 374361, 248974, 153040, 2241, -201400, -360571, -443504, -550897, -735466, -842147, -668092, -249070, 160380, 396694, 530157, 664675, 752440, 706948, 586920, 533353, 566676, 557603, 394214, 106682, -167700, -292332, -219705, -25752, 142811, 183960, 105743, -11230, -75527, -22302, 128500]
39783A28500J08384p1405j84576n4547J94231K66086R0655j06454j53913j32591
39773H4370j40676r1378Q4959K13661Q0378k17067l43895j54026J38249K54122
39763i1303J80851J22304J89088K48395J21403j28866k25756m1534J92859J79611
39753G47052l5687j54542q7240n6645j92302l01570j87528M1988J66435J55484
39743I5445Q4184o2168k63859l18938r6970J82031K10722M2855k4576N3906L9207
39732e8161j38503k50553j67725o3225r0369j35738n4399P5635J06337M9810k994
39721g29885m1754o7608l381J77240L41874L54712K46047J21334P659j04471j75465
39710A26302j81426j66300j39857l8826J21999J99252J33583O7519J13610J49952
$$ y = [128500, 236884, 165479, -19097, -73644, 120587, 386673, 477328, 370874, 216961, 84370, -56306, -147684, -62725, 150936, 231314, 14247, -329648, -483674, -345425, -91303, 89548, 211852, 400940, 649335, 770738, 641872, 416116, 374582, 567441, 747052, 711365, 556823, 469583, 412938, 220636, -80934, -268462, -226474, -60039, 95445, 179629, 117461, -146398, -465336, -562306, -380275, -169553, -126698, -151274, -97368, -58161, -196664, -447217, -614942, -678167, -768536, -904274, -958673, -883038, -776701, -726891, -729885, -771639, -839247, -842628, -665388, -323514, 31198, 277245, 398579, 406238, 301767, 126302, -55124, -221424, -361281, -400107, -278108, -78856, 54727, 122246, 235856, 385808]
39700C85808K1453j75794k16874q4812J7108l3607j38928j47723l2052J16007
39690b89414J80183J22740M0909O7818J78916K03168Q4717j7924M789K9123o1213
39679E43812j29109r399J59844J08236j41952l02370k37164q5934J9632R1169
39669A6765J21096N2488m7616l8124K9244m3072k29016k52312l8837J07249l8447
39658c60582k55215k11306M2932J88656J14768J0932M3852J72702K72791K65700
39648B85230J36845l8780j15861m5090K8745l7333j53047j15261Q0967K20190
39638B46605J53714l5737j70233j59837l9304P7687P7571l3923j06274k3987J22716
39627A08998J53222M6054n5538o6545m6555n8589p9355p7291o3322l6568J8307
$$ y = [385808, 407261, 231467, 14593, -70219, -53111, -86718, -225646, -373369, -405421, -289414, -109231, 13509, 54418, 122236, 301152, 504320, 589037, 571113, 575902, 605025, 543812, 414703, 405304, 565148, 673384, 531432, 229062, -8102, -94036, -74404, 16765, 137861, 190349, 142733, 104609, 133853, 90781, -138235, -390547, -429384, -322135, -360582, -615797, -827103, -784171, -595515, -480747, -469815, -425963, -253261, 19530, 285230, 422075, 383295, 267434, 222344, 251089, 213756, 60709, -54552, 26415, 246605, 400319, 364582, 194349, 34512, -4792, 72895, 150466, 116543, 10269, -13718, 108998, 262220, 308274, 252736, 186191, 139636, 81047, 1692, -75599, -138921, -175489, -157182]
39616a57182O6544O2754N6043J26250K09433J47835m5859j47822l5003J18932
39606D01925Q5060j06639k38695k03333p8918L2478R3939Q5958P034p6209q4208
39595h1608k6643L6453J04571J96545K32829J08561j06499j97758q6107O1238
39585B41582P0655k1181q7400j19710j76180k12619j35428J7090J10793J21849
39575a90549J42498J69944P3136j60974l19057k27478p394Q5664K324q0053m3957
39564e55896K7864K5241j4825J8797J37321K23707J61931l2886k08263k10966
39554d27975n0625J05559J35128R9799J16316J58640J09774l0214j36770j56519
39544g6887j53857j42914m6024J19196J84477P2606m8735J0212J93209K89707
$$ y = [-157182, -90638, -27884, 28159, 154409, 363842, 511677, 465818, 317996, 282993, 401925, 486985, 380346, 141651, -61682, -140600, -108122, -14183, 71775, 78809, 2600, -81608, -108251, -71798, 32773, 229318, 462147, 570708, 464209, 266451, 180344, 241582, 312237, 291056, 203656, 83946, -92234, -304853, -440281, -423191, -312398, -190549, -48051, 121893, 195029, 34055, -285002, -512480, -519874, -434210, -431886, -511939, -555896, -528032, -502791, -517616, -498819, -361498, -137791, 24140, -8746, -217009, -427975, -478600, -373041, -237913, -138114, -21798, 136842, 246616, 216402, 79632, -76887, -230744, -373658, -419682, -300486, -116009, -43403, -92138, -81926, 111283, 400990]
39534D00990K05801J2704j84531k83783j85877O7085K28062J16898r6604r9149
39524A81596J09112K20928J04093j1146O4944J63465M1899k14321l23761k25960
39514A10849j13782r8919q8929q907P1435Q9524R2693J14100R4645J6643j8607
39503B60745M3228Q0567l0601j98320k27679j04967M516L3255R0431K10187K22406
39492C83768J9432j99298j59768P8730J81693J5784j67353j15967O0775Q7578
39482A85374o3375j71647j24329m9074o7897j11850o7340L0467O5551K7829K1530
39471c24761J07977K20791K48174J59680L4469l1443l3162m1290p3981n7220K8822
39460B38056M6783j27137l73414m34349k54826m4713L9489Q2220J81400K31072
$$ y = [400990, 606791, 619495, 434964, 151181, -34696, 32389, 260451, 377349, 280745, 181596, 290708, 511636, 615729, 604583, 669527, 832992, 874891, 660570, 336809, 110849, -2933, -101852, -190781, -199688, -128253, -38729, 53964, 168064, 262709, 279352, 260745, 303973, 384540, 353939, 155619, -72060, -177027, -172511, -139256, -48825, 161362, 383768, 403200, 203902, 44134, 122864, 304557, 320341, 152988, 37021, 97796, 185374, 121999, -49648, -173977, -223051, -290948, -402798, -470138, -439671, -374120, -346291, -324761, -216784, 4007, 252181, 411861, 446330, 414887, 381725, 340435, 266454, 209234, 238056, 284839, 157702, -215712, -650061, -904887, -949600, -910111, -827891, -646491, -415419]
39450d15419J10823n1112k9624J51601K48617J49630j1347r8003j18278r1754
39440a54866J7143J55391J66919K9646p1828l6029k2412j66173k91398j55683
39430e29290J34116K39029Q0847p9043p3329l2466o3118l7584J04923J27018j43885
39419b72782m15931k61250K26215M77838K03978k39407l71145j75865L5630J21800
39409f70919J78884K36667J91739M5664l8591J7787Q8090M3031o3623r9366l8608
39398a09245M4945R4424R2070K4634q1014j21751j4599J67894K41906J26706m4968
39387D21002r0036j4378J377j29784k56906k06324n2414q088p5726l0127J86988
39376b54416K95564P7079k46946k94018o0853J14161Q0691L5018J08555J41451
$$ y = [-415419, -304596, -355708, -385332, -233731, 14886, 164516, 153169, 55166, -63112, -154866, -137723, 17668, 184587, 214233, 142405, 106376, 83964, -82209, -373607, -529290, -395174, -156145, -75298, -154341, -227670, -260136, -323254, -360838, -255915, -128897, -272782, -688713, -949963, -723748, -245910, -41932, -281339, -652484, -828349, -792719, -670919, -492035, -255368, -63629, -17965, -56556, -38769, 49321, 92352, 28729, -70637, -109245, -64300, 30124, 122194, 146828, 65814, -55937, -70536, 97358, 339264, 465970, 421002, 330966, 316588, 317965, 188181, -68725, -275049, -327463, -335551, -411277, -441404, -254416, 41148, 118227, -128719, -422737, -483590, -369429, -288738, -253720, -145165, -3714]
39366c714J4810r1232J222J36833O5263j46493k23412j10409o675r457Q01J01725
39354b70738K01399K19695J84883R4671j07957l42199l84639j80356K4361J3114
39344e47766r2290m0087J50436K18938N9006j30452j29040L1974J62131J75126
39334a42024J57551K02383K57999J87574l1557k26170k09409k4072R9062M9935
39324C21272k0960M2560J33239L3394k21312l33813j36574J75262K86616J27344
39314D07028r8513j76149q3795L1694K0588j13499k10554j49410k7442l8115j66502
39303f04669j73858M0283K43250J92388j261n4692M5746O2470o0742r1828Q7317
39292c15596K53593J78100k9275j09651k9997M7907O3310R3437J48032J43609
$$ y = [-3714, 11096, -80136, -78914, 57919, 123182, -23311, -246723, -357132, -363807, -373264, -372463, -270738, -69339, 150356, 335239, 429910, 321953, -20246, -404885, -585241, -560880, -547766, -640056, -680143, -529707, -310769, -251763, -382215, -511255, -479281, -317150, -142024, 15527, 217910, 475909, 663483, 631926, 405756, 196347, 172275, 271337, 321272, 300312, 342872, 476111, 509505, 288193, -45620, -182194, -6932, 279684, 407028, 308515, 132366, 48571, 80265, 100853, -12646, -223200, -372610, -400052, -438167, -604669, -778527, -738244, -494994, -302606, -303867, -358559, -312813, -250343, -311085, -402913, -315596, -62003, 116097, 86822, -22829, -52826, -4919, 58391, 151828, 299860, 443469]
39282D43469P7442M3605O2510N3045p797m5344l3658m4076j09630j61644j45330
39271A32592r9668q5709j15429j65022j78856p4799J48360L30334L11019J59145
39261C61967Q0688J04208N6158j14720k15058j16597J6326k3930j60984j52310
39251a64252M4746K09893J48124r1537k92866k90875j15147M7569N3689l7612
39241d88268o6995q325K9221J8493M6332R7494L0440j41351j76654L8095K77383
39230c44135L02007J89540J28594R1550k2062j02847j2209R4942j7846k25265
39220H2269j89265Q3220K27147R3416n7052k5107L9267k1253q0495J2832J61068
39209C26047K16405K17786K19094J09998j50850l24311j88940Q6127J40232q7944
$$ y = [443469, 520911, 564516, 627026, 680071, 672274, 626930, 593272, 549196, 439566, 277922, 132592, 32924, -52785, -168214, -333236, -512092, -586891, -438531, -108197, 202822, 361967, 442655, 546863, 603021, 488301, 273243, 156646, 172972, 149042, -11942, -164252, -119506, 90387, 238511, 146974, -145892, -436767, -551914, -504345, -450656, -488268, -555263, -563588, -534367, -515874, -469542, -372048, -341608, -482959, -659613, -621518, -344135, -42128, 147412, 276006, 367556, 345494, 242647, 230438, 325380, 307534, 82269, -106996, -23776, 203371, 296787, 239735, 214628, 253895, 232642, 152147, 164979, 326047, 542452, 760238, 979332, 1089330, 938480, 614169, 425229, 511356, 651588, 563644]
39199E63644l14620l05980r9809J34192K53776J76112p2504l26510m18016l27293
39189g37008j19915J66565M41821M93666K15520j59146k74681q6504J32330J98193
39179B70841J87772J78838Q9572j08445k42318j76131m3139n4774j79408k03120
39169b80312n8596R7515J35215J03100Q6433O9243K2345J260L8346L5192q8984
39158A60757k10949j53290M678m921k14870l21986j43909P7924O9420l872J90594
39147e50424N31455N31907Q0131l36257l05534k4465Q4457j7058o7107J4399P0647
39136A2151L1673j4699l4028p0407q8767k5236K8209p8338k70205k87911m2959
39125h40517K55475L70210K73961Q8382o3947j11502o4417j9289l9561n6313Q3
$$ y = [563644, 249024, -56956, -156765, -22573, 231203, 407315, 334811, 8301, -409715, -737008, -856923, -690358, -248537, 245129, 460649, 301503, 26822, -59682, 72648, 270841, 458613, 637451, 727023, 618578, 376260, 200129, 156990, 102216, -77192, -280312, -338908, -241393, -106178, -3078, 83355, 152598, 174943, 176203, 214549, 249741, 160757, -50192, -203482, -198804, -203725, -418595, -740581, -884490, -806566, -737146, -741018, -550424, -18969, 512938, 593069, 256812, -48722, -73187, 11270, -5788, -72895, -58496, 12151, 43824, 29125, -4903, -75310, -164077, -189313, -161104, -239442, -509647, -797558, -840517, -585042, -214832, 59129, 147511, 83564, -27938, -92355, -111644, -151205, -207518, -207435]
39114b07435L7063n8224j72598r1297J40170K30175O7121j11682p9736O4416Q7492
39103i4535l7930j46747j32785l8868N0534R6958J15740J53766K25807K61931
39093D53871J91048P4361M1098Q1030M7282r4532j83992j14774r566k4652j08066
39082C53108j00989O223P5350L7531l0759m5632j9976r964k7816l4243Q114P8663
39070B89610R4348j0249j87030k93950k31052l7825J46113J97383J04381k3207
39060D8522o8526n4549j09350k39822k54714l0575K50838L05462J23068n2511
39050h2157q0753n0881n8866p6961p3857o8105l5337N0296Q4011l7045j60570
39039e90225m3048K13493K31164n2729k40974r1916J04662L4252j13319J2678
$$ y = [-207435, -170372, -228596, -401194, -492491, -352321, -122146, -55025, -166707, -246443, -182027, -94535, -132465, -279212, -411997, -450865, -400331, -303373, -187633, -33867, 191940, 453871, 644919, 719280, 760378, 841408, 888690, 794158, 610166, 495392, 485826, 461174, 353108, 252119, 258342, 333692, 371223, 340464, 294832, 274856, 264892, 237076, 202833, 210947, 289610, 383958, 373709, 186679, -107271, -338323, -376148, -230035, -32652, 71729, 48522, -20004, -74553, -183903, -423725, -678439, -709014, -458176, -152714, -29646, -82157, -162910, -213791, -272657, -349618, -423475, -491580, -526917, -476621, -392610, -429655, -590225, -633273, -419780, -188616, -241345, -482319, -574235, -469573, -435321, -548640, -535962]
39029e35962L18422M17639K22638j8111j59482k40466k03172N0660L25033K57329
39019D34528j44920m44071l53251o9077R6378J22624J47025J62069O4156j21965
39009a06504k46634k12762n5371J11696J89390J85432K03108K67509K28654k1577
38999E42941l03425l25024q1686J40648J64233Q7348K6305n0918j49495j51654
38989a00727k6957O1995J703r7293j00784o0365p8055j11053o7760K2256Q1711
38978d75329J22361J71739J70089Q2670J4063N6793J10482J6933j79478k71954
38968a81631j75155k4354K2936k7372n3842J4243J21078J61222J06768K3768m3807
38957e6146j25904k00274j27102J40505L74405L22048R2704K4341J62781J90565
$$ y = [-535962, -217540, 200099, 422737, 404626, 245144, 4678, -198494, -147834, 177199, 434528, 289608, -154463, -507714, -576791, -480413, -357789, -210764, -48695, 15461, -106504, -353138, -565900, -621271, -509575, -320185, -134753, 68355, 335864, 564518, 542941, 239516, -85508, -167194, -26546, 137687, 225035, 251340, 200422, 50927, -100727, -127684, -65689, -63986, -161279, -262063, -322428, -400483, -511536, -579296, -557040, -475329, -352968, -181229, -11140, 71530, 85593, 142386, 252868, 269801, 90323, -181631, -356786, -381140, -358204, -385576, -439418, -425175, -304097, -142875, -36107, -12339, -56146, -182050, -382324, -509426, -368921, 5484, 327532, 420236, 444577, 607358, 797923]
38947G97923m4405k65570k06611o822P1532N4175R2921J13945l3745k25684k05165
38936A42494R21J30332R5161L3738m048r7909j90291j10252R4077J61220K8498
38925B83941n9467M2781J50667O5869j26348k37135k37792j81169n7501R5796
38915b60358J21206k7376j33105k908K19741K48681O8568p9613p8119n4422j06708
38904h4413j32846k6856J10813R3335q4768k16940j32427R2073K15929J16200
38894d9900p2591j32453j8841J30854K02264K02301J61908P8211j1189k6242K3968
38883D88290K9238l2082k3398J25523K50133J57692q1883k20332j68478q2149
38873D42554j03129j64201j10637P5672K41995K31565O0302p9661k7342J32761
$$ y = [797923, 753518, 487948, 281337, 274515, 346047, 400222, 493143, 607088, 573343, 347659, 142494, 143415, 273747, 368908, 402646, 398598, 300689, 110398, 146, 94223, 255443, 283941, 224474, 267255, 417922, 483791, 357443, 120308, -117484, -298653, -356154, -260358, -139152, -166528, -299633, -302541, -82800, 165881, 234449, 154836, 76717, 22295, -84413, -217259, -244115, -133302, -39967, -124735, -341675, -474102, -382029, -166100, -49900, -122491, -254944, -273785, -142931, 59333, 261634, 423542, 501753, 490564, 464322, 488290, 517528, 485446, 462048, 587571, 837704, 995396, 913513, 693181, 524703, 442554, 339425, 175224, 64587, 140259, 382254, 613819, 674121, 594460, 567118, 699879]
38863F99879J47691o8899k90672k72477q6594q70q4467j45258o7696R548n3428
38852b13243j52114j03787N4546J20277L8365k5784L8903J06235J5487j49765
38842b70880j54616K9602J44227O307j98863j60004J08689K82690J93968L7273
38832A8393K2392O2433q488j03121k5370J67479K30498J16695J5115N45o0572
38821D35999j91854j91566K5147K27585K02321P0196N0791R1138r176k25948l45606
38810A39027l11842k57981k06459k1145K81645M31703K45002j07373l00302k09072
38800c16797L6479K42693K92550J79983P570r2574r3693q1485j02972r8881k8507
38789e5634M0481L0838m4824j41035k36897k75348j63847P1845K43253K14942
$$ y = [699879, 847570, 778671, 487999, 215522, 128928, 128058, 43591, -101667, -169363, -159815, -213243, -365357, -469144, -414598, -294321, -255956, -281740, -242837, -136602, -121115, -270880, -425496, -395894, -251667, -245360, -444223, -604227, -495538, -212848, -18880, 18393, 40785, 103218, 94730, -8391, -33761, 133718, 364216, 480911, 496026, 496571, 435999, 244145, 52579, 77726, 305311, 507632, 577828, 628619, 719757, 710581, 484633, 139027, -172815, -430796, -637255, -658400, -376755, 54948, 299950, 192577, -107725, -316797, -280318, -37625, 254925, 434908, 442478, 349904, 256211, 174726, 71754, -27127, -55634, -15153, 15685, -29139, -170174, -407071, -682419, -846266, -774421, -531168, -316226]
38779c16226O6988n9914j59619k64081k80094j16991J06129J90290J41548J15273
38769e76697J24236N2230n3624O414K19247K89154O7194j97196k11114l7898O2808
38758b55246K5236k0629j4136J145K4078O1375K2287j34108k24998o6941J87017
38747c94920K19582L7611l0044J41381K89340K17252R0892Q9126P3703j15734
38737F18189k96559k17787j9359l1517k11705j94032R8541L03923J86721j9326
38727B17089k1427R5428R2808m106j1275M7079j4485j91883k67619j38558N7668
38716a39281J61185J45107M0179j08919j87676r5784P1309R7569m8585j60284
38706b25180j07239j9405n2343j40090j25629j0155P9631Q6028N0339K3506N6868
$$ y = [-316226, -249238, -309152, -468771, -732852, -1012946, -1129937, -1023808, -833518, -691970, -576697, -452461, -400231, -453855, -447441, -228194, 60960, 128154, -69042, -280156, -318054, -255246, -230010, -250639, -264775, -263630, -239552, -178177, -155890, -289998, -514996, -581937, -394920, -175338, -137727, -167771, -26390, 262950, 480202, 571094, 660220, 733923, 618189, 321630, 103843, 84484, 52967, -158738, -352770, -254229, 49694, 236415, 217089, 195662, 291090, 383898, 379792, 368517, 415596, 401111, 209228, -58391, -196949, -139281, 21904, 167011, 207190, 98271, -89405, -185189, -113880, -16311, -64896, -225180, -332419, -351824, -404167, -544257, -669886, -680041, -600410, -514382, -464043, -440537, -383669]
38695c83669J89862L34085K89438K7834j64621l8837K19269K04862j22903l65065
38685A90255k45521K7971J05569k5260j05236j3675J06736J00891J130n2664P204
38674I7400J12878J41086M8143p1961r2027p969O7803O5582K3834j4721o2432
38663C07616j04435p4247K3232P5007K9481k083Q3223J98497J78348R589j64734
38652E59494k27244j73702o7498O13l5585j14883p3009J23223K58910J35346j29914
38641B55751k46867j41324O8M1161L0430J8090k6112o1354K6751J85829J76700
38630B59123p1832k90582k25139J1764J47776J56953J99093K52741J22472j76164
38620C86205l40556k01877J7210L3088r2580r4188N7986J16299m1804k06873j37811
$$ y = [-383669, -193807, 140278, 429716, 457550, 292929, 254092, 473361, 678223, 555320, 190255, -55266, -27295, 78274, 53014, -52222, -65897, 40839, 141730, 142860, 90196, 97400, 210278, 351364, 399507, 327546, 235519, 227550, 295353, 360935, 384769, 370048, 307616, 203181, 128934, 152166, 227173, 256654, 254571, 337794, 536291, 714639, 724228, 559494, 332250, 158548, 91050, 91663, 56078, -58805, -131814, -8591, 250319, 385665, 255751, 8884, -132440, -132372, -91211, -60781, -42691, -68803, -130157, -103406, 82423, 259123, 187291, -103291, -328430, -316666, -168890, -11937, 187156, 439897, 562369, 386205, 45649, -156228, -139018, -105930, -198510, -292698, -234712, -118413, -160217, -367090, -504901]
38609e04901R5458K22866J38913q767o6809m5903j4069K9847R4028J13941M1454
38598I6058n0913n8308K990K3806m4982j52762k30609k24309q6191J51959L23012
38587b50249K75066Q2986k1050N2304J55379J48186Q8551R2377J31646R6638j5197
38576H36637r6353q3436j8323K6498J0103p0936j74791k27069j91965j15051n8414
38565a63100k2145K9427R3101J20379O7624o5747k15402k64027j41867O1570J63553
38554c36634J04531J9590M7692J57902K28971K11385J27790j418j30604j57253
38544B71952k9552J58957K71090K66825J66841k3931k35305k84513r1813J28074
38534E98625R9960j20005k13641o4532R7155P6167j2726J2261R5674P9223p029
$$ y = [-504901, -409443, -186577, -47664, -56431, -123240, -169143, -183212, -153365, -59337, 54604, 96058, 45145, -13163, -10173, 13633, -31349, -184111, -414720, -639029, -725220, -573261, -250249, 24817, 107803, 86753, 139057, 294436, 442622, 531173, 623550, 755196, 851834, 836637, 740284, 656848, 638525, 665023, 675126, 604190, 429399, 202330, 10365, -104686, -163100, -185245, -155818, -62717, 57662, 125286, 59539, -155863, -419890, -561757, -500187, -336634, -232103, -212513, -164821, -6919, 222052, 433437, 561227, 559809, 429205, 271952, 242400, 401357, 672447, 939272, 1106113, 1082182, 846877, 562364, 470551, 598625, 698585, 578580, 364939, 300407, 397562, 473729, 461003, 473264, 568938, 648161, 641132]
38523F41132r991O4072M8999j06953k47469k22377o3256R3200J53768J06895O040
38512D64060m7706O895P9074n014k50134l98885k17117J64158L47712J50434j61716
38501A31761k28482o3595K3413p7386j21267O7743K71622J92582p4659j74261
38491e2529k9604O5438o3652k02759j14051R2242J69354J24680J37033K02404
38481C28556J47362m0597j69347j53844j22826j46346r2595J14681K90176K18277
38471C73497l0195j95117j73309r1689o1032l0496P8748K25464K96741K31193
38461F23805N1601j64989l13282l12371j79795k3453O8599R8613J00383O1990
38451A1101m1564j68571k27064j77117p3698P208N2894R9553J53037J62785Q9014
$$ y = [641132, 631141, 695213, 744212, 637259, 389790, 167413, 104157, 197357, 351125, 458020, 464060, 416354, 423249, 502323, 497309, 247175, -151710, -368827, -204669, 143043, 293477, 131761, -96721, -160316, -136903, -214289, -335556, -267813, 3809, 196391, 121732, -52529, -82133, -16695, -80347, -283106, -397157, -304915, -135561, -10881, 126152, 328556, 475918, 435321, 265974, 112130, -10696, -157042, -249637, -134956, 155220, 373497, 343302, 148185, -25124, -116813, -177845, -208341, -129593, 95871, 392612, 623805, 675406, 510417, 197135, -115236, -295031, -318484, -249885, -151272, -50889, 11101, -30463, -199034, -426098, -603215, -676913, -669705, -616811, -517258, -364221, -201436, -112422]
$$ [...]
##END NTUPLES=NMR SPECTRUM
##END=
