##TITLE=31Pdec_DE-137
, 24 sc
 26.3.2026
##JCAMPDX= 6.0         $$ Bruker NMR JCAMP-DX V2.0
##DATA TYPE= NMR SPECTRUM
##DATA CLASS= NTUPLES
##ORIGIN= UXNMR, Bruker Analytische Messtechnik GmbH
##OWNER= root
$$ XWIN-NMR		Version 3.5
$$ Thu Mar 26 13:24:27 2026 Russian Standard Time (UT+4h)  she@DPX200
##.OBSERVE FREQUENCY= 81.013821
##.OBSERVE NUCLEUS= ^31P
##.ACQUISITION MODE= SIMULTANEOUS
##.ACQUISITION SCHEME= undefined
##.AVERAGES= 24
##.DIGITISER RES= 17
##SPECTROMETER/DATA SYSTEM= spect
##.PULSE SEQUENCE= zgpg30
##.SOLVENT NAME= CDCl3
##.SHIFT REFERENCE= (INTERNAL, CDCl3, 0, 197.392)
##AUDIT TRAIL= $$ (NUMBER, WHEN, WHO, WHERE, WHAT)
$$ ##TITLE= Audit trail, XWIN-NMR		Version 3.5
$$ ##JCAMPDX= 5.01
$$ ##ORIGIN= Bruker BioSpin GmbH
$$ ##OWNER= she
$$ F:/spectra/data/she/nmr/P31/2/pdata/1/auditp.txt
$$ ##AUDIT TRAIL=  $$ (NUMBER, WHEN, WHO, WHERE, WHAT)
(   1,<2026-03-26 13:22:45.20 +0400>,<she>,<DPX200>,
      <created by zg, POWCHK disabled, PULCHK disabled
       configuration hash MD5:
       00 E9 B6 7A A2 85 ED C7 34 08 36 98 17 FE 4E 26
       data hash MD5: 32K
       25 9C 92 90 3D 2B 86 3E D0 7C 48 D5 8B 23 0D 4E>)
(   2,<2026-03-26 13:22:47.79 +0400>,<she>,<DPX200>,
      <Start of raw data processing
       efp BC_mod = 2 LB = 1.5 FT_mod = 6 PKNL = 1 PHC0 = 1382.408 PHC1 = 93.90066 SI = 64K 
       data hash MD5: 64K
       E1 37 A9 55 5A 6D A7 56 F1 01 4D 0B DB 1D BB 9E>)
(   3,<2026-03-26 13:23:12.14 +0400>,<she>,<DPX200>,
      <pk PHC0 = 13.14625 PHC1 = 0 
       data hash MD5: 64K
       32 12 F9 F9 80 69 C1 89 D1 F6 08 0A C7 CD 46 1C>)
(   4,<2026-03-26 13:23:29.21 +0400>,<she>,<DPX200>,
      <abs ABSG = 5 
       data hash MD5: 64K
       7E 6A 36 C2 9F 7F 82 19 4A D4 7F EE 4B DC 9F 8D>)
$$ ##END=
$$ 
$$ hash MD5
$$ BA C1 C7 C1 23 56 65 9D AC 9E 19 38 2B A8 31 41
##$RELAX= 
##$RELAX= 
##$RELAX= 
##$RELAX= 
##$RELAX= 
##$RELAX= 
##$RELAX= 
##$RELAX= 
$$ Bruker specific parameters
$$ --------------------------
##$DU= <F:/spectra>
##$EXPNO= 2
##$NAME= <P31>
##$PROCNO= 1
##$TYPE= <nmr>
##$USER= <she>
##$AMP= (0..31)
100 100 100 100 100 100 100 100 100 100 100 100 100 100 100 100 100 100 
100 100 100 100 100 100 100 100 100 100 100 100 100 100 
##$AQSEQ= 0
##$AQ_mod= 1
##$AUNM= <au_zg>
##$AUTOPOS= <>
##$BF1= 81.014009
##$BF2= 200.13
##$BF3= 200.13
##$BF4= 200.13
##$BF5= 200.13
##$BF6= 200.13
##$BF7= 200.13
##$BF8= 200.13
##$BYTORDA= 1
##$CFDGTYP= 0
##$CFRGTYP= 5
##$CHEMSTR= <none>
##$CNST= (0..31)
1 1 145 1 1 1 1 1 1 1 1 1 1 1 1 1 1 1 1 1 1 1 1 1 1 1 1 1 1 1 1 1 
##$CPDPRG= <waltz16>
##$CPDPRG1= <>
##$CPDPRG2= <waltz16>
##$CPDPRG3= <>
##$CPDPRG4= <mlev>
##$CPDPRG5= <mlev>
##$CPDPRG6= <mlev>
##$CPDPRG7= <mlev>
##$CPDPRG8= <mlev>
##$CPDPRGB= <>
##$CPDPRGT= <>
##$D= (0..31)
0 1 0 0 0 0 0 0 0 0.06 0 0.03 2e-05 3e-06 0 0 0.0002 0 0 0 0 0 0 0 0 0 
0 0 0 0 0 0 
##$DATE= 1774516964
##$DBL= (0..7)
120 120 120 11 120 120 24 19 
##$DBP= (0..7)
150 150 150 150 150 150 150 150 
##$DBP07= 0
##$DBPNAM0= <>
##$DBPNAM1= <>
##$DBPNAM2= <>
$$ [...]
##$SUBNAM3= <"">
##$SUBNAM4= <"">
##$SUBNAM5= <"">
##$SUBNAM6= <"">
##$SUBNAM7= <"">
##$SUBNAM8= <"">
##$SUBNAM9= <"">
##$SW= 400.765351723535
##$SWIBOX= (0..15)
0 1 3 0 0 0 0 0 0 0 0 0 0 0 0 0 
##$SW_h= 32467.5324675325
##$TD= 32768
##$TD0= 1
##$TE= 0
##$TE2= 300
##$TE3= 300
##$TEG= 300
##$TL= (0..7)
0 120 53 12 22 120 120 120 
##$TP= (0..7)
150 150 150 150 150 150 150 150 
##$TP07= 0
##$TPNAME0= <>
##$TPNAME1= <>
##$TPNAME2= <>
##$TPNAME3= <>
##$TPNAME4= <>
##$TPNAME5= <>
##$TPNAME6= <>
##$TPNAME7= <>
##$TPOAL= (0..7)
0.5 0.5 0.5 0.5 0.5 0.5 0.5 0.5 
##$TPOFFS= (0..7)
0 0 0 0 0 0 0 0 
##$TUNHIN= 0
##$TUNHOUT= 0
##$TUNXOUT= 0
##$USERA1= <user>
##$USERA2= <user>
##$USERA3= <user>
##$USERA4= <user>
##$USERA5= <user>
##$V9= 5
##$VALIST= <valist>
##$VCLIST= <CCCCCCCCCCCCCCC>
##$VD= 0
##$VDLIST= <DDDDDDDDDDDDDDD>
##$VPLIST= <PPPPPPPPPPPPPPP>
##$VTLIST= <TTTTTTTTTTTTTTT>
##$WBST= 1024
##$WBSW= 4
##$XGAIN= (0..3)
0 0 0 0 
##$XL= 0
##$YL= 0
##$YMAX_a= 35979
##$YMIN_a= -37589
##$ZGOPTNS= <>
##$ZL1= 120
##$ZL2= 120
##$ZL3= 120
##$ZL4= 120
##$ABSF1= 197.3918
##$ABSF2= -203.3724
##$ABSG= 5
##$ABSL= 3
##$ALPHA= 0
##$AQORDER= 0
##$ASSFAC= 0
##$ASSFACI= 0
##$ASSFACX= 0
##$ASSWID= 0
##$AUNMP= <proc_1d>
##$AZFE= 0.1
##$AZFW= 0.5
##$BCFW= 0
##$BC_mod= 2
##$BYTORDP= 0
##$COROFFS= 0
##$CY= -3
##$DATMOD= 1
##$DC= 0
##$DFILT= <>
##$DTYPP= 0
##$F1P= 0
##$F2P= 0
##$FCOR= 1
##$FTSIZE= 65536
##$FT_mod= 6
##$GAMMA= 0
##$GB= 0
##$INTBC= 1
##$INTSCL= 9.790993e-09
##$ISEN= 30
##$LB= 1.5
##$LEV0= 0
##$LPBIN= 0
##$MAXI= 10000
##$MC2= 0
##$MEAN= 0
##$ME_mod= 0
##$MI= 50
##$NCOEF= 0
##$NC_proc= -5
##$NLEV= 6
##$NOISF1= 182.463
##$NOISF2= 159.3651
##$NSP= 0
##$NTH_PI= 0
##$NZP= 0
##$OFFSET= 197.3918
##$PC= 4
##$PHC0= 1395.554
##$PHC1= 93.90066
##$PH_mod= 1
##$PKNL= yes
##$PPARMOD= 0
##$PSCAL= 0
##$PSIGN= 0
##$REVERSE= no
##$SF= 81.014063255964
##$SI= 65536
##$SIGF1= 159.3651
##$SIGF2= -187.1042
##$SINO= 113.3802
##$SIOLD= 16384
##$SREGLST= <1H.CDCl3>
##$SSB= 0
##$STSI= 65536
##$STSR= 0
##$SW_p= 32467.5324675325
##$SYMM= 0
##$S_DEV= 0
##$TDeff= 32768
##$TDoff= 0
##$TI= <>
##$TILT= no
##$TM1= 0
##$TM2= 0
##$TOPLEV= 0
##$USERP1= <user>
##$USERP2= <user>
##$USERP3= <user>
##$USERP4= <user>
##$USERP5= <user>
##$WDW= 1
##$XDIM= 65536
##$YMAX_p= 283607208
##$YMIN_p= -12748107
$$ End of Bruker specific parameters
$$ ---------------------------------
##NTUPLES= NMR SPECTRUM
##VAR_NAME=  FREQUENCY,     SPECTRUM/REAL,   SPECTRUM/IMAG
##SYMBOL=    X,             R,               I
##VAR_TYPE=  INDEPENDENT,   DEPENDENT,       DEPENDENT
##VAR_FORM=  AFFN,          ASDF,            ASDF
##VAR_DIM=   65536,         65536,           65536
##UNITS=     HZ,            ARBITRARY UNITS, ARBITRARY UNITS
##FACTOR=    0.49542278885378, 1,            1
##FIRST=     15991.5117654749, 0,            0
##LAST=      -16476.0207020576, 0,           0
##MIN=       -16476.0207020576, -12748107,   0
##MAX=       15991.5117654749, 283607208,    0
$$ Real data points
##PAGE= N=1
##DATA TABLE= (X++(R..R)), XYDATA
$$ [...]
44565b0910k37681j91556O2449L02213K95252P8458j30370k11649k18794k27016
44555d99604k29272j85446r7434j6168J579m7093q9641n8383M051l133n8684p76
44543a280004K36316M67140M55044K05936o0263j85504j83584j03871M4704J99717
44533b04369K27387Q3156j02865j74051j10945N164J06337J45149P2084r3009
44523d5962k15154j69417N997J53781J71059P7845m5495j09652m6395J13357K14023
44512A03987J28483p6174k21902k43682k10386j47114m580J70058K13356P8127
44502b09827o9268q7166n0972q2563j26485o1746P0473J38163J43037J77515K07635
44491D8796J10238q6510k08316j90527j24907l6073J51774L63161L43538L0403
$$ plain form
44565 -20910 -258591 -450147 -387698 -85485 209767 288225 157855 -53794 -272588 -499604
44555 -499604 -728876 -914322 -1011756 -1027924 -1026345 -1073438 -1163079 -1221462 -1217411 -1220544 -1279228 -1280004
44543 -1280004 -1043688 -576548 -121504 84432 24169 -161335 -344919 -448790 -404086 -204369
44533 -204369 23018 106174 3309 -170742 -281687 -276523 -170186 -25037 47047 -45962
44523 -45962 -261116 -430533 -424536 -270755 -99696 -21851 -67346 -176998 -223393 -110036 103987
44512 103987 232470 156296 -65606 -309288 -519674 -666788 -671368 -501310 -287954 -209827
44502 -209827 -279095 -366261 -417233 -499796 -626281 -688027 -617554 -479391 -336354 -158839 48796
44491 48796 159034 72524 -135792 -326319 -451226 -487299 -335525 27636 371174 401577
44481D01577k57247j95101J23200L31527K53463K7377j49403j99283j25707J2296
44471B22699Q4193R67j46929j89533j04424j3714K4501O1141Q9340J4732j49707
44460a06734k22599q9840J16397J87049J01288N193j9041l0979q2139j08951l0954
44449b81310J11879J96218J74467J26009J28032J38273O6829p2514j65058j42995
44439B79830m9599M5724J04289Q1183n0250j96751j93977k9845R9409M6542r2146
44428D4409j48085j18084q3224j1233J62365L31064L10606J10136q2861j70095
44418C44998k01287j83757n6081J24509J87353R8291J0703R099l222r2344j71010
44407F7252j77530j78972j88639q3705J53580L04656K03011l457o8325Q154N1338
$$ plain form
44481 401577 144330 -50771 72429 403956 657419 684796 535393 336110 210403 222699
44471 222699 306892 307859 160930 -28603 -133027 -146741 -122240 -61099 28241 42973 -106734
44460 -106734 -329333 -419173 -302776 -115727 -14439 -9246 -28287 -59266 -141405 -250356 -281310
44449 -281310 -169431 26787 201254 327263 455295 593568 660397 587883 422825 279830
44439 279830 230231 275955 380244 461427 411177 214426 20449 -9396 90013 136555 44409
44428 44409 -103676 -221760 -304984 -316217 -153852 177212 487818 597954 515093 344998
44418 344998 143711 -40046 -96127 28382 215735 314026 324729 333828 330606 238262 67252
44407 67252 -110278 -289250 -477889 -561594 -408014 -103358 99653 96196 27871 36025 87363
44396H7363J9728K1342Q9589J52883J90255K23257J80286l0129l04956l97094
44386B32524k25966J5520J21331J10951J32034K17983K44550J18318n8227p2492
44376H36526J19252K66677R9753k91163n23053m05750j54854k3517L8742J63593
44366A26206K26726M3290k30823k50694j2782J09957q2399l41592l55027j40919
44356i08057Q1265J96664K14478J56884Q6618J10581K18432K39083P9897j15108
44346C60737j67368r6514k2496L2038Q9101Q7647j3703j01673o3655j886q6288
44335A5940k37454j83831J43213M73430N23316L02745K2732j66040k42247k22918
44325D28886j30686k6770J1911l8229j28513j80804j44504m4556J9218k9873j26953
$$ plain form
44396 87363 107091 128433 218022 370905 561160 784417 964703 934574 629618 232524
44386 232524 6558 22078 143409 254360 386394 604377 848927 967245 909018 836526
44376 836526 955778 1222455 1322208 1031045 507992 102242 -52612 -76129 -37387 126206
44366 126206 352932 396222 165399 -85295 -98077 11880 -70519 -412111 -767138 -908057
44356 -908057 -826792 -630128 -415650 -258766 -172148 -61567 156865 395948 475845 360737
44346 360737 193369 96855 74359 106397 195498 283145 269442 167769 104114 102228 15940
44335 15940 -221514 -405345 -262132 211298 734614 1037359 1060091 894051 651804 428886
44325 428886 298200 271430 283341 245112 116599 -64205 -208709 -253265 -234047 -263920 -390873
44314c90873j06278R0649L01650L16122J30283o5287j44872j67218j92771j32239
44304c60834Q0695K71262J98007o5905j64101N5303L10436K89839P8800l7505
44294F55997l1439j00608k59378k89995j24685K2363p920j03357j12494o7485
44284d19001m7476k4343J4596k0544j37899j75555n4901O5850O8682J02249K98345
44273c29997M50993K80811r7736k91551j59421P0175J85070J94329J41925J6162
44263D60760j03466q3386J2864k8276k00718k34672k8631J63106J36357N3430
44253A47368J29722K45049J54143q2079j88798j12507n4775r3833p2619Q2892
44243A54563J95842J07077p8466j56303j10122r0281j67019k36362j70822J7710
$$ plain form
44314 -390873 -497151 -406502 -104852 211270 341553 276266 131394 -35824 -228595 -360834
44304 -360834 -280139 -8877 189130 123225 -40876 14427 324863 614702 693502 655997
44294 655997 624558 523950 264572 -25423 -150108 -127745 -135665 -239022 -351516 -419001
44284 -419001 -466477 -490820 -476224 -496768 -634667 -810222 -865123 -799273 -730591 -628342 -329997
44273 -329997 120996 401807 304071 12520 -146901 -76726 108344 302673 444598 460760
44263 460760 357294 273908 286772 258496 57778 -176894 -205525 -42419 93938 147368
44253 147368 277090 522139 676282 594203 405405 292898 238123 144290 71671 154563
44243 154563 350405 457482 379016 222713 112591 22310 -144709 -381071 -551893 -534183
44233e34183J86975K06193Q2615m5133m8997N2946J26684R1462J8031K4642J02056
44222B63291J05151n6993k71575l27341j61686P0203J93091J95477J61375J08535
44212B79528O022j02512j35434j21397j64245k42297k00308l112J53360R5235
44202d35160p5729j14574M3241K18869K29894R1058l0354o21J42394K20084J09083
44191C98185r8367k00063j43724o1330k6136N4108K17349K99837J64891o0038
44181E44712j61832j49627j77239k40801j92010k2256J04142J10849Q4656O5691
44171c3715j7039j49175j81374n2621J19403K30794K78939K10066o2428l80511
44161c7661l75242J5249L26630J58163k28734k66023R4571L36854J63787j07332
$$ plain form
44233 -534183 -347208 -141015 -58400 -103533 -152530 -99584 27100 118562 136593 161235 263291
44222 263291 368442 311449 39874 -287467 -449153 -378950 -185859 9618 170993 279528
44212 279528 285550 183038 47604 -73793 -238038 -480335 -680643 -683755 -530395 -435160
44202 -435160 -510889 -625463 -582222 -363353 -133459 -42401 -72755 -73376 69018 289102 398185
44191 398185 299818 99755 -43969 -105299 -131435 -77327 140022 439859 604750 544712
44181 544712 382880 233253 56014 -184787 -376797 -399053 -294911 -184062 -99406 -33715
44171 -33715 -50754 -199929 -381303 -433924 -314521 -83727 195212 405278 342850 -37661
44161 -37661 -412903 -397654 -71024 87139 -141595 -407618 -313047 23807 187594 80262
44151H0262q1198J50369K39552J27829M6809R5924J27297M2205n5873o7520o2474
44140F43182j34019k16399j71800k561J32501J08590l1475j48169j59402r2136
44130g1688n428Q6910J91329K63196K23616O9029q7503j34793r3008o3648o8594
44119C09418k2649J14724K40769K19326M5682j51296k43534j99605q3926j0856
44109B18053o2704j92370k42038j29696J9202J9360j20617k05393j09965R2257
44099g13911K66787L42550K69125J8292k86298l98181k33796l431P2492M2199
44089f24172N8023Q3448J953q6306K6452K68766L16793O9631j78384j55416L6761
44078a82451J39580J04373O1096O4819N6180q842j23589k48317k75995j01161
$$ plain form
44151 80262 -936 149433 388985 516814 563623 659547 786844 829049 773176 705656 643182
44140 643182 509163 292764 120964 118403 250904 359494 328019 179850 20448 -71688
44130 -71688 -77116 9794 201123 464319 687935 756964 669461 534668 441660 378012 309418
44119 309418 286769 401493 642262 861588 907270 755974 512440 312835 228909 218053
44109 218053 155349 -37021 -279059 -408755 -389553 -370193 -490810 -696203 -806168 -713911
44099 -713911 -447124 -104574 164551 182843 -103455 -501636 -735432 -738863 -666371 -624172
44089 -624172 -566149 -482701 -480748 -567054 -540602 -271836 44957 114588 -63796 -219212 -182451
44078 -182451 -42871 61502 122598 187417 243597 234755 111166 -137151 -413146 -514307
44068e14307J82903L08317J78407K5103O4936J74948J24875k6075l8970R1898
44058E72035J28885k5657j99000k23161j24703j6599J6892p1310k19973k28379
44048c90970j118K21329J30482j76094k84434m9937K20381K42953R9137j5571
44038c842p3989q4889L1189K29587K63472M2641j64923j26667n956n3228j59046
44027a05651n6145J89624K62657R8817m9713l3109L5681N6234P9167J19557Q9335
44016F86454k0438j02206j19931j37007j37238l1965J28888J72620O6461m7416
44006D58222j03134j64350j99142p3066J60339K39110Q1892o3637j2096O8234
43996C92372m7937k61353k94311q9517J43743K09648J07082o326M6634K61639
$$ plain form
44068 -514307 -331404 -23087 155320 180423 245359 420307 545182 519107 480137 572035
44058 572035 700920 675263 476263 253102 128399 111800 128692 57382 -162591 -390970
44048 -390970 -392088 -170759 -40277 -216371 -500805 -550742 -330361 -87408 11729 -3842
44038 -3842 -77831 -162720 -131531 98056 361528 404169 239246 112579 106623 53395 -105651
44027 -105651 -161796 27828 290485 389302 339589 306480 342161 398395 477562 597119 686454
44016 686454 666016 563810 443879 306872 169634 137669 266557 439177 505638 458222
44006 458222 355088 190738 -8404 -81470 78869 317979 399871 336234 324138 392372
43996 392372 344435 83082 -211229 -300746 -157003 52645 159727 153401 200035 461674
43986D61674L63870J00425l45784m98812k33427M6943L9631k3022J39129K96767
43976C47394Q4469l22099m20163j46930Q7561R4528J04430K20133J98475n6524
43966A91274k42989j36272O4236J05671N9728P5514P5293j4559k0710J64825K84869
43955F06880R0821j91945j69740R2807J74761l4572j95605p6719J30625J61709
43945E89022L5826p2758q8854l5174M3514O1811m0945j59015j18235M1024Q5008
43934C41224m9391j45056o0184M9043J8038m1566L4720J33458J9963k65045m19054
43923c83850k67815N8106L28680M22523L36441J57997M5651Q9351J71326R6854
43913A055264j28563k97417k93018k20496j92513j53161k5803R9602Q5232j7209
$$ plain form
43986 461674 825544 925969 580185 81373 -152054 -105111 -65480 -88502 50627 347394
43976 347394 431863 109764 -310399 -457329 -369768 -275240 -170810 49323 247798 191274
43966 191274 -51715 -187987 -123751 -18080 41648 117162 192455 177896 157186 322011 606880
43955 606880 697701 505756 336016 428823 603584 569012 373407 296688 427313 589022
43945 589022 624848 552090 463236 428062 471576 533387 492442 333427 215192 256216 341224
43934 341224 291833 146777 86593 135636 153674 112108 146828 280286 300249 35204 -383850
43923 -383850 -651665 -593559 -264879 157644 494085 652082 697733 787084 958410 1055264
43913 1055264 926701 629284 336266 115770 -76743 -229904 -255707 -156105 -70873 -88082
43903h8082j4993J38836K51952J44399j03169k42985j59620K0866J23835J26283
43893A97322J05266P1746k3336j45418j81644j18094p3248r0982m4655J37175
43883a65868K82692J89026o2382k03461j52362p4052o8960l5890Q9107J76274
43873b5876J09264j8021m9281J8711R7043J57287J86436J10256p8976k20026j78434
43862A08383n5921k4256m1855M1825J66536J19936q0496j52468J7233J63988K6089
43851B88994k66658l75388j88001J15385L34292L89913K55415m3593l40404m09800
43841b39845k09298N5606J57828P5758m0282o5157q219M8992O9839Q6452J10471
43830D2145P0702r4598k96083l39913j56336R6945K18414J82850J11419Q8015
$$ plain form
43903 -88082 -103075 35761 287713 432112 328943 85958 -73662 -52796 71039 197322
43893 197322 302588 374334 350998 205580 23936 -94158 -167406 -258388 -303043 -165868
43883 -165868 116824 305850 243468 40007 -112355 -186407 -255367 -291257 -202150 -25876
43873 -25876 83388 65367 16086 34797 131840 289127 475563 585819 506843 286817 108383
43862 108383 52462 28206 -13649 28176 194712 314648 234152 81684 98917 262905 288994
43851 288994 22336 -353052 -541053 -425668 -91376 298537 553952 510359 169955 -239845
43841 -239845 -449143 -393537 -235709 -159951 -200233 -265390 -273609 -224617 -154778 -68326 42145
43830 42145 112847 18249 -277834 -617747 -774083 -677138 -458724 -275874 -164455 -76440
43820g6440R6761J04201J10039J20234J26246R9544j6879k48860m77811m83748
43810f46713k04098J25951K21215Q6624k5349L8183J77089K26087J48880K5160
43800A73029l5340M3306K09667K67829R3289j52945k00368m6732O1359M0449P9858
43789E33401K44039K78997L0697k17760j40782R2230N5307k47510l52919m2592
43779B33108L13456K86770l7753k54320j96060m2275K3759O848l3976r8473j73489
43768B7595j87642j07063j568L8936J2492j0405J2507M7246M1823Q266J1424O9782
43756c6607J15725R3003M5303M2300O4800O0184P1593J71037K69864J71307j29265
43745I39244l63111l16287j04130J4676j6294n2095r860N3418R5117J41911J80272
$$ plain form
43820 -76440 20321 124522 234561 354795 481041 580585 563706 314846 -162965 -646713
43810 -646713 -850811 -724860 -503645 -417021 -442370 -404187 -227098 -1011 147869 173029
43800 173029 137689 180995 390662 658491 751780 598835 398467 351735 413094 453543 533401
43789 533401 777440 1056437 1087134 869374 728592 820822 876129 628619 275700 233108
43779 233108 546564 833334 795581 541261 345201 302926 326685 333533 299557 201084 27595
43768 27595 -160047 -267110 -268678 -229742 -217250 -227655 -215148 -167902 -126079 -117813 -106389 -36607
43756 -36607 79118 172121 217424 259724 324524 384708 456301 627338 897202 1068509 939244
43745 939244 576133 259846 155716 170392 154098 102003 92143 145561 240678 382589 562861
43734E62861J40623J8406j05696j81589k15558j81417m0295J33739J88946R4049
43724D14069l2540j26409k50167l96254l96571j66618R9104J50813J8914n1587
43714g37246M5094J69996J83676J18928O3472J6761n3202j07170q2308K377O1173
43703c18449M7971M709R356R4587K10641K66698K22374J27526M9028j8251j21822
43692E74368k49279l17749k73329j50768k4903N0579N0619j7311r5204j08807
43682e61784m5436M0625J13111J87033K47362K03648K904k40356l17746j57237
43672e27876Q0883J85256J29976N8759M9089P586j34715k33422r9763J70813K42864
43661g0550j5382l17425l27531r2129R1122J18569J40554K22351K33986J27259
$$ plain form
43734 562861 703484 721890 616194 434605 219047 37630 -2665 131074 320020 414069
43724 414069 381529 255120 4953 -391301 -787872 -954490 -855386 -704573 -685659 -737246
43714 -737246 -692152 -522156 -338480 -219552 -156080 -139319 -192521 -299691 -381999 -379622 -318449
43703 -318449 -270478 -265769 -256413 -161826 48815 315513 537887 665413 714441 696190 574368
43692 574368 325089 7340 -265989 -416757 -441660 -391081 -340462 -357773 -452977 -561784
43682 -561784 -607220 -566595 -453484 -266451 -19089 184559 187463 -52893 -370639 -527876
43672 -527876 -446993 -261737 -131761 -73002 -23913 -16327 -151042 -384464 -484227 -313414 -70550
43661 -70550 -85932 -403357 -730888 -823017 -731895 -613326 -472772 -250421 -16435 110824
43651A10824N3430Q9667Q4269o4856j83888q2965J15803J49459J2577o5535N383
43640B24168P6261M1815o649L0015J06651J51219J83746K29432K29730J27840
43630A394228l7912j88800k83347l02094k36264j27659m0576K7064J12713J65315
43620D82668Q7431p1163j25296k8205L9252l4667q3525P0633K83085K57111j5770
43609H61554k35787k20543j14242j08206j66605j54881p7613k6221Q522R6944
43599a37078J87667J39030m8547j80102j11094O3690J53022J17783N8297L393
43589B46061j23040k93250l01789l0341L16015M10252K09545j5050o2204j8098
43579C38101k2818k3854P6795J80268J12503q3068j93920j59362j25910j62715
$$ plain form
43651 110824 164254 253921 338190 273334 89446 6481 122284 271743 284320 218785 224168
43640 224168 300429 342244 335595 365610 472261 623480 807226 1036658 1266388 1394228
43630 1394228 1356316 1167516 884169 582075 345811 218152 177576 204640 317353 482668
43620 482668 570099 498936 373640 345435 384687 350020 266495 337128 620213 877324 861554
43609 861554 625767 405224 290982 182776 16171 -138710 -216323 -242544 -234022 -137078
43599 -137078 50589 189619 141072 -39030 -150124 -86434 66588 184371 242668 246061
43589 246061 123021 -170229 -472018 -502359 -186344 223908 433453 418403 356199 338101
43579 338101 315283 291429 368224 548492 660995 577927 384007 224645 98735 -63980
43569f3980j45137J174J43904J52977R3134O2309k342j64779k63744r2238K43822
43558c4900L96416K28678k3471j02784l8784m092m3548q8186j06987r5888j5507
43547G0947J15010J52019J1866j55858j52585k6100J5035n7870o9912K8596N8090
43536a0762q1354k20288j76351k3619N2808L1920J8580M0097N4646Q3001J64308
43525f7014K40170K35469J93113J79916J38221P038r2726j5836J18469N0398k12974
43514G74244l78591k96018j42890j00363r9963k6180N6141M6198r23K104J1134
43503a55107k5572k6954O1957J08853j1055j70345j46844M9919K03704J86675
43493G5231N8167o9000r7544L8623K49310K70767j5146l29957l14533l2890J24640
$$ plain form
43569 -63980 -209117 -207943 -64039 88938 182072 244381 242039 77260 -186484 -278722 -34900
43558 -34900 361516 590194 566723 463939 425155 421063 377515 289329 182342 86454 70947
43547 70947 185957 337976 349842 193984 41399 15299 30334 -27536 -97448 -68852 -10762
43536 -10762 -92116 -312404 -488755 -512374 -459566 -427646 -409066 -368969 -314323 -231322 -67014
43525 -67014 173156 408625 601738 781654 919875 926913 834187 818351 936820 987218 774244
43514 774244 395653 99635 -43255 -143618 -243581 -269761 -213620 -167422 -168345 -166241 -155107
43503 -155107 -180679 -207633 -145676 -36823 -47878 -218223 -365067 -315148 -111444 75231
43493 75231 133398 64398 -33146 5477 254787 525554 510408 180451 -134082 -166972 -42332
43482d2332J7917q5541J9433J73402J61349N2278L2208R1128Q5315j0063r6245
43471C98849j21563j07445o4930j0644j3094j11873k28664k44584j32801L9013
43461e97736J82219K16845J05263p9158j79910j11100O3371K22309K85848K22882
43451C30833P4425k3299J7666N7523j17887m18599m63681j02420L06709L43655
43441D925P3138j04358k0728J22026J31270N8939J9534l141p9653j98045k70651
43430b66744k10578k351K34591L03922J61452K3844J05662L03390L19494P4993
43420A047675j97680k87649k40513k09236k33277k39201j46538P1374L27181M11890
43410C04026J90510j72317l42194k14024j7047L5061J0894O9661J78253J86803
$$ plain form
43482 -42332 -24415 -109956 -90523 82879 244228 296506 328714 419842 505157 495094 398849
43471 398849 277286 169841 104911 94267 81173 -30700 -259364 -503948 -636749 -597736
43461 -597736 -415517 -198672 -93409 -172567 -352477 -463577 -400206 -177897 107951 330833
43451 330833 405258 381959 399625 457148 339261 -79338 -543019 -645439 -338730 4925
43441 4925 78063 -26295 -47023 75003 206273 265212 284746 281605 201952 3907 -266744
43430 -266744 -477322 -479673 -245082 58840 220292 244136 349798 653188 972682 1047675
43420 1047675 849995 562346 321833 112597 -120680 -359881 -506419 -435045 -107864 304026
43410 304026 494536 322219 -19975 -233999 -251046 -215985 -205091 -135430 42823 229626
43400B29626P6530l7824r3925j21689j29612q1636J7833J11176J58381J58554
43390B87414J20949O5765J8019m3387j67624l04537k84078l1694K63736L39602
43380B64165J89928N3359O1003O4247j02836l28319l49585j32275N0264k6684
43370b56733k31464k51575j9889K00234J87898N8730O2723K03057K46697Q7642
43360B87320j01768j35643n9383k4019m4184k1386O2652J19540J01408N5560K9320
43349B69417K2299M9756J53247K96625L29803J47710j36277k73580j72475k3469
43339F63056m6535j75851j51786O8869J98122K5015k48302k85113r4684L6637
43329a0572J9675L3526J07059P408l05199m63343j99459K02076K86653P3240m7020
$$ plain form
43400 229626 306156 268332 174407 52718 -76894 -158530 -140697 -29521 128860 287414
43390 287414 408363 474128 492147 448760 281136 -23401 -307479 -339173 -75437 264165
43380 264165 454093 507452 568455 632702 529866 201547 -148038 -280313 -230049 -256733
43370 -256733 -488197 -739772 -759661 -559427 -371529 -312799 -250076 -47019 199678 287320
43360 287320 185552 49909 -9474 -33493 -77677 -99063 -36411 83129 184537 240097 269417
43349 269417 291716 341472 494719 791344 1121147 1268857 1132580 859000 686525 663056
43339 663056 616521 440670 288884 357753 555875 580890 332588 47475 -47209 -10572
43329 -10572 9103 42629 149688 157096 -148103 -611446 -810905 -608829 -322176 -248936 -295956
43318b95956O0004J41347L9483q5409q9506n2512k3252J21531L77944M56471J73751
43307H23896k01995k72962m6880J24554O2133o7501q1175j3024L9560Q6053J59215
43296F11874K12821J97796J30800K2016j45411k96334k69091n7479Q4244n0304
43286D40932k92857k92716j2771K00894J07019r8901r4788R9664J95131Q9842
43276C41449j1510M0590J13001M4394p1175m1751J00793J48006M1228n4220k1873
43265F28932L6993k4962j95186l51155m14892l68701j99289O6422L10707M06823
43255a04308L41957J98972M6063q1950j22457j3950J86458K98967J98870l2729
43245I15893j87938j55799k8717K2802m9808j32667j07936p796L6354j7855o0769
$$ plain form
43318 -295956 -235952 -94605 -55122 -140531 -230037 -282549 -305801 -184270 193674 650145 823896
43307 823896 621901 348939 302059 426613 488746 421245 340070 327046 366606 452659 611874
43296 611874 824695 1022491 1153291 1175307 1029896 733562 464471 406992 491236 440932
43286 440932 148075 -144641 -157412 43482 150501 51600 -43188 56476 251607 341449
43276 341449 329939 370529 483530 527924 456749 414998 515791 663797 705025 650805 628932
43265 628932 665925 640963 445777 94622 -320270 -688971 -888260 -821838 -511131 -104308
43255 -104308 237649 436621 482684 400734 278277 264327 450785 749752 948622 915893
43245 915893 727955 572156 543439 566241 516433 383766 275830 268034 304388 286533 225764
43234B25764Q001J18208J10210m0243j70156j29976L9188J83076K28769K18511
43224G91352J82163Q8376n1970j35300r1101L597J8783n6696j24681j31710j07505
43213C85308n5014O8829K20393K45198Q1666j03882j09261K9424Q8946l3444k02062
43202F16101k55329k05090j55656j24992n0353P3435J64903J69350J26734J00639
43192D59742R1037O0135J7791K0239O8006O3788o2800k13597k02813r792J46482
43181D38218O9743j43828k17833n6529J38641J44785r080j23101r9916k5448L829
43170A19481K1698J05453K07791J75204l2955k21582j62877Q7713K14171M4290
43160E58387j96657j73926J00982K90888J88416n4917j98737k07764j62656n5947
$$ plain form
43234 225764 233765 351973 462183 421940 251784 121808 160996 344072 572841 791352
43224 791352 973515 1061891 1009921 874621 783520 787117 805900 749204 624523 492813 385308
43213 385308 330294 399123 619516 864714 946380 842498 733237 762661 851607 818163 616101
43202 616101 360772 155682 26 -124966 -175319 -101884 63019 232369 359103 459742
43192 459742 550779 610914 628705 648944 716950 780738 717938 504341 301528 291736 438218
43181 438218 507961 364133 146300 89771 228412 373197 364117 241016 141100 115652 119481
43170 119481 141179 246632 454423 629627 596672 375090 212213 299926 514097 558387
43160 558387 361730 187804 288786 579674 768090 713173 514436 306672 144016 88069
43150H8069J37009K84292K03517p0769k93944l05832j82782o9750N52N6653P7368
43139g5617L9625P572N4231J17392N5969j25176k22432q8563J38938J92391K9819
43128A24149j18950r3959j6183m0479o5349Q9044L05587K65583n3492k69616j22811
43117C524J37643J11300j80917l49556j84812J13127K56446J94648N8719m5419
43107A14703r9512j28093j51272j32887R697K64134M40206L64056J23639m0897
43097G63774o8838j01230j70204j18491Q7140K11904Q5466j21536j52969m2037
43087C72979m902p3964q8557J674P2667O4010N3489O2526O42j30422j72113n0701
43075A07328P6508M2884p7322p7291R3007K68363K67666O6066k00739l36236k27250
$$ plain form
43150 88069 225078 509370 712887 642118 348174 42342 -140440 -210190 -209638 -152985 -75617
43139 -75617 -35992 -28420 25811 143203 199172 73996 -148436 -236999 -98061 94330 124149
43128 124149 5199 -88760 -104943 -145422 -210771 -121727 183860 449443 395951 126335 3524
43117 3524 141167 252467 71550 -278006 -462818 -349691 -93245 101403 160122 114703
43107 114703 15191 -112902 -264174 -397061 -387364 -123230 316976 681032 804671 763774
43097 763774 694936 593706 423502 305011 392151 604055 689521 567985 415016 372979
43087 372979 368077 294113 205556 207230 279897 343907 397396 459922 460564 330142 158029 107328
43075 107328 183836 226720 149398 72107 165114 433477 701143 767209 566470 230234 2984
43064B984L9397K34038K18582R0701L9708J08634J77532J42963J6470j42074k87170
43053F41765l63802l08832j30596N4609J16766M1523n4664m7702N1775R5567k3130
43042G3279j92426j64175J36283M57889M78159J73029j70536k91603j86222j847
43032C11830J48965K04282J15302q1974k25963j86505l6981L7208j6118p6075
43022A93971n3051j474J5661M8808J50870K31282J52840n4685k07875k10752j62569
43011A03026j75240j91984q2948J45190L45181M05492L26717J41932j12359l27501
43001E77506l58495j98976k2802K7526R250N1172J45812J86925J48460R1171L1916
42990F89465n2351j16379r5029n1611j12101k36220k32530n0928J18083J16416
$$ plain form
43064 2984 42381 276419 495001 585702 625410 734044 911576 1054539 1071009 928935 641765
43053 641765 277963 -30869 -161465 -106856 9910 51433 -3231 -50933 842 96409 73279
43042 73279 -119147 -283322 -147039 310850 789009 962038 791502 499899 313677 311830
43032 311830 460795 665077 780379 698405 472442 285937 248956 286164 270046 193971
43022 193971 140920 139446 155107 203915 354785 586067 738907 684222 476347 265595 103026
43011 103026 -72214 -264198 -347146 -201956 143225 548717 875434 1017366 905007 577506
43001 577506 219011 20035 -2767 24759 34009 85181 230993 417918 566378 657549 689465
42990 689465 637114 520735 425706 374095 261994 25774 -206756 -257684 -139601 -23185
42980b3185K1123k8086l6086n3740k9882P0488J31960N8488l4307K825Q2911K1662
42968A84171j28385j45006r638O3016o063l4214J01689K62928K79594J74201L7076
42957G79369j22287k62489k38273j5532J83444J25741j36617l54486l65831j75793
42947e82754J17551L36425K92736R958k30947k20349p4646o251J287O9991J31657
42936a55342M0745j13167j13607J4024N9694K8074J25550L19209K96264j2916
42926D88528k42910j31337P9043M9650j17163r0234J27826K23817Q0392r4640
42916C72972j43830j44680j64006j16211J8624P1546o0673k04295j28083J24044
42906c74592K89535K35384R6148N2422R9912J08168L6277j7579Q271J4993j14625
$$ plain form
42980 -23185 -2062 -30148 -66234 -119974 -149856 -79368 52592 111080 76773 79598 162509 184171
42968 184171 55786 -89220 -98858 -35842 -41905 -76119 25570 288498 568092 742293 779369
42957 779369 657082 394593 156320 140788 324232 449973 313356 -41130 -406961 -582754
42947 -582754 -465203 -128778 163958 173916 -57031 -277380 -352026 -358277 -356990 -286999 -155342
42936 -155342 -114597 -227764 -341371 -327347 -267653 -239579 -114029 205180 501444 488528
42926 488528 245618 114281 193324 242974 125811 35577 163403 387220 467612 372972
42916 372972 229142 84462 -79544 -195755 -177131 -105585 -166258 -370553 -498636 -374592
42906 -374592 -85057 150327 246475 298897 398809 506977 543254 525675 533946 548939 434314
42895D34314k97911l13211j05249J07931J18113k337m3932J8947L1188n3459q7330
42884a92936K5515J71422K02155J39269J01480J22037J44555J35276R8719K8867
42874I76359o3522j15865r2363n0708l5225L3720K17947L48555J63680k88088
42864A094490n90616m52170r5450M8682p1395j20970N4429J75952j3725l08140
42854b78913l09011M914K72623K68366J34479O4362L4061l1320o0016J5150P4241
42843A88936j7576j61895j53282J1849J48779J69213J54529J51039R4286j8855
42833E67023o1497L3894J42390R1901j32541l80489m66328k96591L3239K56977
42823b12022J80448o1624j30403Q8207L38084L51746J75544Q650j01360k02333
$$ plain form
42895 434314 136403 -176808 -282057 -174126 -56013 -58350 -102282 -83335 -52147 -105606 -192936
42884 -192936 -167421 4001 206156 345425 446905 568942 713497 848773 947492 976359
42874 976359 912837 796972 704609 653901 618676 652396 870343 1218898 1382578 1094490
42864 1094490 503874 51704 -43746 4936 -66459 -187429 -133000 42952 29227 -278913
42854 -278913 -587924 -583010 -310387 -42021 92458 156820 190881 159561 99545 114695 188936
42843 188936 171360 9465 -143817 -131968 16811 186024 340553 491592 585878 567023
42833 567023 505526 539420 681810 773711 641170 260681 -205647 -502238 -468999 -212022
42823 -212022 -31574 -93198 -223601 -135394 202690 554436 729980 738630 637270 434937
42813D34937k20836o5407J15912O1364k03272l48022j93435N4420J35826Q5507
42803a43006Q3066J35876J25194N2307R199l3326j70931l12456k28066R1658L46848
42792d3637L11363J21631L5817O0794J9376j06068j33744J6719J93178K35501
42782G10930J62740O1061n9572j84350k01462m8976J22648J06605o5502j53034
42772D51088m7918P8201L7723j06399j60654r1561l7253n6575l6363R5583K02206
42761C28078J09783j11556j97066m5883J14786L6118j81000k08813J8995J65286
42751B8728m1001l73119l71478L6070M39975M93395K88448Q9669m5483j71227
42741C73977j90510n81J94311P1072k82525l76326j929M02994L31996p9881k71698
$$ plain form
42813 434937 214101 148694 264606 325970 122698 -225324 -418759 -364339 -228513 -143006
42803 -143006 -59940 75936 201130 253437 262636 229310 58379 -254077 -482143 -390485 -43637
42792 -43637 267726 389357 425174 485968 505344 399276 265532 282251 475429 710930
42782 710930 873670 934731 875159 690809 489347 440371 563019 669624 604122 451088
42772 451088 403170 481371 519094 412695 252041 160480 123227 66652 30289 125872 328078
42761 328078 437861 326305 129239 83356 198142 234260 53260 -155553 -136558 28728
42751 28728 -12273 -385392 -756870 -720800 -280825 212570 501018 590687 545204 373977
42741 373977 183467 182886 377197 448269 165744 -210582 -212511 190483 522479 442598 170900
42730A70900p0371J16846k6399k51926j64972J61104L10874J47744k8791L3123
42720C98132J93193J87731K6169p7039m8533k1236q2780j51350j38193q1768n2845
42709A51481m3631l0274m6354j03954j33383j09087j40981k89528l70712j60537
42699a276960K25275M09407K72222J28369K34813L80590K31074j10939k44749
42690B49102r3273J1419r4589j45961O3401K85796K02435n3821j07833P2202J67237
42679E56115L9250q9664l8115P1891O9842K95j6994M719M923J5712O4156O2062
42667G44192n4806j80233j79589r4436n7899p5713m6245M3690R4394N5371j0912
42656B37814k9599J2824Q4166J20438N7927o7945j07679J6034J62499J44328K214
$$ plain form
42730 170900 100529 217375 190976 -60950 -225922 -64818 246056 393800 365009 398132
42720 398132 591325 779056 805225 728186 679653 658417 575637 424287 286094 204326 151481
42709 151481 107850 77576 31222 -72732 -206115 -315202 -456183 -745711 -1116423 -1276960
42699 -1276960 -1051685 -642278 -370056 -241687 -6874 373716 604790 493851 249102
42690 249102 155829 167248 72659 -73302 -9901 275895 478330 424509 316676 388878 556115
42679 556115 595365 505701 467586 539477 609319 609614 592620 597339 602262 617974 682130 744192
42667 744192 689386 509153 329564 235128 177229 101516 55271 98961 193355 248726 237814
42656 237814 208215 221039 305205 425643 483570 415625 307946 323980 486479 630807 633021
42645F33021n2162L8278Q4525n9894k66435k87154o1402K22123L34845K25861
42635H11606M9161m661Q3144J39196K3797j68482k19997p5190R4221J12447j4913
42624H30329j53840j86724q9965M4496O5260n8885j31255N2251L67038M34925
42614A173630J08302l05225m26939k55176o6185k772K0516O7119O9587l710o2462
42603C16685m5915k6352p8458j39143q9200P0986K05002J92636N2862r2318j55058
42592B11727j61385j80432j94402r9475J35367L67947M08889K31735R25j08579
42582F12317p6869k0460l9395r7797o4011J16328L11125L26197J39364o8212j36767
42571A001820r3666m9272k8005R524N2347N2586J2556k5388l5598R611J43565
$$ plain form
42645 633021 580859 619137 703662 643768 377333 90179 28777 250900 585745 811606
42635 811606 860767 856106 939250 1078446 1102243 933761 713764 638574 732795 845242 830329
42624 830329 676489 489765 399800 444296 509556 450671 319416 371667 738705 1173630
42614 1173630 1281932 976707 549768 294592 228407 225635 246151 313270 382857 379147 316685
42603 316685 270770 244418 165960 26817 -62383 8603 213605 406241 459103 366785 211727
42592 211727 50342 -130090 -324492 -423967 -288600 79347 488236 719971 720896 612317
42582 612317 535448 514988 475593 377796 313785 430113 741238 1067435 1206799 1138587 1001820
42571 1001820 908154 858882 830877 840401 892748 945334 957890 932502 896904 906515 1050080
42560A050080L04300L18729J10323j55534k73654k62860k53897k05120J4861K89871
42550I37099L07937K6173k03570j25309N6445J7178j84308k19751m71K14124K03691
42539A029238L9190q9645j04753l6358O1542J24376J12699Q4437J42347K79685
42529A642758L71310L42689K45396J32456l0330k66657m88455n64926m54141k36686
42519F93414n7717k5183r3015p2033J28287L00692J64354k01729l86158j97319
42509B53593O3286N9488q8203n3050J34175J45295p9005k19626r8853N6613K4527
42498A98240o0678R510J34848Q3736j06291j82793m9744J50019K63261K37279
42488F77387P6825j08576j06069J19898K45607k2598m43678m80804n6505L13779
$$ plain form
42560 1050080 1354380 1673109 1783432 1627898 1354244 1091384 837487 632367 647228 937099
42550 937099 1245036 1271209 1067639 942330 998775 1015953 831645 611894 611423 825547 1029238
42539 1029238 1068428 978783 874030 837672 899214 1023590 1136289 1220726 1363073 1642758
42529 1642758 2014068 2356757 2602153 2734609 2704279 2437622 1949167 1384241 930100 693414
42519 693414 635697 610514 517499 445466 573753 874445 1038799 837070 450912 253593
42509 253593 316879 376367 288164 235114 369289 514584 435579 215953 117100 173713 198240
42498 198240 137562 147072 281920 365656 259365 76572 26828 176847 440108 677387
42488 677387 754212 645636 539567 659465 905072 882474 438796 -42008 -98513 215266
42478B15266K50176l640k5206J78498K93594J98673L1833r7455j74547j52415
42468G14777k1210O5334k4475j53449r6156R3875J55527K0904j24318j70308j92687
42457B67814k07438j03099J02194J97101Q9590l3533J4980J70410K58557K14595
42447I71171M8811k19778m63478m61697j78014J27973K18388J58823J30421J32696
42437D65316P6446K0905P1856J44068P7426p6595j36299j09624j63144k85033
42427H5322k68031p5225N6669j9028j40905j21489k4561J1539L5372J53897K81387
42416b5053K51995J07945M9048J25289J89877J53408P8555L363j11524j98363
42406F24540p5133K39052M00356J44374l06854m76940k20969J51007L16384K51309
$$ plain form
42478 215266 465442 461802 436596 615094 908688 1107361 1139194 1041739 867192 714777
42468 714777 693567 758901 734426 580977 484821 578696 734223 755127 630809 460501 267814
42457 267814 60376 -42723 59471 256572 346162 312629 327609 498019 756576 971171
42447 971171 1019982 800204 336726 -124971 -302985 -175012 43376 202199 332620 465316
42437 465316 541762 562667 634523 778591 856017 779422 643123 533499 370355 85322
42427 85322 -182709 -257934 -201265 -220293 -361198 -482687 -507248 -495709 -460337 -306440 -25053
42416 -25053 226942 334887 383935 509224 699101 852509 931064 934427 822903 624540
42406 624540 549407 788459 1188815 1333189 1026335 549395 328426 479433 795817 1047126
42396A047126O3424k04302m59606m89602k22780R1813J86639J30139J46466K08767
42386D98084J18218p7168j00687Q5624J89634P3376k1327Q0739J47801o6195l49795
42375E78304l13049J7970K55968K28584J32241J09311L3036j86069l76171l47319
42365A32806j60423k705O6094J14757J88444K59212K65411J52672n2015j97764
42355G66489j48686K7406J33775J08930O5138O0904K6514m4862l6659Q1220J71788
42344A211957J52771J15496J25748J04518K6532K7094J54946K27099J20552N603
42334B272316O0964J57488J11893P8141L23758P17874Q48445O50350N16275O93885
42324F431389R49088J003954R84224J170837J519075J692345J457851Q37218k2419
$$ plain form
42396 1047126 1110550 906248 446642 -42960 -265740 -173927 12712 142851 289317 498084
42386 498084 616302 539134 438447 524071 713705 787081 765754 846493 994294 928099 578304
42375 578304 265255 283225 539193 767777 900018 1009329 1042365 856296 480125 132806
42365 132806 -27617 -30322 35772 150529 338973 598185 863596 1016268 964253 766489
42355 766489 617803 645209 778984 887914 953052 1013956 1040470 995608 958949 1040169 1211957
42344 1211957 1364728 1480224 1605972 1710490 1737022 1764116 1919062 2146161 2266713 2272316
42334 2272316 2333280 2490768 2602661 2680802 3004560 3722434 4570879 5221229 5737504 6431389
42324 6431389 7380477 8384431 9368655 10539492 12058567 13750912 15208763 16045981 16023562
42315A6023562q97271j479044j569937j316226j080472j047926j084807r98222
42307F549657p88563n83113m39420l21438k20788j95710k71976l68752l70394
42298B989503k54444j05056j340N3978P7468M6145m6694j32818j47257j26806
42288B352679j42545j70213j35037n8636l3435o0297n3387j1493k2108o6275m967
42277A594286J66714K41851J00329q9062j26232q1248j28556k03084q6188K08885
42267A597695M12640L96196L37217L84080L77708R8428l38303n56391l79713m0552
42257B289005J27219O9912j9815l5232p6845k08858k72482j02368J63957K10923
42247B145416j7898k28171j92358m4414k0005r7129j01991l1885k2670o4437o680
$$ plain form
42315 16023562 15126291 13647247 12077310 10761084 9680612 8632686 7547879 6549657
42307 6549657 5761094 5177981 4738561 4417123 4196335 4000625 3728649 3359897 2989503
42298 2989503 2735059 2630003 2628663 2682641 2760109 2806254 2759560 2626742 2479485 2352679
42288 2352679 2210134 2039921 1904884 1846248 1812813 1752516 1699129 1687636 1665528 1599253 1594286
42277 1594286 1761000 2002851 2103180 2014118 1887886 1806638 1678082 1474998 1388810 1597695
42267 1597695 2010335 2406531 2743748 3127828 3505536 3603964 3265661 2709270 2329557 2289005
42257 2289005 2416224 2486136 2466321 2431089 2354244 2145386 1872904 1770536 1934493 2145416
42247 2145416 2127518 1899347 1706989 1662575 1642570 1545441 1443450 1411565 1388895 1324458 1317778
42236A317778J55539K32065J16708o7743j49533q3393P6957K29374K34241M3108
42226B105101j64633j50534N3715J76718R6001k4335m4788n4939j46399k09414
42216A636493j28757n620r82r1626j47748j32169o9744N5319K13062K62795J38989
42205A730012j5287n9674o8552j55919k32642j52052K6533J45612K02195K54179
42195A674405K08340k834j45854N2158M10876M52547Q3214k62942k55739p4229
42185B139942j5279m1204L5542J80457K31599J91728J59809R1341j15339l55723
42175B502873l77570j09532K27649L59116K18215k0687j19175j1258J29405J27648
42165B926684P4004J84369M03095M10039J17649j17745K5661L82776N75922N44538
$$ plain form
42236 1317778 1473317 1705382 1822090 1754347 1604814 1521421 1598378 1827752 2061993 2105101
42226 2105101 1940468 1789934 1843649 2020367 2116368 2092033 2047245 1992306 1845907 1636493
42216 1636493 1507736 1502116 1501134 1409508 1261760 1129591 1059847 1115166 1328228 1591023 1730012
42205 1730012 1714725 1655051 1586499 1430580 1197938 1045886 1072419 1218031 1420226 1674405
42195 1674405 1882745 1879911 1734057 1786215 2197091 2649638 2732852 2469910 2214171 2139942
42185 2139942 2124663 2083459 2119001 2299458 2531057 2722785 2882594 2973935 2858596 2502873
42175 2502873 2125303 2015771 2243420 2602536 2820751 2800064 2680889 2669631 2799036 2926684
42165 2926684 3000688 3185057 3588152 3998191 4115840 3998095 4023756 4406532 4982454 5526992
42155E526992N02588N07532M11066J90426Q458o9406j40433k17347j77170r379
42145F533327J29619J81279K74254M64236O15758O64667P76334J065038J330040
42136A2034552J288798R72803O70124N07033L00074j28285o53782r86021j023764
42127A2981532r45797r43670r82112r02662o81945m48365k69536r9625K9590k5712
42117G711698k44071l25386o2775L11525M00140J74820l1775k5165N5026N4869
42107H018906J8193q459j05459k75987l47840k41815j36612j89457k70199j69482
42097F291789P4408K60137L14758K93320J90733j5388j92382j54419P2550K87608
42087G423114M16983N80563Q28862J014528J019459R70134J112186J535131K102010
$$ plain form
42155 5526992 6029580 6537112 6948178 7138604 7147062 7077656 6937223 6719876 6542706 6533327
42145 6533327 6662946 6844225 7118479 7582715 8198473 8863140 9639474 10704512 12034552
42136 12034552 13323350 14296153 14966277 15473310 15773384 15645099 14991317 14005296 12981532
42127 12981532 12035735 11092065 10109953 9207291 8525346 8076981 7807445 7707820 7737410 7711698
42117 7711698 7467627 7142241 7079466 7390991 7791131 7965951 7934176 7909011 7964037 8018906
42107 8018906 8037099 8028640 7923181 7647194 7299354 7057539 6920927 6731470 6461271 6291789
42097 6291789 6366197 6626334 6941092 7234412 7425145 7409757 7217375 7062956 7135506 7423114
42087 7423114 7840097 8420660 9249522 10264050 11283509 12253643 13365829 14900960 17002970
42078A7002970K619937L031006L444383L984626M581931M913746M579670L346728
42070D7504997J282622j213875l468999m809056n008571m463459l786431l251018
42062B2786210k750445k210945j783198j580683j473008j279756j011534p79224
42054I917417n95598m23094l15577l38559m10955l96513l12033k73318k67067
42045F584703j80824o4661j22465l54947m44349j73974K08695K79854m898k89286
42035E437848l16018j88157r4939l1866P9414J79617J44897k6807k20631l16149
42025D647209k26564M2587K89344K38122r8077l49615k61593n4451p1273k31692
42015C923997j74879J34828L31142K06867j2292p1028m5026j22007k66443l00678
$$ plain form
42078 17002970 19622907 22653913 26098296 30082922 34664853 39578599 44158269 47504997
42070 47504997 48787619 47573744 44104745 39295689 34287118 29823659 26037228 22786210
42062 22786210 20035765 17824820 16041622 14460939 12987931 11708175 10696641 9917417
42054 9917417 9321819 8898725 8583148 8244589 7833634 7437121 7125088 6851770 6584703
42045 6584703 6403879 6339218 6216753 5861806 5417457 5243483 5452178 5732032 5727134 5437848
42035 5437848 5121830 4933673 4838734 4806868 4886282 5065899 5210796 5183989 4963358 4647209
42025 4647209 4420645 4463232 4752576 4990698 4892621 4543006 4281413 4226962 4155689 3923997
42015 3923997 3749118 3883946 4215088 4421955 4409663 4338635 4293609 4171602 3905159 3604481
42005C604481j62161O8144K60651K72586N9040j77921j61901N7307J34063l6672
41995C917617j32481N7942K49031J12158j75160k14019q254J11531N5440L6059
41985D009864J15190J05573m9263j57703r8859L8932J69707K76755K65250N8992
41975D734438j49842q9601J26263R9136k24185m26364k57264J2952Q2769O7213
41965C975515J73481K75396J66376k0399k0370J10406J16912j642j8292J02682
41955D860065J49571K4714j23116j55124j01840m2238j3482m3706j01994m5976
41945D406874J85333L66188K14534j67835l45995j12732K37100L12951J15731
41936E212149m1121L2260K21530L13089K30544N7891p4141q7380R282J38113K06491
$$ plain form
42005 3604481 3442320 3510464 3771115 4043701 4102741 3924820 3762919 3820226 3954289 3917617
41995 3917617 3785136 3843078 4092109 4204267 4029107 3815088 3806834 3918365 3973805 4009864
41985 4009864 4125054 4230627 4181364 4023661 3924802 3963734 4133441 4410196 4675446 4734438
41975 4734438 4584596 4494995 4621258 4720394 4496209 4069845 3812581 3825533 3908302 3975515
41965 3975515 4148996 4424392 4590768 4570369 4549999 4660405 4777317 4775675 4757383 4860065
41955 4860065 5009636 5034350 4911234 4756110 4654270 4612032 4598550 4554844 4452850 4406874
41945 4406874 4592207 4958395 5172929 5005094 4659099 4546367 4783467 5096418 5212149
41936 5212149 5171028 5203288 5424818 5737907 5968451 6026342 5952201 5864821 5874103 6012216 6218707
41925F218707J77164J10779J15608K14733K89942K24607P6875J0711P0706J62171
41915G672003K55032M16848N87029N43363K42907M537J43201N53801Q74135R56244
41905A2249100R45824R73256J015758J032757J004952Q61489N98840M46532O51170
41896A9779678J084723J342174J275839J153069J201490J299452J283601J295576
41888B9715602J577848K094988K604005L003251L394449L861234M388812M983267
41880E5623456N700293O543148P450754Q402055R462509J0732841J2266954J3932221
41872A30114231J5248273J5448034J3857873J0274784N027029j148609p193649
41865A81627966j1947117j4665368j5434996j4943565j3831673j2387147j0781377
$$ plain form
41925 6218707 6395871 6506650 6622258 6836991 7126933 7351540 7428415 7439126 7509832 7672003
41915 7672003 7927035 8343883 8930912 9474275 9717182 9721719 9864920 10418721 11292856 12249100
41905 12249100 13194924 14168180 15183938 16216695 17221647 18083136 18681976 19128508 19779678
41896 19779678 20864401 22206575 23482414 24635483 25836973 27136425 28420026 29715602
41888 29715602 31293450 33388438 35992443 38995694 42390143 46251377 50640189 55623456
41880 55623456 61323749 67866897 75317651 83719706 93182215 103915056 116182010 130114231
41872 130114231 145362504 160810538 174668411 184943195 189970224 188821615 181627966
41865 181627966 169680849 155015481 139580485 124636920 110805247 98418100 87636723
41858H7636723r274363q033246o957578n896939m942414m304934l956091l604817
41850D0666341l069860k505517k168613k079718k027958j839563j519110j157415
41842B4298587q28472n91311m80251m44796l78317k52234j51297j35417j52838
41833B0883654j51217j81435k96585m26950m73399m66935n05796n77618n88103
41824A7215616n40063n24075n31699m46669k52491q5996l4087l5623m8289j40885
41814A4575739l16700m08992l01302j27753q7538j48575j13174O8556K26145K10297
41804A3576703O9479l1345L0977K62637N43542O91238O16178M17506K69504K41255
41794A6687674K90663L77927M79523N33684N02957M81687O17248R11899J202430
$$ plain form
41858 87636723 78362360 70329114 63371536 57474597 52532183 48227249 44271158 40666341
41850 40666341 37596481 35090964 32922351 30842633 28814675 26975112 25456002 24298587
41842 24298587 23470115 22878804 22398553 21953757 21575440 21323206 21171909 21036492 20883654
41833 20883654 20732437 20551002 20254417 19827467 19354068 18887133 18381337 17803719 17215616
41824 17215616 16675553 16151478 15619779 15173110 14920619 14834623 14800536 14764913 14716624 14575739
41814 14575739 14259039 13850047 13548745 13420992 13333454 13184879 13071705 13140261 13366406 13576703
41804 13576703 13646182 13614837 13645814 13908451 14451993 15143231 15759409 16176915 16446419 16687674
41794 16687674 16978337 17356264 17835787 18369471 18872428 19354115 19971363 20883262 22085692
41785B2085692J338024J284068J074671P99194O34171P26995J000475J209615
41777C0152905J241582J214515J216528J122650Q06729L94665J23255K3318p4772
41768C6221375k64620m86191p15212j014367j331445j448076j272892j046471
41760B8642101j067887j280821j328984j036352o56733n66560q24823j131797
41752B0748144j156279q26067l55303o8482j52423m96170p97258q77999q41360
41743A5176803q56028q93993q17613o42402n19861m89830m60659m40594n50621
41734I505202p45370p69426n22394k46084j77977k21783j73549q6189j36923k69897
41724F155610k82165j90720j90474k73248k30125o6030n5324k67979l79778j58668
$$ plain form
41785 22085692 23423716 24707784 25782455 26581649 27215820 27942815 28943290 30152905
41777 30152905 31394487 32609002 33825530 34948180 35754909 36149574 36272829 36296147 36221375
41768 36221375 35956755 35470564 34755352 33740985 32409540 30961464 29688572 28642101
41760 28642101 27574214 26293393 24964409 23928057 23271324 22704764 21879941 20748144
41752 20748144 19591865 18765798 18410495 18342013 18189590 17693420 16896162 16018163 15176803
41743 15176803 14320775 13426782 12609169 11966767 11446906 10957076 10496417 10055823 9505202
41734 9505202 8759832 7990406 7468012 7221928 7043951 6822168 6648619 6562430 6425507 6155610
41724 6155610 5873445 5682725 5492251 5219003 4988878 4922848 4867524 4599545 4219767 4061099
41714D061099J42229J46458r1305j94896k5010J72999J71230N2975L4806J65828
41704D636413L06069L34505L02092L64541N65077P32079O84049N10992M81536
41695H917353O24645O13054K10108l44613o13981n18654l71184l98838m82911
41686G634979m15358k12833p3576j24374k89159l76527k81543j06203k3991j6912
41676E714503J09498L79585N16736L31661M7299k1133N4676j0429j84359j75420
41666F762617J3781N6623r9013q8143K20368L97999J05672l20463l44197m744
41656F700500K33687K11673J74590K39882K49866J71662K03178L83938M73091
41647I042067L53126K47756L84166O84763R32705J029667R77416Q24569P44664
$$ plain form
41714 4061099 4203328 4349786 4258481 4063585 4038575 4211574 4382804 4435779 4470585 4636413
41704 4636413 4942482 5276987 5579079 5943620 6508697 7240776 7924825 8435817 8917353
41695 8917353 9541998 10155052 10365160 10020547 9406566 8887912 8516728 8117890 7634979
41686 7634979 7219621 7006788 6933212 6808838 6519679 6143152 5861609 5755406 5731415 5714503
41676 5714503 5824001 6203586 6720322 7051983 7099282 7078149 7132825 7122396 6938037 6762617
41666 6762617 6776398 6833021 6734008 6645865 6866233 7264232 7369904 7049441 6705244 6700500
41656 6700500 6934187 7145860 7320450 7560332 7810198 7981860 8185038 8568976 9042067
41647 9042067 9395193 9642949 10027115 10711878 11644583 12674250 13651666 14476235 15220899
41638A5220899R33239J286376J405295J080083N53513J31610k30003p04288j162202
41629A8514522j294058j076964q06882o68235n49926l40107j52540j32174k05175
41620A3288461j84465m9963L0272l0730p1646J15700M59206O29780M57450J85181
41610A4829246J59965L86048O07928P56732J000885J346321J556148J594567J782625
41601B4020465K281250K757973K891147K919449L292697M001463M721640N484124
41593E2370208O674328Q389527J0336994J2468539J5203670J8809577K2955993
41586A47208836K7013414L0201295L1046727K7333877J7627898L175161j2103851
41579B71503357k3883607k9899582l0607350k8030577k4192567k0287562j6753701
$$ plain form
41638 15220899 16154138 17440514 18845809 19925892 20479405 20611015 20381012 19676724 18514522
41629 18514522 17220464 16143500 15336618 14668383 14118457 13778350 13625810 13493636 13288461
41620 13288461 13103996 13054033 13084305 13053575 12981929 13097629 13556835 14186615 14644065 14829246
41610 14829246 14989211 15375259 15983187 16739919 17740804 19087125 20643273 22237840 24020465
41601 24020465 26301715 29059688 31950835 34870284 38162981 42164444 46886084 52370208
41593 52370208 59044536 67434063 77771057 90239596 105443266 124252843 147208836
41586 147208836 174222250 204423545 235470272 262804149 280432047 283607208 271503357
41579 271503357 247619750 217720168 187112818 159082241 134889674 114602112 97848411
41572I7848411j3709857j1198084r162763p476333o107668n145088m566222m122415
41564C6359981l584722l001263k566600k316323k102676j817708j490179j187854
41556A8292656r53808q24000p97856q02774p71439p25353p08351o91312o29759
41547A1388004n55352n11092m55883l41818k28643k01383k18862j68059m4597
41538H662315L2000k5298j75674k91408k52387o1801J00185N2916j07170p6513
41528G857165K11576M25910K96966K0944n6797K4453l3030k39045k90246q2738
41518H135158J29579J53607R4915Q2715P6129O8975J84719M08299M96785L34729
41508A0165610J30715P9636P9686o362n9101O2471J99694J06834j58789l50776
$$ plain form
41572 97848411 84138554 72940470 63777707 56301374 50193706 45048618 40482396 36359981
41564 36359981 32775259 29773996 27207396 24891073 22788397 20970689 19480510 18292656
41556 18292656 17338848 16514848 15716992 14914218 14142779 13417426 12709075 12017763 11388004
41547 11388004 10832652 10321560 9865677 9523859 9295216 9093833 8874971 8706912 8662315
41538 8662315 8694315 8669017 8493343 8201935 7949548 7887747 7987932 8040848 7933678 7857165
41528 7857165 8068741 8494651 8791617 8812561 8755764 8780217 8747187 8508142 8217896 8135158
41518 8135158 8264737 8418344 8513259 8595974 8672103 8741078 8925797 9334096 9830881 10165610
41508 10165610 10296325 10375961 10455647 10449285 10390184 10452655 10652349 10759183 10600394 10249618
41498A0249618m22671n03718n70484m62907k07626k5865J539O751M0990j7264
41488H088363j84481k61198j25197P3946J54372J57875K07947K61161J92433M4306
41478H609527j265J15376K51951K66630J84944J22760J21106J17579N5102l2679
41468I811031o4516k3788J4274n549k0393O5139K05748K28316O4995j12416q2577
41457A0080264J46720L60206M29360M60564N98047P93105Q88367Q74089R08562
41448A5539284J070698J240222J296620J316679J461576J753507K098119K464073
41440B8240778K867859L194156L230255K957121K659891K633280K862931L108736
41432E1755007L244139L383787L663644L980425M001598L430337K250253P06984
$$ plain form
41498 10249618 9826947 9323229 8752745 8289838 8082212 8056347 8057886 8064637 8105627 8088363
41488 8088363 7903882 7642684 7517487 7591433 7745805 7903680 8111627 8372788 8565221 8609527
41478 8609527 8608262 8723638 8975589 9242219 9427163 9549923 9671029 9788608 9843710 9811031
41468 9811031 9746515 9722727 9737001 9731452 9711059 9776198 9981946 10210262 10275257 10162841 10080264
41457 10080264 10226984 10587190 11016550 11477114 12075161 12868266 13756633 14630722 15539284
41448 15539284 16609982 17850204 19146824 20463503 21925079 23678586 25776705 28240778
41440 28240778 31108637 34302793 37533048 40490169 43150060 45783340 48646271 51755007
41432 51755007 54999146 58382933 62046577 66027002 70028600 73458937 75709190 76416174
41424G6416174r25876k499925l904368m951883n481486n527273n260427m806120
41416D3058816m254971l787698l557226l432168l099702k504901j968928j760674
41408A8692548j765340j722938j583165j425815j215770q91243n78865m62398
41400I047014m96961m84126l83851l21824l18400k55954j30565j01928k30702
41391F322703l55871l09280j04664J46542L65129M81833M18684J92397l8865j17244
41381G001364m8903J0696p5080k67170l61311k08538O5761J69985J4811j74378
41371F127237j97454j41824j45167r8059J57865M82320N96568N06107M41312M25744
41361H154649K50647j18657m59623o51995p75090q01545n83779k48688j89959
$$ plain form
41424 76416174 75490298 72990373 69086005 64134122 58652636 53125363 47864936 43058816
41416 43058816 38803845 35016147 31458921 28026753 24927051 22422150 20453222 18692548
41408 18692548 16927208 15204270 13621105 12195290 10979520 10088277 9509412 9047014
41400 9047014 8550053 8065927 7682076 7360252 7041852 6785898 6655333 6553405 6322703
41391 6322703 5966832 5657552 5552888 5699430 6064559 6546392 6965076 7157473 7118608 7001364
41381 7001364 6952461 6963157 6888077 6620907 6259596 6051058 6116819 6286804 6301615 6127237
41371 6127237 5929783 5787959 5642792 5544733 5702598 6184918 6781486 7287593 7728905 8154649
41361 8154649 8405296 8286639 7827016 7175021 6399931 5598386 5014607 4765919 4575960
41352D575960m78050o73993m82129k07881k38655m13938l30042k1327J25041k274
41342A852712j40328j26582o3872j3461J01434K40343K22759L4645j14542j06257
41332A886851m2506j7705p062k5522j39394k58132j80212O1581J62710j7690k27542
41321A195377j89659J4910J23359Q1040M1998Q3802J19354N2288j11864k72029
41311A138576k75097m0943K79875L97496K37161O2759J03268K06376Q2611k09526
41301A982556l03174m8638K69832L33443J89777J08463J85533K70368K20051O0744
41291C268955r6282j66717j04932P8200K60726K64950M1884k47409l94831l51216
41281B553328k20620j08472n8238q9817j82391k29382j34719K6573O3201q0879
$$ plain form
41352 4575960 4097910 3423917 2941788 2733907 2495252 2081314 1751272 1729945 1854986 1852712
41342 1852712 1712384 1585802 1521930 1508469 1609903 1850246 2073005 2107650 1993108 1886851
41332 1886851 1844345 1826640 1819578 1794056 1654662 1396530 1216318 1277899 1440609 1422919 1195377
41321 1195377 1005718 1020628 1143987 1225027 1267025 1350827 1470181 1522469 1410605 1138576
41311 1138576 863479 822536 1102411 1499907 1737068 1799827 1903095 2109471 2192082 1982556
41301 1982556 1679382 1630744 1900576 2234019 2423796 2532259 2717792 2988160 3208211 3268955
41291 3268955 3172673 3005956 2901024 2979224 3239950 3504900 3546784 3299375 2904544 2553328
41281 2553328 2332708 2224236 2165998 2076181 1893790 1664408 1529689 1556262 1619463 1538584
41271A538584k49150k96886k63915k44994k18078j19861Q567P9461Q3243M1442
41261C58413p0171k19367k46874p2561J20804J16576K372L4096K01630K16328
41251D41246l3276k93182l07822j28781O1444K07337L06813K80151J02903p4373
41241E62460j18756j08183j67887k37328j83385m0691N5012R0217J34602J52772
41231A38833P0138j9516N5378K43863K86900Q2169j57687j91398m1494R1728R3675
41220F52589J2980n7165q6626j09099j48846j54788m7675J37208K32342J48891
41210E79811L1152P5612K53544L61998L07442J72061L5206p0888m6478J88839
41200A888299M59529M48961J47223p8388j0307Q7539j04498m39993n32501l52618
$$ plain form
41271 1538584 1289434 992548 728633 483639 265561 145700 154267 233728 316971 358413
41261 358413 288242 68875 -177999 -250560 -129756 -13180 -10808 23288 224918 441246
41251 441246 407970 114788 -193034 -321815 -260371 -53034 253779 533930 636833 562460
41241 562460 443704 335521 167634 -69694 -253079 -293770 -238758 -148541 -13939 138833
41231 138833 208971 189455 244833 488696 775596 857765 700078 508680 467186 558914 652589
41220 652589 665569 608404 521778 412679 263833 109045 61370 198578 430920 579811
41210 579811 610963 686575 940119 1302117 1609559 1781620 1816826 1745938 1699460 1888299
41200 1888299 2347828 2796789 2944012 2865624 2855317 2942856 2838358 2398365 1865864 1513246
41190A513246k23298k63746k34755j6803J28284k5610k71026k59810k3916R2633
41180D15199m5128j99093j43572L5571J32241J20269J03370Q0884m6728k59934
41170A93079l75049k65715k2492J64037J96400R2896q5550k31711j93249P1296
41160d56058L51491L56569P1469j91157j65116O0911K02170J35509k9244j49068
41150A87476j58932l1775J89538L15693J50438k29032m77177l54226J0646L05856
41140i1495L74747K70908R4058p5994j41098m6613J12573J74276J14928O3081
41130H49371Q4889P8241n1685k10219k19045p0783L4686o1452k67012l43032j91669
41119c67710L7143J46174J20599Q5272Q8114N4868k8269l0137J33956L22501L12204
$$ plain form
41190 1513246 1289948 1026202 791447 774644 902928 877318 606292 346482 322566 415199
41180 415199 370071 170978 27406 62977 195218 315487 418857 499741 453013 193079
41170 193079 -181970 -447685 -470177 -306140 -109740 -16844 -102394 -334105 -527354 -456058
41160 -456058 -104567 252002 323471 132314 -32802 28109 230279 365788 336544 187476
41150 187476 28544 -3231 186307 502000 652438 423406 -53771 -407997 -397351 -91495
41140 -91495 283252 554160 648218 572224 431126 384513 497086 671362 786290 849371
41130 849371 934260 1012501 960816 750597 531552 460769 495455 434003 166991 -176041 -367710
41119 -367710 -330567 -184393 -63794 21478 109592 164460 136191 106054 240010 562511 874715
41108H74715R1207j13550j08955O0936K03509J85754J9022j97717l62891m17457
41098B34573l43334j48113J12811L06987L03593J35423O055M9384J47475J00322
41088I05176p4897j59257l6243J64908K54863J90369O1190k2401N038J19554K03790
41077A612090J63206L5811r9040k56357m34989m51777j49528K39795K67685j01625
41067H25271l70278j99835J04030Q9125j47143j61385J07737K73406J35308n4886
41057F01350m9242M6920M2794j2078K6685J25458J45086O7630p285j6733K2260
41046I92845N6420J6578j24037k62530k33617j4912K23072L03202J88653m8680
41036A096994k69289k80969J635L73678N01514L22193R5419P699l9834j49119
$$ plain form
41108 874715 965922 852372 743417 804353 1007862 1193616 1212638 1014921 652030 234573
41098 234573 -108761 -256874 -144063 162924 466517 601940 607995 657379 804854 905176
41088 905176 830279 671022 634779 799687 1054550 1244919 1306109 1283708 1288746 1408300 1612090
41077 1612090 1775296 1811107 1712067 1455710 1020721 568944 419416 659211 926896 825271
41067 825271 454993 255158 359188 448313 301170 139785 247522 520928 656236 601350
41057 601350 552108 599028 641822 629744 656429 781887 926973 994603 987318 970585 992845
41046 992845 1049265 1065843 941806 679276 445659 430747 653819 957021 1145674 1096994
41036 1096994 827705 546736 548371 922049 1423563 1745756 1841175 1848874 1809040 1659921
41026A659921j92242n1791J13257P3974j30902k77067k70850j92244j15901o3361
41016E52794m0108K4780K30539M29069K11090n39972j247604j186129l87006L73961
41006a578586N25736K70756J07946J56690J84465N4735j28106k14920j52161J8027
40996g55418J69592J68264L1604o4956k2683M5294J3738l6372N1699K36305L04574
40985A41641J65213l1356j01427m9420j3861n1847o8937K1833J45558J49651K1086
40974C28134q6321o6446J6445Q0788J60816K63470K39749M746k17653j37109J47635
40963G34254K26892m3947l36021l25921j16072l463n1818j16511j39907j80174
40953c52688k21957j71496k0742J33903K17982K17738J36905J3057p5032r7547
$$ plain form
41026 1659921 1467679 1415888 1529145 1603119 1472217 1195150 924300 732056 616155 552794
41016 552794 512686 537466 768005 1197074 1408164 868192 -379412 -1565541 -1952547 -1578586
41006 -1578586 -1052850 -782094 -674148 -517458 -332993 -278258 -406364 -621284 -773445 -755418
40996 -755418 -585826 -417562 -385958 -450914 -473597 -428303 -414565 -450937 -399238 -162933 141641
40985 141641 306854 275498 174071 124651 110790 58943 -9994 11839 157397 307048 328134
40974 328134 241813 175367 191812 272600 433416 696886 936635 941381 723728 586619 734254
40963 734254 961146 917199 581178 255257 139185 135722 83904 -32607 -172514 -352688
40953 -352688 -574645 -746141 -766883 -632980 -414998 -197260 -60355 -47298 -122330 -219877
40943b19877r9986p7993M6994K33020K62416M1916j90764j66421K9038J02801
40933c8856j542p8258l6108j5026r8356j68024j21210j9680N8728J35005K15927
40922a67400K33844J82380J62665K15976K48151J89409R2120Q046q5532j74641
40912I05018j83334j34744j68384l01529l47768j97471j1025K2042l3794R69J20405
40901c29615J74162J31350J01952J27822J29427N4917n6548j50551j83209j02819
40891a03112P7041K21139K07763Q6406o479l3538m0509l0291k932m3658j85092
40880A46738k47932m8031K65275L34655Q7618j50443j12465Q1437J68651R8431
40870F23934j6475j22679k17416k42724j61031m6017L9305J47331K88149L01399
$$ plain form
40943 -219877 -319863 -397856 -350862 -117842 144574 186490 -4274 -170695 -141657 -38856
40933 -38856 -40398 -118656 -154764 -169790 -268146 -436170 -557380 -577060 -518332 -383327 -167400
40922 -167400 66444 248824 411489 627465 875616 1065025 1157145 1165191 1079659 905018
40912 905018 721684 586940 418556 117027 -230741 -428212 -439237 -417195 -450989 -450020 -329615
40901 -329615 -155453 -24103 77849 205671 335098 390015 333467 182916 -293 -103112
40891 -103112 -26071 195068 402831 489237 482758 449220 408711 378420 375488 331830 146738
40880 146738 -101194 -149225 116050 450705 538323 387880 275415 356852 525503 623934
40870 623934 607459 484780 267364 24640 -136391 -182408 -143103 4228 292377 593776
40860E93776Q1070j79921k06768m6680N96j47570k29251n8678J76413K03116O9298
40849B55401M0640J73256K26528L7959k08916k21727j782J64034J08317m380L1726
40838F01056J19369J3624k43599l12219l9831K84931L14426Q6549j04166j27085
40828E93055p5960j6438O2694R1206k1699j63026j11638J01757J88151L3441j17867
40817E63676m5640J12588J00499o4373j56562q9511J6170N2932K9565j7619o3686
40806D38039o1145R523P6171O4699J4825N654K0469J779j7046K8239Q7678O0469
40794G29354k9699p8624r5573j74881k72454k12554J9862J76549N2046k33695
40784a19669l84465k78344n0739J17977J75421J67811J38765Q9416m87j23989
$$ plain form
40860 593776 674846 494925 288157 241477 242073 94503 -134748 -193426 -17013 186103 255401
40849 255401 296041 469297 695825 733784 524868 303141 301359 465393 573710 569330 601056
40838 601056 720425 734049 490450 178231 138400 423331 737757 824306 720140 593055
40828 593055 517095 500657 563351 654557 632858 469832 358194 459951 648102 681543 563676
40817 563676 518036 630624 731123 666750 510188 420677 436847 489779 519344 501725 438039
40806 438039 376894 386417 462588 527287 542112 547766 568235 570014 552968 581207 668885 729354
40794 729354 699655 621031 525458 350577 78123 -134431 -114569 61980 114026 -119669
40784 -119669 -504134 -782478 -833217 -715240 -539819 -372008 -233243 -143827 -144314 -268303
40774b68303k05654j37314R4132L22684L16721K4531l21630m09091j66450J64510
40764e85864K99432J95430K1383p6415p4982L868J22960J85852J19543K0963N3177
40753B85347J61013R7990j76852l61446k31195K3009J01953M4084O9300J33643
40743A46846J3886k21544k29609O3491L04214K26850L676r6660j12709k14516
40733a16075l41892k92419n5383J81685L00466L33455L19018K40892J00572o2632
40723F07687k04641k64853j89287l6204L4811l1786r2927j9160J05745J21182
40713C0567K7440n2665o9574o1670l9965L385K8765K0467N8568J83171K58640
40702C87129J33948j13212k58811k22738j11122k272J19655K16058J75991K364
$$ plain form
40774 -268303 -473957 -611271 -517139 -194455 122266 146797 -174833 -583924 -750374 -585864
40764 -585864 -286432 -91002 -69619 -146034 -221016 -217148 -94188 91664 211207 232170 285347
40753 285347 446360 544350 367498 6052 -225143 -202134 -100181 -56097 13203 146846
40743 146846 160732 -60812 -290421 -226930 77284 304134 307810 211150 98441 -116075
40733 -116075 -457967 -750386 -805769 -624084 -323618 9837 328855 569747 670319 607687
40723 607687 403046 138193 -51094 -87298 -52487 -84273 -177200 -196360 -90615 30567
40713 30567 58007 5342 -64232 -125902 -165867 -162482 -133717 -113250 -54682 128489 387129
40702 387129 521077 407865 149054 -73684 -184806 -187078 -67423 148635 324626 326990
40692C26990j39936j33098m5432k95j4635l7156n4429p6193p5332k3109M4710
40681b27915O4418M0855M8834J13477J34501M771j89851j98616P4706L70758L50997
40670E86935K9120k66046l38658k91476k17585l8909K09764K50869k7326k80508
40660c83820j38924K52570M57219L65160K21331J34548k1736k25279k46949o8189
40650C45931J9895j20754k42798j22749Q5394J17797q698r5229p3153n627Q5882
40639a4109J97819K45468J59715J4750o8798q0959q8666j21282j58013j47150
40629f1225j8016J95959K60414p461l69279l58881M5334K94271M0443l10699j81583
40618d70723L12593N40032K61099j27897k58316k21311k10041j48864P1935K81325
$$ plain form
40692 326990 187054 53956 8524 8229 -6406 -43562 -97991 -174184 -249516 -272625 -227915
40681 -227915 -163497 -122642 -73808 39669 174170 178941 -10910 -209526 -134820 235938 586935
40670 586935 616055 350009 11351 -280125 -497710 -536619 -326855 -75986 -103312 -383820
40660 -383820 -522744 -270174 187045 552205 773536 908084 886348 661069 414120 345931
40650 345931 365826 245072 2274 -120475 -35081 82716 74018 -21211 -94364 -99991 -14109
40639 -14109 183710 429178 588893 603643 534845 453886 365220 243938 85925 -61225
40629 -61225 -79241 116718 377132 369671 392 -358489 -313155 -18884 21559 -289140 -470723
40618 -470723 -158130 381902 643001 515104 256788 35477 -174564 -323428 -251493 29832
40608B9832K38998Q959j31444p7664J7432P405q4004j68153k11178k07616j35002
40597g12435J1036J83308L13075L41868K25194k7363k84970l46540j50035J01851
40587c45011J39340m1122j68093o9885R0215P5680o2564q8879L2187J04534N2272
40576b81326L6990J46271K14079R8642o2854o3682N6098J02727L9357L355O1653
40565C51310J26872J08886J7776q1980j28623r3681k3708j2871q3492j59984j99822
40554a79317k39756k59838j56851M7847J41722J0091j58788j29613N6412K00884
40544f67207K52510K71714K16085K2952j71438j62673R691J26714J27805J26894
40534A53047J23427j0715k32465k98507j09067J49351K73105K49065J49136L2841
$$ plain form
40608 29832 268830 277789 146345 68681 86113 93518 9514 -158639 -369817 -577433 -712435
40597 -712435 -701399 -518091 -205016 136852 362046 334683 49713 -296827 -446862 -345011
40587 -345011 -205671 -246793 -414886 -484771 -394556 -318876 -381440 -470319 -438132 -333598 -281326
40576 -281326 -244336 -98065 116014 214656 151802 88120 144218 246945 286302 289657 351310
40565 351310 478182 587068 604844 522864 394241 300560 276852 263981 180489 20505 -179317
40554 -179317 -419073 -678911 -835762 -787915 -646193 -636102 -794890 -924503 -868091 -667207
40544 -667207 -414697 -142983 73102 96054 -75384 -238057 -228366 -101652 26153 153047
40534 153047 276474 265759 33294 -265213 -374280 -224929 48176 297241 446377 479218
40524D79218j297J06122J97520M1430k85371m25297k46795m6866r8279k57775
40514e37390k30173r123J75715J96878R6231o4385k12352k16962k4982K18949
40504f07594L35722L17154K38471Q5302j57046l44911l16788j43520m5507q4521
40494g23238j17032m8799L6613L4020l3373o5272j221J36798K56715K53456J14949
40483a56384l8166p1731K0632J34764J72277R5152p2415k28597k40405r0069O7599
40472d07343P3594m4611j21428n6994R2596J93678J48863k1510j57952q0784J99350
40461a82541M36698L83887L9882l68611n93649n24625k37774M4734J25413K9647
40451h46939l6871L1573J16567R1343J5861O023M0025L4106J088j1669l5292p3059
$$ plain form
40524 479218 477921 584043 781563 822993 537622 112325 -134470 -181336 -279615 -537390
40514 -537390 -767563 -776686 -600971 -404093 -307862 -372247 -584599 -801561 -826543 -607594
40504 -607594 -271872 45282 283753 369055 212009 -132902 -449690 -593210 -638717 -723238
40494 -723238 -840270 -889069 -852456 -818436 -851809 -917081 -918302 -781504 -524789 -271333 -156384
40483 -156384 -194550 -266281 -245649 -110885 61392 156544 84129 -144468 -384873 -474942 -407343
40472 -407343 -333749 -378360 -499788 -556782 -464186 -270508 -121645 -143155 -301107 -381891 -182541
40461 -182541 254157 638044 677926 309315 -284334 -808959 -1046733 -1001999 -876586 -846939
40451 -846939 -883810 -852237 -735670 -644327 -628466 -622443 -582418 -548312 -547224 -558893 -594185 -667244
40439f67244L705K54418M57248L38647k1552k55511j85438o242M9244R97j1825
40428d3553L8002R5186J44044J73616J22758j7213j22469q3901J6057K996j27372
40417A98151j79592l4889J51293J34376q1465k29937j41335K8344M3647n4004
40407a65411l8644J03070J30165m4641j73656n4635J32308R2235j36362k55126
40397d10697j40133M9947J62461K04981K03113J23241j5420j19079j51980j56246
40387b49812j25756n633J63417K44339J80577N7675k5364l8162J3573P8087M2155
40376C35096j28592k66389j91055N463O7064m6299j20608m9260K8765K4219O2356
40365b79240K12002K87388J15876j69445l09690k69752k09000j90770j22582M4385
$$ plain form
40439 -667244 -663539 -409121 48127 386774 365222 109711 -75727 -81969 -32725 -31728 -43553
40428 -43553 -5551 89635 233679 407295 530053 512840 390371 306470 322527 325523 198151
40417 198151 18559 -16330 134963 269339 187874 -42063 -183398 -155054 -111407 -165411
40407 -165411 -204055 -100985 29180 -15461 -189117 -243752 -111444 -19209 -155571 -410697
40397 -410697 -550830 -500883 -338422 -133441 69672 192913 177493 58414 -93566 -249812
40387 -249812 -375568 -381201 -217784 26555 207132 264807 239443 201281 214854 292941 335096
40376 335096 206504 -59885 -250940 -245477 -178413 -224712 -345320 -394580 -365815 -341596 -279240
40365 -279240 -67238 220150 336026 166581 -143109 -412861 -621861 -812631 -935213 -890828
40355h90828K21120K90955K12007K6681j49492j83686n3766J08438J66130J27238
40345a25203Q5493P1163M1268k1261p5168p1116O252J15976J59835O0031j34760
40334A12510k78849k81177j62188K8031K30684L16290J71497q9299j69273L9478
40324h2296K71889K19115p0327k77656k25311l4398R6045J10798Q0970P0379O1777
40313B20985q302j39676k12884j19996N3156J03396K384m3649R2775K48972K05988
40302D03149j371j64329j82519j05184J4557J31133J45387J2641j34339j32714
40292a3589j2348Q2656J26625J83727K09777R9963r0835j92354j77433j60572
40282E5617j43408r653J94609K44408Q9553l0356M4437J50661J01105j515J9077
$$ plain form
40355 -890828 -669708 -378753 -166746 -140065 -289557 -473243 -527009 -418571 -252441 -125203
40345 -125203 -39710 31453 72721 51460 -23708 -94824 -88572 27404 187239 247270 112510
40334 112510 -166339 -447516 -609704 -581673 -350989 -34699 136798 47499 -121774 -82296
40324 -82296 189593 408708 338381 60725 -164586 -198984 -102939 7859 88829 159208 220985
40313 220985 212683 73007 -139877 -259873 -206717 -103321 -100937 -144586 -51811 197161 403149
40302 403149 401778 237449 54930 -50254 -35697 95436 240823 253464 119125 -13589
40292 -13589 -25937 56719 183344 367071 576848 676811 585976 393622 216189 55617
40282 55617 -87791 -97444 97165 341573 431126 400770 445207 595868 696973 695458 714535
40271G14535P1610l8875k23954k08416J7550J57521O1247p7299p5181l5831r7525
40260B65382j47012k9359J24415O8727j43159k19224q7642J2446m5743p1760Q1617
40249a91312K30096J48113o4449j57476j12340p9191o0200M4117J56232J15211
40239B8801J2293Q7180K76798K39106q8186l28885k32978m5780p1667j81664p7042
40228c82024J80753K63873Q8940r5486r5879K1293J05344Q8585j8180j29005j04831
40217g6617Q4304K64947K58783J07239k2514n3184N056J30107K14074R2157j71450
40206H32902k40172J0780K06316j616l48902l33715n972J32489n7404j96480q1492
40195h3266K9831l1883n1039R1976J35043p2726k26722o2695J79520J69740L8278
$$ plain form
40271 714535 786145 747270 523316 314900 332450 489971 551218 473919 398738 362907 265382
40260 265382 118370 89011 213426 282153 138994 -80230 -167872 -155426 -201169 -272929 -191312
40249 -191312 38784 186897 122448 -35028 -147368 -226559 -286759 -242642 -86410 28801
40239 28801 41094 128274 405072 644178 555992 227107 -5871 -51651 -123318 -304982 -382024
40228 -382024 -201271 62602 151542 56056 -39823 -18530 86814 175399 157219 28214 -76617
40217 -76617 7687 272634 531417 638656 616142 562958 568014 698121 912195 1004352 832902
40206 832902 592730 603510 809826 808210 459308 125593 119621 252110 194706 -1774 -83266
40195 -83266 -53435 -85318 -136357 -44381 90662 17936 -208786 -271481 -91961 77779 116057
40184A16057R0766K37537J71798n3404r6322R5431K06825N9837j66197k58185
40174D04143k14510j19017j5745M8483N2006P5535J77485K36324J17248o9083
40164F92869j14213n7853j05235k33858k06715l407J02553k771o7141J07107L14039
40153D25375K54307k766j33274k9102R7934N1271j25489k77300l18425k32691
40143b90160k9331K12984L37672K46796K7332j35285j69027j66745k12120k48825
40133d26709j86343m9494Q1022K05268L43247L96330K53020J0078j21171j30317
40123C74931j84770k63903j27245K35605M53879K89925L684p4490m7947j69834
40113D89835l05800j43903K00974K95741P2985q3050J7786J14100K437j39697
$$ plain form
40184 116057 206823 444360 616158 562754 466432 561863 768688 828525 662328 404143
40174 404143 189633 70616 54871 103354 155360 230895 408380 644704 761952 692869
40164 692869 578656 520803 415568 181710 -25005 -28412 74141 71370 4229 111336 425375
40153 425375 679682 676916 543642 514540 612474 663745 538256 260956 -57469 -290160
40143 -290160 -319491 -106507 231165 477961 505293 370008 200981 34236 -177884 -426709
40133 -426709 -613052 -662546 -581524 -376256 -33009 363321 616341 626419 505248 374931
40123 374931 190161 -73742 -200987 34618 488497 778422 782106 707616 659669 489835
40113 489835 184035 40132 241106 536847 609832 526782 544568 658668 661105 521408
40103E21408j24185m9932j5467R8696L09712L35236J6731l42217l75669j57966
40093B16347M066N5711J25316J61144K3408j76588k07779j23387j67005l09013
40083c97780k55312N1339L01683K85847J69591J68135K18605J57448J8411m3452
40073F74515j650L5058l110q4678j41112j17616p505J13498J33030J1858j85033
40062D27255l47442l57738j42145J93330L50110J49266j74162k11434P5578L00376
40052B62994K02225k3575q5516k2699m0959j21041q2068O3604J15782L3251N453
40041C07451J24469K15920J08877r1412j43681M123J63506J53247n846j58320
40031F78334k03784j68978j16096n1934K9604O8156l788j23875j30845K2262J77549
$$ plain form
40103 521408 397223 347291 331824 430520 740232 1075468 1092199 749982 374313 216347
40093 216347 220413 276124 401440 562584 585992 409404 201625 78238 -88767 -397780
40083 -397780 -653092 -601753 -300070 -14223 155368 323503 542108 699556 717967 674515
40073 674515 672865 707923 704813 620135 479023 361407 353902 467400 600430 612288 427255
40062 427255 79813 -277925 -420070 -226740 123370 272636 98474 -112960 -37382 262994
40052 262994 465219 441644 356128 333429 292470 171429 89361 152965 268747 301998 307451
40041 307451 431920 647840 756717 665305 521624 525747 689253 842500 836654 678334
40031 678334 474550 305572 189476 137542 167146 235302 231514 107639 -23206 -944 176605
40020A76605J58725k8010k40950l65077l51652j92121L8795J91134K04750J91558
40010b16243K37898K30573N0975j55311j41129M9138J16028l9403j65785n4755
40000h8014J66817K73084K42211J49939l6566l30752n33159m16844n2258K53222
39990c72320L03975J46105q2335k46757k19905J985K05556J73639j8602j05588
39980b14247j3543O7902O325j01407j28482q8886l9223J1547K7303m4223j22212
39969f39146m8191J30737J52078o5552k38188j11964J49463K06179L3169r2365
39959e23780k8580O7355K3710j13390j89107j33141J5190J76415K78039K86885
39949a40404K14631P8631r6758k19220j74144l460P8862l5362j68749j05130Q5974
$$ plain form
40020 176605 335330 307320 66370 -298707 -650359 -842480 -803685 -612551 -407801 -216243
40010 -216243 21655 252228 303203 147892 6763 55901 171929 132526 -33259 -88014
40000 -88014 78803 351887 594098 744037 707471 376719 -156440 -573284 -625542 -372320
39990 -372320 -68345 77760 -4575 -251332 -471237 -469252 -263696 -90057 -108659 -214247
39980 -214247 -227790 -159888 -153563 -254970 -383452 -472338 -511561 -500014 -472711 -516934 -639146
39969 -639146 -687337 -556600 -404522 -470074 -708262 -820226 -670763 -464584 -431415 -523780
39959 -523780 -552360 -485005 -461295 -574685 -763792 -896933 -881743 -705328 -427289 -140404
39949 -140404 74227 152858 56100 -163120 -337264 -340724 -261862 -297224 -465973 -571103 -485129
39938d85129J54737K7946j38185k15919k08591j15502Q7828L10384L79419K59286
39928E6274Q7507k3203o7525m3447M4720P7896o7207k74454k89290j12333l0095
39917f41157j52695j97651Q1119M81380O09925L95972J05875m8991p9974n6332
39907D97471k877L7020R485o5828j33907j97108k56474k21215k5997K07414K90028
39896A38012K19879J47950J11084j221j87849k54083q7717J42279J93464N2302
39886D74100j01410j59742j71685j85853j53072l1219J10214J64868J21547N0262
39876A18010j6022r9744j76662j55489j2541J30952J41787K8861j09144k19033
39866c69025k74282k01450J6813K14876K12621R7852J23305L00322L50336J51083
$$ plain form
39938 -485129 -330392 -302446 -440631 -656550 -865141 -980643 -892815 -582431 -203012 56274
39928 56274 143781 120578 53053 9606 54326 132222 65015 -209439 -498729 -611062 -641157
39917 -641157 -793852 -991503 -910384 -429004 180921 576893 682768 633777 553803 497471
39907 497471 494594 531614 541099 475271 341364 144256 -112218 -333433 -359430 -152016 138012
39896 138012 357891 505841 616925 615704 427855 173772 86055 228334 421798 474100
39886 474100 372690 212948 41263 -144590 -297662 -328881 -218667 -53799 67748 118010
39876 118010 101988 2244 -174418 -329907 -342448 -211496 -69709 -40848 -149992 -369025
39866 -369025 -643307 -844757 -827944 -613068 -400447 -302595 -179290 121032 471368 622451
39856F22451m0146Q958J18498j7666l20997m21984k07632L6641O4655k3357j2642
39845a93221R5743J34370L3657j01176j40127p1971l926m7041j92812l08029k71947
39834a066480r7855J02662K31609K48170J65147N8446K1980N8507P9184N0976
39824a47654M1074O2162K2470p1375l7443J89792L58100K15549r9856k48343j63450
39813A21026m6372L4983J89865L55660K83421l7745k80892k43388j10208j02846
39803A63504j58145j46592j31357j72216j16000J40735L72299K99020L700k02015
39793E2933k07217j27143k1720J07246J34038l8570j96109m1013K94961L46829
39783C04235k942l21702k59293k3531J9378q7716n4255J32548K09365Q1072p0215
$$ plain form
39856 622451 582305 591263 709761 692095 371098 -50886 -258518 -221877 -157222 -180579 -193221
39845 -193221 -97478 36892 70549 -30627 -170754 -242725 -246651 -293692 -486504 -794533 -1066480
39834 -1066480 -1164335 -1061673 -830064 -581894 -416747 -358301 -336321 -277814 -198630 -147654
39824 -147654 -106580 -44418 -21948 -93323 -130766 59026 417126 632675 532819 284476 121026
39813 121026 74654 109637 299502 655162 938583 900838 619946 376558 266350 163504
39803 163504 5359 -141233 -272590 -444806 -560806 -420071 -47772 251248 254948 52933
39793 52933 -154284 -281427 -303147 -195901 -61863 -100433 -296542 -337555 -42594 304235
39783 304235 301293 -20409 -279702 -303233 -283855 -371571 -425826 -293278 -83913 -2841 -73056
39772g3056j10528r8158p8490k696R1877O9186n2541p0214P0993J46855P735j64297
39760b63334j57179p7085j24392j96615o2538J67939J57432o9477r0339K26745
39750d88843M27721J43179k98158l16870Q3708L75956L03588J58271K12658K95990
39740H97200J24295k34789m64154m13828k20477q5531p5298j09408o7028P7365
39730e71653K09552K12939J25961P1206O0483M114j01857j54271j14822m7863
39720c06211J9666J10670J69867J16229L2028P8322J98510J61661m7579j74943
39710C58220j27644j31028k85902l17622m4390K14446P4054k92534l91444j41514
39700a085358P5438O3475N3503K09196L10670J41161j11606j02677J83886M26713
$$ plain form
39772 -73056 -183584 -281742 -360232 -362928 -271051 -201865 -254406 -324620 -253627 -106772 -99037 -263334
39760 -263334 -420513 -497598 -621990 -818605 -881143 -713204 -555772 -625249 -715588 -488843
39750 -488843 -61122 82057 -216101 -532971 -449263 -73307 230281 388552 601210 897200
39740 897200 1021495 786706 322552 -91276 -311753 -397284 -472582 -581990 -649018 -571653
39730 -571653 -362101 -149162 -23201 48005 108488 112602 10745 -143526 -258348 -306211
39720 -306211 -286545 -175875 -6008 110221 142249 220571 419081 580742 533163 358220
39710 358220 230576 99548 -186354 -503976 -548366 -333920 -259866 -552400 -943844 -1085358
39700 -1085358 -1009920 -946445 -892942 -683746 -373076 -231915 -343521 -446198 -262312 164401
39690A64401L78686J20913p8279o2032O2563N4711j55995l42189k53692J9706
39680i1207J24705q9469l50122l01623N0562L60977L58969J25422n9631o3497
39670F5086j3457o0659j40167q7379O5461J15729M2301Q1293L15764M40453J83424
39659A007849k28621l45236j22212O9425K1760q8401r2342q3209j54912j93129
39649b09028r4113M3948J04782J22567J28805M7043j04428j21961Q2703K84226
39639B84544K52939R1150L6962Q1887L3783j43012l00909l58362l43853k39831
39629f04702j5484K07829K52179J50951J11681J92682K24941J01532n7394j12843
39619D51372j07069j43630j99990j85565j00192j6071M3931J00764J21891L7555
$$ plain form
39690 164401 543087 664000 585721 523689 586252 640963 484968 142779 -110913 -91207
39680 -91207 33498 -55971 -406093 -707716 -657154 -296177 62792 188214 128583 65086
39670 65086 51629 -9030 -149197 -236576 -171115 -55386 -13085 68208 383972 824425 1007849
39659 1007849 779228 433992 311780 381205 402965 314564 222222 139013 -15899 -209028
39649 -209028 -303141 -259193 -154411 -31844 96961 144004 39576 -82385 318 284544
39639 284544 537483 628633 665595 747482 781265 638253 337344 -21018 -364871 -604702
39629 -604702 -620186 -412357 -160178 -9227 102454 295136 520077 621609 564215 451372
39619 451372 344303 200673 683 -184882 -285074 -301145 -257214 -156450 -34559 2996
39609B996j33906k59124k29468q5394M3324R8876J37141J98211K06346O6493j73354
39598a27859l41777l27417j70558K4388J72827J96627N3138j57819k25123o4095
39588i67668J49993J89310O1266k1084O9287K18826K22958K0661k40239l46179
39578f42869k31770n4066j1592r3267r8686O9523K61819L00965K07430Q7057o6367
39567b71823k71030l68282j86251J33682K40005N3138j03204L6055L07367L79796
39557e0547K05760l552j24785j94723k01872p8818Q5005Q6387o3499j03602O2610
39546c81636J68493J496k09364j23012J51031J96064m7401j69618P0530L81464
39536C8047M01598J95170L0430n9171j82124k73445k14085j11993j20412j06243
$$ plain form
39609 2996 -130910 -390034 -619502 -704896 -661572 -562696 -425555 -227344 -20998 45495 -127859
39598 -127859 -469636 -797053 -967611 -943223 -770396 -573769 -520631 -678450 -903573 -967668
39588 -967668 -817675 -628365 -567099 -588183 -518896 -300070 -77112 -56451 -296690 -642869
39578 -642869 -874639 -928705 -940297 -1033564 -1132250 -1062727 -800908 -499943 -292513 -205456 -271823
39567 -271823 -542853 -911135 -1097386 -963704 -723699 -670561 -773765 -737710 -430343 -50547
39557 -50547 155213 151661 26876 -167847 -369719 -448537 -363532 -277145 -340644 -444246 -381636
39546 -381636 -213143 -211647 -421011 -544023 -392992 -196928 -244329 -413947 -343417 38047
39536 38047 439645 634815 665245 606074 423950 150505 -63580 -175573 -295985 -402228
39526d02228J28939M00504L34262k9153k59022j81733n8701n3800M490J84551
39516F8109K41636O8427p2289k4382l0302k40357l50440j21448J24599L966k50159
39505e82640j51291K24832L74578J96647R1436K37886L39870J89449j5730p2726
39495H32311p5695j51493k41773k95533l60104l59686j16487K71543M12860J55842
39485G1785j67264k11748m4918Q8837J37152J51523R0316m6929j02812p771N8409
39474A6580l0626r5563M8638K35137J76079q4777k37002j40743N4156J69694J56320
39463B67893L3822j22568j73444o6176N1582K7940n2500l305J49423J91617M5885
39452C50169j18515j31461l5005L431q5574j83342j16526J07729K48844J16982
$$ plain form
39526 -402228 -273289 127215 461477 432324 173302 -8431 -67132 -120932 -116442 68109
39516 68109 309745 378172 305883 281501 251199 10842 -339598 -461046 -336447 -332481 -582640
39505 -582640 -733931 -509099 -134521 62126 153562 391448 731318 920767 905037 832311
39495 832311 756616 605123 363350 67817 -292287 -651973 -768460 -496917 -84057 71785
39485 71785 -95479 -307227 -352145 -263308 -126156 25367 115683 68754 -34058 -41829 16580
39474 16580 -14046 -109609 -60971 174166 350245 265468 28466 -112277 -58121 111573 267893
39463 267893 301715 179147 5703 -60473 -8891 19049 -33451 -36756 112667 304284 350169
39452 350169 231654 100193 65188 68619 -16955 -200297 -316823 -209094 39750 156732
39442A56732j35389j91585l0223N3913n0273o3697K10096M97410M19230L9855
39432I06069k48797k55000j16594q536R631o2860j36693l8796K25672L53533J40531
39421G68160j64944k13915q8859r6400j81868m1105K43339K28837j51239m13434
39411a11428k64556k1755l0371j08560O8911L74142M18388J35577j82871l00594
39401b3117j93836O7140L19130L17389J9647k50658j85759P2859J52535p395j37346
39390A50589r6855k6580l9463o1457l3208j8468m3708l9455k64j2725p6116q1860
39378c79570j4737J9410J1436P9265K09942K03994K226j52152n9426J09062N7522
39367H6972j76918k69201p7246J73614K22035Q8861l5807q2066j29107j94137
$$ plain form
39442 156732 21343 -170242 -200465 -146552 -196825 -260522 -50426 446984 866214 906069
39432 906069 657272 402272 285678 277142 286773 223913 87220 48424 274096 627629 768160
39421 768160 603216 389301 300442 204042 22174 -18931 224408 453245 302006 -111428
39411 -111428 -375984 -397739 -428110 -536670 -467759 -93617 324771 460348 277477 -23117
39401 -23117 -216953 -149813 169317 486706 506353 255695 69936 142795 295330 287935 150589
39390 150589 53734 27154 -12309 -73766 -106974 -125442 -169150 -208605 -208869 -221594 -297710 -379570
39378 -379570 -394307 -374897 -363461 -284196 -74254 129740 131966 -20186 -79612 29450 86972
39367 86972 -89946 -359147 -436393 -262779 -40744 48117 12310 -69756 -198863 -393000
39357c93000j42893J26014M69993N74165K77449k13645n05346m14748j27987N1926
39347b98072L3133m7694o2578k8841q575J6222R9950K14096K48240J38633m5425
39336B59089j65311j49787n3059J6550P755l8788n1418q026M1220K3643p6456
39325a94588j82123j86904p1254O8776J39456J60716J96445K03398O6806j81866
39315A8862l10835j58612J23934K43645J42056M1815R8995J78710P2006j87767
39305B62809l64982l24135j57779j8294N7519J12925J41645P6663q6033k04448
39295e04110j04435J85212L77860K24361j48199l40742j69136J12822J73575J9612
39285a73180j13352j35471j29249r0693O6272K50602K34456K4823p9605O8899
$$ plain form
39357 -393000 -535893 -409879 60114 634279 911728 698083 192737 -222011 -349998 -298072
39347 -298072 -264939 -312633 -375211 -404052 -412627 -396405 -296455 -82359 165881 304514 259089
39336 259089 93778 -56009 -109068 -92518 -84763 -123551 -174969 -182995 -141775 -118132 -194588
39325 -194588 -376711 -563615 -634869 -566093 -426637 -265921 -69476 133922 200728 18862
39315 18862 -291973 -450585 -326651 -83006 59050 100865 199860 378570 450576 262809
39305 262809 -102173 -426308 -584087 -602381 -544862 -431937 -290292 -213629 -299662 -504110
39295 -504110 -608545 -423333 -45473 178888 30689 -310053 -479189 -366367 -192792 -173180
39285 -173180 -286532 -422003 -551252 -641945 -575673 -325071 -90615 -65792 -145397 -76498
39275g6498K21687J20264q8277p9897J34768K16989r23k75266k79778j1210K31669
39264A13528K00629m8898k49276k26307p0749J8872l340l0743j7155k5095o0416
39253c98950m7231l835l8654j11911l8332J73558K51508Q5687n6502L4753J45305
39242d604J0138k03486j70939K7258N7269p6610o4979J27852K03579Q0154K3654
39231I286J28776J27784j10549l07755k19676L891J27406J69972K10397J68886
39221C08418L0568q035J28454J98786M2587j18727o6821K6729o2123j72772o3789
39210B43275Q9490l8048l23825l51382p6364J34963J08387M5204P7149Q0358J5210
39199D417M0740J63063J39734j07707l12111k63380j02777l6691k2287O5761J85413
$$ plain form
39275 -76498 145189 265453 177176 97279 232047 449036 448113 172847 -106931 -118141 113528
39264 113528 314157 265259 15983 -210324 -281073 -262201 -265541 -296284 -313439 -338534 -398950
39253 -398950 -446181 -450016 -488670 -600581 -638913 -465355 -213847 -128160 -184662 -149909 -4604
39242 -4604 5534 -197952 -368891 -341633 -284364 -360974 -425953 -298101 -94522 -14368 9286
39231 9286 138062 265846 155297 -152458 -372134 -368243 -240837 -70865 139532 308418
39221 308418 338986 330951 459405 658191 700778 582051 515230 541959 479836 307064 243275
39210 243275 332765 294717 -29108 -380490 -456854 -321891 -213504 -168300 -91151 -10793 4417
39199 4417 45157 208220 347954 240247 -71864 -335244 -438021 -474712 -496999 -431238 -245825
39188b45825K45304K77135K99074J90118r8148l63551l93875k55385j41460n8561
39178e45174J06029K84022K50161l6678l13569l02448r950L09387M16809K77819
39168D36408L5591j51653k27769k08548j08077L2850J00092J9023r1495k7515
39158a91093J97248L06545J09704k21831l43991j42537J58401K59217P6956k09739
39148a120l48691k43221j4110J57643K13395K10606J94167J58526J00377J8315
39138D45887r9885j97214j32508J10815K88019J75793o8738r9998Q1538J13510
39128F17219j41912l48126k07865Q9422J90689R0786J0915l3979j82965l52661
39118b68477k93825k2540J45300N6174p2908j3553J50205J98716R3452l6776r9128
$$ plain form
39188 -245825 -521 276614 575688 765806 667658 304107 -89768 -345153 -486613 -545174
39178 -545174 -439145 -155123 95038 58360 -255209 -557657 -567607 -258220 158589 436408
39168 436408 471999 320346 92577 -115971 -224048 -191198 -91106 -72083 -163578 -191093
39158 -191093 6155 312700 422404 200573 -143418 -285955 -127554 131663 208619 -1120
39148 -1120 -349811 -593032 -607142 -449499 -236104 -25498 168669 327195 427572 445887
39138 445887 346002 148788 16280 127095 415114 590907 522169 422171 503709 617219
39128 617219 475307 127181 -80684 8738 199427 290213 301128 267149 84184 -268477
39118 -268477 -562302 -584842 -439542 -383368 -456276 -469829 -319624 -120908 -27456 -64232 -163360
39107a63360q1134J8864J64729K33933J24315r4571k30426j84998n8201r808o3709
39096c44366r9598k8369Q7229J23763N9465k3760o7789p1383j0766J43147L02555
39085G0128L00041J18317m6449m3488L4146K3286o2068j07541j15905j63959k11466
39074b04958j50224j2502N9753M2017L6386N7267J1538q1568o5787Q4629J72595
39063e0854O2267j18076j87486j71732j93277k29422j68652l0587O1857R1098
39053i34864J37209J72442O4868j67450k92602j55227J11295K80996L22296L41150
39043a19887L37415K20269L6785l3427M3414Q2379k1159j06112o717J60718J70039
39032G63717K6177r9074j88832l54105n02705l63565O0669L64390K47536p6322
$$ plain form
39107 -163360 -244494 -225630 -60901 173032 297347 202776 -27650 -212648 -270849 -280657 -344366
39096 -344366 -443964 -472333 -385104 -261341 -201876 -225636 -293425 -364808 -375574 -232427 70128
39085 70128 370169 488486 442037 398549 432695 455981 393913 286372 170467 6508 -204958
39074 -204958 -355182 -367684 -307931 -265914 -229528 -172261 -160723 -242291 -308078 -223449 -50854
39063 -50854 11413 -106663 -294149 -465881 -659158 -888580 -1057232 -1087819 -1025962 -934864
39053 -934864 -797655 -625213 -560345 -727795 -1020397 -1175624 -1064329 -783333 -461037 -119887
39043 -119887 217528 437797 474582 441155 484569 566948 545789 439677 432960 593678 763717
39032 763717 789894 690820 501988 147883 -354822 -718387 -657718 -293328 -45792 -122114
39022a22114j97171m8920J16471J56764J53417J53901Q4389n3510j28717q2367
39012C2143o263L2188P7508J34573R0408j06695l03921l03737j16950M7700M1615
39001c81431n2684m6805R0654J78390Q0595o3226j6858J72429J97351l5922k09443
38990h6950n0676K35137K64439M5953q8411m0132m3310j83412k11101J7566K46295
38979A05398J85895o3685j98919j48868q2188q9418r7648n9604k8451m2389p2448
38968e92325q4774n8744L1215J61264K23873J47216K0109j415J00684J82644J22490
38957B52237m0232j60515j46874n4755k2765j03177j83749j35169m197M7326p009
38946e58879q318J37631K94507K76618J05668k2102J5256J31714J40386l4793
$$ plain form
39022 -122114 -319285 -368205 -251734 -94970 58447 212348 296737 243227 114510 32143
39012 32143 25880 58068 135576 270149 360557 253862 -50059 -353796 -470746 -423046 -381431
39001 -381431 -434115 -480920 -390266 -211876 -131281 -194507 -211365 -38936 158415 122493 -86950
38990 -86950 -137626 97511 361950 407903 319492 279360 236050 52638 -158463 -140897 105398
38979 105398 291293 227608 28689 -120179 -202367 -291785 -389433 -449037 -477488 -519877 -592325
38968 -592325 -677099 -735843 -704628 -543364 -319491 -172275 -152166 -153581 -52897 129747 252237
38957 252237 212005 51490 -95384 -150139 -172904 -276081 -459830 -594999 -599196 -551870 -558879
38946 -558879 -567197 -429566 -135059 141559 247227 225125 240381 372095 512481 477688
38936D77688k43827k39480J7426K44644J64957j05960k02876l5169R4583k8527
38926A43459k12072j92298m9778l9140j64015j98083n3858J22827K01731J95950
38916b45277J44060N2504k9288k8187M1036R5000R9964P1122J505q8474r0816
38905B3149N3406K06170J81886J1816j02390p6384k0183l7640j09113j77510k05753
38894b52546j46517Q381J51169J60043O4644j1794l3262l4467Q731J08701J31240
38883A54323l9651k42507k07385K1007J19212j6874j22730j9075R8125R116j52136
38872c98575j18237R4963K43712K16796J13911L2949k1494n0720l8720J544N3446
38861A29575J15470J28967q77k21723l15816j95633o4215j08859j92121q2015
$$ plain form
38936 477688 233861 -5619 11807 256451 421408 315448 112572 77403 171986 143459
38926 143459 -68613 -260911 -310689 -349829 -513844 -711927 -765785 -642958 -441227 -245277
38916 -245277 -101217 -48713 -78001 -106188 -65152 29848 129812 200934 202439 113965 23149
38905 23149 76555 282725 464611 476427 374037 297653 277470 239830 130717 -46793 -252546
38894 -252546 -399063 -390682 -239513 -79470 -14826 -26620 -59882 -94349 -85618 23083 154323
38883 154323 114672 -127835 -335220 -314213 -195001 -211875 -334605 -353680 -255555 -246439 -398575
38872 -398575 -516812 -421849 -178137 38659 152570 185519 164025 113305 74585 76129 129575
38861 129575 245045 374012 373135 151412 -164404 -360037 -424252 -533111 -725232 -807247
38851h07247J36036J70952k552r6309M0046K17319K50324K32065K98336L32099
38841G71069J33609k18920m06463k64194K3291J57923N1746j33764k00801j02582
38831a89086O0357J69860J87585J47139R3835M6106q489r2047j92012k42170j92080
38820b11002r7458p2035j22031j08412O4349K85643L44436J65946j13351k69745
38810a33660j56652J72421M39963L49467o7063l97628l01318N9827K29372N1746
38800B46475j78884j86090o4632m2744j10928r2179M0751J33844J00548K4918
38790a28921Q856M8332Q1678O2242l2832j80018k75961k02487L9594K99586L96411
38779A16480K57834k4836k39121j99354O3090K84161K36762K295j34718o0899
$$ plain form
38851 -807247 -671211 -500259 -502811 -599120 -559074 -341755 -91431 140634 438970 771069
38841 771069 904678 685758 279295 15101 38392 196315 248061 114297 -86504 -189086
38831 -189086 -128729 41131 228716 375855 469690 515796 507307 415260 223248 -18922 -211002
38820 -211002 -308460 -380495 -502526 -610938 -546589 -260946 83490 249436 136085 -133660
38810 -133660 -290312 -117891 322072 671539 604476 206848 -94470 -34643 194729 246475
38800 246475 67591 -118499 -183131 -225875 -336803 -428982 -388231 -254387 -153839 -128921
38790 -128921 -120065 -71733 9945 72187 39355 -140663 -416624 -619111 -579517 -279931 116480
38779 116480 374314 349478 110357 -88997 -25907 258254 495016 497311 362593 301694
38769C01694L5866m1046k13779k53280j00222P2741R3330l2741j79496k36297
38759e53230j62342J1314J87695K59323K02600J01236N5172P7836R3416L0135
38749C03155q5644j40847p1759K7154J0104r1478p1296J45950L40839K92249J09857
38738G68284M8913Q0660m2309k93389l16070M168K69475J28186j91190k43671
38728B13057l9161O0892j8555J060J93509K70817R1579r1345p1223j0577r4999
38717E05054j84270q7816P0673O9300l0271k5794N7427N2802j5538j983N2572
38706D62156M255o8797L3928K34141K28085k1588j91695r2012O1280Q842j81565
38695D77030k76081j93658n786J94651K76241J08667k15169l66759j68871J51237
$$ plain form
38769 301694 337560 296514 82735 -170545 -270767 -198026 -104696 -137437 -316933 -553230
38759 -553230 -715572 -704258 -516563 -257240 -54640 46596 101768 179604 273020 303155
38749 303155 217511 76664 4905 32059 42163 -49315 -120611 25339 366178 658427 768284
38738 768284 817197 897857 855548 562159 246089 250257 519732 647918 456728 213057
38728 213057 173896 234788 216233 217293 410802 681619 773198 681853 610630 600053 505054
38717 505054 320784 232968 303641 372941 342670 316876 374303 427105 411567 409584 462156
38706 462156 466411 397614 431542 665683 893768 872180 680485 588473 649753 658595 477030
38695 477030 200949 7291 1505 196156 472397 581064 365895 -864 -169735 -18498
38685a8498K67781J68703P0633O2337O6441O6008J21587J88620J36683l6466j81660
38674I12169k02228j39253n6013K1406M8436j4434j12695j50734j29715j16397
38664F0542r5830N486J59874K50129K42854K03073J36474j3483j90258k28350
38654E30511r0749N9480Q8867L9093j6275q0320j11432P871K40653L19435R0486
38643A077620k12563k56443n9728P7698J8072r9788j56418j87856j98716j05261
38633a03383N2167P7216q3805k18084j57294j9818K0166K1363J22082K45180K08910
38622A64700M9060k9292J1604J1664p3273q8167K8514J12466M5759m6033q725
38611A78277J00449J40263J05861N9912k1777j50709j85227m939K41549K81484
$$ plain form
38685 -18498 249283 417986 488619 550956 617397 683405 804992 993612 1130295 1093829 912169
38674 912169 709941 570688 514675 536081 584517 570083 457388 306654 176939 60542
38664 60542 -35288 -29802 130072 380201 623055 826128 962602 949119 758861 530511
38654 530511 439762 499242 588109 627202 610927 530607 419175 427046 667699 987134 1077620
38643 1077620 865057 608614 548886 626584 644656 544868 388450 200594 1878 -103383
38633 -103383 -51216 26000 -57805 -275889 -433183 -453001 -432835 -411472 -289390 -44210 164700
38622 164700 213760 184468 196072 207736 134463 46296 74810 187276 233035 187002 178277
38611 178277 278726 418989 524850 584762 562985 412276 227049 222110 463659 745143
38601G45143Q1940j34802k20078k26174k01308r6497O1167J22578M5328j6928
38591A60369L9769J13271J03694Q9405J34100J00818j20024l35277k67012K2951
38581D2064J96649J13449k7816n1261l4830p7211q3861L9214J59349R0605j15434
38570B50917k46038k22309j31257j9459J33533K45696J67121m8730j14715J15141
38560A29900L94469L83227J00305j26487j28435q3708j76649k85165j81017P9152
38550A05592J84345j1657k87878l36483j11505J84402L50963L22492J38733p6555
38540D62449j47285J239K15626K63115J20334j1587o799K2378n2045j31053l0388
38529G05984K01118K86837O9121k80526m50773l07923J5429K72354K93189R1004
$$ plain form
38601 745143 827083 692281 472203 246029 44721 -51776 9391 131969 177297 160369
38591 160369 200138 313409 417103 506508 640608 741426 621402 286125 19113 42064
38581 42064 238713 352162 324346 273085 238255 161044 77183 116397 275746 366351 250917
38570 250917 4879 -217430 -348687 -368146 -234613 11083 178204 129474 14759 129900
38560 129900 524369 907596 1007901 881414 752979 669271 492622 207457 26440 105592
38550 105592 289937 278280 -9598 -346081 -457586 -273184 77779 400271 539004 462449
38540 462449 315164 316403 532029 795144 915478 903891 897092 919470 867425 736372 705984
38529 705984 907102 1193939 1263060 982534 531761 223838 239267 511621 804810 895814
$$ [...]
##END NTUPLES=NMR SPECTRUM
##END=
