##TITLE=31Pdec_DE-136rm_5h
, 24 sc
 23.3.2026
##JCAMPDX= 6.0         $$ Bruker NMR JCAMP-DX V2.0
##DATA TYPE= NMR SPECTRUM
##DATA CLASS= NTUPLES
##ORIGIN= UXNMR, Bruker Analytische Messtechnik GmbH
##OWNER= root
$$ XWIN-NMR		Version 3.5
$$ Mon Mar 23 16:12:26 2026 Russian Standard Time (UT+4h)  she@DPX200
##.OBSERVE FREQUENCY= 81.013821
##.OBSERVE NUCLEUS= ^31P
##.ACQUISITION MODE= SIMULTANEOUS
##.ACQUISITION SCHEME= undefined
##.AVERAGES= 24
##.DIGITISER RES= 17
##SPECTROMETER/DATA SYSTEM= spect
##.PULSE SEQUENCE= zgpg30
##.SOLVENT NAME= CDCl3
##.SHIFT REFERENCE= (INTERNAL, CDCl3, 0, 197.392)
##AUDIT TRAIL= $$ (NUMBER, WHEN, WHO, WHERE, WHAT)
$$ ##TITLE= Audit trail, XWIN-NMR		Version 3.5
$$ ##JCAMPDX= 5.01
$$ ##ORIGIN= Bruker BioSpin GmbH
$$ ##OWNER= she
$$ F:/spectra/data/she/nmr/P31/2/pdata/1/auditp.txt
$$ ##AUDIT TRAIL=  $$ (NUMBER, WHEN, WHO, WHERE, WHAT)
(   1,<2026-03-23 16:10:50.92 +0400>,<she>,<DPX200>,
      <created by zg, POWCHK disabled, PULCHK disabled
       configuration hash MD5:
       00 E9 B6 7A A2 85 ED C7 34 08 36 98 17 FE 4E 26
       data hash MD5: 32K
       BF 65 10 C8 6A 8B 8B 77 89 0D 21 CE C6 9F 67 DB>)
(   2,<2026-03-23 16:11:10.78 +0400>,<she>,<DPX200>,
      <Start of raw data processing
       efp BC_mod = 2 LB = 1.5 FT_mod = 6 PKNL = 1 PHC0 = 1381.623 PHC1 = 93.30066 SI = 64K 
       data hash MD5: 64K
       CF 34 04 01 C1 6F 2E C5 FF C2 B5 4B 4F D6 73 7D>)
(   3,<2026-03-23 16:11:30.64 +0400>,<she>,<DPX200>,
      <pk PHC0 = -5.066596 PHC1 = 0.6 
       data hash MD5: 64K
       54 71 B2 B3 58 C6 65 C1 62 F6 0A 53 C7 37 7B 12>)
(   4,<2026-03-23 16:11:39.04 +0400>,<she>,<DPX200>,
      <abs ABSG = 5 
       data hash MD5: 64K
       BC 6C 8B BE E5 F0 6E A1 11 1F 82 5B A9 4B 9C 4B>)
$$ ##END=
$$ 
$$ hash MD5
$$ DD B4 48 9C 95 A4 23 7C E5 B0 FA 43 AB EC 30 57
##$RELAX= 
##$RELAX= 
##$RELAX= 
##$RELAX= 
##$RELAX= 
##$RELAX= 
##$RELAX= 
##$RELAX= 
$$ Bruker specific parameters
$$ --------------------------
##$DU= <F:/spectra>
##$EXPNO= 2
##$NAME= <P31>
##$PROCNO= 1
##$TYPE= <nmr>
##$USER= <she>
##$AMP= (0..31)
100 100 100 100 100 100 100 100 100 100 100 100 100 100 100 100 100 100 
100 100 100 100 100 100 100 100 100 100 100 100 100 100 
##$AQSEQ= 0
##$AQ_mod= 1
##$AUNM= <au_zg>
##$AUTOPOS= <>
##$BF1= 81.014009
##$BF2= 200.13
##$BF3= 200.13
##$BF4= 200.13
##$BF5= 200.13
##$BF6= 200.13
##$BF7= 200.13
##$BF8= 200.13
##$BYTORDA= 1
##$CFDGTYP= 0
##$CFRGTYP= 5
##$CHEMSTR= <none>
##$CNST= (0..31)
1 1 145 1 1 1 1 1 1 1 1 1 1 1 1 1 1 1 1 1 1 1 1 1 1 1 1 1 1 1 1 1 
##$CPDPRG= <waltz16>
##$CPDPRG1= <>
##$CPDPRG2= <waltz16>
##$CPDPRG3= <>
##$CPDPRG4= <mlev>
##$CPDPRG5= <mlev>
##$CPDPRG6= <mlev>
##$CPDPRG7= <mlev>
##$CPDPRG8= <mlev>
##$CPDPRGB= <>
##$CPDPRGT= <>
##$D= (0..31)
0 1 0 0 0 0 0 0 0 0.06 0 0.03 2e-05 3e-06 0 0 0.0002 0 0 0 0 0 0 0 0 0 
0 0 0 0 0 0 
##$DATE= 1774267850
##$DBL= (0..7)
120 120 120 11 120 120 24 19 
##$DBP= (0..7)
150 150 150 150 150 150 150 150 
##$DBP07= 0
##$DBPNAM0= <>
##$DBPNAM1= <>
$$ [...]
##$SUBNAM3= <"">
##$SUBNAM4= <"">
##$SUBNAM5= <"">
##$SUBNAM6= <"">
##$SUBNAM7= <"">
##$SUBNAM8= <"">
##$SUBNAM9= <"">
##$SW= 400.765351723535
##$SWIBOX= (0..15)
0 1 3 0 0 0 0 0 0 0 0 0 0 0 0 0 
##$SW_h= 32467.5324675325
##$TD= 32768
##$TD0= 1
##$TE= 0
##$TE2= 300
##$TE3= 300
##$TEG= 300
##$TL= (0..7)
0 120 53 12 22 120 120 120 
##$TP= (0..7)
150 150 150 150 150 150 150 150 
##$TP07= 0
##$TPNAME0= <>
##$TPNAME1= <>
##$TPNAME2= <>
##$TPNAME3= <>
##$TPNAME4= <>
##$TPNAME5= <>
##$TPNAME6= <>
##$TPNAME7= <>
##$TPOAL= (0..7)
0.5 0.5 0.5 0.5 0.5 0.5 0.5 0.5 
##$TPOFFS= (0..7)
0 0 0 0 0 0 0 0 
##$TUNHIN= 0
##$TUNHOUT= 0
##$TUNXOUT= 0
##$USERA1= <user>
##$USERA2= <user>
##$USERA3= <user>
##$USERA4= <user>
##$USERA5= <user>
##$V9= 5
##$VALIST= <valist>
##$VCLIST= <CCCCCCCCCCCCCCC>
##$VD= 0
##$VDLIST= <DDDDDDDDDDDDDDD>
##$VPLIST= <PPPPPPPPPPPPPPP>
##$VTLIST= <TTTTTTTTTTTTTTT>
##$WBST= 1024
##$WBSW= 4
##$XGAIN= (0..3)
0 0 0 0 
##$XL= 0
##$YL= 0
##$YMAX_a= 26062
##$YMIN_a= -29116
##$ZGOPTNS= <>
##$ZL1= 120
##$ZL2= 120
##$ZL3= 120
##$ZL4= 120
##$ABSF1= 197.3918
##$ABSF2= -203.3724
##$ABSG= 5
##$ABSL= 3
##$ALPHA= 0
##$AQORDER= 0
##$ASSFAC= 0
##$ASSFACI= 0
##$ASSFACX= 0
##$ASSWID= 0
##$AUNMP= <proc_1d>
##$AZFE= 0.1
##$AZFW= 0.5
##$BCFW= 0
##$BC_mod= 2
##$BYTORDP= 0
##$COROFFS= 0
##$CY= -3
##$DATMOD= 1
##$DC= 0
##$DFILT= <>
##$DTYPP= 0
##$F1P= 0
##$F2P= 0
##$FCOR= 1
##$FTSIZE= 65536
##$FT_mod= 6
##$GAMMA= 0
##$GB= 0
##$INTBC= 1
##$INTSCL= 9.790993e-09
##$ISEN= 30
##$LB= 1.5
##$LEV0= 0
##$LPBIN= 0
##$MAXI= 10000
##$MC2= 0
##$MEAN= 0
##$ME_mod= 0
##$MI= 50
##$NCOEF= 0
##$NC_proc= -7
##$NLEV= 6
##$NOISF1= 182.463
##$NOISF2= 159.3651
##$NSP= 0
##$NTH_PI= 0
##$NZP= 0
##$OFFSET= 197.3918
##$PC= 4
##$PHC0= 1376.556
##$PHC1= 93.90066
##$PH_mod= 1
##$PKNL= yes
##$PPARMOD= 0
##$PSCAL= 0
##$PSIGN= 0
##$REVERSE= no
##$SF= 81.014063255964
##$SI= 65536
##$SIGF1= 159.3651
##$SIGF2= -187.1042
##$SINO= 113.3802
##$SIOLD= 16384
##$SREGLST= <1H.CDCl3>
##$SSB= 0
##$STSI= 65536
##$STSR= 0
##$SW_p= 32467.5324675325
##$SYMM= 0
##$S_DEV= 0
##$TDeff= 32768
##$TDoff= 0
##$TI= <>
##$TILT= no
##$TM1= 0
##$TM2= 0
##$TOPLEV= 0
##$USERP1= <user>
##$USERP2= <user>
##$USERP3= <user>
##$USERP4= <user>
##$USERP5= <user>
##$WDW= 1
##$XDIM= 65536
##$YMAX_p= 332121777
##$YMIN_p= -67722384
$$ End of Bruker specific parameters
$$ ---------------------------------
##NTUPLES= NMR SPECTRUM
##VAR_NAME=  FREQUENCY,     SPECTRUM/REAL,   SPECTRUM/IMAG
##SYMBOL=    X,             R,               I
##VAR_TYPE=  INDEPENDENT,   DEPENDENT,       DEPENDENT
##VAR_FORM=  AFFN,          ASDF,            ASDF
##VAR_DIM=   65536,         65536,           65536
##UNITS=     HZ,            ARBITRARY UNITS, ARBITRARY UNITS
##FACTOR=    0.49542278885378, 1,            1
##FIRST=     15991.5117654749, 0,            0
##LAST=      -16476.0207020576, 0,           0
##MIN=       -16476.0207020576, -67722384,   0
##MAX=       15991.5117654749, 332121777,    0
$$ Real data points
##PAGE= N=1
##DATA TABLE= (X++(R..R)), XYDATA
$$ [...]
$$ plain form
44601 2503146 1675690 1984823 2906505 2654781 641174 -1540799 -2099542 -1088471 172682
44592 172682 892220 1161686 1116465 764252 423459 426246 441371 -108936 -954044 -1110244
44582 -1110244 -292846 526039 303370 -857954 -1993089 -2318211 -1657167 -258090 1338235
44573 1338235 2437908 2620824 2065914 1351749 1049563 1514979 2706143 3967407 4331699
44564 4331699 3465851 2198095 1723541 2304054 3092080 3260914 2908436 2611353 2398497
44555 2398497 1659447 144212 -1380390 -1875326 -1297107 -658471 -731420 -1147513 -1079077
44546 -1079077 -401945 324624 777962 1126849 1413729 1380845 1118736 1276126 2233842 3498800
44536 3498800 4316318 4510707 4284111 3570397 2234995 739018 -119266 -221316 -275385
$$ packed form
44601B503146q27456L09133R21682k51724k013607k181973n58743J011071J261153
44592A72682P19538K69466m5221l52213l40793K787J5125n50307q45108j56200
44582a110244Q17398Q18885k22669j161324j135135l25122O61044J399077J596325
44573A338235J099673J82916n54910p14165l02186M65416J191164J261264L64292
44564D331699q65848j267756m74554N80513P88026J68834l52478k97083k12856
44555B398497p39050j515235j524602m94936N78219O38636p2949m16093O8436
44546a079077O77132P26569M53338L48887K86880l2884k62109J57390R57716J264958
44536C498800Q17518J94389k26596p13714j335402j495977q58284j02050n4069
$$ plain form
44527 -275385 -734099 -1147927 -1011527 -764211 -1243445 -2267396 -2531756 -1225015 801271
44518 801271 2007503 2007093 1760387 1979151 2159017 1612260 789970 767729 1655393 2370215
44508 2370215 2093885 1223786 593805 385229 261151 97005 12448 -44001 -182096 -159128
44498 -159128 425973 1529290 2611530 3176686 3074191 2369423 1319205 490426 493876
44489 493876 1389980 2512543 3011101 2577717 1724228 1363564 1886943 2554748 2151897
44480 2151897 488491 -1162611 -1528734 -819160 -181544 -113604 -267092 -560554 -1357927
44471 -1357927 -2400710 -2668974 -1788565 -687861 -263032 -162642 407589 1348666 1954028
44462 1954028 2017967 1816719 1399923 790168 550182 1157805 1985933 1920004 961035 196796
$$ packed form
44527b75385m58714m13828J36400K47316m79234j023951k64360J306741K026286
44518H01271J206232m10k46706K18764J79866n46757q22290k2241Q87664P14822
44508B370215k76330q70099o29981k08576j24078j64146q4557n6449j38095K2968
44498a59128N85101J103317J082240N65156j02495p04768j050218q28779L450
44489D93876Q96104J122563M98558m33384q53489l60664N23379O67805m02851
44480B151897j663406j651102l66123P09574O37616O7940j53488k93462p97373
44471a357927j042783k68264Q80409J100704M24829J00390N70231R41077O05362
44462A954028O3939k01248m16796o09755k39986O07623Q28128o5929r58969p64239
$$ plain form
44452 196796 112635 26091 -539422 -1046253 -1023641 -914152 -1096766 -961152 102653 1472395
44442 1472395 2103204 2096889 2339725 2854162 2748693 1855058 1210179 1534707 2236497 2461274
44432 2461274 2279801 2151242 1919673 1214702 404245 198371 461597 343457 -317959
44423 -317959 -582262 261940 1643441 2500326 2631645 2644775 2870697 3052546 3046706 3089484
44413 3089484 3163630 2765127 1742196 871219 997284 1881353 2547705 2642167 2723071 3149317
44403 3149317 3466250 3248999 2883472 2924362 3122985 2772549 1806789 898902 512629 441994
44393 441994 357570 292824 425677 767956 1249952 1841166 2468696 3016711 3401407 3406490
44383 3406490 2571057 694271 -1540170 -2942179 -2987090 -2259742 -1647728 -1485485 -1558537
$$ packed form
44452A96796q4161q6544n65513n06831K2612J09489j82614J35614J063805J369742
44442A472395O30809o315K42836N14437j05469q93635o44879L24528P01790K24777
44432B461274j81473j28559k31569p04971q10457k05874K63226j18140o61416
44423c17959k64303Q44202J381501Q56885J31319J3130K25922J81849n840M2778
44413C089484P4146l98503j022931q70977J26065Q84069O66352R4462Q0904M26246
44403C149317L16933k17251l65527M0890J98623l50436r65760r07887l86273p0635
44393D41994q4424o4746J32853L42279M81996N91214O27530N48015L84696N083
44383C406490q35433j876786k234441j402009m4911P27348O12014J62243p3052
$$ plain form
44374 -1558537 -1455007 -743016 710454 2365381 3392975 3629755 3670124 3856199 3835210
44365 3835210 3412290 3059549 3031880 2734008 1742313 802664 831753 1402641 1359735 695960
44355 695960 584959 1498170 2507642 2799037 2783467 3124876 3544806 3344736 2550042 1815561
44345 1815561 1522879 1538952 1607673 1496470 989095 188048 -347970 -160709 541464 1166518
44335 1166518 1417178 1420623 1393959 1490224 1814215 2299675 2679224 2773872 2661733 2418600
44325 2418600 1945620 1254391 652300 399477 422175 580224 920180 1404732 1722859 1717814
44315 1717814 1722735 2095156 2663262 3021644 3138004 3219340 3154806 2601105 1614863 794970
44305 794970 706063 1362059 2282805 2943799 3229304 3433748 3612451 3107403 1371103 -678382
$$ packed form
44374a558537J03530P11991J453470J654927J027594K36780M0369J86075k0989
44365C835210m22920l52741k7669k97872r91695r39649K9089N70888m2906o63775
44355F95960j11001R13211J009472K91395j5570L41409M19930k00070p94694p34481
44345A815561k92682J6073O8721j11203n07375q01047n36018J87261P02173O25054
44335A166518K50660L445k6664R6265L23991M85460L79549R4648j12139k43133
44325B418600m72980o91229o02091k52823K2698J58049L39956M84552L18127n045
44315A717814M921L72421N68106L58382J16360Q1336o4534n53701r86242q19893
44305G94970q8907O55996R20746O60994K85505K04444J78703n05048j736300k049485
$$ plain form
44295 -678382 -1092135 747157 3056122 3819514 3301268 3243753 4131252 4779330 4558158
44286 4558158 4363658 4856246 5130589 4059653 2027855 353291 -406110 -660193 -736663
44277 -736663 -539572 -82358 410522 913480 1531860 2044551 2016146 1386918 562822 -69010
44267 -69010 -366684 -225184 452392 1483447 2384863 2769932 2693081 2581545 2829842 3360349
44257 3360349 3596269 3081018 2124758 1498386 1402671 1172809 240102 -1033678 -1826797
44248 -1826797 -1800161 -1178381 -237920 786372 1526287 1748545 1690887 1699359 1690282 1441935
44238 1441935 1235246 1594541 2434457 3090023 3274077 3399196 3752254 3913589 3346849
44229 3346849 2173541 991930 181426 -282506 -509934 -549175 -547796 -828388 -1675046 -2978187
$$ packed form
44295f78382m13753J839292K308965P63392n18246n7515Q87499O48078k21172
44286D558158j94500M92588K74343j070936k031798j674564p59401k54083p6470
44277g36663J97091M57214M92880N02958O18380N12691k8405o29228q24096o31832
44267f9010k97674J41500O77576J031055R01416L85069p6851j11536K48297N30507
44257C360349K35920n15251r56260o26372r5715k29862r32707j273780p93119
44248a826797K6636O21780R40461J024292P39915K22258n7658Q472r077k48347
44238A441935k06689L59295Q39916O55566J84054J25119L53058J61335n66740
44229C346849j173308j181611q10504m63932k27428l9241J379k80592q46658j303141
$$ plain form
44219 -2978187 -4071116 -4138447 -3083087 -1874014 -1613423 -2245137 -2659166 -2183870 -1388935
44210 -1388935 -1045451 -850619 98743 1775576 2969449 2760140 1647065 822309 717306
44201 717306 794596 619404 509244 886585 1428606 1362940 547726 -201029 -66268 748097
44191 748097 1242356 796078 -130128 -514575 144951 1332901 2040868 1761768 960126
44182 960126 511510 707143 999049 812598 353221 294898 767371 1069304 563748 -415503
44172 -415503 -879845 -392035 329392 211233 -884192 -1967616 -2092767 -1371964 -514034
44163 -514034 337974 1669708 3497330 4948206 5314603 4960420 4663365 4513123 4106273
44154 4106273 3492302 3139412 3079876 2870991 2445023 2263416 2485269 2673305 2541543 2350523
$$ packed form
44219b978187j092929o7331J055360J209073K60591o31714m14029M75296P94935
44210a388935L43484J94832R49362J676833J193873k09309j113075q24756j05003
44201G17306P7290j75192j10160L77341N42021o5666q15214p48755J34761Q14365
44191G48097M94259m46278r26206l84447O59526J187950P07967k79100q01642
44182I60126m48616J95633K91906j86451m59377n8323M72473L01933n05556r79251
44172d15503m64342M87810P21427j18159j095425j083424j25151P20803Q57930
44163e14034Q52008J331734J827622J450876L66397l54183k97055j50242m06850
44154D106273o13971l52890n9536k08885m25968j81607K21853J88036j31762j91020
$$ plain form
44144 2350523 2317277 2288745 2287300 2658988 3260180 3250811 2329194 1515386 1917426 3231519
44134 3231519 4331374 4896871 5404215 5764796 5233347 3817497 2600092 2201330 1918516
44125 1918516 1045217 185377 336781 1209632 1520179 845088 216967 640375 1735525
44116 1735525 2291036 1753873 719247 122380 355994 1183836 2150433 2838178 2898029
44107 2898029 2212787 1184310 592075 828896 1355581 1294399 615433 306872 1125126
44098 1125126 2546534 3369313 3128531 2423914 1935639 1685205 1401219 1078899 824015
44089 824015 521193 123981 56893 781576 1975371 2688666 2510065 2109972 2300692 2960977
44079 2960977 3391235 3450295 3643009 4098022 4226835 3688440 2999001 2661633 2301418 1453292
$$ packed form
44144B350523l3246k8532j445L71688O01192r369r21617q13808M02040J314093
44134C231519J099855N65497N07344L60581n31449j415850j217405l98762k82814
44125A918516q73299q59840J51404Q72851L10547o75091o28121M23408J095150
44116A735525N55511n37163j034626n96867K33614Q27842R66597O87745N9851
44107B898029o85242j028477n92235K36821N26685o1182o78966l08561Q18254
44098A125126J421408Q22779k40782p04617m88275k50434k83986l22320k54884
44089H24015l02822l97212o7088P24683J193795P13295j78601m00093J90720O60285
44079B960977M30258N9060J92714M55013J28813n38395o89439l37368l60215q48126
$$ plain form
44069 1453292 765976 1325342 2824258 3614793 3002588 2378187 3229839 4895094 5470595
44060 5470595 4509618 3479397 3522761 4063469 4071487 3604958 3318388 3213716 2815107 2161953
44050 2161953 1703075 1369815 639411 -398382 -816112 -16524 1372234 2141148 1803444
44041 1803444 1004529 759005 1419426 2348150 2612835 2040434 1377704 1245287 1296509 864839
44031 864839 125012 -120885 281126 637222 645639 933859 1884155 2716932 2496663 1546032
44021 1546032 1053783 1553358 2540687 3412526 3990296 4128688 3580623 2469140 1351949
44012 1351949 606077 142392 -171527 -243254 -53621 155920 140670 -170477 -740676 -1316186
44002 -1316186 -1350390 -564473 441255 764775 461820 520359 1371570 2191926 2110650 1421863
$$ packed form
44069A453292o87316N59366J498916P90535o12205o24401Q51652J665255N75501
44060E470595r60977j030221M3364N40708Q018m66529k86570j04672l98609o53154
44050B161953m58878l33260p30404j037793m17730P99588J388758P68914l37704
44041A803444p98915k45524O60421R28724K64685n72401o62730j32417N1222m31670
44031H64839p39827k45897M02011L56096Q417K88220R50296Q32777k20269r50631
44021A546032m92249M99575R87329Q71839N77770J38392n48065j111483j117191
44012A351949p45872m63685l13919p1727J89633K09541j5250l11147n70199n75510
44002a316186l4204P85917J005728L23520l02955N8539Q51211Q20356q1276o88787
$$ plain form
43992 1421863 1004437 1066954 1132153 918326 616850 527786 914024 1935906 3253353 4033169
43982 4033169 3878515 3383303 3191013 2968526 2093267 919155 320272 209352 -291398
43973 -291398 -1156730 -1195627 116240 1653116 2132397 1716478 1399668 1506237 1595412 1348992
43963 1348992 782501 -44577 -825309 -874273 81802 1303185 1964362 2363376 3348212
43954 3348212 4770256 5531316 5194776 4522397 4152065 3724153 2830717 1986828 1897951
43945 1897951 2301426 2352507 1884156 1492564 1446849 1291135 723143 234184 452059 1198208
43935 1198208 1671396 1462245 947372 596772 294559 -331348 -1143341 -1563895 -1459483
43926 -1459483 -1429043 -1883740 -2269767 -1780060 -630873 71661 -196362 -721232 -653823 -152044
$$ packed form
43992A421863m17426O2517O5199k13827l01476q9064L86238J021882J317447P79816
43982D033169j54654m95212j92290k22487q75259j174112n98883j10920n00750
43973b91398q65332l8897J311867J536876M79281m15919l16810J06569Q9175k46420
43963A348992n66491q27078p80732m8964R56075J221383O61177L99014R84836
43954C348212J422044P61060l36540o72379l70332m27912q93436q43889q8877
43945A897951M03475N1081m68351l91592m5715j55714n67992m88959K17875P46149
43935A198208M73188k09151n14873l50600l02213o25907q11993m20554J04412
43926a459483L0440m54697l86027M89707J149187P02534k68023n24870O7409N01779
$$ plain form
43916 -152044 84588 -26247 69877 591138 1089280 1171452 1035554 1092189 1414449 1774728
43906 1774728 1970753 1909740 1554847 1003746 553093 541663 1102057 2025139 2804270 2940149
43896 2940149 2424983 1864168 1846124 2220494 2335251 2001794 1786427 2182154 2939666 3533187
43886 3533187 3892162 4221900 4395919 4091307 3413520 2841797 2568276 2409841 2391691 2818627
43876 2818627 3601658 4120680 4087667 3999091 4267706 4398827 3684415 2402221 1563154 1559724
43866 1559724 1830276 1920580 2045962 2277684 1978577 736407 -634936 -850643 232332
43857 232332 1494617 2074398 2298539 2853957 3645082 3954311 3411092 2337280 1293421
43848 1293421 687474 727084 1319497 1969755 2135755 1812236 1520872 1650744 2100030 2687979
$$ packed form
43916a52044K36632j10835R6124N21261M98142Q2172j35898N6635L22260L60279
43906A774728J96025o1013l54893n51101m50653j1430N60394R23082P79131J35879
43896B940149n15166n60815j8044L74370J14757l33457k15367L95727P57512N93521
43886C533187L58975L29738J74019l04612o77787n71723k73521j58435j8150M26936
43876B818627P83031N19022l3013q8576K68615J31121p14412j282194q39067l430
43866A559724K70552R0304J25382K31722k99107j242170j371343k15707J082975
43857B32332J262285N79781K24141N55418P91125L09229n43219j073812j043859
43848A293421o05947L9610N92413O50258J66000l23519k91364J29872M49286N87949
$$ plain form
43838 2687979 3546725 4755499 5808583 5925119 4958444 3685939 3073623 3446879 4437182
43829 4437182 5472710 6155279 6376944 6313384 6212044 6020377 5356092 4048451 2558966
43820 2558966 1562990 1188785 1020041 848535 1006580 1794418 2947810 3946496 4568763
43811 4568763 4820396 4568727 3713251 2652602 2103932 2315619 2764861 2774901 2189674
43802 2189674 1322451 509816 -72211 -340747 -311307 -120485 114815 438383 985100 1820734
43792 1820734 2844498 3711108 3898647 3188001 2188924 1998269 3010098 4346442 4874046
43783 4874046 4575088 4408195 4915420 5586147 5750244 5547309 5638780 6273449 7018578 7290035
43773 7290035 6878278 6014645 5091523 4277649 3380693 2245070 1254290 1068449 1727743
$$ packed form
43838B687979Q58746J208774J053084J16536r66675j272505o12316L73256R90303
43829D437182J035528O82569K21665o3560j01340j91667o64285j307641j489485
43820B558966r95976l74205j68744j71506J58045P87838J153392R98686O22267
43811D568763K51633k51669q55476j060649n48670K11687M49242J0040n85227
43802B189674q67223q12635n82027k68536K9440J90822K35300L23568N46717Q35634
43792A820734J023764Q66610J87539p10646r99077j90655J011829J336344N27604
43783D874046k98958j66893N07225O70727J64097k02935R1471O34669P45129K71457
43773G290035m11757q63633r23122q13874q96956j135623r90780j85841O59294
$$ plain form
43764 1727743 2432894 2513562 2243990 2305810 2804960 3380995 4024441 5035382 6159575
43755 6159575 6516250 5674745 4255911 3120663 2409528 1785332 1248915 1188335 1770232
43746 1770232 2743008 3820784 4899222 5855630 6423190 6368078 5676156 4571300 3436228
43737 3436228 2603304 2061891 1490838 781789 388297 844058 1983036 2978165 3207870
43728 3207870 2786343 2163399 1556602 1010209 726824 953803 1602862 2305548 2862038
43719 2862038 3325140 3561013 3122437 1915935 758794 712890 1773757 2747309 2757977
43710 2757977 2434011 3019058 4550044 5684816 5457929 4500503 4131981 4780227 5832054
43701 5832054 6681050 7288473 7841939 8472858 9381305 10752811 12362244 13558658 13821515
$$ packed form
43764A727743P05151Q0668k69572O1820M99150N76035O43446J010941J124193
43755F159575L56675q41505j418834j135248p11135o24196n36417o0580N81897
43746A770232R72776J077776J078438R56408N67560n5112o91922j104856j135072
43737C436228q32924n41413n71053p09049l93492M55761J138978R95129K29705
43728C207870m21527o22944o06797n46393k83385K26979O49059P02686N56490
43719B862038M63102K35873m38576j206502j157141m5904J060867R73552J0668
43710B757977l23966N85047J530986J134772k26887r57426l68522O48246J051827
43701E832054Q48996O07423N53466O30919R08447J371506J609433J196414K62857
$$ plain form
43692 13821515 13216552 12307116 11757054 11903632 12472170 12819964 12739199 12857209 13850092
43683 13850092 15385893 16317835 15862260 14115140 11559957 8788933 6701484 6032974
43675 6032974 6305354 6063406 4708820 3378296 3311590 4030450 4085014 3147360 2254982
43666 2254982 2134593 2421394 2678540 3121719 3907043 4549252 4609871 4366973 4285842 4327770
43656 4327770 4280619 4296226 4537557 4683685 4372246 3813414 3365550 2801297 1697669 375873
43646 375873 -301974 -44850 674887 1550607 2746864 4083218 4772158 4463825 3875287
43637 3875287 3753882 3735772 2967150 1510288 319341 -49170 99482 452033 1198997
43628 1198997 2414622 3571854 4091998 3960544 3463494 2734389 1956373 1612349 1990225
$$ packed form
43692A3821515o04963r09436n50062J46578N68538L47794q0765J18010R92883
43683A3850092J535801R31942m55575j747120k555183k771024k087449o68510
43675F032974K72380k41948j354586j330524o6706P18860N4564r37654q92378
43666B254982j20389K86801K57146M43179P85324O42209O0619k42898q1131M1928
43656D327770m7151J5607K41331J46128l11439n58832m47864n64253j103628j321796
43646C75873o77847K57124P19737Q75720J196257J336354O88940l08333n88538
43637C875287j21405j8110p68622j456862j190947l68511J48652L52551P46964
43628A198997J215625J157232N20144j31454m97050p29105p78016l44024L77876
$$ plain form
43619 1990225 2632474 2772407 2240349 1551359 1202066 1283967 1707764 2371016 3085251 3676572
43609 3676572 4142876 4437124 4275989 3596539 2995287 3076000 3456107 3204136 2332472 1946453
43599 1946453 2577337 3287972 3063255 2301074 2075170 2509241 2869361 2896108 2981156 3162708
43589 3162708 3014236 2614050 2630978 3192729 3539382 3140349 2400899 1919061 1768995 1874051
43579 1874051 2314112 2797558 2598549 1617008 810220 924256 1473806 1692094 1748495 2098547
43569 2098547 2357110 2059841 2024463 3451973 5802667 7091806 6490045 5194566 4374484
43560 4374484 3774110 3034623 2886845 3866532 4997628 5104843 4592701 4504028 4499608 3431682
43550 3431682 1600008 652416 1091298 1557452 1105243 655417 1306590 2461072 2806228
$$ packed form
43619A990225O42249J39933n32058o88990l49293Q1901M23797O63252P14235N91321
43609C676572M66304K94248j61135o79450o01252Q0713L80107k51971q71664l86019
43599A946453O30884P10635k24717p62181k25904M34071L60120K6747Q5048J81552
43589C162708j48472m00186J6928N61751L46653l99033p39450m81838j50066J05056
43579A874051M40061M83446j99009r81541q06788J14036N49550K18288N6401L50052
43569B098547K58563k97269l5378J427510K350694J289139o01761j295479q20082
43560D374484o00374p39487j47778R79687J131096J07215n12142q8673m420j067926
43550C431682j831674r47592M38882M66154m52209m49826O51173J154482L45156
$$ plain form
43541 2806228 2325735 2085089 2476850 2889957 2980001 3164072 3704817 4167632 4078876 3529262
43531 3529262 2884124 2383681 2235756 2625472 3335836 3716197 3357844 2605045 2153786
43522 2153786 2299710 2790760 3290879 3743884 4262023 4796285 5037154 4731894 4105871
43513 4105871 3798533 4219230 5069602 5691145 5791935 5608203 5451342 5416705 5526191 5805834
43503 5805834 6133850 6331801 6537753 7147119 8128753 8703898 8148963 6851458 6100350
43494 6100350 6622280 7641717 7766629 6693542 5541506 5307238 5481072 4780676 3066994
43485 3066994 1742754 1999784 3343884 4374507 4531094 4377415 4440732 4569661 4455855
43476 4455855 4098049 3585935 2972865 2525742 2579282 2945938 2980486 2483164 2054831 2247218
$$ packed form
43541B806228m80493k40646L91761M13107R0044J84071N40745M62815q8756n49614
43531C529262o45138n00443j47925L89716P10364L80361l58353p52799m51259
43522B153786J45924M91050N00119M53005N18139N34262K40869l05260o26023
43513D105871l07338M20697Q50372O21543J00790j83732j56861l4637J09486K79643
43503E805834L28016J97951K05952O09366R81634N75145n54935j297505p51108
43494F100350N21930J019437J24912j073087j152036k34268J73834p00396j713682
43485C066994j324240K57030J344100J030623J56587j53679O3317J28929j13806
43476D455855l57806n12114o13070m47123N3540L66656L4548m97322m28333J92387
$$ plain form
43466 2247218 2816498 3203426 3366402 3695575 4372695 5236368 6081313 6716689 6912579
43457 6912579 6665367 6392946 6545748 7122997 7793834 8281732 8355062 7727150 6432395
43448 6432395 5194097 4965611 6024789 7729053 9129411 9686223 9564326 9456707 9944235
43439 9944235 10809630 11220530 10838771 10414567 10886081 12187262 13424370 13967429 13805077
43430 13805077 13051543 11821999 10570799 9854861 9633545 9382388 9018296 9106228 9948749
43421 9948749 11080249 12011431 12974937 14494093 16537669 18506460 19845816 20354513 20101545
43412 20101545 19386912 18673664 18243822 17897283 17123724 15571371 13368375 11143105 9717622
43403 9717622 9498492 10044403 10449262 10270560 9878890 9800101 9983445 9923875 9318649 8368660
$$ packed form
43466B247218N69280L86928J62976L29173O77120Q63673Q44945O35376J95890
43457F912579k47212k72421J52802N77249O70837M87898P3330o27912j294755
43448F432395j238298k28486J059178J704264J400358N56812j21897j07619M87528
43439I944235Q65395M10900l81759m24204M71514J301181J237108N43059j62352
43430A3805077p53534j229544j251200p15938k21316k51157l64092Q7932Q42521
43421I948749J131500R31182R63506J519156K043576J968791J339356N08697k52968
43412B0101545p14633p13248m29842l46539p73559j552353k202996k225270j425483
43403I717622k19130N45911M04859j78702l91670p8789J83344n9570o05226r49989
$$ plain form
43393 8368660 7514603 7075556 7156846 7775714 8916112 10316869 11265360 10967955 9407409
43384 9407409 7637744 6914834 7635301 9321304 11323609 13116769 14219044 14494360 14483400
43375 14483400 14857505 15578277 16140412 16493164 16958132 17278952 16680182 15069305 13293027
43366 13293027 11892888 10509114 8947989 7870262 7702302 7684794 6914620 5759360 5288339
43357 5288339 5661481 5997841 5667745 4939430 4457984 4716504 5849996 7314741 8003955
43348 8003955 7378765 6274715 5857654 6014677 5670395 4592500 3848527 4242299 5185091
43339 5185091 5556562 5078665 4414187 4326260 5085398 6401878 7693095 8630442 9493716
43330 9493716 10701685 12012181 12632828 12237014 11476616 11328215 12202184 13729700 15083766
$$ packed form
43393H368660q54057m39047Q1290O18868J140398J400757R48491k97405j560546
43384I407409j769665p22910P20467J686003K002305J793160J102275K75316j0960
43375A4483400L74105P20772N62135L52752M64968L20820n98770j610877j776278
43366A3293027j400139j383774j561125j077727j67960j7508p70174j155260m71021
43357E288339L73142L36360l30096p28315m81446K58520J133492J464745O89214
43348H003955o25190j104050m17061J57023l44282j077895p43973L93772R42792
43339E185091L71471m77897o64478q7927P59138J316480J291217R37347Q63274
43330I493716J207969J310496O20647l95814p60398j48401Q73969J527516J354066
$$ plain form
43321 15083766 15460318 14622444 13139917 11916521 11461822 11720781 12351805 12862202 12787272
43312 12787272 12218570 11876021 12109853 12187312 11333248 10154890 9979572 10830202 11218201
43303 11218201 10213865 8660766 7887672 8156819 8921332 9725030 10173901 9810130 8826577
43294 8826577 8314839 9002296 10208754 10798773 10691448 10602449 10725264 10657875 10409731 10419654
43284 10419654 10523079 9913386 8473567 7333112 7540099 8677100 9400727 9129688 8605082
43275 8605082 8730276 9381821 9746117 9573559 9522471 10140653 11044537 11498355 11391475 11114984
43265 11114984 10835318 10587610 10791873 11766976 12858816 13098993 12773935 13155604 14425138
43256 14425138 15221567 14882716 14764187 16240319 18494585 19667408 19473281 19257691 19898820
$$ packed form
43321A5083766L76552q37874j482527j223396m54699K58959O31024N10397p4930
43312A2787272n68702l42549K33832P7459q54064j178358j75318Q50630L87999
43303A1218201j004336j553099p73094K69147P64513Q03698M48871l63771r83553
43294H826577n11738O87457J206458N90019j07325q8999J22815o7389k48144R923
43284A0419654J03425o09693j439819j140455K06987J137001P23627k71039n24606
43275H605082J25194O51545L64296j72558n1088O18182R03884M53818j06880k76491
43265A1114984k79666k47708K04263R75103J091840K40177l25058L81669J269534
43256A4425138P96429l38851j18529J476132K254266J172823j94127k15590O41129
$$ plain form
43247 19898820 21035760 22125250 22934426 23126793 22691423 22770291 24703393 28053368 30829520
43238 30829520 31993935 32619788 34239241 37186472 41000100 45294625 49585161 53277625
43230 53277625 56622781 60876891 66769463 73547486 80290650 87421123 95945391 105700668
43222 105700668 115324776 123667086 130305722 134799069 136332087 134321499 128901698 120738430
43214 120738430 110702012 99695676 88493446 77728208 68065776 60023544 53392744
43207 53392744 47298731 41263995 35854779 31826008 28994635 26514304 23971690 21596049
43199 21596049 19585353 17882095 16551163 15751266 15256182 14502948 13242032 11807508
43191 11807508 10702363 10186399 10204177 10398811 10279536 9721568 9238138 9452901 10409036
$$ packed form
43247A9898820J136940J089490Q09176J92367m35370P8868J933102L349975K776152
43238C0829520J164415O25853J619453K947231L813628M294525M290536L692464
43230E3277625L345156M254110N892572O778023O743164P130473Q524268R755277
43222A05700668R624108Q342310O638636M493347J533018k010588n419801q163268
43214A20738430j0036418j1006336j1202230j0765238r662432q042232o630800
43207E3392744o094013o034736n409216m028771k831373k480331k542614k375641
43199B1596049k010696j703258j330932p99897m95084p53234j260916j434524
43191A1807508j105145n15964J7778J94634j19275n57968m83430K14763R56135
$$ plain form
43182 10409036 11665830 12809997 13449184 13019955 11294956 9011314 7336866 6665534
43174 6665534 6496068 6440950 6594286 6798285 6434542 5403684 4621967 4928286 5948722
43165 5948722 6653228 6707309 6631727 6811093 7012791 6919603 6580196 6155681 5615236 4915704
43155 4915704 4256905 3959852 4193460 4908127 5913121 6928164 7667843 7992901 7960335
43146 7960335 7709857 7383197 7169758 7259167 7582526 7691689 7145859 6079972 5182716
43137 5182716 4984443 5350629 5833735 6255333 6584694 6471011 5519367 4095564 3205096
43128 3205096 3261498 3561690 3471751 3585028 4918221 7208684 8881791 8809053 7430693
43119 7430693 5980048 5198600 5040608 5091258 4932870 4456136 4046015 4138838 4496738 4393117
$$ packed form
43182A0409036J256794J144167O39187m29229j724999k283642j674448o71332
43174F665534j69466n5118J53336K03999l63743j030858p81717L06319J020436
43165E948722P04506N4081p5582J79366K01698r3188l39407m24515n40445o99532
43155D915704o58799k97053K33608P14667J004994J015043P39679L25058l2566
43146G960335k50478l26660k13439Q9409L23359J09163n45830j065887q97256
43137E182716j98273L66186M83106M21598L29361j13683r51644j423803q90468
43128C205096N6402L00192q9939J13277J333193K290463J673107p2738j378360
43119G430693j450645p81448j57992N0650j58388m76734m10121R2823L57900j03621
$$ plain form
43109 4393117 3653787 2914943 2585975 2250272 1596974 1303990 2237954 4148143 5905383
43100 5905383 6825050 7083408 7044752 6927722 7013195 7382641 7448682 6549876 5131321 4538765
43090 4538765 5379253 6793736 7661096 7827936 7757363 7658783 7529112 7499962 7530572 7214405
43080 7214405 6524247 6315321 7325244 8965905 9939519 9933401 9862066 10391385 11072498 11205048
43070 11205048 10832762 10445068 10202209 9936158 9616124 9398450 9378120 9571554 10001762
43061 10001762 10608378 11234302 11823328 12406440 12798979 12648128 11971734 11321119 11179458
43052 11179458 11521891 12184746 13209202 14416143 15096140 14756742 13930961 13588968 13903694
43043 13903694 14320057 14772450 15913211 17843117 19469183 19774527 19210227 19097062 19886936
$$ packed form
43109D393117p39330p38844l28968l35703o53298k92984R33964J910189J757240
43100E905383R19667K58358l8656j17030Q5473L69446O6041q98806j418555n92556
43090D538765Q40488J414483Q67360J66840p0573r8580j29671k9150L0610l16167
43080G214405o90158k08926J009923J640661R73614o118p1335N29319O81113J32550
43070A1205048l72286l87694k42859k66051l20034k17674k0330J93434M30208
43061A0001762O06616O25924N89026N83112L92539j50851o76394o50615j41661
43052A1179458L42433O62855J024456J206941O79997l39398q25781l41993L14726
43043A3903694M16363M52393J140761J929906J626066L05344n64300j13165P89874
$$ plain form
43034 19886936 20728410 20748525 20146174 19831960 20419524 21805110 23433768 24711080 25320237
43025 25320237 25381148 25285661 25318427 25533948 25997875 26872938 28098051 29251838 30087793
43016 30087793 31101301 33156534 36467664 40301983 43902877 47456942 51873257 57741352
43008 57741352 64775025 72221101 79570651 86874870 94533602 102718180 110833287 117680507
43000 117680507 122416444 125209086 126598738 126392137 123780646 118566280 111591039 103738827
42992 103738827 95217049 86240298 77710273 70489422 64461728 59083683 54484617 51100925
42984 51100925 48443450 45325874 41462656 37874679 35414662 33780277 32386780 31308888
42976 31308888 30707985 30093417 29012687 27980414 27823392 28363833 28591203 28012199 27029223
$$ packed form
43034A9886936Q41474K0115o02351l14214N87564J385586J628658J277312O09157
43025B5320237O0911r5487L2766K15521M63927Q75063J225113J153787Q35955
43016C0087793J013508K055233L311130L834319L600894L554065M416315N868095
43008E7741352P033673P446076P349550P304219P658732Q184578Q115107O847220
43000A17680507M735937K792642J389652k06601k611491n214366o975241p852212
42992A03738827q521778q976751q530025p220851o027694n378045m599066l383692
42984E1100925k657475l117576l863218l587977k460017j634385j393497j077892
42976C1308888o00903o14568j080730j032273j57022N40441K27370n79004r82976
$$ plain form
42967 27029223 26005294 24768624 23218229 21717353 20570901 19629603 18724828 18060738
42959 18060738 17826662 17756963 17458918 16989803 16778144 17056143 17608792 18036323 18087186 17748841
42949 17748841 17126066 16258322 15088822 13689602 12449424 11838298 11943496 12377522 12650115
42940 12650115 12488906 11870311 11033140 10489914 10675131 11417330 12048216 12237234 12420362
42931 12420362 13091376 13931494 14128213 13510814 12870349 13003366 13869667 14989095 16284848
42922 16284848 17990889 19857310 21110429 21426832 21404190 21619898 21627181 20541155 18456701
42913 18456701 16511279 15402994 14594859 13384034 12086402 11473699 11458627 11186604 10346556
42904 10346556 9582615 9431608 9526487 9201350 8401888 7587943 7055382 6765697 6653992
$$ packed form
42967B7029223j023929j236670j550395j500876j146452r41298r04775o64090
42959A8060738k34076o9699k98045m69115k11659K77999N52649M27531N0863l38345
42949A7748841o22775q67744j169500j399220j240178o11126J05198M34026K72593
42940A2650115j61209o18595q37171n43226J85217P42199O30886J89018J83128
42931A2420362O71014Q40118J96719o17399o40465J33017Q66301J119428J295753
42922A6284848J706041J866421J253119L16403k2642K15708P283j086026k084454
42913A8456701j945422j108285q08135j210825j297632o12703j5072k72023q40048
42904A0346556p63941j51007R4879l25137p99462q13945n32561k89685j11705
$$ plain form
42895 6653992 6709309 6813549 6825333 6834000 7074749 7527853 7796515 7521755 6852459 6350459
42885 6350459 6344184 6461579 6015798 4921215 3985537 4066946 5110848 6310184 7069039
42876 7069039 7405612 7482292 7286547 6932079 6775318 6908601 6886541 6290999 5285984 4291426
42866 4291426 3428690 2729997 2612770 3516738 5101336 6386808 6809970 6665106 6403302
42857 6403302 6083465 5793376 5981098 6765396 7344391 6904091 6003406 6174874 7910328
42848 7910328 9828421 10361577 9671127 9187121 9659878 10553745 11250455 11871950 12640612
42839 12640612 13257719 13443740 13509899 13802007 14004288 13628882 12905846 12530623 12677376
42830 12677376 12878295 12797372 12519237 12115032 11576370 11236361 11556456 12250946 12253576 10972220
$$ packed form
42895F653992N5317J04240J1784Q667K40749M53104K68662k74760o69296n02000
42885F350459o275J17395m45781j094583r35678Q1409J043902J199336P58855
42876G069039L36573P6680j95745l54468j56761J33283k2060n95542j005015r94558
42866D291426q62736o98693j17227R03968J584598J285472M23162j44864k61804
42857F403302l19837k90089J87722P84298N78995m40300r00685J71468J735454
42848G910328J918093N33156o90450m84006M72757Q93867O96710O21495P68662
42839A2640612O17107J86021O6159K92108K02281l75406p23036l75223J46753
42830A2677376K00919q0923k78135m04205n38662l40009L20095O94490K630j281356
$$ plain form
42820 10972220 9144424 8009702 7908107 8076450 7622644 6354682 4804466 3773835
42812 3773835 3792010 4733863 5931660 6770335 7142420 7292992 7386428 7363022 7134704 6813534
42802 6813534 6746318 7243063 8132334 8702601 8382720 7487189 6997540 7528221 8696990
42793 8696990 9509928 9199092 7850544 6534278 6594424 8268659 10125602 10514476 9527196
42784 9527196 8750074 9022157 9433464 8924856 7863958 7261455 7189025 6941499 6311423
42775 6311423 5716112 5270625 4673804 4026184 3951257 4710771 5752606 6321877 6179851
42766 6179851 5685712 5466233 5929827 6796598 7245892 6835972 6042214 5530770 5259466
42757 5259466 4833775 4395999 4415994 4778749 4876898 4604829 4517774 4904749 5368597 5485242
$$ packed form
42820A0972220j827796j134722j01595J68343m53806j267962j550216j030631
42812C773835J8175R41853J197797Q38675L72085J50572R3436k3406k28318l21170
42802F813534o7216M96745Q89271N70267l19881q95531m89649N30681J168769
42793H696990Q12938l10836j348548j316266O0146J674235J856943L88874r87280
42784I527196p77122K72083M11307n08608j060898o02503p2430k47526o30076
42775F311423n95311m45487n96821o47620p4927P59514J041835N69271j42026
42766F179851m94139k19479M63594Q66771M49294m09920p93758n11444k71304
42757E259466m25691m37776J9995L62755R8149k72069q7055L86975M63848J16645
$$ plain form
42747 5485242 5320245 5152467 5174372 5524934 6102113 6320966 5650224 4468724 3807141
42738 3807141 4144163 5016694 5854047 6529034 6988487 7080011 6992495 7232883 7936618 8791202
42728 8791202 9753626 11073851 12400769 12751950 11801170 10421205 9501164 9011240 8725338
42719 8725338 8960945 9839890 10591024 10511838 10071902 10170132 10780048 11254007 11542866 12094237
42709 12094237 12817530 13201956 13369389 14045271 15509288 17476110 19944812 23082205 26098945
42700 26098945 27372877 26258679 24018575 22392952 21804407 21467538 20741581 19751215 18950852
42691 18950852 18635509 18824012 19292346 19759676 20198359 20830518 21714176 22558528 23128592
42682 23128592 23669044 24763829 26848889 29856858 33148777 35825270 37437543 38516545
$$ packed form
42747E485242j64997j67778K1905L50562N77179K18853o70742j181500o61583
42738C807141L37022Q72531Q37353O74987M59453R1524q7516K40388P03735Q54584
42728H791202R62424J320225J326918L51181r50780j379965r20041m89924k85902
42719H725338K35607Q78945P51134p9186m39936R8230O09916M73959K88859N51371
42709A2094237P23293L84426J67433O75882J464017J966822K468702L137393L016740
42700B6098945J273932j114198k240104j625623n88545l36869p25957r90366q00363
42691A8950852l15343J88503M68334M67330M38683O32159Q83658Q44352N70064
42682B3128592N40452J094785K085060L007969L291919K676493J612273J079002
$$ plain form
42674 38516545 40162812 42998265 46680270 50416636 53660573 56298801 58562455 60906699
42666 60906699 63636888 66438466 68510871 69332958 69102972 68340805 67306830 65884743
42658 65884743 63737845 60499748 56170544 51465923 47401127 44324776 41681393 38861627
42650 38861627 35849644 32838863 29787613 26786532 24340811 22669866 21108207 18920335
42642 18920335 16485516 14915963 14595463 14876826 15212663 15671793 16104913 15767525 14396343
42633 14396343 12945339 12447875 12584640 12211938 11041211 9890154 9321373 8983513 8542531
42624 8542531 8394506 8924972 9684167 9944918 9705956 9510934 9501314 9290317 8726876 8213983
42614 8213983 8165368 8528718 8917621 8932169 8381236 7499264 6867742 6773784 6775556 6341484
$$ packed form
42674C8516545J646267K835453L682005L736366L243937K638228K263654K344244
42666F0906699K730189K801578K072405Q22087k29986p62167j033975j422087
42658F5884743k146898l238097m329204m704621m064796l076351k643383k819766
42650C8861627l011983l010781l051250l001081k445721j670945j561659k187872
42642A8920335k434819j569553l20500K81363L35837M59130M33120l37388j371182
42633A4396343j451004m97464J36765l72702j170727j151057n68781l37860m40982
42624H542531j48025N30466P59195K60751k38962j95022r620k10997n63441n12893
42614H213983m8615L63350L88903J4548n50933q81972o31522r3958J772m34072
$$ plain form
42604 6341484 5743933 5682608 6108620 6252163 5955775 6047629 6923123 7600328 6950467 5310461
42594 5310461 4049486 3876496 4374058 4974555 5549997 6060666 6392218 6682407 7226186
42585 7226186 7935374 8395813 8539702 8749601 9195225 9582944 9718942 9830249 10103474
42576 10103474 10320287 10205197 9818310 9380721 8968860 8567880 8220692 7993709 7949733
42567 7949733 8145875 8417027 8233060 7171819 5586625 4418867 4231543 4734138 5315448
42558 5315448 5690575 5940892 6267905 6810742 7409873 7539970 6856927 5834701 5421123
42549 5421123 5970143 6900629 7446248 7321837 6679357 5964722 5839848 6589706 7491512
42540 7491512 7476742 6627183 6290274 7421833 9537217 11615626 13215782 14249126 14557914
$$ packed form
42604F341484n97551o1325M26012J43543k96388R1854Q75494O77205o49861j640006
42594E310461j260975j72990M97562O00497N75442N10669L31552K90189N43779
42585G226186P09188M60439J43889K09899M45624L87719J35998J11307K73225
42576A0103474K16813j15090l86887m37589m11861m00980l47188k26983m3976
42567G949733J96142K71152j83967j061241j585194j167758j87324N02595N81310
42558E315448L75127K50317L27013N42837N99131J30097o83043j022226m13578
42549E421123N49020R30486N45619j24411o42480p14635j24874P49858R01806
42540G491512j4770q49559l36909J131559K115384K078409J600156J033344L08788
$$ plain form
42531 14557914 14434369 14791028 16012053 17326521 18181425 19500708 22449266 26484889
42523 26484889 29909506 32050632 33596194 34928945 35558083 35331808 34775311 33778556 31284944
42514 31284944 27047388 22623501 19695873 18175990 16898992 15538805 14740897 14709030
42506 14709030 14786084 14444448 13758576 12756462 11191096 9336983 8247528 8525281 9232704
42497 9232704 8812988 7062715 5451411 5223895 5865623 6052572 5608266 5502696 5948187
42488 5948187 5705929 3939862 1868638 1508194 3135745 5059462 5850540 5784869 5859565
42479 5859565 6331877 6784438 7017192 7215051 7457798 7533794 7220359 6591249 6115835 6376135
42469 6376135 7390903 8330475 8401297 7979858 8203704 9303496 10102946 9558271 8096223
$$ packed form
42531A4557914j23545L56659J221025J314468Q54904J319283K948558M035623
42523B6484889L424617K141126J545562J332751O29138k26275n56497r96755k493612
42514C1284944m237556m423887k927628j519883j276998j360187p97908l1867
42506A4709030P7054l41636o85872j002114j565366j854113j089455K77753P07423
42497I232704m19716j750273j611304k27516O41728J86949m44306j05570M45491
42488E948187k42258j766067k071224l60444J627551J923717P91078o5671P4696
42479E859565M72312M52561K32754J97859K42747P5996l13435o29110m75414K60300
42469F376135J014768R39572P0822m21439K23846J099792P99450n44675j462048
$$ plain form
42460 8096223 6865806 6269918 5970497 5890398 6281760 6902036 6995436 6309527 5531442 5429553
42450 5429553 5953533 6451516 6517969 6369688 6487825 7054659 7747770 8088198 8021661 8063266
42440 8063266 8729533 9858263 10625341 10287270 8927440 7520286 7181441 8143536 9448146
42431 9448146 9869867 9198402 8381834 8374365 9161038 10014332 10341781 10088095 9668083 9782415
42421 9782415 10982993 13089400 15246673 16779140 17679617 18046148 17561627 16068327 14284273
42412 14284273 13247406 13136226 13219712 12948783 12572062 12662666 13536366 15189800 17337984
42403 17337984 19405013 20899777 21954674 23180326 24895020 26784536 28366704 29505136
42395 29505136 30469334 31787580 33927210 36634352 38626596 38580254 36641413 34433509
$$ packed form
42460H096223j230417n95888k99421q0099L91362O20276R3400o85909p78085j01889
42450E429553N23980M97983O6453j48281J18137N66834O93111L40428o6537M1605
42440H063266O66267J128730P67078l38071j359830j407154l38845R62095J304610
42431I448146M21721o71465q16568p469P86673Q53294L27449k53686m20012J14332
42421I782415J200578K106407K157273J532467R00477L66531m84521j493300j784054
42412A4284273j036867j11180Q3486k70929l76721R0604Q73700J653434K148184
42403A7337984K067029J494764J054897J225652J714694J889516J582168J138432
42395B9505136R64198J318246K139630K707142J992244m6342j938841k207904
$$ plain form
42387 34433509 33295174 33009024 32611898 31907091 31531829 31801660 32227359 32275859 32036513
42378 32036513 31787095 31193307 29423282 26218615 22629116 20336049 20114268 21168001
42370 21168001 22176821 22770860 23600813 25091042 26711278 27686427 27965248 28121045 28598018
42361 28598018 29496767 30965423 33334197 36788363 41240301 46646746 53142456 60562057
42353 60562057 67926220 73716102 76793737 76948716 74516822 69754997 62932724 54937940
42345 54937940 47269145 41077617 36356426 32293796 28315803 24607453 21755935 20122531
42337 20122531 19510821 19284712 18866670 18201713 17598676 17107786 16412921 15493539 14922595
42328 14922595 15116291 15676522 15967923 16007167 16203349 16528516 16662644 16768536 17328940
$$ packed form
42387C4433509j138335k86150l97126p04807l75262K69831M25699M8500k39346
42378C2036513k49418n93788j770025l204667l589499k293067k21781J053733
42370B1168001J008820N94039Q29953J490229J620236R75149K78821J55797M76973
42361B8598018Q98749J468656K368774L454166M451938N406445O495710P419601
42353F0562057P364163N789882L077635J54979k431894m761825o822273p994784
42345E4937940p668795o191528m721191m062630l977993l708350k851518j633404
42337B0122531o11710k26109m18042o64957o03037m90890o94865r19382n70944
42328A4922595J93696N60231K91401L9244J96182L25167J34128J05892N60404
$$ plain form
42319 17328940 18264306 18999394 19432632 20050343 21015283 21996115 23051758 24756897 27138178
42310 27138178 29408794 31213910 33245982 36017940 38842052 40782729 41999508 43418819
42302 43418819 45619079 48704615 52667877 57108877 61176251 64605399 68225169 72534208
42294 72534208 76445400 78641038 79649524 81112878 83186494 84217067 83154633 80773892
42286 80773892 78040084 74682208 70213052 65254382 60819723 56973640 53152835 49355086
42278 49355086 46137968 43714376 41802054 40207124 38916833 37720933 36333104 34906862
42270 34906862 33978059 33810078 34080035 34291920 34365308 34778259 36104132 38323132 40731458
42261 40731458 42799693 44943626 47970956 51919271 56182887 60833317 66885845 74876928
$$ packed form
42319A7328940R35366P35088M33238O17711R64940R80832J055643J705139K381281
42310B7138178K270616J805116K032072K771958K824112J940677J216779J419311
42302D3418819K200260L085536L963262M441000M067374L429148L619770M309039
42294G2534208L911192K195638J008486J463354K073616J030573j062434k380741
42286H0773892k733808l357876m469156m958670m434659l846083l820805l797749
42278D9355086l217118k423592j912322j594930j290291j195900j387829j426242
42270C4906862r28803j67981K69957K11885P3388M12951J325873K219000K408326
42261D0731458K068235K143933L027330L948315M263616M650430O052528P991083
$$ plain form
42253 74876928 84086700 93831812 104664291 117166472 129879209 139488297 143170828 140199363
42245 140199363 131518105 118728758 103663742 88119720 73464791 60628333 50341952
42238 50341952 42853097 37432847 32864745 28658297 25271759 23000746 21336431 19819845
42230 19819845 18903314 19278430 20639335 21815950 22147925 22171197 22755209 23944119 24965460
42221 24965460 25263903 25273888 26114395 28594930 32532738 36975602 41052940 44658277 48364915
42212 48364915 52651080 57142702 60648791 62030914 61009889 58051010 53641273 48017722
42204 48017722 41582838 35127986 29386074 24617482 20822785 18032069 16089593 14483532
42196 14483532 12839287 11412247 10690324 10690504 11103656 11927930 13290248 14631007 14811269
$$ packed form
42253G4876928R209772R745112J0832479J2502181J2712737R609088L682531k971465
42245A40199363q681258j2789347j5065016j5544022j4654929j2836458j0286381
42238E0341952p488855n420250m568102m206448l386538k271013j664315j516586
42230A9819845r16531L75116J360905J176615L31975K3272N84012J188910J021341
42221B4965460K98443R985Q40507K480535L937808M442864M077338L605337L706638
42212D8364915M286165M491622L506089J382123j021025k958879m409737n623551
42204D8017722o434884o454852n741912m768592l794697k790716j942476j606061
42196A4483532j644245j427040p21923J80M13152Q24274J362318J340759J80262
$$ plain form
42187 14811269 13385417 11286456 9855641 9500704 9629858 9579608 9172524 8554490 7971167
42178 7971167 7737829 8076648 8847615 9607960 10024073 10146804 10280985 10682626 11378806
42169 11378806 12181560 12870634 13454303 14256723 15623641 17449294 19062603 19747111 19459964
42160 19459964 18956919 19100393 20111043 21648266 23518542 25925829 28858568 31557772
42152 31557772 32992741 32844985 31763690 30613965 29634556 28367658 26324042 23681237
42144 23681237 21258567 19651460 18481053 16893046 14848585 13327168 12900921 12746587
42136 12746587 11797028 10426145 9999808 10877417 11948734 12370218 12689660 13677392 14933697
42127 14933697 15511187 15362578 15247638 15477095 15649084 15592331 15751496 16497590 17767428
$$ packed form
42187A4811269j425852k098961j430815l54937J29154n0250m07084o18034n83323
42178G971167k33338L38819P70967P60345M16113J22731J34181M01641O96180
42169A1378806Q02754O89074N83669Q02420J366918J825653J613309O84508k87147
42160A9459964n03045J43474J010650J537223J870276K407287K932739K699204
42152C1557772J434969j47756j081295j149725r79409j266898k043616k642805
42144B3681237k422670j607107j170407j588007k044461j521417m26247j54334
42136A2746587r49559j370883m26337Q77609J071317M21484L19442R87732J256305
42127A4933697N77490j48609j14940K29457J71989n6753J59165P46094J269838
$$ plain form
42118 17767428 19629232 22488821 26173600 29253883 30037358 28312429 25624251 23638091
42110 23638091 22569722 21471580 19728646 17766405 16348076 15745098 15807130 16334507 16966341
42101 16966341 17112520 16585160 16070476 16359968 17262866 17945832 18214315 18585039 19032908
42092 19032908 18698540 17247018 15560445 14436044 13462296 12074936 11008299 11508803
42084 11508803 13406622 15135285 15667761 15403733 15011283 14430038 13461831 12545542 12319397
42075 12319397 12809003 13485306 13853313 13716548 13175147 12624549 12492536 12784466 13137333
42066 13137333 13393689 13717167 14008469 13728804 12657452 11434886 10926577 11274389 11940241
42057 11940241 12505369 13069090 13945369 15234357 16635257 17531442 17424154 16482868 15526607
$$ packed form
42118A7767428J861804K859589L684779L080283P83475j724929k688178j986160
42110B3638091j068369j098142j742934j962241j418329o02978O2032N27377O31834
42101A6966341J46179n27360n14684K89492R02898O82966K68483L70724M47869
42092A9032908l34368j451522j686573j124401r73748j387360j066637N00504
42084A1508803J897819J728663N32476k64028l92450n81245r68207r16289k26145
42075A2319397M89606O76303L68007j36765n41401n50598j32013K91930L52867
42066A3137333K56356L23478K91302k79665j071352j222566n08309L47812O65852
42057A1940241N65128N63721Q76279J288988J400900Q96185j07288r41286r56261
$$ plain form
42048 15526607 15282577 15802632 16719394 17785351 18898055 19878645 20673443 21706977 23601097
42039 23601097 26395775 29279587 31270268 32112413 32403888 32798463 33135277 32543016 30550581
42030 30550581 27894670 25869297 24937819 24420958 23586223 22519740 21748368 21588212 22236580
42021 22236580 23917214 26299203 28197680 28678444 28338279 28708288 30367931 32442423
42013 32442423 34137317 35904013 38573737 42056940 45732831 49774262 55132305 62123258
42005 62123258 69877776 77649164 86133129 96914437 110950001 128345877 149507765
41998 149507765 175318583 205148516 234840249 257532077 267043686 260771188 240139629
41991 240139629 209494326 174808635 142065320 115101128 94381478 78189008 65108211
$$ packed form
42048A5526607k44030N20055R16762J065957J112704R80590P94798J033534J894120
42039B3601097K794678K883812J990681Q42145K91475L94575L36814n92261j992435
42030C0550581k655911k025373r31478n16861q34735j066483p71372j60156O48368
42021B2236580J680634K381989J898477M80764l40165L70009J659643K074492
42013C2442423J694894J766696K669724L483203L675891M041431N358043O990953
42005F2123258P754518P771388Q483965J0781308J4035564J7395876K1161888
41998A49507765K5810818K9829933K9691733K2691828R511609o272498k0631559
41991B40139629l0645303l4685691l2743315k6964192k0719650j6192470j3080797
$$ plain form
41984 65108211 55108833 48462321 44431559 41478539 38446382 35190016 32218309 30007086
41976 30007086 28597116 27646583 26824514 26151479 25885442 26129605 26753049 27699362 29114112
41967 29114112 31071929 33398002 35857585 38273925 40305050 41363652 41042834 39541446
41959 39541446 37505054 35552097 34065648 33222321 32953538 32978299 33102786 33414140 34023239
41950 34023239 34810264 35698706 36996116 39078282 41843930 44933921 48464451 53014051
41942 53014051 58759694 65173834 71899860 79502270 88960046 100786153 115155440 132667010
41934 132667010 154386407 181080052 212619777 247656564 282922762 312769042 330594125
41927 330594125 332121777 317954142 293216887 264990821 239778793 222144698 214222303
$$ packed form
41984F5108211r999378o646512m030762k953020l032157l256366k971707k211223
41976C0007086j409970r50533q22069o73035k66037K44163O23444R46313J414750
41967B9114112J957817K326073K459583K416340K031125J058602l20818j501388
41959C9541446k036392j952957j486449q43327k68783K4761J24487L11354O09099
41950C4023239P87025Q88442J297410K082166K765648L089991L530530M549600
41942E3014051N745643O414140O726026P602410R457776J1826107J4369287J7511570
41934A32667010K1719397K6693645L1539725L5036787L5266198K9846280J7825083
41927C30594125J527652j4167635k4737255k8226066k5212028j7634095p922395
$$ plain form
41920 214222303 215648277 223739533 233801447 239912993 236839455 222518844 199013483
41913 199013483 170773277 141975917 115461345 93176239 76195265 64039626 54956163
41906 54956163 47492548 41426555 36968514 33778086 31291933 29415772 28150137 26909539
41898 26909539 25090953 23273851 23009847 25093044 28557562 31777893 34272180 37042920
41890 37042920 41267385 47051517 53632634 60608441 68640392 78840575 91778612 107476932
41882 107476932 126100116 147612415 170013689 188388714 196890552 192415743 176468029
41875 176468029 153634967 128627429 104608778 83365023 65996170 53046508 44189091
41868 44189091 38175581 33455806 29104999 25189773 22171354 20068363 18414984 16956671
$$ packed form
41920B14222303J425974Q091256J0061914O111546l073538j4320611k3505361
41913A99013483k8240206k8797360k6514572k2285106j6980974j2155639r083463
41906E4956163p463615o065993m458041l190428k486153j876161j265635j240598
41898B6909539j818586j817102k64004K083197L464518L220331K494287K770740
41890C7042920M224465N784132O581117O975807Q031951J0200183J2938037J5698320
41882A07476932J8623184K1512299K2401274J8375025Q501838m474809j5947714
41875A76468029k2833062k5007538k4018651k1243755j7368853j2949662q857417
41868D4189091o013510m719775m350807l915226l018419k102991j653379j458313
$$ plain form
41860 16956671 16007244 15932494 16499623 16981109 16846303 16197275 15565319 15413529 15802427
41851 15802427 16359833 16507351 15867985 14630058 13456760 12807502 12331823 11285584 9767311
41842 9767311 9123628 10529332 13325178 15540646 16225165 16475160 17735084 19873130 21726181
41833 21726181 22984198 24485478 26815345 29633989 32473455 35254956 37766289 39501658
41825 39501658 40418795 41078869 41556808 40972704 38763436 35770620 33245478 31246203 28957336
41816 28957336 26328932 24343103 23554789 23292776 22667921 21699519 21008339 20890167 21187527
41807 21187527 21797128 22848160 24469290 26675233 29411320 32478297 35454196 37861985
41799 37861985 39419747 40099680 40043847 39427775 38210234 35986852 32399124 27861969 23591547
$$ packed form
41860A6956671r49427p4750N67129M81486j34806o49028o31956j51790L88898
41851A5802427N57406J47518o39366j237927j173298o49258m75679j046239j518273
41842I767311o43683J405704K795846K215468O84519K49995J259924K138046J853051
41833B1726181J258017J501280K329867K818644K839466K781501K511333J735369
41825C9501658R17137O60074M77939n84104k209268k992816k525142j999275k288867
41816B8957336k628404j985829p88314k62013o24855r68402o91180j18172K97360
41807B1187527O09601J051032J621130K205943K736087L066977K975899K407789
41799C7861985J557762O79933n5833o16072j217541k223382l587728m537155m270422
$$ plain form
41790 23591547 20617839 18959385 18035093 17595902 17746622 18188755 18112369 17045347 15320879
41781 15320879 13448117 11493887 9458673 7785003 6860050 6265783 5256969 3981991
41773 3981991 3506374 4403329 5941767 7028267 7430675 7607797 7764506 7683520 7277530
41764 7277530 6720754 6090423 5358845 4703494 4370992 4250775 4034732 3803314 3975710
41755 3975710 4615687 5272286 5644255 5931021 6309965 6491415 6093565 5182833 4225926
41746 4225926 3756277 4195756 5618554 7499833 9107086 10377005 11947379 14011465
41738 14011465 15707053 16230082 16122297 16653096 18042697 19064651 18525426 16547240 14256373
41729 14256373 12772423 12691381 13937146 15668357 16736087 16752833 16532622 17081706 18364979
$$ packed form
41790B3591547k973708j658454r24292m39191J50720M42133p6386j067022j724468
41781A5320879j872762j954230k035214j673670r24953n94267j008814j274978
41773C981991m75617Q96955J538438J086500M02408J77122J56709q0986m05990
41764G277530n56776o30331p31578o55351l32502j20217k16043k31418J72396
41755C975710O39977O56599L71969K86766L78944J81450l97850r10732r56907
41746D225926m69649M39479J422798J881279J607253J269919J570374K064086
41738A4011465J695588N23029j07785N30799J389601J021954n39225j978186k290867
41729A4256373j483950q1042J245765J731211J067730J6746k20211N49084J283273
$$ plain form
41720 18364979 19561199 20394232 21529779 23479592 25780473 27799467 29936485 33243511
41712 33243511 37828348 42329596 45256031 46307693 45985294 44420858 41299243 36764895
41704 36764895 31709255 27040810 23114552 19924290 17373210 15216471 13152906 11156593
41696 11156593 9444763 8103237 7108792 6656959 6902598 7346794 7181938 6449406 6125121
41687 6125121 6704920 7448740 7552124 7358172 7691187 8563706 9373407 9944840 10460975
41678 10460975 10642713 9992576 8850367 8356252 9233218 11214642 13652349 16028613 17923601
41669 17923601 19257606 20639415 22733494 25188108 26958186 27823992 28751839 30496463
41661 30496463 32725612 34967751 37556219 40871901 44174571 45977364 45425903 42849284
$$ packed form
41720A8364979J196220Q33033J135547J949813K300881K018994K137018L307026
41712C3243511M584837M501248K926435J051662l22399j564436l121615m534348
41704C6764895n055640m668445l926258l190262k551080k156739k063565j996313
41696A1156593j711830j341526r94445m51833K45639M44196j64856p32532l24285
41687F125121N79799P43820J03384j93952L33015Q72519Q09701N71433N16135
41678A0460975J81738o50137j142209m94115Q76966J981424K437707K376264J894988
41669A7923601J334005J381809K094079K454614J770078Q65806R27847J744624
41661C0496463K229149K242139K588468L315682L302670J802793n51461k576619
$$ plain form
41653 42849284 39204048 35450482 32281176 29953097 28293259 26967429 25630784 23866969
41645 23866969 21405532 18543389 15952924 13931489 12256827 10834816 9854126 9135807
41637 9135807 8127378 6925429 6453630 6994680 7360988 6427953 4857890 4219051 4798019
41628 4798019 5480857 5664152 6018266 7097029 8260816 8509496 7689546 6402938 5240394
41619 5240394 4512707 4308936 4412486 4403330 4062206 3452377 2610661 1609686 935699 1140245
41609 1140245 1898875 2118465 1402325 751307 1186631 2215415 2491429 1714530 947679
41600 947679 1000864 1358642 1069305 77752 -837551 -1101700 -790823 -191779 572487 1403561
41590 1403561 2098153 2559553 2925878 3305533 3560253 3582071 3658855 4231733 5234905 5957811
$$ packed form
41653D2849284l645236l753566l169306k328079j659838j325830j336645j763815
41645B3866969k461437k862143k590465k021435j674662j422011r80690p18319
41637I135807j008429j201949m71799N41050L66308r33035j570063o38839N78968
41628D798019O82838J83295L54114J078763J163787K48680q19950j286608j162544
41619E240394p27687k03771J03550r156l41124o09829q41716j000975o73987K04546
41609A140245P58630K19590p16140o51018M35324J028784K76014p76899p66851
41600I47679N3185L57778k89337r91553r15303k64149L10877N99044P64266Q31074
41590A403561O94592M61400L66325L79655K54720K1818P6784N72878J003172P22906
$$ plain form
41580 5957811 5744658 4702130 3584887 3091487 3379736 4124615 4850630 5243508 5299220
41571 5299220 5226725 5223197 5410654 5921516 6788441 7677396 8018310 7604356 6865744 6391080
41561 6391080 6443393 7139705 8680478 10906764 12919781 13831706 13900949 14279813 15448744
41552 15448744 16463628 16107860 14410829 12642769 12029919 12791133 14245467 15495172
41544 15495172 16015122 15805618 15034090 13589841 11278443 8574442 6735016 6621774 7514391
41535 7514391 7681599 6315001 4428500 3494151 3577556 3438864 2388160 1289497 1360505
41526 1360505 2528975 3612953 3859797 3571344 3236957 2858525 2404065 2191137 2312782
41517 2312782 2261578 1739264 1360711 1818796 2721445 3129676 3038005 3318419 4157155 4592657
$$ packed form
41580E957811k13153j042528j117243m93400K88249P44879P26015L92878N5712
41571E299220p2495l528J87457N10862Q66925Q88955L40914m13954p38612m74664
41561F391080N2313O96312J540773K226286K013017R11925O9243L78864J168931
41552A5448744J014884l55768j697031j768060o12850P61214J454334J249705
41544A5495172N19950k09504p71528j444249k311398k704001j839426j13242Q92617
41535G514391J67208j366598j886501r34349Q3405j38692j050704j098663P1008
41526A360505J168470J083978K46844k88453l34387l78432m54460k12928J21645
41517B312782n1204n22314l78553M58085R02649M08231r1671K80414Q38736M35502
$$ plain form
41507 4592657 3949579 2816247 2075899 1770486 1625700 2028535 3511407 5525196 6669048
41498 6669048 6268774 5098301 4360012 4427630 4813795 5000526 4952921 4904606 4906539 4745392
41488 4745392 4308600 3861654 3757542 3939208 4024892 3907598 3923502 4303600 4791947 4990498
41478 4990498 4787303 4261961 3471644 2532987 1634698 821960 109712 -106946 683704
41469 683704 2189762 3303626 3448285 3304406 3624315 3988307 3559557 2523456 1770712
41460 1770712 1519540 1340245 1290453 1785319 2398644 2170704 1360474 1498625 3105093
41451 3105093 4621711 4489616 3242635 2498470 2725519 3221153 3701887 4548386 5666818
41442 5666818 6375231 6522664 6675876 7013584 6998037 6445698 6030979 6238821 6528582 6147213
$$ packed form
41507D592657o43078j133332p40348l05413j44786M02835J482872K013789J143852
41498F669048m00274j170473p38289O7618L86165J86731m7605m8315J933j61147
41488D745392m36792m46946j04112J81666Q5684j17294J5904L80098M88347J98551
41478D990498k03195n25342p90317r38657q98289q12738p12248k16658P90650
41469F83704J506058J113864J44659j43879L19909L63992m28750j036101p52744
41460A770712k51172j79295m9792M94866O13325k27940q10230J38151J606468
41451C105093J516618j32095j246981p44165K27049M95634M80734Q46499J118432
41442E666818P08413J47433J53212L37708j5547n52339m14719K07842K89761l81369
$$ plain form
41432 6147213 5285248 4758097 4767626 4626430 3785202 2674464 2230338 2727517 3432901 3613348
41422 3613348 3634068 4520917 6350336 7743130 7471909 6083197 5186476 5414498 5959877
41413 5959877 6078128 6085998 6586205 7516484 8448626 9261789 10047823 10774071 11437244 12159231
41403 12159231 12770937 12701618 11664366 10118758 8768564 8003699 8058003 9072980 10543336
41394 10543336 11343890 10975454 10279236 10216164 10453434 10030939 9005500 8365664 8464023
41385 8464023 8606025 8291694 7929261 8100504 8877937 10028919 11161674 11556725 10674973
41376 10674973 9043157 7849635 7452624 7111807 6399929 5879468 5958086 6082206 5711297
41367 5711297 5218114 5102184 5114772 4952668 5051796 5798210 6649668 7012196 7322073 8151560
$$ packed form
41432F147213q61965n27151R529j41196q41228j110738m44126M97179P05384J80447
41422C613348K0720Q86849J829419J392794k71221j388712q96721K28022N45379
41413E959877J18251P870N00207R30279R32142Q13163P86034P26248O63173P21987
41403A2159231O11706o9319j037252j545608j350194p64865N4304J014977J470356
41394A0543336Q00554l68436o96218o3072K37270m22495j025439o39836R8359
41385H464023J42002l14331l62433J71243P77433J150982J132755L95051q81752
41376A0674973j631816j193522l97011l40817p11878n20461P8618J24120l70909
41367E711297m93183j15930J2588j62104R9128P46414Q51458L62528L09877Q29487
$$ plain form
41357 8151560 8853717 8422003 7301348 6908335 7500779 7981723 7868009 7940463 8590080
41348 8590080 8964031 8422762 7671161 7666295 8328067 9059294 9689256 10152012 10034653 9278580
41338 9278580 8654516 8726785 8988377 8849980 8777083 9397828 10086946 9736041 8663840 8426329
41328 8426329 9655940 11275799 12111479 12200254 12064245 11643752 10638623 9292781 8134891
41319 8134891 7230868 6216613 4919426 3610835 2773346 2787612 3615607 4642527 5138437
41310 5138437 5065577 5101983 5649526 6198438 6019266 5169863 4384209 4159326 4410881 4950548
41300 4950548 5810959 6941385 7880060 7980346 6988453 5415488 4328926 4565224 5935600
41291 5935600 7309243 7690022 7129478 6397721 5971394 5763921 5740126 6146261 6869577
$$ packed form
41357H151560P02157m31714j120655l93013N92444M80944j13714P2454O49617
41348H590080L73951n41269p51601m866O61772P31227O29962M62756j17359p56073
41338I278580o24064P2269K61592j38397p2897O20745O89118l50905j072201k37511
41328H426329J229611J619859Q35680Q8775j36009m20493j005129j345842j157890
41319H134891r04023j014255j297187j308591q37489J4266Q27995J026920M95910
41310E138437p2860L6406N47543N48912j79172q49403p85654k24883K51555N39667
41300D950548Q60411J130426R38675J00286r91893j572965j086562K36298J370376
41291E935600J373643L80779n60544p31757m26327k07473k3795M06135P23316
$$ plain form
41282 6869577 7126600 6328466 4964258 4026765 3683667 3186497 2182034 1396632 1604817
41273 1604817 2447458 2875189 2501536 1899917 1627746 1551809 1283995 848336 673005 1119514
41263 1119514 2137533 3276613 4095478 4700333 5631509 6886092 7422757 6361926 4529569
41254 4529569 3852933 4994871 6494284 6709016 5760348 4886057 4645914 4700200 4818084
41245 4818084 5020413 4968681 4267413 3328131 2973336 3177317 3182879 2933842 3261023 4314082
41235 4314082 4953158 4361881 3315834 3016836 3447105 3844143 4161045 4871342 5690367
41226 5690367 5825710 5536102 6125888 7922749 9345321 8753056 6496483 4285089 3017927
41217 3017927 2200365 1304268 651452 669021 1050916 1187576 1013890 929866 1093635 1247676
$$ packed form
41282F869577K57023p98134j364208r37493l43098m97170j004463p85402K08185
41273A604817Q42641M27731l73653o01619k72171p5937k67814m35659j75331M46509
41263A119514J018019J139080Q18865O04855R31176J254583N36665j060831j832357
41254D529569o76636J141938J499413K14732r48668q74291k40143N4286J17884
41245D818084K02329n1732p01268r39282l54795K03981N562k49037L27181J053059
41235D314082O39076n91277j046047k98998M30269L97038L16902P10297Q19025
41226E690367J35343k89608N89786J796861J422572n92265k256573k211394j267162
41217C017927q17562q96097o52816J7569L81895J36660j73686q4024J63769J54041
$$ plain form
41207 1247676 1187854 1045845 1078225 1396649 1875050 2123679 1668088 475891 -732455
41198 -732455 -1066699 -422917 477762 1072376 1558851 2320511 3207076 3843569 4404323 5515672
41188 5515672 7319832 9023512 9575885 8654917 6900463 5293449 4390730 4110716 4149695
41179 4149695 4437592 5027348 5637656 5666782 4843800 3660023 2953933 3170683 4111737
41170 4111737 5215729 5978366 6340315 6808204 7933255 9526413 10728811 11059870 10965631
41161 10965631 10982265 10806794 9750350 7823404 5783204 4281650 3514798 3520162 4160007
41152 4160007 4866787 5044576 4761035 4509002 4344564 3918985 3367187 3386882 4197599 5065374
41142 5065374 5157703 4358452 3041613 1650943 793290 1111349 2589733 4413576 5885520
$$ packed form
41207A247676n9822j42009L2380L18424M78401K48629m55591j192197j208346
41198g32455l34244O43782R00679N94614M86475P61660Q86565O36493N60754J111349
41188E515672J804160J703680N52373r20968j754454j607014r02719k80014L8979
41179D149695K87897N89756O10308K9126q22982j183777p06090K16750R41054
41170D111737J103992P62637L61949M67889J125051J593158J202398L31059r4239
41161A0965631J6634j75471j056444j926946k040200j501554p66852N364O39845
41152D160007P06780J77789k83541k52033j64438m25579n51798J9695Q10717Q67775
41142E065374R2329p99251j316839j390670q57653L18059J478384J823843J471944
$$ plain form
41133 5885520 7040366 8010852 8372512 7735024 6599034 5921489 5936823 5970333 5416662
41124 5416662 4453771 3713360 3571569 3914091 4468440 5218047 6356734 7779869 8883198
41115 8883198 9213887 9142908 9376564 9874789 9897295 9185896 8362669 7897962 7423651 6516234
41105 6516234 5502517 4894885 4532340 3931328 3148986 2682296 2716541 2975319 3154080
41096 3154080 3131492 2963597 2956030 3431494 4170842 4530710 4419230 4580172 5460270 6402893
41086 6402893 6557059 6003187 5278427 4361811 3017863 1729984 1314664 1785846 2444297
41077 2444297 2953071 3560336 4424587 5480122 6797021 8312717 9404330 9527496 9087389
41068 9087389 8855383 8745846 8080846 6874359 5872274 5447373 5429759 5840227 6662266
$$ packed form
41133E885520J154846R70486L61660o37488j135990o77545J5334L3510n53671
41124E416662r62891p40411j41791L42522N54349P49607J138687J423135J103329
41115H883198L30689p0979K33656M98225K2506p11399q23227m64707m74311r07417
41105F516234j013717o07632l62545o01012p82342m66690L4245K58778J78761
41096C154080k2588j67895p567M75464P39348L59868j11480J60942Q80098R42623
41086F402893J54166n53872p24760r16616j343948j287879m15320M71182O58451
41077B444297N08774O07265Q64251J055535J316899J515696J091613J23166m40107
41068I087389k32006j09537o65000j206487j002085m24901j7614M10468Q22039
$$ plain form
41059 6662266 7041833 6047368 4286540 3406570 3781427 4078576 3451694 2708127 2735874
41050 2735874 3177006 3439068 3772858 4479436 5162835 5639783 6511105 7932547 8916109
41041 8916109 8833312 8485441 8565050 8242216 6702881 5023899 4767407 5422525 5102165
41032 5102165 3426600 1908065 1577288 1954047 2440138 3038061 3395350 2730415 1213385
41023 1213385 46218 -347848 -891062 -2024331 -2658850 -1807925 -153531 961936 1202130
41014 1202130 957346 246604 -980296 -1998143 -1899399 -823484 270134 861138 1127014
41005 1127014 1147105 688366 -196207 -1020788 -1407281 -1324567 -845747 -153824 265040 -34248
40995 -34248 -848345 -1469585 -1488497 -1105197 -641121 -135447 492723 1220578 1990554 2769503
$$ packed form
41059F662266L79567r94465j760828q79970L74857K97149o26882p43567K7747
41050B735874M41132K62062L33790P06578O83399M76948Q71322J421442R83562
41041H916109q2797l47871P9609l22834j539335j678982k56492O55118l20360
41032E102165j675565j518535l30777L76759M86091N97923L57289o64935j517030
41023A213385j167167l94066n43214j133269o34519Q50925J654394J115467K40194
41014A202130k44784p10742j226900j017847R8744J075915J093618N91004K65876
41005A127014K0091m58739q84573q24581l86493Q2714M78820O91923M18864k99288
40995c4248q14097o21240j8912L83300M64076N05674O28170P27855P69976P78949
$$ plain form
40985 2769503 3437517 3783268 3669901 3103740 2178553 1092200 164247 -305316 -155519
40976 -155519 660766 1925717 2833604 2316936 281850 -1718113 -1787045 230110 2565887
40967 2565887 3576071 3309453 2729793 2148444 1248490 281790 178365 1217336 2357071
40958 2357071 2417813 1522846 815907 955250 1479090 1688116 1577033 1575544 1739947 1675604
40948 1675604 1184208 574958 226938 121046 -32423 -388597 -865516 -1303091 -1512861
40939 -1512861 -1258923 -460529 545197 1178812 1195405 941458 894717 1087764 1204992 1160418
40929 1160418 1248710 1630506 1985078 1963645 1824957 2229540 3335914 4433534 4714532
40920 4714532 4240152 3852947 4162655 4919668 5512176 5813210 6203889 6805307 7078662
$$ packed form
40985B769503O68014L45751j13367n66161r25187j086353r27953m69563J49797
40976a55519Q16285J264951R07887n16668k035086j999963o8932K017155K335777
40967B565887J010184k66618n79660n81349q99954r66700j03425J038971J139735
40958B357071O0742q94967p06939J39343N23840K09026j11083j489J64403o4343
40948A675604m91396o09250l48020j05892j53469l56174m76919m37575k09770
40939a512861K53938P98394J005726O33615J6593k53947m6741J93047J17228m4574
40929A160418Q8292L81796L54572k1433j38688M04583J106374J097620K80998
40920D714532m74380l87205L09708P57013N92508L01034L90679O01418K73355
$$ plain form
40911 7078662 6438616 5092323 3983387 3918607 4932976 6431842 7667126 8089003 7595893
40902 7595893 6580956 5490984 4311387 2856980 1569125 1321781 2072590 2457471 1517924
40893 1517924 317458 785073 3122900 5501666 6478070 6578662 7031080 7999028 8892613
40884 8892613 9611170 10397367 10856857 10233242 8688449 7438615 7363053 8023462 8282810
40875 8282810 7517689 6054013 4688012 3919785 3521795 2851712 1655500 372516 -491876
40866 -491876 -951584 -1176435 -930673 45945 1292378 1923452 1707787 1303155 1322238 1649988
40856 1649988 1832181 1702808 1413467 1173341 1181953 1588171 2312081 3015682 3347110 3164885
40846 3164885 2582709 1936085 1642673 1935431 2743081 3815594 4748482 4934506 4039282
$$ packed form
40911G078662o40046j346293j108936o4780J014369J498866J235284M21877m93110
40902G595893j014937j089972j179597j454407j287855k47344P50809L84881r39547
40893A517924j200466M67615K337827K378766R76404J00592M52418R67948Q93585
40884H892613P18557P86197M59490o23615j544793j249834p5562O60409K59348
40875H282810p65121j463676j366001p68227l97990o70083j196212j282984q64392
40866d91876m59708k24851K45762R76618J246433O31074k15665m04632J9083L27750
40856A649988J82193j29373k89341k40126Q612M06218P23910P03601L31428j82225
40846C164885n82176o46624k93412K92758Q07650J072513R32888J86024q95224
$$ plain form
40837 4039282 2746637 2388686 3334867 4342866 4206860 3519382 3896992 5840047 8375236
40828 8375236 10550755 12126489 12886520 12582362 11767209 11425650 11379882 10289930 7807551
40819 7807551 5510022 4842415 5189926 5057530 4328968 4122179 4912757 6064127 7070750
40810 7070750 8184085 9740379 11694084 13914850 16309948 18602830 20506617 22065092
40802 22065092 23320064 23777660 22812224 20563945 17873883 15329239 12881548 10401350
40794 10401350 8092188 6270910 5106451 4578145 4378193 3973203 3143676 2325052 2006948
40785 2006948 1987180 1739613 1361585 1507020 2337909 3118026 3030457 2050045 926343 559882
40775 559882 1309204 2579509 3220404 2708646 1782038 1496660 1903492 2215827 2047180
$$ packed form
40837D039282j292645l57951R46181J007999j36006o87478L77610J943055K535189
40828H375236K175519J575734P60031l04158q15153l41559m5768j089952k482379
40819G807551k297529o67607L47511j32396p28562k06789P90578J151370J006623
40810G070750J113335J556294J953705K220766K395098K292882J903787J558475
40802B2065092J254972M57596r65436k248279k690062k544644k447691k480198
40794A0401350k309162j821278j164459n28306j99952m04990q29527q18624l18104
40785B006948j9768k47567l78028J45435Q30889P80117q7569r80412j123702l66461
40775E59882P49322J270305O40895n11758r26608k85378M06832L12335j68647
$$ plain form
40766 2047180 1735239 1518355 1227608 944034 1185437 2106146 3100872 3573251 3678774
40757 3678774 4007233 4860734 6043753 7045367 7321037 6778035 6071611 5984596 6420808
40748 6420808 6505470 5802189 4862274 4353044 4256148 4328235 4828632 6203977 8266497 10163419
40738 10163419 11144263 11144453 10705691 10470397 10650105 10906105 10824750 10412139 9910638 9299761
40728 9299761 8361034 7126382 5844549 4636071 3652838 3354686 3953554 4760055 4911220
40719 4911220 4628176 4747362 5055638 4411143 2807392 1845043 2390379 3113278 2467083
40710 2467083 984507 211991 221915 -190536 -1288487 -2042642 -1955284 -1725590 -1882069 -2067272
40700 -2067272 -2032747 -2177275 -2632920 -2819847 -2417365 -1907156 -1650690 -1249668 -372924 545089
$$ packed form
40766B047180l11941k16884k90747k83574K41403R20709R94726M72379J05523
40757C678774L28459Q53501J183019J001614K75670n43002p06424q7015M36212
40748F420808Q4662p03281r39915n09230r6896P2087N00397J375345K062520J896922
40738A0163419R80844J90m38762k35294J79708K56000q1355m12611n01501o10877
40728I299761r38727j234652j281833j208478r83233k98152N98868Q06501J51165
40719D911220k83044J19186L08276o44495j603751r62349N45336P22899o46195
40710B467083j482576p72516R924m12451j097951p54155Q7358K29694j56479j85203
40700b067272L4525j44528m55645j86927M02482N10209K56466M01022Q76744R18013
$$ plain form
40690 545089 1042023 1380095 1913505 2333126 2265930 2078395 2268510 2487328 2063354 1226829
40680 1226829 838931 957000 672352 -379532 -1245160 -928958 168216 767080 390137
40671 390137 -125702 212645 1414426 2701767 3477292 3790233 3984583 4190333 4240636
40662 4240636 3977630 3561338 3433157 3863454 4492954 4530563 3642866 2520706 2216835
40653 2216835 2922581 3781917 4021962 3859633 4043109 4861594 5976971 6966715 7589235
40644 7589235 7650037 7074120 6164719 5487869 5416254 5877363 6420124 6404678 5427440 3880733
40634 3880733 2832348 2941883 3694499 4105506 3912782 3562433 3328947 3185469 3357964
40625 3357964 4103780 4885522 4673007 3313882 1783341 785464 4348 -786032 -814082
$$ packed form
40690E45089M96934L38072N33410M19621o7196j87535J90115K18818m23974q36525
40680A226829l87898J18069k84648j051884q65628L16202J097174N98864l76943
40671C90137n15839L38347J201781J287341P75525L12941J94350K05750N0303
40662D240636k63006m16292j28181M30297O29500L7609q87697j122160l03871
40653B216835P05746Q59336K40045j62329J83476Q18485J115377R89744O22520
40644G589235O0802n75917r09401o76850p1615M61109N42761j5446r77238j546707
40634C880733j048385J09535P52616M11007j92724l50349k33486j43478J72495
40625C357964P45816P81742k12515j359125j530541r97877p81116p90380k8050
$$ plain form
40616 -814082 644132 2929631 4602586 5024407 4591517 3787617 2894431 2420857 2863484
40607 2863484 3976187 5003907 5654734 6115090 6128872 5023255 2979462 1424659 1530106
40598 1530106 2811600 3810533 3835522 3448620 3404674 3710123 3843411 3551529 3233124 3582868
40588 3582868 4828020 6262339 6700537 5605562 3705265 2311111 2080504 2635664 3304733
40579 3304733 3871200 4457303 5004093 5251547 5164012 5002179 4886678 4619279 4122789 3755189
40569 3755189 3890154 4421717 5031419 5702515 6482205 6922636 6428472 5186157 4074834
40560 4074834 3511831 3066144 2409803 1832407 1406672 532977 -962937 -2046595 -1739130
40551 -1739130 -588675 192831 611967 1632337 3209786 4005594 3311726 2019158 1214356
$$ packed form
40616h14082J458214K285499J672955M21821m32890q03900q93186m73574M42627
40607B863484J112703J027720O50827M60356J3782j105617k043793j554803J05447
40598A530106J281494R98933K4989l86902m3946L05449J33288k91882l18405L49744
40588C582868J245152J434319M38198j094975j900297j394154k30607N55160O69069
40579C304733N66467N86103N46790K47454q7535j61833j15501k67399m96490l67600
40569C755189J34965N31563O09702O71096P79690M40431m94164j242315j111323
40560D074834n63003m45687o56341n77396m25735q73695j495914j083658L07465
40551a739130J150455P81506M19136J020370J577449P95808o93868j292568q04802
$$ plain form
40542 1214356 905335 720401 854712 1518857 2196995 2286378 1954467 1654324 1303484 681461
40532 681461 179603 342181 961163 1379912 1462414 1541582 1608868 1325496 795775 637592
40522 637592 1188746 2120121 2878982 3168039 3055015 2913213 3091724 3388721 3181039 2370406
40512 2370406 1681807 1575691 1530379 1092318 877925 1470699 1987757 1189854 -319665
40503 -319665 -653803 549673 1547730 1089888 -42740 -736981 -1138879 -1514812 -1033605
40494 -1033605 851978 2914166 3665982 3618537 4347464 5796707 6327738 5385915 4335626
40485 4335626 4284086 4640557 4488418 4079209 4088329 4351725 4277654 3870867 3516792 3241342
40475 3241342 2938417 2899602 3353547 3821581 3711776 3297864 3275332 3483654 3014278 1735283
$$ packed form
40542A214356l09021j84934J34311O64145O78138Q9383l31911l00143l50840o22023
40532F81461n01858J62578O18982M18749Q2502P9168O7286k83372n29721j58183
40522F37592N51154R31375P58861K89057j13024j41802J78511K96997k07682q10633
40512B370406o88599j06116m5312m38061k14393N92774N17058p97903j509519
40503c19665l34138J203476R98057m57842j132628o94241m01898l75933M81207
40494a033605J885583K062188P51816m7445P28927J449243N31031r41823j050289
40485D335626n1540L56471j52139m09209R120K63396p4071m06787l54075k75450
40475C241342l02925l8815M53945M68034j09805m13912k2532K08322m69376j278995
$$ plain form
40465 1735283 795242 1133727 2176853 2697558 2570129 2847027 4094234 5408472 5491596
40456 5491596 4301141 3130634 3116202 4050831 4783538 4556973 3776231 3507451 4307170
40447 4307170 5594469 6270845 5985571 5562090 5943824 6928769 7392505 6729200 5533912
40438 5533912 4688432 4324694 4107062 4105731 4744965 5962361 6952353 6879121 5615692 3813101
40428 3813101 2464463 2256509 2991984 3712647 3739073 3524718 4096092 5700457 7476494
40419 7476494 8506381 8691333 8428798 7949104 7347569 6913071 6922597 7169292 7056093 6238567
40409 6238567 5014246 4025066 3636686 3615544 3401865 2716833 1852892 1296795 1169106
40400 1169106 1211308 1237992 1305515 1393929 1243961 727246 202336 230963 924623 1744679
$$ packed form
40465A735283r40041L38485J043126N20705j27429K76898J247207J314238Q3124
40456E491596j190455j170507j4432R34629P32707k26565p80742k68780P99719
40447D307170J287299O76376k85274m23481L81734R84945M63736o63305j195288
40438E533912q45480l63738k17632j331O39234J217396R89992p3232j263429j802591
40428C813101j348638k07954P35475P20663K6426k14355N71374J604365J776037
40419G476494J029887J84952k62535m79694o01535m34498R526K46695j13199q17526
40409F238567j224321r89180l88380k1142k13679o85032q63941n56097j27689
40400A169106M2202K6684O7523Q8414j49968n16715n24910K8627O93660Q20056
$$ plain form
40390 1744679 2055145 1811719 1557438 1704968 2036951 2123771 2021805 2119536 2368607 2289257
40380 2289257 1912704 2040123 3103156 4326711 4659380 4151897 3751877 4031317 4787069
40371 4787069 5611834 6127119 5941625 5241962 5179895 6640286 8718035 9549502 8713301
40362 8713301 7581220 7065515 6412677 4863853 3219560 2741218 3393876 4194859 4632562
40353 4632562 4808981 4815841 4940396 5907021 7869156 9638489 9993842 9349375 8976263
40344 8976263 8913050 7992941 5891713 3763994 2529839 1708932 488990 -949159 -1761917
40335 -1761917 -1455301 -75574 2045809 4215736 5460303 5227811 3923920 2544662
40327 2544662 1917646 2303249 3373912 4437103 4939942 4864061 4500563 4009396 3513384
$$ packed form
40390A744679L10466k43426k54281J47530L31983Q6820j01966R7731K49071p9350
40380B289257l76553J27419J063033J223555L32669n07483m00020K79440P55752
40371D787069Q24765N15285j85494o99663o2067J460391K077749Q31467q36201
40362H713301j132081n15705o52838j548824j644293m78342O52658Q00983M37703
40353D632562J76419O860J24555R66625J962135J769333L55353o44467l73112
40344H976263o3213r20109k101228k127719j234155q20907j219942j438149q12758
40335a761917L06616J379727K121383K169927J244567k32492j303891j379258
40327B544662o27016L85603J070663J063191N02839p5881l63498m91167m96012
$$ plain form
40318 3513384 3373260 3824775 4466497 4678285 4457756 4246134 4056602 3530698 2817252
40309 2817252 2510518 2581661 2298486 1531022 1229798 2067717 3371926 4069141 4097962 4171085
40299 4171085 4582374 4996933 5164715 5149752 4968719 4588142 4214982 4053811 3781614 2790494
40289 2790494 1102207 -361564 -690911 25114 892672 1333001 1663151 2357307 3080485
40280 3080485 3093560 2604496 2826057 4194437 5381630 5029313 3831786 3575412 4375098
40271 4375098 4437164 2832727 971859 570969 1398612 2037734 1940765 1602457 1340946
40262 1340946 1066818 934010 1213271 1676269 1890059 1921214 2042802 2046190 1652239 1340751
40252 1340751 1845271 2905961 3424148 2928247 2095737 1692584 1734925 1927003 2279393
$$ packed form
40318C513384j40124M51515O41722K11788k20529k11622j89532n25904p13446
40309B817252l06734P1143k83175p67464l01224Q37919J304209O97215K8821P3123
40299D171085M11289M14559J67782j4963j81033l80577l73160j61171k72197r91120
40289B790494j688287j463771l29347P16025Q67558M40329L30150O94156P23178
40280C080485J3075m89064K21561J368380J187193l52317j197527k56374P99686
40271D375098O2066j604437j860868m00890Q27643O39122r6969l38308k61511
40262A340946k74128j32808K79261M62998K13790L1155J21588L388l93951l11488
40252A340751N04520J060690N18187m95901q32510m03153M2341J92078L52390
$$ plain form
40243 2279393 2939469 3808330 4600491 5061869 5069591 4787987 4707838 5190720 5962552 6364062
40233 6364062 6093248 5441363 4885504 4717383 4905971 5008197 4448177 3290480 2472654
40224 2472654 2749420 3644528 4078612 3850817 3730305 4105880 4405313 4116722 3645890
40215 3645890 3669803 4095159 4184972 3556444 2671319 2328158 2847443 3809888 4572701 4961730
40205 4961730 5310076 5889548 6650414 7536984 8521764 9124355 8555123 6806005 4992717
40196 4992717 4001732 3393691 2421658 1526982 1743513 2989208 4151835 4738298 5231503
40187 5231503 5787826 5825248 5152503 4368749 3800154 3096195 2229807 1791910 1849230 1669681
40177 1669681 1180266 1479542 3016267 4387238 4138065 2914152 2485130 3181518 3699351
$$ packed form
40243B279393O60076Q68861P92161M61378P722k81604q0149M82882P71832M01510
40233F364062k70814o51885n55859j68121J88588J02226n60020j157697q17826
40224B472654K76766Q95108M34084k27795j20512L75575K99433k88591m70832
40215C645890K3913M25356Q9813o28528q85125l43161N19285R62445P62813L89029
40205D961730L48346N79472P60866Q86570R84780O02591n69232j749118j813288
40196D992717r90985o08041r72033q94676K16531J245695J162627N86463M93205
40187E231503N56323L7422o72745p83754n68595p03959q66388m37897N7320j79549
40177A669681m89415K99276J536725J370971k49173j223913m29022O96388N17833
$$ plain form
40168 3699351 3213011 2311045 1763013 1597968 1733598 2467286 3781050 4883310 5052610
40159 5052610 4523801 4049260 3885948 3699805 3326802 3144444 3561141 4409762 5093378
40150 5093378 5291726 5282561 5430909 5560096 5131687 4010801 2744942 2023203 2094016 2747066
40140 2747066 3616244 4440897 5202134 5949654 6336378 5630111 3641190 1357429 -19770
40131 -19770 -499940 -959080 -1496657 -1218133 157305 1607933 2204045 2161748 1919884 1234224
40121 1234224 36603 -769548 -452744 326439 542659 437829 942757 1976463 2635747
40112 2635747 2786944 3125118 3743061 3970975 3733941 3806583 4483236 5180222 5686373 6635073
40102 6635073 8224481 9539272 9820960 9537741 9473888 9516412 9158491 8619006 8558172 8969210
$$ packed form
40168C699351m86340r01966n48032j65045J35630P33688J313764J102260J69300
40159E052610n28809m74541j63312j86143l73003j82358M16697Q48621O83616
40150E093378J98348r165J48348J29187m28409j120886j265859p21739P0813O53050
40140B747066Q69178Q24653P61237P47520L86724p06267j988921k283761j377199
40131a9770m80170m59140n37577K78524J375438J450628N96112m2297k41864o85660
40121A234224j197621q06151L16804P79183K16220j04830N04928J033706O59284
40112B635747J51197L38174O17943K27914k37034P2642O76653O96986N06151R48700
40102F635073J589408J314791K81688k83219o3853M2524l57921n39485o0834M11038
$$ plain form
40092 8969210 9151454 8710843 7975861 7389496 6908049 6077883 4531626 2483274 837862
40083 837862 566824 1722853 3209635 3738094 2964687 1649073 835695 888276 1165344
40074 1165344 731467 -386258 -897394 287830 2458571 3696136 3119911 1756541 954317
40065 954317 810252 698309 566899 854093 1528861 2074718 2290969 2390248 2324528 1677668
40055 1677668 384936 -903207 -1380673 -784811 492820 1742753 2373460 2281722 1890079
40046 1890079 1720388 1964206 2544092 3386366 4362207 5094610 5200916 4791410 4461928
40037 4461928 4655642 5153093 5292902 4661796 3534619 2643578 2521348 3110480 4031613
40028 4031613 5057699 6095733 6823385 6764135 5863556 4695647 3921899 3750543 3998476
$$ packed form
40092H969210J82244m40611p34982n86365m81447q30166j546257k048352j645412
40083H37862k71038J156029J486782N28459p73407j315614q13378N2581K77068
40074A165344m33877j117725n11136J185224K170741J237565n76225j363370q02224
40065I54317j44065j11943j31410K87194O74768N45857K16251R9279o5720o46860
40055A677668j292732j288143m77466N95862J277631J249933O30707r1738l91643
40046A890079j69691K43818N79886Q42274R75841P32403J06306m09506l29482
40037D461928J93714M97451J39809o31106j127177q91041j22230N89132R21133
40028D031613J026086J038034P27652n9250r00579j167909p73748j71356K47933
$$ plain form
40019 3998476 4339597 4325446 3585191 2378845 1629290 1912817 2593340 2509598 1521224 818344
40009 818344 1474424 3105510 4320701 4281212 3429214 2746152 2714916 3158875 3725725 4126823
39999 4126823 4037463 3249737 2057208 1120447 743702 586693 304549 120134 442328
39990 442328 1251254 2247235 3253129 3982848 3823645 2589568 1229539 914288 1518013
39981 1518013 1930342 1837404 2052143 2848902 3255189 2678428 2108918 2692215 3935543
39972 3935543 4503137 4245276 4176252 4682490 5027994 4735840 4330758 4357596 4564565 4571786
39962 4571786 4716855 5638308 7270066 8660752 8783506 7491564 5804723 5135748 5938760
39953 5938760 7216024 7671414 7164191 6568430 6394390 6230401 5589749 4656663 3990284
$$ packed form
40019C998476L41121j4151p40255j206346p49555K83527O80523q3742r88374p02880
40009H18344O56080J631086J215191l9489q51998o83062l1236M43959N66850M01098
39999D126823q9360p87726j192529r36761l76745j57009k82144j84415L22194
39990D42328Q08926R95981J005894P29719j59203j234077j360029l15251O03725
39981A518013M12329r2938K14739P96759M06287n76761n69510N83297J243328
39972C935543N67594k57861o9024N06238L45504k92154m05082K6838K06969P221
39962D571786J45069R21453J631758J390686J22754j291942j686841o68975Q03012
39953E938760J277264M55390n07223n95761j74040j63989o40652r33086o66379
$$ plain form
39944 3990284 3988154 4797373 6247788 7689549 8395380 8331696 8062147 7748647 6889549 5357360
39934 5357360 4001761 3642513 3975362 4148492 4047220 4234605 4804915 5140068 4916816
39925 4916816 4638309 4853059 5361385 5583786 5370342 5018523 4656210 4018440 2869171
39916 2869171 1404718 181274 -260809 219514 1160526 1729432 1429753 645033 254022
39907 254022 636320 1343088 1891843 2496300 3602956 4964281 5748296 5558938 4828131
39898 4828131 4137371 3702487 3664223 4210539 4993634 5016702 3758246 2083415 1371698
39889 1371698 1899397 2707910 2972975 2822104 2721643 2708048 2533338 2182126 1958647 2243088
39879 2243088 3234750 4682968 5833447 5952966 5014813 3656837 2476008 1640470 1135732
$$ packed form
39944C990284k130Q09219J450415J441761P05831o3684k69549l13500q59098j532189
39934E357360j355599l59248L32849J73130j01272J87385N70310L35153k23252
39925D916816k78507K14750N08326K22401k13444l51819l62313o37770j149269
39916B869171j464453j223444m42083M80323R41012N68906k99679p84720l91011
39907B54022L82298P06768N48755O04457J106656J361325P84015j89358p30807
39898D828131o90760m34884l8264N46316P83095K3068j258456j674831p11717
39889A371698N27699Q08513K65065j50871j00461j3595j74710l51212k23479K84441
39879B243088R91662J448218J150479J19519r38153j357976j180829q35538n04738
$$ plain form
39870 1135732 972395 1059306 1204429 1325258 1396697 1247706 810399 526008 960413 1916187
39860 1916187 2485076 2214067 1715187 1798513 2418923 2848663 2587158 1764275 880618 431687
39850 431687 596972 1106971 1608348 2199383 3218464 4439934 5071844 4833616 4428171
39841 4428171 4474677 4530090 3833605 2630314 1969688 2313170 3047924 3416789 3348966 3257660
39831 3257660 3467197 3971725 4448318 4463049 3932714 3333707 3147400 3198501 2930327 2253346
39821 2253346 1662869 1534726 1799456 2364105 3307148 4441865 5173999 5156085 4786930
39812 4786930 4712168 4999438 5101613 4539953 3394813 2185680 1444459 1349047 1615074
39803 1615074 1767316 1619134 1437177 1529774 1743175 1563246 787052 -69948 -256055 321376
$$ packed form
39870A135732j63337Q6911J45123J20829P1439j48991m37307k84391M34405R55774
39860A916187N68889k71009m98880Q3326O20410M29740k61505q22883q83657m48931
39850D31687J65285N09999N01377N91035J019081J221470O31910k38228m05445
39841D428171M6506N5413o96485j203291o60626L43482P34754L68865o7823r1306
39831C257660K09537N04528M76593J4731n30335n99007j86307N1101k68174o76981
39821B253346n90477j28143K64730N64649R43043J134717P32134j7914l69155
39812D786930p4762K87270J02175n61660j145140j209133p41221r5412K66027
39803A615074J52242j48182j81957R2597K13401j79929p76194q57000j86107N77431
$$ plain form
39793 321376 921538 840339 233257 -217985 -273220 -290278 -434532 -327341 270054 932227
39783 932227 1112769 819398 365025 -126941 -482474 -202504 852725 1800989 1592445
39774 1592445 430347 -482007 -595796 -513597 -701569 -720270 -206969 260574 -11360 -779596
39764 -779596 -1387333 -1843826 -2550838 -3282952 -3357291 -2763778 -2297048 -2432259 -2753357 -2707953
39754 -2707953 -2343310 -2010010 -1820034 -1738027 -1837713 -2100937 -2218443 -1939768 -1446431 -1060457
39744 -1060457 -736184 -208844 416913 646487 289400 -156144 -72412 506334 993532 1048111
39734 1048111 921116 950155 1115585 1372230 2054800 3421074 4930820 5621147 5332678
39725 5332678 4981095 5325257 6000902 6190980 5741405 5011664 4049480 2748527 1648464
$$ packed form
39793C21376O00162q1199o07082m51242n5235j7058j44254J07191N97395O62173
39783I32227J80542k93371m54373m91966l55533K79970J055229R48264k08544
39774A592445j162098r12354j13789Q2199j87972j8701N13301M67543k71934p68236
39764g79596o07737m56493p07012p32114p4339N93513M66730j35211l21098M5404
39754b707953L64643L33300J89976Q2007r9686k63224j17506K78675M93337L85974
39744a060457L24273N27340O25757K29574l57087m45544Q3732N78746M87198N4579
39734A048111j26995K9039J65430K56645O82570J366274J509746O90327k88469
39725E332678l51583L44162O75645J90078m49575p29741r62184j300953j100063
$$ plain form
39716 1648464 1628516 2622176 3425154 3111202 2002422 904560 54039 -679012 -1150921
39707 -1150921 -1190028 -1091764 -1198204 -1264635 -888544 -297617 12720 213836 886106 1919743
39697 1919743 2590003 2792165 3202181 3934054 4112925 3403850 2975076 3934797 5466828
39688 5466828 5735245 4419722 3158591 3324206 4390925 4927181 4395854 3361805 2431826
39679 2431826 1687368 1031084 554759 443174 730268 1241294 1746303 2169536 2582836
39670 2582836 2927953 2935217 2562718 2320481 2715799 3430007 3562261 2791177 1797337 1327467
39660 1327467 1291155 1066760 321713 -775884 -1828611 -2378913 -2102155 -1144593 -35158
39651 -35158 950455 2002689 3137162 3812550 3581893 2704646 1669115 560590 -530487
$$ packed form
39716A648464j9948R93660Q02978l13952j108780j097862q50521p33051m71909
39707a150921l9107R8264j06440o6431L76091N90927L10337K01116O72270J033637
39697A919743O70260K02162M10016P31873J78871p09075m28774R59721J532031
39688E466828K68417j315523j261131J65615J066719N36256n31327j034049r29979
39679B431826p44458o56284m76325j11585K87094N11026N05009M23233M13300
39670B582836L45117P264l72499k42237L95318P14208J32254p71084r93840m69870
39660A327467l6312k24395p45047j097597j052727n50302K76758R57562J109435
39651c5158R85613J052234J134473O75388k30657q77247j035531j108525j091077
$$ plain form
39642 -530487 -941626 -89951 1536794 2830438 3372502 3531398 3428755 2812299 2052630
39633 2052630 2211232 3646814 5302045 5861447 5068256 3574258 2152497 1455295 1829972
39624 1829972 2804676 3366091 3318427 3709063 5201546 6716028 6686786 5211981 3827236
39615 3827236 3366042 3236374 2851473 2561715 2795282 3301281 3797063 4539178 5612741
39606 5612741 6319430 5988604 4939033 3961698 3215181 2321006 1282650 571378 377297
39597 377297 426597 558760 895116 1332386 1408073 911328 275768 127367 633951 1420578
39587 1420578 1939277 1829026 1086431 12500 -1022444 -1731632 -1878341 -1410076 -809807
39578 -809807 -904458 -1852507 -2614594 -2070250 -526814 613939 708448 567801 1053530 1802709
$$ packed form
39642e30487m11139Q51675J626745J293644N42064J58896j02643o16456p59669
39633B052630J58602J435582J655231N59402p93191j493998j421761o97202L74677
39624A829972R74704N61415m7664L90636J492483J514482k9242j474805j384745
39615C827236m61194j29668l84901k89758K33567N05999M95782P42115J073563
39606E612741P06689l30826j049571r77335p46517q94175j038356p11272j94081
39597C77297M9300J32163L36356M37270P5687m96745o35560j48401N06584P86627
39587A420578N18699j10251p42595j073931j034944p09188j46709M68265O00269
39578h09807r4651r48049p62087N44344J543436J140753R4509j40647M85729P49179
$$ plain form
39568 1802709 1907736 1268976 596307 397609 564750 760764 725458 368785 -43854 -35343
39558 -35343 380696 490176 -137653 -823269 -584308 473775 1263569 1074110 177228 -774297
39548 -774297 -1263888 -970722 -93854 459701 50721 -551320 64939 1967237 3681077
39539 3681077 4201060 4114424 4294569 4580401 4437060 3944484 3286902 2129254 489614
39530 489614 -505160 109410 1574571 2244671 1672620 773794 171086 -406877 -1084262
39521 -1084262 -1399667 -1204436 -1039012 -1226108 -1343370 -987443 -444677 -199443 -220205 -83765
39511 -83765 447002 1133825 1385022 777321 -275539 -688779 -34489 668421 209185 -1126975
39501 -1126975 -2071574 -2288627 -2539838 -2946907 -2527455 -945079 530984 583522 -548089
$$ packed form
39568A802709J05027o38760o72669j98698J67141J96014l5306l56673m12639Q511
39558c5343M16039J09480o27829o85616K38961J058083P89794j89459q96882r51525
39548g74297m89591K93166Q76868N53555m08980o02041O16259J902298J713840
39539C681077N19983q6636J80145K85832j43341m92576o57582j157648j639640
39530D89614r94774O14570J465161O70100n72051q98826o02708n77963o77385
39521a084262l15405J95231J65424j87096j17262L55927N42766K45234k0762J36440
39511h3765N30767O86823K51197o07701j052860m13240O54290P02910m59236j336160
39501a126975r44599k17053k51211m07069M19452J582376J476063N2538j131611
$$ plain form
39492 -548089 -1729047 -2343849 -2298955 -1449683 2805 1087434 978100 42089 -708013
39483 -708013 -845134 -595702 -161813 279946 312799 -202649 -661521 -505193 -161824 -431170
39473 -431170 -1219107 -1697752 -1522655 -1095984 -776881 -607615 -684533 -1004314 -1027554 -179520
39463 -179520 1259576 2493184 3313174 4037409 4469587 3965091 2678134 1727566 1745851
39454 1745851 2087860 1880300 1101967 177727 -771055 -1670879 -2038041 -1444450 -191308
39445 -191308 955243 1541167 1680996 1809098 2402992 3619978 4935577 5433386 4688994
39436 4688994 3099898 1239927 -639898 -2247063 -2968646 -2479339 -1312372 -342979 112186
39427 112186 318675 486547 542499 418215 181837 -95487 -372458 -614923 -893363 -1311505
$$ packed form
39492e48089j180958o14802M4894Q49272J452488J084629j09334r36011p50102
39483g08013j37121K49432M33889M41759L2853n15448m58872J56328L43369k69346
39473d31170p87937m78645J75097M26671L19103J69266p6918l19781k3240Q48034
39463a79520J439096J233608Q19990P24235M32178n04496j286957r50568J8285
39454A745851L42009k07560p78333r24240r48782q99824l67162N93591J253142
39445a91308J146551N85924J39829J28102N93894J216986J315599M97809p44392
39436D688994j589096j859971j879825j607165p21583M89307J166967R69393M55165
39427A12186K06489J67872N5952j24284k36378k77324k76971k42465k78440m18142
$$ plain form
39417 -1311505 -1652992 -1376574 -283811 1014530 1656685 1425267 768839 102990 -478258
39408 -478258 -867771 -844801 -487544 -309120 -673449 -1234220 -1241575 -410985 698901 1238298
39398 1238298 890757 92077 -436495 -210151 857576 2474436 4015912 4835695 4819098
39389 4819098 4511486 4464625 4581712 4371941 3720959 3054381 2765577 2822164 2978666 3083103
39379 3083103 3094148 3011647 2852013 2573938 2108784 1620253 1532289 1999214 2542170 2607342
39369 2607342 2324487 2252249 2509247 2699234 2623348 2480499 2386023 2327685 2628137 3726408
39359 3726408 5300174 6269677 5990993 4971531 4231812 4467280 5880761 8082755 9948886
39350 9948886 10390413 9615373 8855083 8531411 7699515 5884111 4362481 4574810 6043117
$$ packed form
39417a311505l41487K76418J092763J298341O42155k31418o56428o65849n81248
39408d78258l89513K2970L57257J78424l64329n60771p355Q30590J109886N39397
39398A238298l47541p98680n28572K26344J067727J616860J541476Q19783j6597
39389D819098l07612m6861J17087k09771o50982o66578k88804N6587J56502J04437
39379C083103J1045q2501j59634k78075m65154m88531q7964M66925N42956O5172
39369B607342k82855p2238K56998J89987p5886j42849r4476n8338L00452J098271
39359C726408J573766R69503k78684j019462p39719K35468J413481K201994J866131
39350I948886M41527p75040p60290l23672q31896j815404j521630K12329J468307
$$ plain form
39341 6043117 7083913 7125384 7090905 7683186 8460397 8665160 7993365 6426914 4192603
39332 4192603 2119104 1306551 2107767 3808715 5353762 6007986 5490315 4076773 2532657
39323 2532657 1409244 530237 -307800 -487613 702833 2692421 4011246 4109132 3803549
39314 3803549 3787489 3781994 3547507 3672977 4659090 5946821 6561432 6244099 5425888 4587684
39304 4587684 4169426 4615787 5905969 7355463 8339439 8867014 9068482 8632944 7339259
39295 7339259 5755233 4767761 4628201 4950833 5355306 5549167 5082136 3766812 2291698
39286 2291698 1724269 2252547 2924764 2843747 2245768 2114921 2892190 3858447 3961450 3232098
39276 3232098 3061296 4680540 7506401 9593861 9827024 8979881 8302581 7813144 6658155
$$ packed form
39341F043117J040796M1471l4479N92281P77211K04763o71795j566451k234311
39332D192603k073499q12553Q01216J700948J545047O54224n17671j413542j544116
39323B532657j123413q79007q38037j79813J190446J989588J318825R7886l05583
39314C803549j6060n495k34487J25470R86113J287731O14611l17333q18211q38204
39304D587684m18258M46361J290182J449494R83976N27575K01468m35538j293685
39295G339259j584026r87472j39560L22632M04473J93861m67031j315324j475114
39286B291698n67429N28278O72217q1017n97979j30847P77269R66257J03003p29352
39276C232098j70802J619244K825861K087460K33163q47143o77300m89437j154989
$$ plain form
39267 6658155 4640400 2575044 1373073 1460379 2834975 4881811 6253813 5825096 3905487
39258 3905487 1846744 419807 -636429 -1403051 -1206275 169099 1542466 1513780 203535
39249 203535 -973171 -1087895 -527984 -111840 -143292 -555874 -1349137 -2405203 -3201634
39240 -3201634 -3221906 -2613927 -2067120 -1973759 -2017949 -1747415 -1285558 -1162327 -1524854 -1869867
39230 -1869867 -1670902 -1021166 -476805 -426238 -791426 -1209871 -1303963 -880661 -99033 625607
39220 625607 1107265 1688696 2743515 3906393 4215373 3215322 1617772 576805 485833
39211 485833 798898 929227 898082 960069 962582 501686 -333387 -810881 -420092 336033
39201 336033 389555 -635668 -1922383 -2324903 -1499973 -70235 1042832 1223983 402797
$$ packed form
39267F658155k017755k065356j201971Q7306J374596K046836J372002m28717j919609
39258C905487k058743j426937j056236p66622J96776J375374J373367k8686j310245
39249B03535j176706j14724N59911M16144l1452m12582p93263j056066p96431
39240c201634k0272O07979N46807R3361m4190K70534M61857J23231l62527l45013
39230a869867J98965O49736N44361N0567l65188m18445r4092M23302P81628P24640
39220F25607M81658N81431J054819J162878L08980j000051j597550j040967r0972
39211D85833L13065J30329l1145O1987K513m60896q35073m77494L90789P56125
39201C36033N3522j025223j286715m02520Q24930J429738J113067J81151q21186
$$ [...]
##END NTUPLES=NMR SPECTRUM
##END=
