##TITLE=31Pdec_DE-136rm_3h
, 24 sc
 23.3.2026
##JCAMPDX= 6.0         $$ Bruker NMR JCAMP-DX V2.0
##DATA TYPE= NMR SPECTRUM
##DATA CLASS= NTUPLES
##ORIGIN= UXNMR, Bruker Analytische Messtechnik GmbH
##OWNER= root
$$ XWIN-NMR		Version 3.5
$$ Mon Mar 23 14:35:11 2026 Russian Standard Time (UT+4h)  she@DPX200
##.OBSERVE FREQUENCY= 81.013821
##.OBSERVE NUCLEUS= ^31P
##.ACQUISITION MODE= SIMULTANEOUS
##.ACQUISITION SCHEME= undefined
##.AVERAGES= 24
##.DIGITISER RES= 17
##SPECTROMETER/DATA SYSTEM= spect
##.PULSE SEQUENCE= zgpg30
##.SOLVENT NAME= CDCl3
##.SHIFT REFERENCE= (INTERNAL, CDCl3, 0, 197.392)
##AUDIT TRAIL= $$ (NUMBER, WHEN, WHO, WHERE, WHAT)
$$ ##TITLE= Audit trail, XWIN-NMR		Version 3.5
$$ ##JCAMPDX= 5.01
$$ ##ORIGIN= Bruker BioSpin GmbH
$$ ##OWNER= she
$$ F:/spectra/data/she/nmr/P31/2/pdata/1/auditp.txt
$$ ##AUDIT TRAIL=  $$ (NUMBER, WHEN, WHO, WHERE, WHAT)
(   1,<2026-03-23 14:33:48.60 +0400>,<she>,<DPX200>,
      <created by zg, POWCHK disabled, PULCHK disabled
       configuration hash MD5:
       00 E9 B6 7A A2 85 ED C7 34 08 36 98 17 FE 4E 26
       data hash MD5: 32K
       17 64 4F A7 24 17 49 93 D6 60 33 B0 60 8D 05 26>)
(   2,<2026-03-23 14:34:02.23 +0400>,<she>,<DPX200>,
      <Start of raw data processing
       efp BC_mod = 2 LB = 1.5 FT_mod = 6 PKNL = 1 PHC0 = 1381.52 PHC1 = 83.90066 SI = 64K 
       data hash MD5: 64K
       AE 52 0A BB 04 F1 01 16 9F 5D D6 30 98 EB 69 44>)
(   3,<2026-03-23 14:34:22.68 +0400>,<she>,<DPX200>,
      <pk PHC0 = 0.1026247 PHC1 = 9.399999 
       data hash MD5: 64K
       5A 3E 77 34 F6 38 AA E2 ED E9 7F 21 03 73 E6 71>)
(   4,<2026-03-23 14:34:28.14 +0400>,<she>,<DPX200>,
      <abs ABSG = 5 
       data hash MD5: 64K
       8C 29 D4 12 90 65 54 97 6A 4C 62 C4 D7 27 91 2E>)
$$ ##END=
$$ 
$$ hash MD5
$$ 72 88 A5 8A EB 1E 4B 5E C5 A3 1C 1E 98 A4 E0 16
##$RELAX= 
##$RELAX= 
##$RELAX= 
##$RELAX= 
##$RELAX= 
##$RELAX= 
##$RELAX= 
##$RELAX= 
$$ Bruker specific parameters
$$ --------------------------
##$DU= <F:/spectra>
##$EXPNO= 2
##$NAME= <P31>
##$PROCNO= 1
##$TYPE= <nmr>
##$USER= <she>
##$AMP= (0..31)
100 100 100 100 100 100 100 100 100 100 100 100 100 100 100 100 100 100 
100 100 100 100 100 100 100 100 100 100 100 100 100 100 
##$AQSEQ= 0
##$AQ_mod= 1
##$AUNM= <au_zg>
##$AUTOPOS= <>
##$BF1= 81.014009
##$BF2= 200.13
##$BF3= 200.13
##$BF4= 200.13
##$BF5= 200.13
##$BF6= 200.13
##$BF7= 200.13
##$BF8= 200.13
##$BYTORDA= 1
##$CFDGTYP= 0
##$CFRGTYP= 5
##$CHEMSTR= <none>
##$CNST= (0..31)
1 1 145 1 1 1 1 1 1 1 1 1 1 1 1 1 1 1 1 1 1 1 1 1 1 1 1 1 1 1 1 1 
##$CPDPRG= <waltz16>
##$CPDPRG1= <>
##$CPDPRG2= <waltz16>
##$CPDPRG3= <>
##$CPDPRG4= <mlev>
##$CPDPRG5= <mlev>
##$CPDPRG6= <mlev>
##$CPDPRG7= <mlev>
##$CPDPRG8= <mlev>
##$CPDPRGB= <>
##$CPDPRGT= <>
##$D= (0..31)
0 1 0 0 0 0 0 0 0 0.06 0 0.03 2e-05 3e-06 0 0 0.0002 0 0 0 0 0 0 0 0 0 
0 0 0 0 0 0 
##$DATE= 1774262028
##$DBL= (0..7)
120 120 120 11 120 120 24 19 
##$DBP= (0..7)
150 150 150 150 150 150 150 150 
##$DBP07= 0
##$DBPNAM0= <>
##$DBPNAM1= <>
$$ [...]
##$SUBNAM3= <"">
##$SUBNAM4= <"">
##$SUBNAM5= <"">
##$SUBNAM6= <"">
##$SUBNAM7= <"">
##$SUBNAM8= <"">
##$SUBNAM9= <"">
##$SW= 400.765351723535
##$SWIBOX= (0..15)
0 1 3 0 0 0 0 0 0 0 0 0 0 0 0 0 
##$SW_h= 32467.5324675325
##$TD= 32768
##$TD0= 1
##$TE= 0
##$TE2= 300
##$TE3= 300
##$TEG= 300
##$TL= (0..7)
0 120 53 12 22 120 120 120 
##$TP= (0..7)
150 150 150 150 150 150 150 150 
##$TP07= 0
##$TPNAME0= <>
##$TPNAME1= <>
##$TPNAME2= <>
##$TPNAME3= <>
##$TPNAME4= <>
##$TPNAME5= <>
##$TPNAME6= <>
##$TPNAME7= <>
##$TPOAL= (0..7)
0.5 0.5 0.5 0.5 0.5 0.5 0.5 0.5 
##$TPOFFS= (0..7)
0 0 0 0 0 0 0 0 
##$TUNHIN= 0
##$TUNHOUT= 0
##$TUNXOUT= 0
##$USERA1= <user>
##$USERA2= <user>
##$USERA3= <user>
##$USERA4= <user>
##$USERA5= <user>
##$V9= 5
##$VALIST= <valist>
##$VCLIST= <CCCCCCCCCCCCCCC>
##$VD= 0
##$VDLIST= <DDDDDDDDDDDDDDD>
##$VPLIST= <PPPPPPPPPPPPPPP>
##$VTLIST= <TTTTTTTTTTTTTTT>
##$WBST= 1024
##$WBSW= 4
##$XGAIN= (0..3)
0 0 0 0 
##$XL= 0
##$YL= 0
##$YMAX_a= 29080
##$YMIN_a= -31896
##$ZGOPTNS= <>
##$ZL1= 120
##$ZL2= 120
##$ZL3= 120
##$ZL4= 120
##$ABSF1= 197.3918
##$ABSF2= -203.3724
##$ABSG= 5
##$ABSL= 3
##$ALPHA= 0
##$AQORDER= 0
##$ASSFAC= 0
##$ASSFACI= 0
##$ASSFACX= 0
##$ASSWID= 0
##$AUNMP= <proc_1d>
##$AZFE= 0.1
##$AZFW= 0.5
##$BCFW= 0
##$BC_mod= 2
##$BYTORDP= 0
##$COROFFS= 0
##$CY= -3
##$DATMOD= 1
##$DC= 0
##$DFILT= <>
##$DTYPP= 0
##$F1P= 0
##$F2P= 0
##$FCOR= 1
##$FTSIZE= 65536
##$FT_mod= 6
##$GAMMA= 0
##$GB= 0
##$INTBC= 1
##$INTSCL= 9.790993e-09
##$ISEN= 30
##$LB= 1.5
##$LEV0= 0
##$LPBIN= 0
##$MAXI= 10000
##$MC2= 0
##$MEAN= 0
##$ME_mod= 0
##$MI= 50
##$NCOEF= 0
##$NC_proc= -7
##$NLEV= 6
##$NOISF1= 182.463
##$NOISF2= 159.3651
##$NSP= 0
##$NTH_PI= 0
##$NZP= 0
##$OFFSET= 197.3918
##$PC= 4
##$PHC0= 1381.623
##$PHC1= 93.30066
##$PH_mod= 1
##$PKNL= yes
##$PPARMOD= 0
##$PSCAL= 0
##$PSIGN= 0
##$REVERSE= no
##$SF= 81.014063255964
##$SI= 65536
##$SIGF1= 159.3651
##$SIGF2= -187.1042
##$SINO= 113.3802
##$SIOLD= 16384
##$SREGLST= <1H.CDCl3>
##$SSB= 0
##$STSI= 65536
##$STSR= 0
##$SW_p= 32467.5324675325
##$SYMM= 0
##$S_DEV= 0
##$TDeff= 32768
##$TDoff= 0
##$TI= <>
##$TILT= no
##$TM1= 0
##$TM2= 0
##$TOPLEV= 0
##$USERP1= <user>
##$USERP2= <user>
##$USERP3= <user>
##$USERP4= <user>
##$USERP5= <user>
##$WDW= 1
##$XDIM= 65536
##$YMAX_p= 349241341
##$YMIN_p= -18072195
$$ End of Bruker specific parameters
$$ ---------------------------------
##NTUPLES= NMR SPECTRUM
##VAR_NAME=  FREQUENCY,     SPECTRUM/REAL,   SPECTRUM/IMAG
##SYMBOL=    X,             R,               I
##VAR_TYPE=  INDEPENDENT,   DEPENDENT,       DEPENDENT
##VAR_FORM=  AFFN,          ASDF,            ASDF
##VAR_DIM=   65536,         65536,           65536
##UNITS=     HZ,            ARBITRARY UNITS, ARBITRARY UNITS
##FACTOR=    0.49542278885378, 1,            1
##FIRST=     15991.5117654749, 0,            0
##LAST=      -16476.0207020576, 0,           0
##MIN=       -16476.0207020576, -18072195,   0
##MAX=       15991.5117654749, 349241341,    0
$$ Real data points
##PAGE= N=1
##DATA TABLE= (X++(R..R)), XYDATA
$$ [...]
44648a783440R00371O62580J31660k06456j49916R85J13294N48891J263387J250140
44638B731496j03755j593570j459745R0514J081368N94115j70836r3563K21474
44629A297498j08430n79131l42218J40524q4186o60876m22809N94736J037353
44620H72461K16354r33837j189717m84364L58582P28128O37606L83923K07399
44611G96535K28869M63390P58931P72632K39937n86653j029413q09690m66872
44602C67666m89699m32133L10222J163496R61475j49200p02828j30445L78705
44593A277259j24544q18453n77703J65093K87968j38262k13662J25308K19324
44584B02328J24295N12619J215806J214954K62078o41799o93482k61119o1104
$$ plain form
44648 -1783440 -883069 -220489 -88829 -295285 -445201 -444216 -330922 217969 1481356 2731496
44638 2731496 2627741 1034171 -425574 -335060 746308 1340423 1169587 1076024 1297498
44629 1297498 1189068 609937 267719 408243 324057 -336819 -759628 -164892 872461
44620 872461 1088815 154978 -1034739 -1519103 -1160521 -432393 205213 589136 796535
44611 796535 1025404 1488794 2247725 3020357 3260294 2673641 1644228 834538 367666
44602 367666 -122033 -554166 -243944 919552 1881027 1731827 1028999 898554 1277259
44593 1277259 1152715 334262 -243441 -78348 209620 71358 -142304 -16996 202328
44584 202328 326623 839242 2055048 3270002 3532080 2890281 2196799 1935680 1874576
44575A874576j54432j78620l0937N0364j79869o63702r07899m11496M75519O11500
44565D85004m35367j479756j162554J46168R14502N89960J3681j24202J116J71660
44555h79788M34313N02952N5042l19353K11374J038318O94361o15765r24924L79161
44545E75691J314597L86729r65533p55785K78382L7329j295846j492734Q8180
44536a828990J507630J225386K4562o96831q20391q20943o06754o6084K74688
44527a807727J12235Q0366P28605J476829J433541O90938J2367k88654m02380
44518B036120l72328j39144M1056j55997o68201j235309j646243j461546j91594
44509c793186J631995K335014J024663r16731j375392j89297R00478P82429J21676
$$ plain form
44575 1874576 1720144 1541524 1510587 1560951 1381082 717380 -190519 -602015 -126496 485004
44565 485004 49637 -1430119 -2592673 -2446505 -1532003 -942043 -928362 -1052564 -1051448 -879788
44555 -879788 -445475 57477 112519 -206834 4540 1042858 1737219 1121454 196530 575691
44545 575691 1890288 2277017 1311484 555699 834081 871410 -424436 -1917170 -1828990
44536 -1828990 -321360 904026 928588 231757 -588634 -1409577 -2016331 -2082415 -1807727
44527 -1807727 -1695492 -1615126 -886521 590308 2023849 2714787 2727154 2438500 2036120
44518 2036120 1663792 1524648 1565704 1409707 741506 -493803 -2140046 -3601592 -3793186
44509 -3793186 -2161191 173823 1198486 281755 -1093637 -1282934 -382456 399973 521649
44500E21649j56356j92447m52879o88498l87221L23177Q38992Q01425L05508k56000
44490F57350l72691J09478N79898K90235n16805q09013k50438L44871L37658J38313
44480E08856K70721M33745J58645l33505o31406q31706j045582q78205j55096
44471b503533M89079N52440N21168Q95437J086247L81726o19138p92299k23777
44462b12650J49137K06646N16788Q61109M98571k20275k10022L13303j5700j192247
44452F94660j415772P3459J590550J547713P25540N84939P60909J8453j288062
44443C292389j647677q33510j27217k03394l66095k6595M33929N85073N92594
44434A699497N69405K31189l91638o98520m19179j20552l53759q09504q27871
$$ plain form
44500 521649 365293 172846 -280033 -968531 -1355752 -1032575 -193583 607842 913350 657350
44490 657350 284659 394137 974035 1264270 747465 -61548 -311986 32885 370543 508856
44480 508856 779577 1213322 1371967 1038462 407056 -424650 -1470232 -2348437 -2503533
44471 -2503533 -2014454 -1462014 -940846 -45409 1040838 1422564 803426 11127 -212650
44462 -212650 -63513 143133 659921 1521030 2019601 1799326 1589304 1902607 1886907 694660
44452 694660 -721112 -647653 942897 2490610 3216150 3801089 4561998 4580451 3292389
44443 3292389 1644712 811202 683985 480591 114496 87901 521830 1106903 1699497
44434 1699497 2268902 2500091 2108453 1409933 990754 870202 516443 -293061 -1120932
44425a120932m17253k22944n19641o81544M3097J334484J843336P93325p92998
44416B58930j172006j09769Q44194N07441m89412q95444n07389J15109P25073
44407g23273J200410J013739L3283o94408j79752Q95100J057609K20202m01762
44398B421148l56747m08387q50433r72698o03303o37874j329953j459526k12350
44389d410123J231509J194410j30991r99109m20030Q80032J632800J301671K32357
44380E12526p65271r32926j60365Q60445J334646J118700N77890j0205n25898
44371B009542p15700l39474L62490O97767J83926q70627j513670j007542L42278
44362h51010J383509J346792O25142Q914m27303r98845j343242p39415N05326
$$ plain form
44425 -1120932 -1538185 -1761129 -2280770 -2962314 -2919217 -1584733 258603 1051928 258930
44416 258930 -913076 -1022845 -178651 328790 -160622 -1056066 -1563455 -1448346 -723273
44407 -723273 477137 1490876 1524159 829751 649999 1545099 2602708 2822910 2421148
44398 2421148 2064401 1656014 805581 -167117 -770420 -1408294 -2738247 -4197773 -4410123
44389 -4410123 -3178614 -1984204 -2115195 -3114304 -3534334 -2654302 -1021502 280169 512526
44380 512526 -252745 -1185671 -1346036 -485591 849055 1967755 2545645 2535440 2009542
44371 2009542 1293842 954368 1316858 2014625 2198551 1327924 -185746 -1193288 -851010
44362 -851010 532499 1879291 2504433 2513347 2086044 1087199 -256043 -995458 -490132
44353d90132J122722O48618O0942J87382N40561M35237K55871O31850J116529
44344D509580P99968k33902j099295j406958j390239j061833l09225L57101K49487
44335D14684l22574l76258J74119L54504k15008o02483n0995P27526N42890n31010
44325A15395j224306p02841N03412J232334R61264K52207O7857O66178J230566
44316C102066Q04480m37945j245233p80761L18746P34714Q9061o82414n84429
44307A318285K37896Q10015O00296O7468j17543J4045n6499m38345o69985m76247
44297A289386j67731r0307j38372j04235p5982j02255J31522P78867J289070R85189
44287C795152M5049o45463n61443M756M64944M38065j56714r79460j325117q62490
$$ plain form
44353 -490132 632590 1281208 1342150 1529532 2070093 2505330 2761201 3393051 4509580
44344 4509580 5309548 5075646 3976351 2569393 1179154 117321 -191904 165197 414684
44335 414684 92110 -284148 -110029 244475 29467 -573016 -624011 103515 646405 115395
44325 115395 -1108911 -1811752 -1308340 -76006 885258 1137465 1205322 1871500 3102066
44316 3102066 3906546 3468601 2223368 1442607 1761353 2496067 2585128 1902714 1318285
44307 1318285 1556181 2366196 2966492 3033960 2916417 2930462 2873963 2435618 1765633 1289386
44297 1289386 1121655 1031348 892976 788741 712759 610504 742026 1520893 2809963 3795152
44287 3795152 3840201 3194738 2633295 2638051 3102995 3541060 3384346 2404886 1079769 217279
44277B17279k40604l21543q66929p79413K44640J180156J136992N43293L14968
44268A428839N16564N46681J90044k43838n42293o77636m94149K4923L33479j26466
44258I56148r80446j229364n97909Q9805R8044k72819k87471J57973N21971L82509
44248a161559j76905p51182q78921l43071M93128R03503O91809N53436J058834
44239C89072J598489J101875k92496j209697r10069k63752l07389o71091l52140
44230i17198N12531Q04361K00724l63049j92877K48610L34551K54548M05778N76641
44220A864620M56627L26978M40095K62330o94291j662656j374558L5648R91617
44211F46410N42502n33834j061609r47342p26079m42596J42670O99732O20998
$$ plain form
44277 217279 -23325 -344868 -1211797 -1991210 -1746570 -566414 570578 1113871 1428839
44268 1428839 1945403 2492084 2682128 2438290 1895997 1218361 724212 749135 1082614 956148
44258 956148 -24298 -1253662 -1851571 -1761766 -1663722 -1936541 -2224012 -2066039 -1544068 -1161559
44248 -1161559 -1338464 -2089646 -2968567 -3311638 -2818510 -1915007 -1223198 -669762 389072
44239 389072 1987561 3089436 2796940 1587243 677174 413422 106033 -565058 -917198
44230 -917198 -404667 399694 600418 237369 44492 293102 627653 882201 1287979 1864620
44220 1864620 2321247 2648225 3088320 3350650 2656359 993703 -380855 -345207 646410
44211 646410 1188912 655078 -406531 -1353873 -2079952 -2522548 -2379878 -1680146 -1059148
44202a059148O9626o5068N88350J267846R99095j72495j142709q85157M54041
44193E4381J603621J400808K9128j145552j069177p3649P22214P35784K48106
44184B505664l04125p47746r13150n92560J1683K74599q4638n35317l57833M73695
44174b69728J304693J519734J007966J06286o34020p70299l50373J19578K99328
44165B333165M12555P40453R90649O68768n7721m68450l16265j64172n04587j058149
44155B576246j236062q73654j99493N28560J014131R18470K64615m27047p36010
44146A829756p68201o96256l36961L52861Q33434O65268K45294J51996J35198
44137B412389l55456r19699n91654N19025J108813M88084n16828r00200p67240
$$ plain form
44202 -1059148 -989522 -1054590 -466240 801606 1800701 1628206 485497 -399660 54381
44193 54381 1658002 3058810 3087938 1942386 873209 799560 1521774 2257558 2505664
44184 2505664 2201539 1453793 540643 -51917 -40234 234365 149727 -385590 -743423 -269728
44174 -269728 1034965 2554699 3562665 3668951 3034931 2264632 1914259 2033837 2333165
44165 2333165 2745720 3486173 4476822 5145590 5087869 4619419 4303154 4138982 3634395 2576246
44155 2576246 1340184 466530 267037 795597 1809728 2728198 2992813 2565766 1829756
44146 1829756 1061555 365299 28338 381199 1214633 1879901 2125195 2277191 2412389
44137 2412389 2056933 1137234 545580 1064605 2173418 2661502 2144674 1244474 477234
44128D77234p03008o88722l95791L6355K49612K71907K67223J04577k48660l52060
44118i81333O4848M99921L78324j9153k7781L14684L97659N5375k65368k66303
44108A50873j03709J8028N1622j3703p2107J07680M35286L84113k19744p21648
44098A6691n08520J26964O33425J101444J636853J486969N8260j590721j746063
44089A215302m71195M28915L5352o02820m47684l3968k39680p39083p21025k70253
44079a846139m445L8797K17610M68177N00895M22501M52493M11341J26868j01179
44069F86919p8976k30436p96089j078214m02301O18583Q35489L07503J61427P61837
44059G85742J180759P25248n3088l46060k56104l63060o92674p70492m16886N1142
$$ plain form
44128 477234 -225774 -914496 -1310287 -1273932 -1024320 -752413 -485190 -380613 -629273 -981333
44118 -981333 -916485 -416564 -38240 -57393 -85174 229510 627169 682544 417176 150873
44108 150873 47164 65192 116814 103111 31004 138684 573970 958083 738339 16691
44098 16691 -491829 -364865 268560 1370004 3006857 4493826 4552086 2961365 1215302
44089 1215302 744107 1173022 1208374 605554 157870 123902 -115778 -854861 -1575886 -1846139
44079 -1846139 -1850584 -1811787 -1594177 -1126000 -625105 -202604 249889 661230 788098 686919
44069 686919 607943 377507 -418582 -1496796 -1899097 -1280514 -445025 -137522 23905 785742
44059 785742 1966501 2691749 2638661 2292601 2036497 1673437 980763 210271 -206615 -155473
44049a55473K80543J56888k58119p00410o95460K7216J037431J450079Q74899
44040B017594p3725m74260j93894O4091j72143m90008k95660K35756M40958J79983
44030A238692o6640o6105j15065l33637l76527j40075r1275m40005n81402J6294
44020i55745Q16503Q47510J10103l89038j1442P42872R94579N35268j19683m28325
44010B142602l12106m5884J52316L23090N37885O18583L30248j85662n03864m98197
44000B559011m75814o24342p19264n51357k46941L4466L00707M16997R3572n26034
43990B61001p93534m38128L5944K49486N63126J160929J249007J62099j228423
43981A221507j420205m19641K87691K3821j38282P33062J753243J454916L2376
$$ plain form
44049 -155473 125070 281958 23839 -676571 -1372031 -1344815 -307384 1142695 2017594
44040 2017594 1943869 1469609 1275715 1339806 1167663 677655 381995 617751 1058709 1238692
44030 1238692 1172052 1105947 990882 657245 280718 140643 49368 -390637 -972039 -955745
44020 -955745 -139242 708268 818371 429333 417891 1160763 2155342 2690610 2570927 2142602
44010 2142602 1830496 1784612 1936928 2260018 2797903 3416486 3746734 3561072 3057208 2559011
44000 2559011 2083197 1458855 739591 188234 -58707 -24241 276466 693463 787035 261001
43990 261001 -532533 -970661 -934717 -685231 -122105 1038824 2287831 2449930 1221507
43981 1221507 -198698 -618339 -330648 -306827 -445109 287953 2041196 3496112 3528488
43972C528488q31951k90312N72391L19815r02620j664433j132901Q0342R51755
43963F30574J169195R05462K02338p12594j012301j55529J021080J164112L47223
43954C559560m0250M45718N46968n47911j673166j421150l11423J62183j38193
43945E82336j73938K26866J66022n40110r25881m96487J7738o6311m23025m60796
43935b093586j55440K31942N25898M72204o1287n51318k86092M79151P05842J17232
43925f15454l55363L2220Q79933J419659J399271Q61658p5061q35067o76406J90429
43915B225819O35430J97692k77894q9638K44445N7998k73978j17326K16998L8210
43905B857756m85196n85788o0749N79579Q30633M77406m39726j377202j463585
$$ plain form
43972 3528488 2696537 2406225 2978616 3298431 2395811 731378 -401523 -321181 630574
43963 630574 1799769 2705231 2907569 2194975 1182674 1027145 2048225 3212337 3559560
43954 3559560 3519310 3965028 4511996 3964085 2290919 869769 558346 720529 582336
43945 582336 408398 635264 801286 261176 -664705 -1161192 -1143454 -1209765 -1632790 -2093586
43935 -2093586 -2249026 -2017084 -1491186 -1018982 -1080269 -1631587 -1917679 -1438528 -732686 -615454
43925 -615454 -970817 -938597 -58664 1360995 2760266 3621924 3546863 2711796 2035390 2225819
43915 2225819 2861249 3058941 2781047 2691409 2935854 2993852 2719874 2602548 2819546 2857756
43905 2857756 2372560 1786772 1726023 2305602 3136235 3613641 3173915 1796713 333128
43896C33128n19201N22354P29618K19811l69735p89270r77820o92872n4277K52020
43886a346244N8192K00015J052151J504860N92564o89513o80220M10781Q88941
43877A991527J95947n49337o15605n74547q51573r05764l96605J20644K46907
43868a338406L52084N79638L71553l39992n50274L46159J385351J289604K39159
43859B334876n59411n96851l99460m08908m37317k51128L356J28117K04073M11850
43849D29197P05185P82155M08646k02662m95050k53774L2038j19286l55176J305
43839I32578P51579R45072K94813l68751l42473K6866O4253k80961o61011q93408
43829D68557q39792l16657M01345N99383J61820m4482N53706J211193Q91882k02898
$$ plain form
43896 333128 -186073 336281 1065899 1285710 915975 126705 -851115 -1543987 -1598264 -1346244
43886 -1346244 -1288052 -1088037 -35886 1468974 2061538 1372025 691805 1102586 1991527
43877 1991527 2187474 1638137 1022532 447985 -403588 -1309352 -1705957 -1585313 -1338406
43868 -1338406 -986322 -406684 -35131 -375123 -925397 -579238 806113 2095717 2334876
43859 2334876 1775465 1178614 779154 370246 -67071 -318199 -314843 -186726 17347 429197
43849 429197 1134382 1916537 2325183 2122521 1627471 1373697 1405735 1286449 931273 932578
43839 932578 1684157 2629229 2924042 2555291 2212818 2239684 2303937 2022976 1361965 468557
43829 468557 -371235 -687892 -286547 312836 474656 430174 983880 2195073 3086955 2884057
43819B884057j004795j089545q94687o71205j84565N46239J043218J016054O04007
43810B248778k2031o90245r30385l64636N57591R04001M49765j02725j92038k9467
43800A828608J466o8309o7392j1269Q5713K69054L75021K05961M2832L33425P69361
43789C764471N13362l63224o26081L32160J324800Q89276o61433j726201j551724
43780A895406q06515k15613K45397O78805Q00304M99378J28196j04015m17530
43771B703813q62193j025558o54959m7036M57752Q37342J002054O79697L5494
43762C126406k41722P4807L08387n0358m85862l45928L5828l6775l72643k58057
43752A754083K45373M16936J48839M6919K61023K70958j8631j2607M52737P08720
$$ plain form
43819 2884057 1879262 789717 -104970 -776175 -960740 -414501 628717 1644771 2248778
43810 2248778 2226747 1536502 606117 241481 799072 1703073 2152838 2050113 1858075 1828608
43800 1828608 1830074 1761765 1694373 1683104 1768817 2037871 2412892 2618853 2661685 2995110 3764471
43789 3764471 4277833 3914609 3288528 3620688 4945488 5834764 5173331 3447130 1895406
43780 1895406 1088891 873278 1118675 1797480 2597784 3097162 3225358 3121343 2703813
43771 2703813 1841620 816062 161103 114067 571819 1409161 2411215 3090912 3126406
43762 3126406 2884684 2959491 3267878 3217520 2731658 2385730 2421558 2384783 2012140 1754083
43752 1754083 1999456 2416392 2565231 2612150 2873173 3144131 3125500 3112893 3565630 4274350
43742D274350L99017J16571L51489O01562J91644o18175r87110n46218L75319
43733D158449J176613J307083O62726n3548K7543O86508P83602n545o34871m14050
43723G694510j42108o18787j123916o20133M12874P81189N53197O77839J085033
43714H699698Q57391J18289p852N32528L98817r20609k080976j803698o31493
43705E162095O439m26707j376940j996979j630089k54301J137037J354958N12393
43696B487906j48221j07465j18774n93555p94003k87726J12698k45691p06411
43687d01242n56766k89058m77940n10461K10100P82836J26562r44853p02822Q07209
43677a956435J763366J195306O1682m35079k24835K10832N99303P03970L41828
$$ plain form
43742 4274350 4673367 4789938 5141427 5742989 5934633 5316458 4329348 3783130 4158449
43733 4158449 5335062 6642145 7304871 7251323 7278866 7965374 8748976 8743431 8108560 7694510
43723 7694510 7552402 6933615 5809699 5189566 5602440 6383629 6936826 7614665 8699698
43714 8699698 9557089 9675378 9667526 10200054 10598871 9678262 7597286 5793588 5162095
43705 5162095 5168534 4741827 3364887 1367908 -262181 -516482 620555 1975513 2487906
43696 2487906 2339685 2232220 2113446 1519891 725888 438162 550860 305169 -401242
43687 -401242 -958008 -1247066 -1725006 -2235467 -2025367 -1242531 -1115969 -2060822 -2763644 -1956435
43677 -1956435 -193069 1002237 1063919 628840 404005 614837 1214140 1918110 2259938
43668B259938j41521j83966J16885K11248J08181K62217N32765L05698l40093
43659C131352o72828n70035o16710q48717o08581J34059N51466L58271K17152
43650A075429L87790K68301k39104k74582L89731O60225r5705q45696n22473K89605
43640A093521M75486J67118J08097J47250k20062n45767j54778L95923J19247
43631A586035n70250m29484M55938P41539L6727n67117l58567J41307M81186R03877
43621B421191J212175N41828j013976j944415j386611m31595l62371p19487l35870
43612b019131O32475J108037R05578P09924N85724m2325r54831j061919o4398
43603b00866R30762R21934K72413o6193P7831R7325m00397j089649j279537n82973
$$ plain form
43668 2259938 2118417 1934451 2051336 2262584 2370765 2632982 3165747 3471445 3131352
43659 3131352 2458524 1888489 1271779 423062 -185519 -51460 500006 858277 1075429
43650 1075429 1463219 1731520 1492416 1217834 1607565 2267790 2172085 1326389 803916 1093521
43640 1093521 1569007 1736125 1844222 1991472 1771410 1225643 1070865 1466788 1586035
43631 1586035 1015785 586301 1042239 1783778 1820505 1253388 894821 1036128 1517314 2421191
43621 2421191 3633366 4175194 3161218 1216803 -169808 -601403 -963774 -1683261 -2019131
43612 -2019131 -1386656 -278619 626959 1336883 1922607 1880282 925451 -136468 -200866
43603 -200866 729896 1651830 1924243 1858050 1935881 2033206 1632809 543160 -736377 -1319350
43593a319350N78366J144788M97475o13266p85877K31282J130326Q18399q4207
43584A597936k26723M77936Q18652J68329o26644o26290k33687m79056j294685
43575d24232j458669l45227J101342J594685J130447P30391Q91861J088498Q02302
43566E111398K54162j60915m82333p96385q13201l78238N5321P3910R802K94571
43556C168092M94371r1123j067033j236092l25157O16303P97852O35920O62016
43547C655149M93265l46632j334787j542973q50361J59384J042484J524175J204864
43538D004568J10368q45369q41770k97891j57678l71845j51993M84726O49987
43529B583103J05838l50225k49747n2288k4269L27011J126007J490965P97258
$$ plain form
43593 -1319350 -740984 403804 901279 288013 -497864 -266582 863744 1682143 1597936
43584 1597936 1371213 1849149 2667801 2836130 2209486 1583196 1349509 870453 -424232
43575 -424232 -1882901 -2228128 -1126786 467899 1598346 2328737 3220598 4309096 5111398
43566 5111398 5365560 5204645 4722312 3925927 3112726 2734488 2789809 2863719 2873521 3168092
43556 3168092 3662463 3571340 2504307 1268215 943058 1559361 2357213 2993133 3655149
43547 3655149 4148414 3801782 2466995 924022 73661 233045 1275529 2799704 4004568
43538 4004568 4114936 3269567 2427797 2129906 1972228 1600383 1448390 1933116 2583103
43529 2583103 2688941 2338716 2088969 2036681 2012412 2339423 3465430 4956395 5753653
43520E753653k61134o97864o30333p86599j175439j168155n75163J63666O26371
43511A249003N93683q1596j081755j438128n67520P05016J008363K33799l72087
43502B48778N053P04328O44722k19412r61126q77403k07056L04707L10788J47698
43492A01077J64969O1519o16665j408423j164299L46568J827475K011205J155477
43483B478903L37155l1380j28750J18022O53252O09869o19875j912587j512954
43474h345L83954J667986J188078P6027k92661j17715r3060R6766R56113J840454
43464E697597J785174J067253O93547P61039N53624P644j74597J30724J90724
43455A0712729k68931m85554J33182R80644J040660K87203l02826m2571O15676
$$ plain form
43520 5753653 5492519 4794655 4164322 3377723 2202284 1034129 458966 622632 1249003
43511 1249003 1842686 1761090 679335 -758793 -1326313 -621297 387066 620865 248778
43502 248778 253831 958159 1602881 1383469 422343 -455060 -662116 -357409 -46621 101077
43492 101077 266046 327565 -289100 -1697523 -2861822 -2515254 -687779 1323426 2478903
43483 2478903 2816058 2784678 2655928 2773950 3427202 4037071 3417196 1504609 -8345
43474 -8345 375609 2043595 3231673 3307700 3015039 2897324 2804264 2901030 3857143 5697597
43464 5697597 7482771 8550024 9243571 10004610 10558234 10565878 10391281 10522005 10712729
43455 10712729 10443798 9958244 10091426 11072070 12112730 12399933 12097107 12054536 12670212
43446A2670212P08685O0236l92663K15490J422672J889653J104347j0468m46185
43437A7221979l94476o63076j359374j875523j866160j512714r85975l47825Q0528
43428H297384p7237o40159j014673r68183p38085m07699J94810Q89723J074472
43419F610353N10618k83672o61546m96316m8171M09572O36220M81664J49954J18926
43409G427602N66548J072946J043812K94033p79262j387126q40013P19065K108803
43400A0226408K164728J079942J52155P9106J76452l88647j284342j560106j047488
43391I598208m80297m01679o30812q13499r15428j021663j057039q83125m45561
43382B949105K17170Q81140J095501N76319l16772q39413o97457l09697j31104
$$ plain form
43446 12670212 13378897 13439133 13046470 13261960 14684632 16574285 17678632 17668164 17221979
43437 17221979 16827503 16164427 14805053 12929530 11063370 9550656 8564681 8216856 8297384
43428 8297384 8220147 7579988 6565315 5597132 4859047 4451348 4646158 5535881 6610353
43419 6610353 7120971 6837299 6175753 5679437 5631266 6040838 6677058 7158722 7308676 7427602
43409 7427602 7994150 9067096 10110908 10404941 9625679 8238553 7398540 8117605 10226408
43400 10226408 12391136 13471078 13623233 13702339 13878791 13490144 12205802 10645696 9598208
43391 9598208 9117911 8716232 8085420 7271921 6356493 5334830 4277791 3394666 2949105
43382 2949105 3166275 4047415 5142916 5719235 5402463 4563050 3865593 3555896 3424792
43373C424792r1190M9990J31782j97895q31065j170468q09259K2484P50047R88014
43363B267232P38244K67756j01602j97755n7479K59927P90117J380487J469747
43354F816674O57260m62481o68052L30216J271175Q92291l23270p71480P0589
43345G812922J011308Q81545K5823m03741J3063P16453J039493P68693R4518n30495
43335A1429582o91378n31950o97751j391658j865340j369953k73049M11354L56982
43326E376839O8935j40869m58014p70182m54787O35046J616960J533549M92231
43317G899708n75484j014296r14760p04362o81219q82717j091727r52919k88151
43308G94073O55493J363181J490938J160024Q49335R42831J299807J353359P63639
$$ plain form
43373 3424792 3333602 3383592 3515374 3317479 2486414 1315946 506687 529171 1279218 2267232
43363 2267232 3005476 3273232 3171630 2973875 2916396 3176323 3966440 5346927 6816674
43354 6816674 7473934 7011453 6343401 6673617 7944792 8837083 8513813 7742333 7812922
43345 7812922 8824230 9705775 9731598 9327857 9340920 10057373 11096866 11865559 11960077 11429582
43335 11429582 10738204 10206254 9508503 8116845 6251505 4881552 4608503 5019857 5376839
43326 5376839 5445774 5304905 4846891 4076709 3621922 4256968 5873928 7407477 7899708
43317 7899708 7324224 6309928 5395168 4690806 4009587 3126870 2035143 1082224 794073
43308 794073 1449566 2812747 4303685 5463709 6313044 7255875 8555682 9909041 10672680
43299A0672680j24425o42349n04784L9977O01976Q89721O93364K7421p17232j096375
43289I839974j068065q33675l76525L69127R91085Q74204J00267n29245n61413
43280H805734l99541m83757n76355k89119J97185M73327N81751Q06352J065627
43271A0181204J080438R57052J025449J174462R16676J83854m16014k98991M67580
43262A5271710J392914K146290K705863L084453L169860K922450K620350K689278
43254C6003168L164599L515708L306209K917524L165740M154055N030871N123732
43246F6381606M804277M810217N122645N079878M371258L312129K187002R00756
43238I6969768n87158j935061k778289l181702l524573m037218m591831m936554
$$ plain form
43299 10672680 10548255 9905906 9401122 9441099 10043075 10932796 11626160 11653581 10936349 9839974
43289 9839974 8771909 7938234 7561709 7930836 8921921 9796125 9896392 9367147 8805734
43280 8805734 8406193 7922436 7346081 7056962 7254147 7727474 8309225 9115577 10181204
43271 10181204 11261642 12218694 13244143 14418605 15335281 15519135 15103121 14804130 15271710
43262 15271710 16664624 18810914 21516777 24601230 27771090 30693540 33313890 36003168
43254 36003168 39167767 42683475 45989684 48907208 52072948 56227003 61257874 66381606
43246 66381606 71185883 75996100 81118745 86198623 90569881 93882010 96069012 96969768
43238 96969768 96382610 94447549 91669260 88487558 84962985 80925767 76333936 71397382
43230G1397382n057700n211340n519669n666155n253004m419441l741562l458193
43222C3070318l212866k713113k178408j862678j594490j165599p56925n59265
43214A9026974l84155j15089r8106n23141q81645p32471n52519r64939j514720
43205A3260189j265395l73143J26051K3306R7060M31489Q2697j045016j510306
43196I826932n11107N57350O1641j336552j679002o27470L22715L23459J19224
43187G057190L07468L24329j94110m49440J80352R04756O82773j64377o19840
43178H029101o65100j054752j671482j436637m3313J347330J604229R87715M74049
43169G571140L84514L40945J37640o7136k55338o00551r95811j023218n03564
$$ plain form
43230 71397382 66339682 61128342 55608673 49942518 44689514 40270073 36528511 33070318
43222 33070318 29857452 27144339 24965931 23103253 21508763 20343164 19586239 19026974
43214 19026974 18642819 18527730 18429624 17906483 17024838 16292367 15739848 14774909 13260189
43205 13260189 11994794 11621651 11747702 11771008 11868068 12299557 12382254 11337238 9826932
43196 9826932 9315825 9873175 9934816 8598264 6919262 6291792 6614507 6937966 7057190
43187 7057190 7364658 7688987 7494877 7045437 7225789 8130545 8813318 8648941 8029101
43178 8029101 7364001 6309249 4637767 3201130 3157817 4505147 6109376 7097091 7571140
43169 7571140 7955654 8296599 8434239 8367103 8111765 7511214 6515403 5492185 4988621
43160D988621K49899P86763Q58802M23202l33376r23780r04482m44087j92873
43151D508689l83811m45676J47610R83095J183108O10428M380j12920l7888j53629
43141F303386k16991R1462L52441q8081r34254j108732l03279M37899J77716n42610
43131D168957n63150J08189L81248j12689l97845K83865J217499J237705L88844
43122F712623k87476k99730j60626l45999o19535n96675l54512j64036k3010K47915
43112D108939O77853J081974J153168O28488l45294j062988r01301j27077M01124
43103E614886L78759L22118N37681N18547j85938j040799j073785r2694J136677
43094F115452J745687J410761L87722o62750j062076p40994l33199l00535k39359
$$ plain form
43160 4988621 5238520 6025283 6884085 7307287 6973911 6050131 5145649 4701562 4508689
43151 4508689 4124878 3679202 3826812 4809907 5993015 6603443 6607823 6494903 6457015 6303386
43141 6303386 6086395 6177857 6530298 6442217 5507963 4399231 4095952 4533851 4711567 4168957
43131 4168957 3605807 3713996 4095244 3982555 3584710 3868575 5086074 6323779 6712623
43122 6712623 6425147 6125417 5964791 5618792 4999257 4402582 4048070 3884034 3861024 4108939
43112 4108939 4786792 5868766 7021934 7650422 7305128 6242140 5340839 5213762 5614886
43103 5614886 5993645 6315763 6853444 7371991 7186053 6145254 5071469 4978775 6115452
43094 6115452 7861139 9271900 9659622 8996872 7934796 7193802 6860603 6560068 6320709
43085F320709M46265J426517J690739R17978n5472l49484q9454O806k65802l67527
43075I681275J59393R81478J288533P50377m7852k67940K14031P66413Q73407
43066A4399115O64283M79293L26756M3369l06507m99043m44724k22226k852j6837
43056A4420627k95486m30096n8070M02245K22424l03133L182J264732J880716
43047A7107141P13248j039159j397236k80510P99540J159971J392303J650767
43039B0106065J334682O57646P64195J777780K344051J803629J291212J789159
43031C1868419K542602K557752K395297L076033M185811M588557M356340M464225
43023F0035036M975562N030703M468904M022882L850122L217321J920815Q36386
$$ plain form
43085 6320709 6766974 8193491 9884230 10802208 10746736 10397252 10307798 10314604 10048802 9681275
43075 9681275 9840668 10822146 12110679 12861056 12813204 12545264 12759295 13525708 14399115
43066 14399115 15063398 15542691 15869447 15912816 15606309 15107266 14662542 14440316 14437464 14420627
43056 14420627 14125141 13695045 13636975 14039220 14261644 13958511 13961693 15226425 17107141
43047 17107141 17820389 16781230 15383994 15103484 15903024 17062995 18455298 20106065
43039 20106065 21440747 22098393 22862588 24640368 26984419 28788048 30079260 31868419
43031 31868419 34411021 36968773 39364070 42440103 46625914 51214471 55570811 60035036
43023 60035036 65010598 70041301 74510205 78533087 82383209 85600530 87521345 88357731
43015H8357731N88017N98104j3433j291945k705828l949997m934081n354717m876393
43006F6417458l705220k620363k287931k599470k817965k494965k078344k241215
42998D5571985k732822k596263j665602r58257j101260j306383p52015j23982
42990C4335401n66087j684832k042323j391867r03638j096989j096231l78831
42982B5174603J63834l21560j261181j599605j287930r70025q78314q79048j015701
42973A7125073j172559p56787L75888J166134N71139p45329j071962Q231J039828
42964A6539656P45905l26767q06615m31134j55877o00109j212458j165212m89246
42955A2098143J36094M41413Q12702J403428J614190R39883l2152j79353O17585
$$ plain form
43015 88357731 88945748 89543852 89530419 88238474 85532646 81582649 76648568 71293851 66417458
43006 66417458 62712238 60091875 57803944 55204474 52386509 49891544 47813200 45571985
42998 45571985 42839163 40242900 38577298 37619041 36517781 35211398 34459383 34335401
42990 34335401 33769314 32084482 30042159 28650292 27746654 26649665 25553434 25174603
42982 25174603 25338437 25016877 23755696 22156091 20868161 19898136 19019822 18140774 17125073
42973 17125073 15952514 15195727 15571615 16737749 17308888 16563559 15491597 15499828 16539656
42964 16539656 17285561 16958794 16152179 15721045 15565168 14965059 13752601 12587389 12098143
42955 12098143 12234237 12675650 13488352 14891780 16505970 17445853 17413701 17234348 17851933
42946A7851933J192599O10769n97560j154227o24540J91720L00087m80683j529210
42937A5760888k122735k043364j609215j171379o83472M5654P50904P72911r2552
42928I607640j133801j431697q86203k61952k50714o92484p91005o0340J023606
42919E123050J477497R47581Q6716l92898o00935r39939j161506p70346j16490
42910C652730n9648n35158n62182Q8450M24594o1837m20215J91304J028830R53709
42900D700577K56443L4236L71895N02171L64194N56250R06724N66502l81431q08091
42890G069470l20072J50177m6360l28304j34234M7717l08512o92347l94170L00682
42880E344047O15204M14860P1330k76320n76355m88169Q5028N43220M03707Q6771
$$ plain form
42946 17851933 19044532 19655301 19057741 17903514 17278974 17470694 17770781 17290098 15760888
42937 15760888 13638153 11594789 9985574 8814195 8130723 8176377 8927281 9700192 9607640
42928 9607640 8473839 7042142 6155939 5893987 5643273 4950789 4159784 4099444 5123050
42919 5123050 6600547 7548128 7634844 7241946 6641011 5701072 4539566 3769220 3652730
42910 3652730 3593082 3057924 2495742 2584192 3008786 2946949 2526734 2718038 3746868 4700577
42900 4700577 4957020 4991256 5363151 5865322 6229516 6785766 7692490 8258992 7877561 7069470
42890 7069470 6749398 6899575 6853215 6524911 6390677 6438394 6129882 5437535 5043365 5344047
42880 5344047 5959251 6374111 6445441 6169121 5592766 5104597 5189625 5732845 6136552 6223323
42870F223323J29183J74028l17580q63792o07095J81346M76481J97246K01889
42861E795029N79102L89057n53933j049813l25247P38274J029022P95837Q07038
42852H204366Q34876K27077o05823o23233J51106O20608L18360k3350J82657M79734
42842I766378K23248m33252q62191p42636j89517M23736N42815j34242j051148
42833G543191j179543l15094N65639N87191L7492k87967k35646k07386l62603
42824F145274n24008n71594l93190K15811J042813J251400M01362o52839p17282
42815F197747R5019N81164K24182k54100k33463m9675j26143j87162O4946K34686
42805F547201q7152m68997k28747M50430P32194L06614k95427n39751m65146l27475
$$ plain form
42870 6223323 6352506 6526534 6208954 5345162 4738067 4919413 5395894 5593140 5795029
42861 5795029 6374131 6763188 6209255 5159442 4834195 5572469 6601491 7397328 8204366
42852 8204366 9039242 9266319 8660496 8037263 8188369 8808977 9127337 9103987 9286644 9766378
42842 9766378 9989626 9556374 8694183 7951547 7762030 8185766 8728581 8594339 7543191
42833 7543191 6363648 6048554 6614193 7201384 7238876 6950909 6715263 6507877 6145274
42824 6145274 5621266 5049672 4656482 4872293 5915106 7166506 7567868 6915029 6197747
42815 6197747 6292766 6873930 7098112 6844012 6610549 6560874 6434731 6247569 6312515 6547201
42805 6547201 6460049 5991052 5762305 6212735 6944929 7251543 6956116 6416365 5951219 5623744
42795E623744j41320J74452M32623K55213m07690r68240p07139K54981Q47673
42786E364297L55739m74362l53740O92741J372175J109268P95272J084539J208546
42777A1154475M39617l66898o2125P18714L92136r77054j620731p43436L52416
42768I287114L20651m42074q17782o27344l44753k8427M46122O71092K24130m25999
42758H262730m23598K19429O38245L44756j95598k78136K07179P41019P25639
42749A0241665R5969n00251l44357M10251Q16067L66771l41564n55762m21960
42740I766829n05692p30350n87304j47700j4472k94002l89147P0937P52004J227987
42730I149090J501146J719267J866967J923844J896020J566535P04831l22700
$$ plain form
42795 5623744 5482424 5656876 6089499 6344712 5937022 4968782 4261643 4516624 5364297
42786 5364297 5720036 5245674 4891934 5584675 6956850 8066118 8861390 9945929 11154475
42777 11154475 11594092 11227194 11165069 11883783 12275919 11298865 9678134 8934698 9287114
42768 9287114 9607765 9165691 8347909 7720565 7375812 7347385 7793507 8464599 8688729 8262730
42758 8262730 7839132 8058561 8696806 9041562 8845964 8567828 8775007 9516026 10241665
42749 10241665 10337634 9837383 9493026 9903277 10719344 11086115 10744551 10188789 9766829
42740 9766829 9261137 8530787 7943483 7795783 7781311 7487309 7098162 7169099 7921103 9149090
42730 9149090 10650236 12369503 14236470 16160314 18056334 19622869 20327700 20005000
42722B0005000p10347k67524K06413L556m84227l64472M40544J082802R45383
42713B0857128L74616R7651K72763M06822J06452l58300l67502K62868J018072
42704B2670570J291724J070819Q30009R04208J244858J682687K061914K142883
42696C3899672J794862J360160J392501J865423K071448J577332Q76666P07028
42688D5545092J030911J156438O77707j81824j053475j736370k005972j632787
42680D1799720q29077l33783p31504j781225k603787k517638j657000q37502p92996
42671B9715208j424719j857072j415009m56739O6681j79971o13782p28554p84859
42662B2321184j104405j251687o96225n447l71438j790353k695255j962183m94877
$$ plain form
42722 20005000 19294653 19027129 19233542 19237098 18752871 18388399 18828943 19911745 20857128
42713 20857128 21231744 21329395 21602158 22008980 22115432 21757132 21389630 21652498 22670570
42704 22670570 23962294 25033113 25863122 26767330 28012188 29694875 31756789 33899672
42696 33899672 35694534 37054694 38447195 40312618 42384066 43961398 44838064 45545092
42688 45545092 46576003 47732441 48410148 48228324 47174849 45438479 43432507 41799720
42680 41799720 40970643 40636860 39905356 38124131 35520344 33002706 31345706 30508204 29715208
42671 29715208 28290489 26433417 25018408 24561669 24628350 24448379 23834597 23106043 22321184
42662 22321184 21216779 19965092 19268867 19263420 18891982 17101629 14406374 12444191 11949314
42653A1949314K8491n59516r61051n33820j26133n02756j057642q12071O7290
42644G492106O02363M01884r8850m96207o87499m63939K96706J046913J018387
42635I111864L42178r8517n8385k27224q24928r59986r5987P61065L84847p49578
42625G585349j057331j20255Q30668P86535J80545j27724j07941j86907l35435
42616G447504k52923m9958q1698l22845m47378l65278k18193o477L20368N39473
42606F562595L86437K3302j58254j02281n395K01502P13954J243364J214888O74978
42596A0755090L05768L15865Q9703o09738q80697O0627J402472J554041K72149
42587A3265280j064820j403381j193317j210817j176095l80779Q71216J430278
$$ plain form
42653 11949314 11977805 11418289 10457238 9923418 9797285 9294529 8236887 7424816 7492106
42644 7492106 8094469 8496353 8397503 7901296 7213797 6749858 7046564 8093477 9111864
42635 9111864 9454042 9355525 9297140 9069916 8244988 7285002 7189015 7950080 8334927 7585349
42625 7585349 6528018 6407763 7238431 8024966 8205511 8077787 7969846 7782939 7447504
42616 7447504 7194581 7144623 7062925 6740080 6292702 5927424 5709231 5702754 6023122 6562595
42606 6562595 6949032 6972334 6814080 6711799 6706404 6907906 7621860 8865224 10080112 10755090
42596 10755090 11060858 11376723 11466426 10856688 9975991 10036618 11439090 12993131 13265280
42587 13265280 12200460 10797079 9603762 8392945 7216850 6836071 7707287 9137565
42579I137565Q12565k38078p85849o67302k56643J36099K88196n3587q02361j241921
42569F328684o46882P24288J658518J271347O0263o33458j61138P93626J232314
42560A0627562J098951J096030J477032J701881J443234J262168J772357K579542
42552B3058757K745033K121517J483700J278202R90938Q2072j068466j689146
42544B9002607j718805j777336k170044k491167k287945j670418j085079q04854
42536A4996959q52514j167096j550874j594251j015629j32649K98950r2124q03421
42527H087351j025433o03744j54167k11691n67071n92212j9661P57867J037858
42518F709097M05164q00930j566779j090729K62171J259250J232314P34484N06735
$$ plain form
42579 9137565 9950130 9712052 8926203 8258901 8002258 8138357 8426553 8372966 7570605 6328684
42569 6328684 5681802 6406090 8064608 9335955 9396218 8762760 8601622 9395248 10627562
42560 10627562 11726513 12822543 14299575 16001456 17444690 18706858 20479215 23058757
42552 23058757 25803790 27925307 29409007 30687209 31678147 31760219 30691753 29002607
42544 29002607 27283802 25506466 23336422 20845255 18557310 16886892 15801813 14996959
42536 14996959 14144445 12977349 11426475 9832224 8816595 8683946 8982896 8890772 8087351
42527 8087351 7061918 6458174 6304007 6092316 5525245 4933033 4913372 5671239 6709097
42518 6709097 7114261 6313331 4746552 3655823 3917994 5177244 6409558 7144042 7650777
42509G650777M59100K35732P6855K01393o5049j285099k393368j753184K17014
42500C344171J188795K19330q13073q9469J388481J445851K1253j000863o52547
42491E051929K26279P71250J071413J232167R61521M25226K68327M59489K64811
42482A0732412l33152m01166L33550Q16838K02790r55561j644032j598003j041017
42473F112659j75198M79612K09247p67300j211034n37664M02605Q40179J166487
42464F519593J645387J415244P8522r30173j99238J351206J762143R12430K30239
42455A2785353R8296l43410j033496q57162J35267N14507p3266l04949L08778
42446A1229918M11182o75338j415597n03436Q52298Q09198k47257n79829R3792
$$ plain form
42509 7650777 8109877 8345609 8422464 8623857 8558808 7273709 4880341 3127157 3344171
42500 3344171 4532966 4752296 3939223 3849754 5238235 6684086 6705339 5704476 5051929
42491 5051929 5278208 6049458 7120871 8353038 9314559 9739785 10008112 10467601 10732412
42482 10732412 10399260 9998094 10331644 11148482 11351272 10395711 8751679 7153676 6112659
42473 6112659 5937461 6417073 6626320 5859020 4647986 4110322 4512927 5353106 6519593
42464 6519593 8164980 9580224 9658746 8728573 8529335 9880541 11642684 12555114 12785353
42455 12785353 12883649 12540239 11506743 10649581 10784848 11299355 11226089 10921140 11229918
42446 11229918 11641100 10965762 9550165 9046729 9899027 10708225 10460968 9881139 9974931
42437I974931N61215L29302R6866K82861O48529J196575J989715K269192J284875
42428A8634061m9773R9296J925700L649298M029134L741681L788185L987399L841791
42419D3646772L694322M065757M731233N361102O304466P763528Q785806Q115366
42411I2468352N751699K797006R64k651438m987129o243773o020390n113895m889584
42402G1111812n819168o903871o771332n328742l952255l755863m128302l688366
42394C0763913k398719j649992k107636k666215k164615j117519p67487j124690
42386A6767040j120435m07256J43331j89987j009896j432965j085933k88093L34033
42377A1709839L55953K3792R0385P84201J249877O74966l26208m19221M27715
$$ plain form
42437 9974931 10536146 10865448 10962314 11245175 11893704 13090279 15079994 17349186 18634061
42428 18634061 18584288 18683584 20609284 24258582 28287716 32029397 35817582 39804981 43646772
42419 43646772 47341094 51406851 56138084 61499186 67803652 75567180 84352986 92468352
42411 92468352 98220051 101017057 101018021 98366583 93379454 87135681 81115291 76001396 71111812
42402 71111812 65292644 58388773 51617441 46288699 42336444 38580581 34452279 30763913
42394 30763913 28365194 26715202 24607566 21941351 19776736 18659217 17891730 16767040
42386 16767040 15646605 15239349 15382680 15192693 14182797 12749832 11663899 11375806 11709839
42377 11709839 12065792 12089584 12179969 12964170 14214047 14889013 14562805 14143584 14571299
42368A4571299P91669j6599p89942k21012J070332J419773N30657k34735M6283
42359A7167725O25054L70972n72985j128070q05800j31800L19408N71961P68575
42350A7185040O93230K36945p0255L75936J284381J712409J354318R28021J002836
42341B4702861J111900N96654j91164l41334K08104O23986N89622Q50897J953417
42332C0104943L158145L279906K260832J274692J345731K350546L419886L928866
42324E1123547L918629L768092L706115L700458L718503L913930M461170N338897
42316H3649341O430412P702570R086802J0380696J1598797J3180691J5236539
42309A57265848J6610080J5454517J1100285M851175j363738o538643j0419298
$$ plain form
42368 14571299 15362968 15346369 14556427 14335415 15405747 16825520 17356177 17121442 17167725
42359 17167725 17792779 18163751 17590766 16462696 15656896 15525096 15844504 16416465 17185040
42350 17185040 17878270 18115215 18044960 18420896 19705277 21417686 22772004 23700025 24702861
42341 24702861 25814761 26411415 26220251 25878917 26087021 26711007 27300629 28151526 30104943
42332 30104943 33263088 36542994 38803826 40078518 41424249 43774795 47194681 51123547
42324 51123547 55042176 58810268 62516383 66216841 69935344 73849274 78310444 83649341
42316 83649341 90079753 97782323 106869125 117249821 128848618 142029309 157265848
42309 157265848 173875928 189330445 200430730 205281905 203918167 197379524 186960226
42302A86960226j2630110j3010015j2511723j2606805j3534235j3972067j2847098
42295I5848173j0793149r253891q631423q054412o804096n201486l888890k853189
42287D0367637j676878m80803K2097m50224j151030j087830j32364J072954K142516
42278C8626075L310717M709707N882828O348348O206108N737387M714843K676705
42270G8212718j76609k855296m462775m920517m759110m452327m073969l486766
42262D9025349k783234k461468k943512l866560m224157l483807k230229j339211
42254B5693171q89526m40244m4901j85172p77607j102073q78518o42689p87882
42245A9944559r88308r62780j063496j523597j760279j179342k36236J11541k38114
$$ plain form
42302 186960226 174330116 161320101 148808378 136201573 122667338 108695271 95848173
42295 95848173 85055024 75801133 67169710 59115298 52311202 47109716 43220826 40367637
42287 40367637 38690759 38209956 38232053 37781829 36630799 35542969 35410605 36483559 38626075
42278 38626075 41936792 46646499 52529327 58877675 65083783 70821170 75536013 78212718
42270 78212718 78036109 75180813 70718038 65797521 61038411 56586084 52512115 49025349
42262 49025349 46242115 43780647 40837135 36970575 32746418 29262611 27032382 25693171
42254 25693171 24803645 24363401 24318500 24133328 23355721 22253648 21375130 20732441 19944559
42245 19944559 18956251 17993471 16929975 15406378 13646099 12466757 12230521 12342062 12103948
42236A2103948n08403k63552J05161J24182k15970p20031j141631r99723L7314
42227H521295J366672J776653R51809R068P547N02008L09635o62765j250758o70681
42217A0860483M87656J163345J101620Q24752P37355P46173O19802L27619K5405
42208A6894210m0952L69282J263168K265468K896309L028233K889869K598411
42200C2163998J944796Q09466l85347r14417m91233L51174O94768O2155j155676
42191C3079684k082702k222220j931713j928612k353025k583507k098906j207880
42183A6671119o06250m43449k89114O7029L33704L20765K56311K36621j04122
42174A6442614r11605j522061j197293k51976K51572l6285k73333L47960J473304
$$ plain form
42236 12103948 11595545 11331993 11437154 11561336 11345366 10625335 9483704 8483981 8521295
42227 8521295 9887967 11664620 12616429 12625497 12633044 13135052 13444687 12781922 11531164 10860483
42217 10860483 11348139 12511484 13613104 14437856 15175211 15921384 16541186 16868805 16894210
42208 16894210 16853258 17222540 18485708 20751176 23647485 26675718 29565587 32163998
42200 32163998 34108794 34918260 34532913 33618496 33127263 33478437 34173205 34235360 33079684
42191 33079684 30996982 28774762 26843049 24914437 22561412 19977905 17878999 16671119
42183 16671119 16064869 15621420 15332306 15399335 15733039 16053804 16310115 16546736 16442614
42174 16442614 15531009 14008948 12811655 12559679 12811251 12774966 12501633 12849593 14322897
42165A4322897K128882K007954J664118J561611J495871J086706M25329p7158
42157B4616210l00803n52155j076053j670515j904250j583635q82002j21625M10478
42148A6935650N42245L69091K90353N96125J004218R70381N32149L55989O89176
42139B2285377Q22840J46326p27688p23250J2403J79760p42436j613692j217250
42130A8422390L5307P48054L93067l52983q94205j395617k034057k360670j865804
42121A0695482p71167J74497N28582M82646M30945M46573K47901l54710j020636
42112A0860113j037340r8983J157306J688741J178008L49727K2769J35074R001
42103A4264416n91497j115695j028888n55565k80719k42388O3295P43178J152311
$$ plain form
42165 14322897 16451779 18459733 20123851 21685462 23181333 24268039 24693368 24616210
42157 24616210 24315407 23763252 22687199 21016684 19112434 17528799 16646797 16525172 16935650
42148 16935650 17477895 17846986 18137339 18733464 19737682 20708063 21240212 21596201 22285377
42139 22285377 23108217 23254543 22526855 21803605 21816008 21995768 21253332 19639640 18422390
42130 18422390 18457697 19205751 19598818 19245835 18351630 16956013 14921956 12561286 10695482
42121 10695482 9924315 10098812 10627394 11110040 11540985 11987558 12235459 11880749 10860113
42112 10860113 9822773 9723790 10881096 12569837 13747845 14097572 14120341 14255415 14264416
42103 14264416 13672919 12557224 11528336 10972771 10692052 10449664 10512959 11256137 12408448
42094A2408448Q15718K16365P7629J97199j85284r34916r19214L14920J661649
42085A3652514J896804J318367J146388J753014K381184K384199J868149J172078
42077B7572697N10827J44949J76594J61626l74263j083600j262367j091107j379731
42068B3375625j986182j720768k60158J061256J105791M84057L12147M15489j1011
42059B2776246p12812p64626k24869L4812k8534L91165J277302J573050J005676
42050B5327410P67992J727571L096042L698100L644055L819963M428847N047325
42042E1557305N672399O698757Q066128R375565J0888022J3642881J8355560K4523279
42034A48779896L0462125L3706809L1661300K3016268R300078n228606j5913568
$$ plain form
42094 12408448 13224166 13440531 13518160 13715359 13530075 12595159 11675945 11990865 13652514
42085 13652514 15549318 16867685 18014073 19767087 22148271 24532470 26400619 27572697
42077 27572697 28083524 28228473 28405067 28566693 28192430 27108830 25846463 24755356 23375625
42068 23375625 21389443 19668675 19408517 20469773 21575564 22059621 22371768 22787257 22776246
42059 22776246 22063434 21298808 21073939 21108751 21080217 21471382 22748684 24321734 25327410
42050 25327410 26095402 27822973 30919015 34617115 38261170 42081133 46509980 51557305
42042 51557305 57229704 63928461 71994589 81370154 92258176 105901057 124256617 148779896
42034 148779896 179242021 212948830 244610130 267626398 276926476 271697870 255784302
42027B55784302k0512647k0252084j8481852j8064254j9416253k0704531j9976331
42020A18376350j7105794j3603171j0822844q866735p197983n633194m311299
42013E0835330l136118j899846q82988p15705j428756k108849j905207j111402
42005C7646459p37917j091346j383509r45345k48279k22768r15257j443926j182221
41996B9475891l93661L45572P97095R73155Q80403O08434L61285K27698J86471
41987C3462343L74489R44898J610638J856695J750391J952717K684019L326478
41979D7962668L446585L578319M463638O089711Q085122J0515592J3571812J7006987
41971A14720434K0769285K5698771L2332838L8932934M1728080L7605961K6406895
$$ plain form
42027 255784302 235271655 215019571 196537719 178473465 159057212 138352681 118376350
42020 118376350 101270556 87667385 76844541 67977806 60779823 55146629 50835330
42013 50835330 47699212 45799366 44916378 44200673 42771917 40663068 38757861 37646459
42005 37646459 36908542 35817196 34433687 33488342 33240063 33017295 32102038 30658112 29475891
41996 29475891 29082230 29427802 30224897 31198052 32078455 32686889 33048174 33275872 33462343
41987 33462343 33836832 34781730 36392368 38249063 39999454 41952171 44636190 47962668
41979 47962668 51409253 54987572 59451210 65540921 73626043 84141635 97713447 114720434
41971 114720434 135489719 161188490 193521328 232454262 274182342 311788303 338195198
41964C38195198J1046143l800613j3666441j6667097j4646862j1219516q280023
41957B80960789n054836n73638M094435O535162M963879q74434r550270j7917318
41949B62583769k2478371k2222957j9690091j8187328j8375064j8505020j7339380
41942A25785558j5384947j3460128j1586014r641758p939318o626630n348894
41935E5797869l938996k744392j912151j067053j04334M23287K55337J37931R36221
41926D7783719K494369M067504N555121P561986J0392320J3739558J7380780K1328753
41918A30304110K4834932K5799710K2000734J3184272J789877q484274j4898405
41911A94530956j6906404j5940763j4326508j3904240j4897123j5899897j5358426
$$ plain form
41964 338195198 349241341 345440728 331774287 315107190 300460328 289240812 280960789
41957 280960789 275905953 275332315 279426750 285961912 290925791 290051357 280501087 262583769
41949 262583769 240105398 217882441 198192350 180005022 161629958 143124938 125785558
41942 125785558 110400611 96940483 85354469 75712711 67773393 61146763 55797869
41935 55797869 51858873 49114481 47202330 46135277 46030943 46454230 46709567 46847498 47783719
41926 47783719 50278088 54345592 59900713 67462699 77855019 91594577 108975357 130304110
41918 130304110 155139042 180938752 202939486 216123758 217913635 209429361 194530956
41911 194530956 177624552 161683789 147357281 133453041 118555918 102656021 87297595
41904H7297595j3203182j0711535q809727p212797n507454m206486l893872l896795
41896B9855747k972379j242857k93863j006958k262677k430613j462354p00995
41888A7483051r47276j541312j420373m68108N02587Q26501O70202N76737N87998
41879A6270007J89317p98098j674228j579746n34189O56071J348144J455867J089285
41870A6422430M50712N4303L43841R71162J117296O91377N04596J010386J643597
41861B3209700J832473J928911K524752L411234L869514L589231K746633J595700
41853D4708148N31299R9372L28526M75368L7936m83516n37283o24186j451691
41844D3083973k439349k291337r18352M27301R84586J234995J588745J571747
$$ plain form
41904 87297595 74094413 63382878 54573151 47360354 41852900 37646414 33752542 29855747
41896 29855747 26883368 25640511 25346648 24339690 22077013 19646400 18184046 17483051
41888 17483051 16535775 14994463 13574090 13105982 13608569 14435070 15105272 15682009 16270007
41879 16270007 16459324 15661226 13986998 12407252 11873063 12529134 13877278 15333145 16422430
41870 16422430 16873142 16927445 17271286 18242448 19359744 20051121 20555717 21566103 23209700
41861 23209700 25042173 26971084 29495836 32907070 36776584 40365815 43112448 44708148
41853 44708148 45239447 45338819 45667345 46142713 46180649 45697133 45159850 44535664 43083973
41844 43083973 40644624 38353287 37434935 37862236 38846822 40081817 41670562 43242309
41836D3242309Q98265L06222N34431J217753J600891J754641K188427K614702
41828E4357641K070965L33015j520845k257014j829224j285271j495075k294192
41820D6080000k991767l404391l873461m286705l868867k416934j033937q10802
41812B3393136j309591j395279j157093j634612k718839k902533j543182N1281
41804A0783288M96307M8125l72293o81410j099013j117369k47433Q88376J353424
41795A0052002J200217R41451M52977l54417m97899Q67401K624952K769718J195324
41786A9251726k32012m37143k60337m99635o01877r6635J79565n87936j708898
41777A5006818j974184j377997q01043n48592k48944J52008K99196K28527M27113
$$ plain form
41836 43242309 44140574 44446796 44981227 46198980 47799871 49554512 51742939 54357641
41828 54357641 56428606 56761621 55240776 52983762 51154538 49869267 48374192 46080000
41820 46080000 43088233 39683842 35810381 31523676 27654809 25237875 24203938 23393136
41812 23393136 22083545 20688266 19531173 17896561 15177722 12275189 10732007 10783288
41804 10783288 11279595 11327720 10955427 10274017 9175004 8057635 7810202 8698578 10052002
41795 10052002 11252219 12193670 12646647 12292230 11794331 12661732 15286684 18056402 19251726
41786 19251726 19019714 18582571 18322234 17822599 17220722 17124087 17303652 16715716 15006818
41777 15006818 13032634 11654637 10853594 10305002 10056058 10208066 10507262 10735789 11162902
41768A1162902J008625J416722J130570L57901j37647J29562P32153P26469j03707
41759A6423550p44773k50963P69138Q66547j31064q20936k64333Q26077J431621
41750A8104864J638951J943255K140140J923511J849119K591679L701603M160918
41742C8054040L900307L770096M106147M196146L241987J276454q89916k297846
41734E5357415k623822k602769l243336m371650m685378l695439k651887k737803
41726B8745331l317516l117023k279556j816078j673554j029155j63923k37652
41718A5110874j152984j386467l12440Q52960R53371L70445J307l997J93892P37664
41708A5364625J543425K051075K078800K057708J981581J184853k78176j176497
$$ plain form
41768 11162902 12171527 13588249 14718819 15076720 14939073 15068635 15800788 16527257 16423550
41759 16423550 15678777 15427814 16196952 17063499 16932435 16111499 15847166 16673243 18104864
41750 18104864 19743815 21687070 23827210 25750721 27599840 30191519 33893122 38054040
41742 38054040 41954347 45724443 49830590 54026736 57268723 58545177 57655261 55357415
41734 55357415 52733593 50130824 46887488 42515838 37830460 34135021 31483134 28745331
41726 28745331 25427815 22310792 20031236 18215158 16541604 15512449 15348526 15110874
41718 15110874 13957890 12571423 12258983 13111943 14065314 14435759 14437066 14433069 14626961 15364625
41708 15364625 16908050 18959125 21037925 23095633 25077214 26262067 25983891 24807394
41700B4807394p90318j1810R6265j37633J72700R72160J664070K277301L153139
41691C2203268M050313M574087M948107N365365N133770L558915J230661o57530
41683F0406956j889628l041224m087246m420549m110266l956680m238914m395988
41675C0266461m013650l258691k334724j365021p87989r72631j421136j240754
41667A4871865m59842Q828k08319m82596l27469j05311k52963n46902n42282k15447
41657A1739562J45337L10187K21469O1273J56014M54718L63310l60655r20451
41648A2170764m83262M59858P38182K75505L7971K77763J79681n21850r49115
41639A2185497o15689k98374o61866j109297q59869k59043p7010k24357j31242
$$ plain form
41700 24807394 24017076 24005266 24101531 23963898 24136598 25108758 26772828 29050129 32203268
41691 32203268 36253581 40827668 45775775 51141140 56274910 59833825 61064486 60406956
41683 60406956 58517328 55476104 51388858 46968309 42858043 38901363 34662449 30266461
41675 30266461 26252811 22994120 20659396 19294375 18506386 17533755 16112619 14871865
41667 14871865 14412023 14420851 14212532 13729936 13402467 13297156 13044193 12497291 11955009 11739562
41657 11739562 11884899 12195086 12416555 12477828 12633842 13088560 13451870 13091215 12170764
41648 12170764 11687502 12147360 12885542 13161047 13199018 13476781 13656462 13134612 12185497
41639 12185497 11569808 11271434 10609568 9500271 8640402 8381359 8304349 8079992 7948750
41630G948750J39763J25745m5229J90801Q23738J156443P07190k47972j000802
41621I798427j003869l06540L94841L87260k55109q37518j026173j095107j143369
41612D912843q49314k41717J12346M3911O6626L31042K48199l02534m30092L23826
41602D215136R87626N86592k95953m68331J17326P09605J128576J500743J270201
41593I751521k6619j396905j361826j41463O16616K42137l29855m07128m34725
41584F511753o97847o23248M7045O49992P70275Q64475J143140J018747L59859
41575A0044191J02873P31895J257853P80366Q5544M00415J288999J255769J08199
41566A6056104p39436l85020L98497M74099j50833o48703n83999k64077j64970
$$ plain form
41630 7948750 8088513 8214258 8169029 8359830 9183568 10340011 11047201 10799229 9798427
41621 9798427 8794558 8488018 8882859 9270119 9015010 8177492 7151319 6056212 4912843
41612 4912843 4063529 3821812 3934158 3978069 4044695 4375737 4623936 4321402 3891310 4215136
41602 4215136 5202762 5789354 5493401 5025070 5142396 5852001 6980577 8481320 9751521
41593 9751521 9724902 8327997 6966171 6824708 7441324 7683461 7353606 6946478 6511753
41584 6511753 5813906 5190658 5237703 5887695 6657970 7522445 8665585 9684332 10044191
41575 10044191 10147064 10878959 12136812 12917178 13002722 13403137 14692136 15947905 16056104
41566 16056104 15316668 14931648 15330145 15804244 15653411 15004708 14420709 14156632 13991662
41557A3991662m01425p15976q47327q87987j155771j618096j716162j069917j33585
41548E445416K90845R2835o4034K92020Q56330J055493P36665J41304m71343q77905
41538G497626q08595k02728N02457P08014L77608J09101K74595M01154j59755
41529H699477j111038j392425o29358K49880K81887k04450k21897K89143M28721
41520F389940j47878o46119l78120K16795L46294P9695J14225O29457J038677
41511G642966Q53482L12931N8065M36012J164228J543356J066195l5556r24987
41502A2116692r63682k97583M21728P07987N05277J8029m67693p13452p23743
41493A0603560p64407j000875j181223r04688k19836K72023O1515o28925j056556
$$ plain form
41557 13991662 13590237 12874261 12026934 11138947 9983176 8365080 6648918 5579001 5445416
41548 5445416 5736261 5829096 5765062 6057082 6913412 7968905 8705570 8846874 8375531 7497626
41538 7497626 6689031 6486303 6988760 7696774 8074382 8183483 8458078 8859232 8699477
41529 8699477 7588439 6196014 5566656 5816536 6098423 5893973 5672076 5961219 6389940
41520 6389940 6242062 5595943 5217823 5434618 5780912 5860607 5974832 6604289 7642966
41511 7642966 8496448 8809379 8867444 9303456 10467684 12011040 13077235 13041679 12116692
41502 12116692 11153010 10855427 11277155 11985142 12490419 12508448 12040755 11327303 10603560
41493 10603560 9839153 8838278 7657055 6752367 6532531 6804554 6866069 6237144 5180588
41484E180588q15859k34250K13294N38897R01401R60791L21011m55054k50652
41475F360167R02837J579223J021261L56800P50962J397913Q54352m01231o64291
41466A2157993M9896o5679j453879k178185r71049O69223Q00814j34306m57448
41457H417380j4494O9652l54710l54344K17324M58816O0705k47852o0550J31393
41447H323320o1664m06752o96602r49083q52599l2521R61576R91791j7739p35443
41437F524284j75528J021716J553438J022146M8636o32534p08636l15254P7191
41428H415459O7247j83684j56007K51371N64973M70778K59859L52524P26429R93060
41418A1762009Q23925K60369k43287k36968Q8655N9690l96832m62386J83958M73349
$$ plain form
41484 5180588 4364729 4130479 4343773 4882670 5784071 6744862 7065873 6610819 6360167
41475 6360167 7263004 8842227 9863488 10220288 10971250 12369163 13223515 12822284 12157993
41466 12157993 12207889 12142210 10688331 8510146 7539097 8208320 9009134 8874828 8417380
41457 8417380 8402886 8472538 8117828 7763484 7980808 8439624 8500329 8252477 8191927 8323320
41447 8323320 8261656 7854904 7158302 6209219 5356620 5324099 6285675 7277466 7259727 6524284
41437 6524284 6348756 7370472 8923910 9946056 9994692 9362158 8653522 8338268 8415459
41428 8415459 8482706 8299022 8143015 8394386 8959359 9430137 9689996 10042520 10768949 11762009
41418 11762009 12585934 12846303 12603016 12366048 12454703 12514393 12117561 11655175 11839133 12312482
41408A2312482m86097j618431j170469N05405J226518K06014q27553m01974N14687
41399A0260582K66986q56982j209954k67627Q79332J239601R72054P05380O27809
41390A2617181M47001r0219p15393p42047K9842P08530L41688n66168o41526J95071
41380A1583960N47681q9494m13676L73449J000119K75380o70589j90194R16060
41371A3332696M94852j383919k297935j072508O22416Q92649P0146l50930J16420
41362A0423887Q39867J214714J045891L81526l98393p79287p41318o71375n20349
41353A0795163J53443J082498J200455J39943j033879j185049m95579R3963J75946
41344A0926904k3366k72899m16213k40193J84454M00045K21779N2850J53791J66191
$$ plain form
41408 12312482 11826385 10207954 9037485 9542890 10769408 10975422 10147869 9745895 10260582
41399 10260582 10527568 9670586 8460632 8193005 9072337 10311938 11283992 11989372 12617181
41390 12617181 13064182 12973963 12258570 11516523 11546365 12254895 12596583 12030415 11388889 11583960
41380 11583960 12131641 12042147 11628471 12001920 13002039 13277419 12606830 12416636 13332696
41371 13332696 13827548 12443629 10145694 9073186 9695602 10588251 10658397 10307467 10423887
41362 10423887 11263754 12478468 13524359 13905885 13507492 12728205 11986887 11315512 10795163
41353 10795163 10948606 12031104 13231559 13371502 12337623 11152574 10656995 10750958 10926904
41344 10926904 10903538 10630639 10214426 9974233 10158687 10558732 10780511 10833361 10987152 11153343
41334A1153343j59394l85628j56635M5149l40677r15467q65091j92968M04452
41325H587084O15476O35609M43158j34235p17326o77014k13415k32808r35039
41316G371490j383485q57206J27327O48516O03262M95455M95149M22366L78072
41307H300946O17507Q42699L84115o89452j286976n92417P45663J298147N85934
41298A0206166m63531q40776o07799l88069k44689K59345J062718J411785Q64021
41289A1259171n1232n14760m09303k49023l29552l75776n2981M83964P29260M39102
41279A0928870n2447k45194j36602k08871o58021j010080q47626n58062p60827
41270F451140j211143j063012k20138M54734M88854M33651P19771Q28799L34011
$$ plain form
41334 11153343 10993949 10608321 10451686 10496835 10156158 9240691 8375600 8182632 8587084
41325 8587084 9202560 9838169 10281327 10147092 9429766 8752752 8539337 8306529 7371490
41316 7371490 5988005 5130799 5258126 5906642 6509904 7005359 7500508 7922874 8300946
41307 8300946 8918453 9761152 10145267 9455815 8168839 7576422 8322085 9620232 10206166
41298 10206166 9742635 8901859 8294060 7905991 7661302 7920647 8983365 10395150 11259171
41289 11259171 11207939 10693179 10283876 10034853 9705301 9329525 9276544 9760508 10489768 10928870
41279 10928870 10876423 10631229 10494627 10285756 9627735 8617655 7770029 7211967 6451140
41270 6451140 5239997 4176985 3956847 4411581 4900435 5334086 6053857 6882656 7216667
41261G216667r4068K56680P23749J51022j149100j653400q42253J58806M17808
41252E185911M03870P83749J144233Q13377J78792J82986Q99821J473727J258544
41243A2325010L29774r02967j910959k079382j255742j91287K14020L0069R656
41234F568192L03926K96063k24764o29469m93519k44686l02658l36675j5343J84278
41224E105345k33876o75081j60632J035714J524951P18045l63132n69469q8938
41215F292927J55001p3853k54876j01231J65710M38691R02512J455521J518924
41206A0499326P21494n35906j460794j650453j325117r24468o55667m12770l8685
41197D216960L77301N15731J94717l34352n58470j64957O96507J533596J858236
$$ plain form
41261 7216667 7122599 7379279 8103028 8254050 7104950 5451550 4609297 4768103 5185911
41252 5185911 5589781 6373530 7517763 8331140 8509932 8692918 9592739 11066466 12325010
41243 12325010 12654784 11751817 9840858 7761476 6505734 6314447 6528467 6558536 6568192
41234 6568192 6872118 7168181 6943417 6313948 5820429 5575743 5273085 4936410 4921067 5105345
41224 5105345 4871469 4196388 4035756 5071470 6596421 7314466 6951334 6381865 6292927
41215 6292927 6447928 6374075 6119199 6017968 6183678 6622369 7524881 8980402 10499326
41206 10499326 11220820 10684914 9224120 7573667 6248550 5324082 4668415 4255645 4216960
41197 4216960 4594261 5109992 5304709 4970357 4411887 4246930 4943437 6477033 8335269
41188H335269J574079J134110J157461J733965K246261K025719J009283l86613
41180A8829534j719247k542486k353761j123266K42204O04681j40769j026433
41172A0770457j323431j291369j378177j312836n69188N95571J211715P53334
41164G456076j73606m73055K36349J177466J242094K74781o66459n56000L09084
41155H826730P39504L04666j09892L58764J266199J443230N35886n91060r18726
41146A1855301l47552L22893K85666m13808r05767n39258K00444K52902n26968
41137A0183853j094928p14008j8918o031n45917p09203k29759K39581K23194o6253
41127G261611l62535p07379r86510q03480j41288L85466K89494j77902m82223
$$ plain form
41188 8335269 9909348 11043458 12200919 13934884 16181145 18206864 19216147 18829534
41180 18829534 17110287 14567801 12214040 11090774 11332978 11937659 11796890 10770457
41172 10770457 9447026 8155657 6777480 5464644 4895456 5491027 6702742 7456076
41164 7456076 7282470 6809415 7045764 8223230 9465324 9740105 9073646 8517646 8826730
41155 8826730 9566234 9870900 9761008 10119772 11385971 12829201 13365087 12774027 11855301
41146 11855301 11507749 11830642 12116308 11702500 10796733 10257475 10457919 10710821 10183853
41137 10183853 9088925 8374917 8355999 8349968 7804051 7094848 6865089 7104670 7327864 7261611
41127 7261611 6899076 6191697 5205187 4401707 4260419 4645885 4935379 4757477 4275254
41118D275254n17165n28334n90209n06020j30709M22476Q60247R40346P17241
41109D943127N15626M86279L04689l67173j209411j491796j021789l44160J30059
41100A945451O21823J295899J633102J088525Q9837l00906K56055R27626Q22107
41091H379519J14123l26055j87927q6650n78187j259220j248302l86153N12247
41082D933395O55119J25706m01917m41361k11N57947P52033M22575J11325N38812
41072G253423J448978J599602M00417j083974j504146j000419o17819m48849K86785
41063F333998J421687J618550L92786r39347j045526k90331J35926o0626l49762
41054G217355n16538p20652p93518m16324J64137L73684J67036q040n138j19563
$$ plain form
41118 4275254 3758089 3229755 2639546 2133526 2002817 2425293 3285540 4225886 4943127
41109 4943127 5458753 5945032 6249721 5882548 4673137 3181341 2159552 1815392 1945451
41100 1945451 2567274 3863173 5496275 6584800 6674637 6373731 6629786 7557412 8379519
41091 8379519 8493642 8167587 7979660 7893010 7314823 6055603 4807301 4421148 4933395
41082 4933395 5588514 5714220 5312303 4870942 4870731 5428678 6180711 6603286 6714611 7253423
41072 7253423 8702401 10302003 10702420 9618446 8114300 7113881 6496062 6047213 6333998
41063 6333998 7755685 9374235 9767021 8827674 7782148 7491817 7627743 7567117 7217355
41054 7217355 6700817 5980165 5186647 4770323 4934460 5308144 5475180 5467140 5462002 5342439
41044E342439m71274p81012p65895l71179K96127R03595R51093L18866m09968
41035E012792n90410k92719l7128j9634j01204l03811p04166r88443p31879n4281
41025A189117N44967Q83780J046628Q10008r8522j139847j192620L4347J411669
41016C489527J588855M19826j057565j728036j267844k17964N62989O68846M71397
41007B930031N71131J012431J281817R70768J38259q48663j483174j312122m30843
40998B829635L46981L18889k18482m33243j43523J22572J30659J89045L46130
40989C488663J95180k87280m97498j41074K75772K60896Q691j26929k27368m56881
40979B492172o55826o82429o45238m69218J42891R29982R83051J6906r28978p64977
$$ plain form
41044 5342439 4871165 4090153 3324258 2953079 3249206 4152801 5103894 5422760 5012792
41035 5012792 4422382 4129663 4092535 4072901 3971697 3667886 2963720 1975277 1243398 1189117
41025 1189117 1734084 2617864 3664492 4474500 4375978 3236131 2043511 2077858 3489527
41016 3489527 5078382 5498208 4440643 2712607 1444763 1226799 1789788 2458634 2930031
41007 2930031 3501162 4513593 5795410 6766178 6904437 6055774 4572600 3260478 2829635
40998 2829635 3176616 3495505 3277023 2843780 2700257 2822829 2953488 3142533 3488663
40989 3488663 3683843 3396563 2899065 2757991 3033763 3294659 3303350 3176421 2949053 2492172
40979 2492172 1836346 1153917 508679 39461 182352 1112334 2095385 2112291 1183313 418336
40969D18336K05943Q36698O48941M8901n29395q70926o98889J0378O34713N78864
40959A283564J27606p9081r2040l04606l74307L91551J619126J998954J087441
40950E658208k4639k33699K38624M89265J96785k80151n39293m06477M3123M21956
40940E563702L62031Q5634J70840O21016P83975L81012j03489l27823n55799p87031
40930F194068l64671Q00909J475950O46822p48440q79756L95417J289390N82818
40921I392507q02243j250638n90778n756k53514p79363o36792K34514R51016P83568
40911G042521L1082l81839l3624O31009J072293J269610J322083J015514L19649
40902A2288298j58089N0863L57518j74739j342784j959124j545326r10241p94546
$$ plain form
40969 418336 624279 1460977 2109918 2158819 1629424 758498 59609 69987 704700 1283564
40959 1283564 1411170 1332089 1240049 935443 561136 952687 2571813 4570767 5658208
40950 5658208 5633569 5399870 5638494 6127759 6324544 6044393 5505100 5098623 5141746 5563702
40940 5563702 5925733 6011367 6182207 6803223 7587198 7968210 7864721 7536898 6981099 6194068
40930 6194068 5829397 6630306 8106256 8753078 8004638 7124882 7520299 8809689 9392507
40921 9392507 8590264 7339626 6748848 6743092 6489578 5710215 5073423 5307937 6258953 7042521
40911 7042521 7073603 6691764 6658140 7289149 8361442 9631052 10953135 11968649 12288298
40902 12288298 12130209 12181072 12538590 12363851 11021067 9061943 7516617 6606376 5811830
40893E811830q96084p12891m83111o00898p64545m79794M1847K21678J2140k16559
40883A933613l75114n67015o01576l17588j32715m78728q83429m95332N44141
40874a373743J181430R80674O22789O29778N40423j47039r90929j199927o77822
40865d34366R4983P68893J162315J015501L31142l06480l11637J87849O49698
40856C157898Q67098R58665R15193P22309O92485J042545J282497O82617o63896
40847I657411j832922k148567j732573r79695j14602N88706P52627L73607m8842
40838D515150j30256l5804r0220k60863k63138L2075M71353P51216O28842J94146
40828E812501q0261J93270Q42549J391627J638880J584473J016535j49162j202664
$$ plain form
40893 5811830 4915746 4202855 3719744 3118846 2354301 1874507 1916354 2138032 2150172 1933613
40883 1933613 1558499 991484 389908 72320 -60395 -539123 -1422552 -1917884 -1373743
40874 -1373743 -192313 788361 1411150 2040928 2581351 2434312 1443383 243456 -434366
40865 -434366 -339383 429510 1591825 2607326 2938468 2631988 2320351 2508200 3157898
40856 3157898 4024996 4983661 5898854 6621163 7313648 8356193 9638690 10321307 9657411
40847 9657411 7824489 5675922 3943349 2963654 2849052 3437758 4190385 4563992 4515150
40838 4515150 4384894 4349090 4258870 3998007 3734869 3766944 4238297 4989513 5618355 5812501
40828 5812501 5732240 5925510 6768059 8159686 9798566 11383039 12399574 12250412 11047748
40819A1047748j190222l22400N9150o71007j489047j280143n10261l91228r41369
40810D311221j038755k50213N19919M13547k42552n68653k83531J78170K94966
40801C334119j09068p58382j037389m97318N83378J431740J673134J617152J528162
40792G765528J122252J55459q97280j286049r41629m87970l35861k51462M4509
40783D887497K82780K063o80789j045441n96208L24265R22135Q22792L33242j12121
40773E140215m51568p94582r91348p44567r9520M97614P05472N99376L75504L2667
40763D269263l96254n29396r344P93338R53698J80912n50736j11851J183241J769857
40753G552728P89981p99287j493037j053338m22304k42642l17896m03617o06229
$$ plain form
40819 11047748 9857526 9535126 9594276 8923269 7434222 6154079 5643818 5252590 4311221
40810 4311221 3272466 3022253 3542172 3955719 3713167 3144514 2860983 3039153 3334119
40801 3334119 3225051 2466669 1429280 931962 1515340 2947080 4620214 6237366 7765528
40792 7765528 8887780 9043239 8145959 6859910 5918281 5430311 5094450 4842988 4887497
40783 4887497 5170277 5172340 4491551 3446110 2849902 3174167 4096302 4919094 5252336 5140215
40773 5140215 4688647 3894065 2902717 2158150 2058630 2556244 3261716 3861092 4236596 4269263
40763 4269263 3873009 3343613 3334269 4127607 5081305 5262217 4711481 4599630 5782871 7552728
40753 7552728 8342709 7543422 6050385 4997047 4574743 4332101 4014205 3610588 3004359
40744C004359q29673o52216j00028J40171l05765q88040r12577m08964J78629
40735g74104O12803P48153M18395l2354K22786J255093J865384J191260J58071
40726E665487J73167R18535R14375N9820p8472J205341K555311K566092J600691
40717A5580347O79871j87060j334603k107062j719409r02293j084384k059660
40709F865747k047261l68851J367309J434857K00443p55697q84282q85477j120975
40700C805813j057847l85457L41812N63653M76807M88846N15075L49269K09449
40691E307420K63663O2934p18816j294630n85974R68224J605699O18436o02430
40682E624526o04342R3465R5457n28358m40430O82670J544095J165481K21803
$$ plain form
40744 3004359 2174686 1522470 1422442 1562613 1256848 368808 -543769 -952733 -774104
40735 -774104 -161301 586852 1005247 972893 1195679 2450772 4316156 5507416 5665487
40726 5665487 5838654 6757189 7671564 7731384 7652912 8858253 11413564 13979656 15580347
40717 15580347 16260218 16073158 14738555 12631493 10912084 10009791 8925407 6865747
40709 6865747 4818486 4449635 5816944 7251801 7452244 6696547 5812265 4926788 3805813
40700 3805813 2747966 2362509 2704321 3267974 3744781 4233627 4748702 5097971 5307420
40691 5307420 5571083 5634017 4915201 3620571 3034597 4002821 5608520 6226956 5624526
40682 5624526 5020184 5113649 5209106 4680748 4240318 4922988 6467083 7632564 7854367
40673G854367j10707K43753M84418K23832q4726J78033J054843J881985J879413
40664A3605211J050314L02974K94827M68439r3994j157853j660387j431090j367487
40655A0010954j705567j471687k68104O68086J85448r74601j257164n01412J59017
40646D844970J73138O9865J83280Q1343m94647j013146q44023l7604Q24054J194553
40636D981783R05348K73908j14981l40K76436L12827J99226J90305J57156j34418
40626G047250m64568m39971j58203m6575j63252j64151J38307O16836J063811
40617G429484J185754O61100k99389q11770l89644J79032j74706j171213j484390
40608E124258o35177L82754N53798L9292m17625n30394m19367p8618N10659R71678
$$ plain form
40673 7854367 7743660 7987413 8471831 8695663 8610937 8788970 9843813 11725798 13605211
40664 13605211 14655525 14958499 15253326 15721765 15627771 14469918 12809531 11378441 10010954
40655 10010954 8305387 6833700 6565596 7233682 7419130 6444529 5187365 4685953 4844970
40646 4844970 5018108 5087973 5271253 5352596 4857949 3844803 3000780 2963176 3787230 4981783
40636 4981783 5887131 6161039 6046058 6045718 6322154 6634981 6834207 7024512 7181668 7047250
40626 7047250 6582682 6142711 5984508 5937933 5774681 5610530 5748837 6365673 7429484
40617 7429484 8615238 9276338 8976949 8165179 7775535 7954567 7779861 6608648 5124258
40608 5124258 4489081 4871835 5425633 5464925 5047300 4516906 4097539 4018921 4529580 5501258
40598E501258P61601j18817r06713p95688P0181N61833j15362j233153j334973
40589B390167k50961O00284K82559l28289l4119Q48444J214456R25348N66345
40580F214234J10613p14805j212108n06219O56036O06173p04180j545494j012076
40571A892174j04506J72064J08008J03435j75307o68428m94352M24064P63909
40562B021061j01281q01073l4163J287786J406473K81220o85980p90817m69721
40553B113505r1974L77566P96071R56388R70209P84559l8745j238280j478406
40544C150893k29372R02789K23312j413235j738875l85160Q01797O53394K6330
40535A991873k1958K65765K72164J41377K86924O12710P33695M05649l93248j206915
$$ plain form
40598 5501258 6262859 6144042 5237329 4441641 4511822 5073655 4958293 3725140 2390167
40589 2390167 2139206 2739490 3022049 2693760 2659641 3508085 4722541 5647889 6214234
40580 6214234 6324847 5610042 4397934 3891715 4547751 5153924 4449744 2904250 1892174
40571 1892174 1787668 1959732 2067740 2171175 1995868 1327440 833088 1257152 2021061
40562 2021061 1919780 1118707 1084544 2372330 3778803 4060023 3374043 2583226 2113505
40553 2113505 2021531 2399097 3195168 4151556 5121765 5906324 5867579 4629299 3150893
40544 3150893 2921521 3824310 4047622 2634387 895512 510352 1312149 1965543 1991873
40535 1991873 1969915 2235680 2507844 2649221 2936145 3548855 4282550 4688199 4294951 3088036
40525C088036j108816J73203J398615J196340R0875j98119O05381R77656Q6540
40516F309711j036543j375371j360903j532759j222281J94809J780414K089732
40508C846809J115301L8265m83951p20084q87133p96169m21464o9945M8663l5990
40498A634302k54584n04191o21489n77708m40324m7049P69863J480086J125059
40489B563965k64255j230754n47513J175263K207153J666014J72571j117585j493083
40480C131776r29401L828M98485J89702n05995q84727o03538K33620J231221J773380
40470D138351J413915M52892l07772n59830o90812q42496n59019K48538Q20709
40461D114476O26544J78375Q6622J6743n77287j283887j253083n01686J83012
$$ plain form
40525 3088036 1979220 2152423 3551038 4747378 4838253 4640134 5245515 6223171 6309711
40516 6309711 5273168 3897797 2536894 1004135 -218146 -23337 1757077 3846809
40508 3846809 4962110 5000375 4516424 3796340 2909207 2113038 1691574 1621629 1670292 1634302
40498 1634302 1379718 875527 254038 -323670 -763994 -811043 -41180 1438906 2563965
40489 2563965 2299710 1068956 521443 1696706 3903859 5569873 5742444 4624859 3131776
40480 3131776 2202375 2206203 2704688 2894390 2388395 1503668 900130 1133750 2364971 4138351
40470 4138351 5552266 6005158 5697386 5137556 4446744 3604248 3045229 3293767 4114476
40461 4114476 4741020 4919395 5006017 5022760 4445473 3161586 1908503 1406817 1589829
40452A589829L68067K40805N4056K2333M05882R77064Q79213j35425q70120j72868
40442C358836J187095J440726L96471l44117J64427R94324J011111M74379K49037
40433H932289L66859K04533m53054j187249j458902r83792K8985P90536N66282
40424F806487l91525j059952r52687n88116m79376m45443k92462l63976q12712
40415A420238j007914m13953M25118N64415K3373k98947M1086M89223L67052k40816
40405A368875o59052l92591M05427J098121J159061O59908J23290q9028o0130
40396C613881O299J08620L44919P15304J085708J145431N10321p11583j549216
40387E269684j021623N00765J472035J012624p0729n05121j36783K62948K07126
$$ plain form
40452 1589829 1957896 2198701 2252757 2275090 2680972 3658036 4537249 4401824 3531704 3358836
40442 3358836 4545931 5986657 6383128 6039011 6203438 7197762 8208873 8683252 8932289
40433 8932289 9299148 9503681 9050627 7863378 6404476 5420684 5449669 6240205 6806487
40424 6806487 6414962 5355010 4402323 3814207 3334831 2889388 2596926 2232950 1420238
40415 1420238 412324 -1629 423489 987904 1011277 712330 753416 1242639 1609691 1368875
40405 1368875 709823 317232 722659 1820780 2979841 3639749 3763039 3674011 3613881
40396 3613881 3620180 3728800 4073719 4789023 5874731 7020162 7530483 6818900 5269684
40387 5269684 4248061 4748826 6220861 7233485 7162756 6657635 6520852 6783800 6990926
40378F990926j69942n76350p20558l77804J00547j74103j338305k067453j175249
40369D91709N07054J147451O21456O28444J816779K480477J100641j151900j901916
40360E740195q05670K67696O9864n45787k96194O26890J041717M26367o60298
40351E864780j444482j609595j250410o28980j000N29407R62736J174793R47625
40342D544874L30050k94918o53587q25884q99913p33101l05495M6430Q8932O4597
40332A361985K41777M49144N13569P45943J329830J593895Q01580m98889r76756
40323E562078m57082j96310q26465j230417l06244J149850J524643P44781K09431
40314F174265N74087R62940N98434j3668j11049L2048l49351j167856j501328
$$ plain form
40378 6990926 6820984 6244634 5524076 5146272 5246819 5072716 3734411 1666958 491709
40369 491709 998763 2146214 2767670 3396114 5212893 7693370 8794011 7642111 5740195
40360 5740195 4934525 5202221 5272085 4726298 4430104 5056994 6098711 6525078 5864780
40351 5864780 4420298 2810703 1560293 931313 930313 1459720 2422456 3597249 4544874
40342 4544874 4874924 4580006 3926419 3100535 2200622 1467521 1162026 1208456 1297388 1361985
40332 1361985 1603762 2052906 2566475 3312418 4642248 6236143 7037723 6538834 5562078
40323 5562078 5104996 4908686 4082221 2851804 2545560 3695410 5220053 5964834 6174265
40314 6174265 6748352 7711292 8309726 8296058 8185009 8217057 7867706 6699850 5198522
40305E198522q55014J86767O70895L01912l78727o85954n09721k85788l20214
40296C322678l84473j42094K56866L50695L9566k84695k88899o0208J12706N1219
40286B973361k18736m32674k23860L93862Q00083M60826k26051l17173M05191
40277C614829J120750J083501M79367q8324m23409o43834p01575n02732k65123
40268C673450k79715m19153k95530Q8281J92046l87017j223017j285206n7742
40259F397J618221K226660J334842K27145K70702J044330R37214n08050j854074
40250E303387j643840j68245J103206J213133L62529n96732q44362j89270O50160
40241E189966P63444K23446p1513J14914k7415q20013j272325o27183K55929J86041
$$ plain form
40305 5198522 4343508 4530275 5201170 5503082 5124355 4438401 3928680 3642892 3322678
40296 3322678 2938205 2796111 3052977 3403672 3443238 3158543 2869644 2809436 2922142 2973361
40286 2973361 2754625 2321951 2098091 2491953 3292036 3752862 3526811 3209638 3614829
40277 3614829 4735579 5819080 6298447 6210123 5786714 5142880 4441305 3938573 3673450
40268 3673450 3393735 2974582 2679052 2767333 2959379 2572362 1349345 64139 6397
40259 6397 1624618 3851278 5186120 5413265 5683967 6728297 7665511 7157461 5303387
40250 5303387 3659547 3491302 4594508 5807641 6170170 5573438 4729076 4539806 5189966
40241 5189966 5953410 6176856 6105343 6220257 6192842 5372829 4100504 3473321 3729250 3915291
40231C915291m69960m81723K22659O42900M88079M15067N91367M56109j4905j87029
40221E577855n7100k63894n92908k4526J262162J575819K37671j123540r55965
40212E635574q9328j94275j058494j170987l55139O6293m24813q20739l90630
40203A197462K78769M74614L79928L99503M50332M15897M68578N11019J06642
40194D682744o14291q01884j14458O92487Q97133P03130M50009j19155r87564
40185D788151j177494o9977J239855J188916l5991q48031o26706k93971m26501
40176C738251l02561N99193J423635J147663J00667o16480o30048l92162k61678
40167D806480k85918n43174r45204r64364k59544O53970J027651R33900R79627
$$ plain form
40231 3915291 3445331 2963608 3186267 3829167 4317246 4732313 5323680 5779789 5764884 5577855
40221 5577855 5520755 5256861 4663953 4639427 5901589 7477408 7715079 6591539 5635574
40212 5635574 5546246 5351971 4293477 3122490 2767351 2833644 2408831 1588092 1197462
40203 1197462 1476231 1950845 2330773 2730276 3180608 3596505 4065083 4576102 4682744
40194 4682744 4068453 3266569 3152111 3844598 4741731 5444861 5894870 5775715 4788151
40185 4788151 3610657 3540680 4780535 5969451 5933460 5085429 4458723 4164752 3738251
40176 3738251 3435690 4034883 5458518 6606181 6706848 6090368 5460320 5068158 4806480
40167 4806480 4520562 3977388 3032184 2067820 1808276 2462246 3489897 4423797 5403424
40158E403424J171247Q96232K3351p74346r52886p21567n61114o39683q47673
40149B996985r51953o33707J61749Q61518P47977j19240r31551j118833q25411
40140A87534m15064q3477k896k38591m33085j66695L22763M40670K68586M74311
40130C54056J078818J264789P23392K31934M07058P76060O73713K30200j80069
40121E559951o61576j242676j387566q85894m79510o89677p61255J37115J304767
40112H93679J369663L42929m92734n22981l25219l16708j90450J33747J76796
40103A068722j78227m23911l60989l57519m27178l8920P82952J128589M90450
40094A683969m29794p52935n50139l62420k30674J18343N42815N91306J51752
$$ plain form
40158 5403424 6574671 7470903 7494254 6719908 5767022 5045455 4484341 3844658 2996985
40149 2996985 2045032 1411325 1573074 2434592 3182569 3063329 2131778 1012945 187534
40140 187534 -227530 -311007 -313903 -552494 -985579 -1152274 -829511 -388841 -120255 354056
40130 354056 1432874 2697663 3421055 3652989 4060047 4836107 5509820 5740020 5559951
40121 5559951 4898375 3655699 2268133 1382239 902729 213052 -548203 -411088 893679
40112 893679 2263342 2606271 2113537 1590556 1265337 948629 758179 891926 1068722
40103 1068722 890495 466584 105595 -251924 -679102 -718022 64930 1193519 1683969
40094 1683969 1254175 501240 -48899 -411319 -641993 -523650 19165 610471 762223
40085G62223m24166o94790m11246L00849Q56754O56955j45971o35465j39483R54781
40075A080441J559625R43426n28473j537456r40374Q74265K068404J360580l50937
40066D529501j105510l33387P68431J149694J016486Q92375P59468N41685M29394
40057H648137K75041l88176j282078j337648k72446P56990P33833R2905k50675
40048F975883k56940l04082k32705J78863M67967J91859j87791m2793L57138M55530
40038G602929N29647J153400J962548K028262J209528J79244o52922j320060j644100
40029A1048476j367511q24808o24444p44314o78475l18452K2268K26680L00331
40020G039751o608p26019j175706p90906r0676R2384o6109J33029N31450M45850
$$ plain form
40085 762223 338057 -356733 -767979 -467130 389624 1046579 900608 265143 125660 1080441
40075 1080441 2640066 3583492 3055019 1517563 577189 1451454 3519858 4880438 4529501
40066 4529501 3423991 3090604 3859035 5008729 6025215 6917590 7677058 8218743 8648137
40057 8648137 8923178 8535002 7252924 5915276 5642830 6399820 7133653 7226558 6975883
40048 6975883 6718943 6414861 6182156 6361019 6828986 7020845 6833054 6790261 7147399 7602929
40038 7602929 8132576 9285976 11248524 13276786 14486314 14665558 14012636 12692576 11048476
40029 11048476 9680965 8856157 8231713 7487399 6808924 6490472 6512740 6739420 7039751
40020 7039751 7033143 6307124 5131418 4340512 4249836 4342220 4276111 4409140 4940590 5386440
40010E386440O1295J18894L87942n1327r78966j079431j05098N76967J60929l52435
40000D125210Q8638Q61089P42714k17898r71527r74925m77437K16025Q68885R98587
39990E259361K60773q97732j518323j103299o8313P16467P50276L82875L89611
39981D171696Q91409J059104L54109m24733j67440Q61178J434800J200322Q33076
39972A0213521N10452k42430j070671q56179K57678O04590m71296j459525j079455
39963F406685k37055k51157n74796K4718J101780J206564K63670m97283n95366
39954F847760o21772p40587m64179J00943K24141j46183k97106l3102J16125L084
39944D989124M5474K75074L16549L12725P11755J134441P24183k69584o00378
$$ plain form
40010 5386440 5447735 5566629 5954571 5903244 4924278 3844847 3739749 4316716 4477645 4125210
40000 4125210 4213848 5074937 5817651 5599753 4628226 3653301 3175864 3391889 4260774 5259361
39990 5259361 5520134 4622402 3104079 2000780 1932467 2648934 3399210 3782085 4171696
39981 4171696 5063105 6122209 6476318 6051585 5884145 6745323 8180123 9380445 10213521
39972 10213521 10723973 10481543 9410872 8554693 8812371 9416961 8945665 7486140 6406685
39963 6406685 6169630 5918473 5343677 5368395 6470175 7676739 7940409 7443126 6847760
39954 6847760 6225988 5485401 5021222 5122165 5346306 5200123 4903017 4869915 4986040 4989124
39944 4989124 5034598 5309672 5626221 5938946 6650701 7785142 8509325 8239741 7639363
39935G639363J5109L98500j68040q24593o23982p995O4611l80303n85643k77739
39925E249288J11117J18537l08872p82194p20169n5277L55651k67090j286337
39916B414654j327273l83511J1717q79184j802698j390889o2091Q87806J084514
39907a446955R19450M72380k40457o09291j90645L87647L57553J00717L65589
39898A15988P68872M42934k40301j44104N82093N65354m94534j199415o35405
39889b38518K80357M11885R4807K07030N61464M28658J1753J40671P65344R13013
39879C576464J85344o57254q16775m03843M3168L69105O94643R02075P50354L84534
39869E027815K67769M95984N19911j53361j129936j419848o78004K40982L10193
$$ plain form
39935 7639363 7654472 8052972 7884932 7060339 6436357 6428362 6492973 6112670 5527027 5249288
39925 5249288 5360405 5478942 5170070 4387876 3667707 3612430 3968081 3700991 2414654
39916 2414654 1087381 703870 715587 -163597 -1966295 -3357184 -3419275 -2531469 -1446955
39907 -1446955 -527505 -55125 -295582 -904873 -1095518 -707871 -350318 -249601 115988
39898 115988 884860 1327794 1087493 943389 1525482 2090836 1596302 396887 -238518
39889 -238518 41839 453724 548531 755561 1317025 1745683 1757436 1898107 2663451 3576464
39879 3576464 3761808 3104554 2287779 1883936 1927104 2296209 2990852 3892927 4643281 5027815
39869 5027815 5295584 5791568 6311479 6158118 5028182 3608334 2930330 3171312 3481505
39860C481505l84035q91696p56219m27472k55414J15705Q91852J342356O56375
39851C772957p07866j361141p11167L37515O22427J02564l45664j27882M78612
39842B060355P68196L40517n12926r66469l67302R86487J937659J628288M51900
39833F326705m65826o21283n17176o81734q87913o92535l03848l26776p91872
39824A037742j036028o37385M0571M50755N60097O07534N33990J42935l53060
39815A347151m79383k01851j1327j93873m37508l62053n7495J99401M38773P90510
39805A032345R74769N14706m77931j155412q31793J57169P37495K35306q80432
39796C06222j432707p27792O80939J500034J041754n1210n89978k19813L09557
$$ plain form
39860 3481505 3097470 2205774 1449555 1022083 766669 882374 1774226 3116582 3772957
39851 3772957 3065091 1703950 992783 1330298 1952725 2055289 1709625 1581743 2060355
39842 2060355 2828551 3169068 2656142 1689673 1322371 2308858 4246517 5874805 6326705
39833 6326705 5860879 5239596 4722420 4040686 3152773 2460238 2156390 1829614 1037742
39824 1037742 1714 -635671 -595100 -144345 415752 1023286 1557276 1700211 1347151
39815 1347151 867768 665917 654590 460717 23209 -338844 -396339 -196938 241835 1032345
39805 1032345 2007114 2521820 2043889 888477 56684 213853 951348 1186654 306222
39796 306222 -1126485 -1854277 -1173338 326696 1368450 1317240 727262 507449 817006
39787H17006K48380k25286m48950k87496j98775l72270l47989K80775J145048
39778F10443J441097Q75159l4348n87742n91527l63960k56876l03122k68055K5405
39768E46474M14850M94618J02307l70065l97530o2286l2237o32376j282996j200344
39758b419585l91789M86848J055233J398845J430604Q46781o1582l39016L66325
39749B372664J089427Q08229n0210k25948N14616J118095Q53507J88846k25470
39740F443756n34742j091561j585260j449622p32468M5152N84904Q14380N12150
39731C006689m04018j347963j469234o51761L35057P30347M79736M4347j46671
39722E76529j6817J52192N3124j84747p1673N22819J074365J160729J113094J398993
$$ plain form
39787 817006 1065386 840100 391150 103654 -95121 -467391 -815380 -534605 610443
39778 610443 2051540 2926699 2892351 2304609 1713082 1349122 1092246 789124 521069 546474
39768 546474 961324 1455942 1558249 1188184 790654 728368 696131 63755 -1219241 -2419585
39758 -2419585 -2811374 -2324526 -1269293 129552 1560156 2406937 2345355 2006339 2372664
39749 2372664 3462091 4270320 4220110 3994162 4508778 5626873 6480380 6669226 6443756
39740 6443756 5909014 4817453 3232193 1782571 1050103 1095255 1680159 2494539 3006689
39731 3006689 2602671 1254708 -214526 -866287 -531230 199117 678853 723200 576529
39722 576529 559712 711904 765028 580281 508608 1031427 2105792 3266521 4379615 5778608
39712E778608J722818J426632N52152k52175p47603j210160j558252j292337m83395
39703C936288N2949r0834l60004k43234r3283l96878q48688q15308l10503J20798
39693I51303K19239J58959P8704l3599r8670J3472K65332N21286O92672O31571
39683C400269J36340o91669j344998j419448j014781m46724J48961P12644J075322
39674E55916J139256J007634P63223L86165j0450k18113k75830l47680k56037
39665B744084K54744P67914N45785j80469k62056O00184J186954N50803n23940
39656E684003p81318l42183j81795m56332n80597m91540n88657p29529m79119
39647A052933j11217j72869k74942L97059J463916J614429O31977j34237L21716
$$ plain form
39712 5778608 7501426 8928058 9480210 9228035 8480432 7270272 5712020 4419683 3936288
39703 3936288 3989237 3898403 3538399 3295165 3201882 2805004 1956316 1141008 830505 951303
39693 951303 1170542 1329501 1408205 1374606 1275936 1289408 1554740 2076026 2768698 3400269
39683 3400269 3536609 2844940 1499942 80494 -934287 -1381011 -1232050 -519406 555916
39674 555916 1695172 2702806 3466029 3852194 3841744 3623631 3347801 3000121 2744084
39665 2744084 2998828 3766742 4312527 4132058 3870002 4470186 5657140 6207943 5684003
39656 5684003 4902685 4560502 4378707 3922375 3341778 2850238 2261581 1532052 1052933
39647 1052933 941716 768847 493905 890964 2354880 3969309 4601286 4467049 4788765
39638D788765J364681J731347R67515m43001j589423j603697m48710O56017M60525
39629E884019o52935j223082q57571n44018p20166n61069L15633Q99479L50415
39620B890705o81344j135234q87565k39666Q14985J875302J789114K09420j369386
39611C266331j380732l36410L6994p00909j376275j132002m35015p3758j19232
39602b251008j40335J13894M42368M10791o1046l44354J59354Q99348O74300m95721
39592e92409j110184l74710N56010M26419k11073j73522L04575K31067k03742
39583a147569m7256N04198L54761m78129p76683j43520M37768L17344L4000P2792
39573h72294N5029l16088n64535k29949M66217J102812J465067J298725N12581
$$ plain form
39638 4788765 6153446 7884793 8852308 8409307 6819884 5216187 4767477 5423494 5884019
39629 5884019 5231084 4008002 3150431 2606413 1886247 1325178 1640811 2540290 2890705
39620 2890705 2209361 1074127 186562 -53104 761881 2637183 4426297 4635717 3266331
39611 3266331 1885599 1549189 1586183 885274 -491001 -1623003 -2058018 -2131776 -2251008
39602 -2251008 -2391343 -2277449 -1835081 -1424290 -1485336 -1829690 -1670336 -770988 -96688 -592409
39592 -592409 -1702593 -2077303 -1521293 -1094874 -1305947 -1479469 -1174894 -943827 -1147569
39583 -1147569 -1194825 -690627 -335866 -813995 -1590678 -1734198 -1296430 -979086 -945086 -872294
39573 -872294 -817265 -1133353 -1697888 -1927837 -1461620 -358808 1106259 2404984 2917565
39564B917565k33319r6061O04942O20528l89701j298339j170240m69592j19065
39555C66718k67679n41848p37214p34151l95375L6697R0238j07991Q9622P06609
39545a494374R72896O06123K76324L85572M18184K0333l29105l35242m86548r10245
39535h76082p61426L05964J138659P07982j97561k06031M75625N71698j18325
39526A040503n89116l94719j08331n7022Q2009L22041K07600j92239k11928K59003
39516C57801N45533L43112J35336J88479J08471k29846k63768K55503P07155O17460
39506B765236M38068O43569P70887J76660p71211j141740p84752l97937m05479
39497A293301n61419o49357q16767j065164j053358o52809j74546K15254P88395
$$ plain form
39564 2917565 2684246 2588185 3193127 3813655 3423954 2125615 955375 485783 366718
39555 366718 99039 -442809 -1180023 -1914174 -2309549 -2272852 -2182614 -2290605 -2200983 -1494374
39545 -1494374 -521478 84645 360969 746541 1164725 1185058 855953 520711 34163 -876082
39535 -876082 -1637508 -1331544 -192885 515097 317536 111505 587130 1158828 1040503
39526 1040503 451387 56668 -51663 -108685 -26676 295365 502965 310726 98798 357801
39516 357801 903334 1246446 1381782 1570261 1678732 1448886 1185118 1440621 2147776 2765236
39506 2765236 3203304 3846873 4617760 4794420 4023209 2881469 2096717 1698780 1293301
39497 1293301 731882 82525 -734242 -1799406 -2852764 -3505573 -3680119 -3464865 -2676470
39488b676470J595417K000354J455986M71330J25402O23835R93820M36587n84010
39479D442251j033494o91641k65489k69861m29519l34110j39028k14267m10617
39470F54225k14355L72684O28050P9891o68638o03319L03270R80669P37002J87759
39460B457238K00801N16377K89182l67969n39446j87983l79920j433586k120138
39451a565444j483543l28708J35158J44841O00390J253773J218416P50736Q16615
39442A542234J115984L85885j170293j634333j90245J446303J371232k2312r75087
39433A869368p92419k19880l9637l08977o44920n71211Q9640P77480P00358P9961
39423I39763M8418Q57200J229957K61315j045713j180908k63423M00503L22621
$$ plain form
39488 -2676470 -1081053 919301 2375287 2846617 2972019 3595854 4589674 5026261 4442251
39479 4442251 3408757 2717116 2451627 2181766 1752247 1418137 1279109 1064842 654225
39470 654225 439870 812554 1440604 1520495 851857 248538 551808 1532477 2269479 2457238
39460 2457238 2658039 3174416 3463598 3095629 2556183 2368200 1988280 554694 -1565444
39451 -1565444 -3048987 -3377695 -3242537 -3097696 -2497306 -1243533 -25117 725619 1542234
39442 1542234 2658218 3044103 1873810 239477 49232 1495535 2866767 2844455 1869368
39433 1869368 1076949 857069 817432 508455 -136465 -707676 -618036 159444 859802 939763
39423 939763 988181 1845381 3075338 3336653 2290940 1110032 846609 1247112 1569733
39414A569733J54659L10692M62492L88808L50096M77335M69436M8260o59241j187524
39404B384746j045996k67097L02069j18694r49825p76612N11116J286287N55431
39395A881425m98389l71838N43325R41482P98121R95730J454348J300426N16185
39386G560815j10314m02200p47429r51743n70219o2988j31270k33330O07203J781986
39376F740511J697408L33945o51082n05638k05563m11907m88891p2973J61412
39367F597222l5680Q8023O97543P96124k710o89192o48279o46755j108737j050288
39357C997271O0226Q86743J17138j430979k060543j559578q81979l49771L05877
39348i15595P42857L50240n19760q89243n03051J12950O10478R55682R71779N67830
$$ plain form
39414 1569733 1724392 2035084 2497576 2886384 3236480 3713815 4183251 4231511 3572270 2384746
39404 2384746 1338750 1071653 1373722 1255028 305203 -471409 39707 1325994 1881425
39395 1881425 1383036 1011198 1554523 2496005 3294126 4289856 5744204 7044630 7560815
39386 7560815 7450501 7048301 6300872 5349129 4778910 4715922 4584652 4351322 4958525 6740511
39376 6740511 8437919 8771864 8120782 7615144 7409581 6997674 6508783 6435810 6597222
39367 6597222 6561542 6649565 7347108 8143232 8140522 7451330 6803051 6156296 5047559 3997271
39357 3997271 4057497 4944240 5061378 3630399 1569856 10278 -871701 -1221472 -915595
39348 -915595 -172738 177502 -342258 -1231501 -1734552 -1621602 -1011124 -55442 916337 1484167
39338A484167R7041j33042k32966j41430N35222J496598J588544N28146k83889
39329D938391K46172J173060J071995L00759J30295M72557K76298l77162m64011
39320G768354k7288j25747q11654r77896l98852j69935p08617r48180j58529Q19647
39310D261303R09213K52012l78089o65897n91960l5245P69668J070894N47016
39301F138915j22406j78280K03158L09796q8313n68025o39761k06527L64179N09633
39291E722369N4347m77029m34267J43792O43319O56350K23271m89549j203558
39282D839045j401425q03026J26506O59078N98590J18797p40492j685901j795032
39273h3860n89254Q24488Q58784m12871j370890j070755j65570M29200N40762
$$ plain form
39338 1484167 1581208 1448166 1215200 1073770 1608992 3105590 4694134 5222280 4938391
39329 4938391 5184563 6357623 7429618 7730377 7860672 8333229 8609527 8232365 7768354
39320 7768354 7741066 7615319 6803665 5825769 5426917 5256982 4548365 3600185 3441656 4261303
39310 4261303 5170516 5422528 5044439 4378542 3786582 3751337 4521005 5591899 6138915
39301 6138915 6016509 5838229 6041387 6351183 6262870 5694845 5055084 4848557 5212736 5722369
39291 5722369 5776716 5299687 4865420 5009212 5652531 6308881 6532152 6042603 4839045
39282 4839045 3437620 2634594 2761100 3420178 4018768 4137565 3397073 1711172 -83860
39273 -83860 -673114 151374 1010158 597287 -773603 -1844358 -2009928 -1580728 -1039966
39264a039966K29820m69122r84725n81473L38094M92710k99577o59883K45349
39255b728773J383417J457172P28335K55089J83221j08264o92413r38289m79231
$$ plain form
39264 -1039966 -810146 -1279268 -2263993 -2845466 -2507372 -2014662 -2314239 -2974122 -2728773
39255 -2728773 -1345356 111816 840151 1095240 1278461 1170197 477784 -460505 -939736
$$ [...]
##END NTUPLES=NMR SPECTRUM
##END=
