##TITLE=31Pdec_DE-136_TFA
 DMSO+CCl4,24 sc
 7.4.2026
##JCAMPDX= 6.0         $$ Bruker NMR JCAMP-DX V2.0
##DATA TYPE= NMR SPECTRUM
##DATA CLASS= NTUPLES
##ORIGIN= UXNMR, Bruker Analytische Messtechnik GmbH
##OWNER= root
$$ XWIN-NMR		Version 3.5
$$ Tue Apr  7 14:45:13 2026 Russian Standard Time (UT+4h)  she@DPX200
##.OBSERVE FREQUENCY= 81.013821
##.OBSERVE NUCLEUS= ^31P
##.ACQUISITION MODE= SIMULTANEOUS
##.ACQUISITION SCHEME= undefined
##.AVERAGES= 24
##.DIGITISER RES= 17
##SPECTROMETER/DATA SYSTEM= spect
##.PULSE SEQUENCE= zgpg30
##.SOLVENT NAME= DMSO
##.SHIFT REFERENCE= (INTERNAL, DMSO, 0, 197.392)
##AUDIT TRAIL= $$ (NUMBER, WHEN, WHO, WHERE, WHAT)
$$ ##TITLE= Audit trail, XWIN-NMR		Version 3.5
$$ ##JCAMPDX= 5.01
$$ ##ORIGIN= Bruker BioSpin GmbH
$$ ##OWNER= she
$$ F:/spectra/data/she/nmr/P31/2/pdata/1/auditp.txt
$$ ##AUDIT TRAIL=  $$ (NUMBER, WHEN, WHO, WHERE, WHAT)
(   1,<2026-04-07 14:43:22.31 +0400>,<she>,<DPX200>,
      <created by zg, POWCHK disabled, PULCHK disabled
       configuration hash MD5:
       00 E9 B6 7A A2 85 ED C7 34 08 36 98 17 FE 4E 26
       data hash MD5: 32K
       AD 8F 6C F3 88 6D 9F 33 1F AE EE 81 41 DF 08 D9>)
(   2,<2026-04-07 14:43:28.03 +0400>,<she>,<DPX200>,
      <Start of raw data processing
       efp BC_mod = 2 LB = 1.5 FT_mod = 6 PKNL = 1 PHC0 = 1396.895 PHC1 = 116.9007 SI = 64K 
       data hash MD5: 64K
       54 BA 8A E4 89 AF 69 C4 77 C3 1C F5 A1 67 FA 3A>)
(   3,<2026-04-07 14:43:45.34 +0400>,<she>,<DPX200>,
      <pk PHC0 = -19.54994 PHC1 = 0 
       data hash MD5: 64K
       3B B4 E0 C1 2B A8 B0 C1 21 42 DA 9E 8F 6C 82 5F>)
(   4,<2026-04-07 14:43:48.32 +0400>,<she>,<DPX200>,
      <abs ABSG = 5 
       data hash MD5: 64K
       E4 DC 31 EE 6D AD 65 58 BA 7C 87 8C 41 0D 44 54>)
(   5,<2026-04-07 14:44:17.90 +0400>,<she>,<DPX200>,
      <pk PHC0 = -225.1163 PHC1 = 595.2 
       data hash MD5: 64K
       EE 34 8A FA 03 AC 11 27 49 9D 35 59 C4 B7 B7 FF>)
$$ ##END=
$$ 
$$ hash MD5
$$ BA B2 C8 05 77 AB BA E1 FA 98 33 E1 09 9C C6 C3
##$RELAX= 
##$RELAX= 
##$RELAX= 
##$RELAX= 
##$RELAX= 
##$RELAX= 
##$RELAX= 
##$RELAX= 
$$ Bruker specific parameters
$$ --------------------------
##$DU= <F:/spectra>
##$EXPNO= 2
##$NAME= <P31>
##$PROCNO= 1
##$TYPE= <nmr>
##$USER= <she>
##$AMP= (0..31)
100 100 100 100 100 100 100 100 100 100 100 100 100 100 100 100 100 100 
100 100 100 100 100 100 100 100 100 100 100 100 100 100 
##$AQSEQ= 0
##$AQ_mod= 1
##$AUNM= <au_zg>
##$AUTOPOS= <>
##$BF1= 81.014009
##$BF2= 200.13
##$BF3= 200.13
##$BF4= 200.13
##$BF5= 200.13
##$BF6= 200.13
##$BF7= 200.13
##$BF8= 200.13
##$BYTORDA= 1
##$CFDGTYP= 0
##$CFRGTYP= 5
##$CHEMSTR= <none>
##$CNST= (0..31)
1 1 145 1 1 1 1 1 1 1 1 1 1 1 1 1 1 1 1 1 1 1 1 1 1 1 1 1 1 1 1 1 
##$CPDPRG= <waltz16>
##$CPDPRG1= <>
##$CPDPRG2= <waltz16>
##$CPDPRG3= <>
##$CPDPRG4= <mlev>
##$CPDPRG5= <mlev>
##$CPDPRG6= <mlev>
##$CPDPRG7= <mlev>
##$CPDPRG8= <mlev>
##$CPDPRGB= <>
##$CPDPRGT= <>
##$D= (0..31)
0 1 0 0 0 0 0 0 0 0.06 0 0.03 2e-05 3e-06 0 0 0.0002 0 0 0 0 0 0 0 0 0 
$$ [...]
##$SUBNAM3= <"">
##$SUBNAM4= <"">
##$SUBNAM5= <"">
##$SUBNAM6= <"">
##$SUBNAM7= <"">
##$SUBNAM8= <"">
##$SUBNAM9= <"">
##$SW= 400.765351723535
##$SWIBOX= (0..15)
0 1 3 0 0 0 0 0 0 0 0 0 0 0 0 0 
##$SW_h= 32467.5324675325
##$TD= 32768
##$TD0= 1
##$TE= 0
##$TE2= 300
##$TE3= 300
##$TEG= 300
##$TL= (0..7)
0 120 53 12 22 120 120 120 
##$TP= (0..7)
150 150 150 150 150 150 150 150 
##$TP07= 0
##$TPNAME0= <>
##$TPNAME1= <>
##$TPNAME2= <>
##$TPNAME3= <>
##$TPNAME4= <>
##$TPNAME5= <>
##$TPNAME6= <>
##$TPNAME7= <>
##$TPOAL= (0..7)
0.5 0.5 0.5 0.5 0.5 0.5 0.5 0.5 
##$TPOFFS= (0..7)
0 0 0 0 0 0 0 0 
##$TUNHIN= 0
##$TUNHOUT= 0
##$TUNXOUT= 0
##$USERA1= <user>
##$USERA2= <user>
##$USERA3= <user>
##$USERA4= <user>
##$USERA5= <user>
##$V9= 5
##$VALIST= <valist>
##$VCLIST= <CCCCCCCCCCCCCCC>
##$VD= 0
##$VDLIST= <DDDDDDDDDDDDDDD>
##$VPLIST= <PPPPPPPPPPPPPPP>
##$VTLIST= <TTTTTTTTTTTTTTT>
##$WBST= 1024
##$WBSW= 4
##$XGAIN= (0..3)
0 0 0 0 
##$XL= 0
##$YL= 0
##$YMAX_a= 16768
##$YMIN_a= -3633
##$ZGOPTNS= <>
##$ZL1= 120
##$ZL2= 120
##$ZL3= 120
##$ZL4= 120
##$ABSF1= 197.3918
##$ABSF2= -203.3724
##$ABSG= 5
##$ABSL= 3
##$ALPHA= 0
##$AQORDER= 0
##$ASSFAC= 0
##$ASSFACI= 0
##$ASSFACX= 0
##$ASSWID= 0
##$AUNMP= <proc_1d>
##$AZFE= 0.1
##$AZFW= 0.5
##$BCFW= 0
##$BC_mod= 2
##$BYTORDP= 0
##$COROFFS= 0
##$CY= -3
##$DATMOD= 1
##$DC= 0
##$DFILT= <>
##$DTYPP= 0
##$F1P= 0
##$F2P= 0
##$FCOR= 1
##$FTSIZE= 65536
##$FT_mod= 6
##$GAMMA= 0
##$GB= 0
##$INTBC= 1
##$INTSCL= 9.790993e-09
##$ISEN= 30
##$LB= 1.5
##$LEV0= 0
##$LPBIN= 0
##$MAXI= 10000
##$MC2= 0
##$MEAN= 0
##$ME_mod= 0
##$MI= 50
##$NCOEF= 0
##$NC_proc= -9
##$NLEV= 6
##$NOISF1= 182.463
##$NOISF2= 159.3651
##$NSP= 0
##$NTH_PI= 0
##$NZP= 0
##$OFFSET= 197.3918
##$PC= 4
##$PHC0= 1152.229
##$PHC1= 712.1007
##$PH_mod= 1
##$PKNL= yes
##$PPARMOD= 0
##$PSCAL= 0
##$PSIGN= 0
##$REVERSE= no
##$SF= 81.014063255964
##$SI= 65536
##$SIGF1= 159.3651
##$SIGF2= -187.1042
##$SINO= 113.3802
##$SIOLD= 16384
##$SREGLST= <1H.CDCl3>
##$SSB= 0
##$STSI= 65536
##$STSR= 0
##$SW_p= 32467.5324675325
##$SYMM= 0
##$S_DEV= 0
##$TDeff= 32768
##$TDoff= 0
##$TI= <>
##$TILT= no
##$TM1= 0
##$TM2= 0
##$TOPLEV= 0
##$USERP1= <user>
##$USERP2= <user>
##$USERP3= <user>
##$USERP4= <user>
##$USERP5= <user>
##$WDW= 1
##$XDIM= 65536
##$YMAX_p= 569241827
##$YMIN_p= -67796441
$$ End of Bruker specific parameters
$$ ---------------------------------
##NTUPLES= NMR SPECTRUM
##VAR_NAME=  FREQUENCY,     SPECTRUM/REAL,   SPECTRUM/IMAG
##SYMBOL=    X,             R,               I
##VAR_TYPE=  INDEPENDENT,   DEPENDENT,       DEPENDENT
##VAR_FORM=  AFFN,          ASDF,            ASDF
##VAR_DIM=   65536,         65536,           65536
##UNITS=     HZ,            ARBITRARY UNITS, ARBITRARY UNITS
##FACTOR=    0.49542278885378, 1,            1
##FIRST=     15991.5117654749, 0,            0
##LAST=      -16476.0207020576, 0,           0
##MIN=       -16476.0207020576, -67796441,   0
##MAX=       15991.5117654749, 569241827,    0
$$ Real data points
##PAGE= N=1
##DATA TABLE= (X++(R..R)), XYDATA
$$ [...]
43557C3861l465883j068948K847793M788720L315669J087413N23001M41407q36029
43548G667004j853508n02469J832073J932174m88597k749570l288715k814858
43540b66466j755663K68193K138703J550149j250642k641054k62048L332569L642466
43531D756207m7246l661532l004562J584389N432383M168237j698920o986463
43523E42493p143828k961039J032930K250521K033117J969946J333696j28705
43515a070869J89510L916320P167782M292286l758127r237093p341789k102522
43507g944502J68433m13452N25711L289434L694773P09993j209851Q94725L954552
43498C669816M048167K194665J593347K295126K568157K964022M451600M455372
$$ y = [33861, -3432022, -4500970, -1653177, 3135543, 6451212, 7538625, 8061626, 8503033, 7667004, 5813496, 5311027, 7143100, 9075274, 8586677, 5837107, 2548392, -266466, -2022129, -1753936, 384767, 1934916, 684274, -1956780, -2218828, 1113741, 4756207, 4708961, 1047429, -1957133, -372744, 5059639, 9227876, 7528956, 542493, -6601335, -9562374, -8529444, -6278923, -4245806, -2275860, -942164, -1070869, -881359, 3034961, 10202743, 14495029, 10736902, 1499809, -5841980, -7944502, -7776069, -8189521, -7663810, -4374376, -679603, 30390, -1179461, -284736, 3669816, 7717983, 9912648, 11505995, 13801121, 16369278, 19333300, 23784900, 28240272]
43490B8240272J51156n152325n011023P3897J893732l542496r199025o756704
43482F97484J298229N435613K516149j303705r47580R52626R095k765426l635132
43473B257353k435079j731679j627855k335K571709K595937q02006l877525l559590
43464f611070j575220r43343j081112L60840K671755L025737J586906J603396
43456i62111L934855N301306L323881p2851k125446k940889l385015k290656J007503
43447A790577L744301L071758O48295l1128M93730j030684m098212m472061j229210
43438a112634J425124J051280O61055K700667M000015R83157l490328l634836
43430B583500O10167L522289J890293j211546j699113K80647J870542J486867
$$ y = [28240272, 28391428, 23239103, 18228080, 18301977, 20195709, 16653213, 7454188, 697484, 1995713, 7431326, 9947475, 8643770, 7696190, 8648816, 8657911, 5892485, 2257353, -177726, -1909405, -3537260, -3539595, -967886, 1628051, 826045, -3051480, -6611070, -8186290, -9129633, -10210745, -9849905, -7178150, -4152413, -2565507, -962111, 2972744, 8274050, 11597931, 11525080, 9399634, 6458745, 3073730, 783074, 1790577, 5534878, 8606636, 9254931, 9223803, 9717533, 8686849, 4588637, 116576, -1112634, 312490, 1363770, 2024825, 4725492, 8725507, 9708664, 6218336, 2583500, 3193667, 6715956, 8606249, 7394703, 5695590, 5976237, 7846779, 9333646]
43422I333646l36702k166050k393701k62730K774891M049412K812446R75732N0187
43413A4837131q46507k779448m604467m566687l016736j590176o04420O17362
43405b553948J496144Q02959n21427O4374K488050L183533K46577k922909j997728
43396B85625J745376K855646n29534m059124l387892K46635K660341K303170O28508
43387B748751j117276k457551k288792p3045K155557J968584L93507M97668K236163
43378D063566K229825p07499l453197l422112k121885j739684j300757Q12948
43370e638795K949213K390694J04647m19793J292278J871990n73563l339661k869216
43361d232206K96565K189058M24065k885663l574495k91588L755038M431294J577636
$$ y = [9333646, 8996944, 6830894, 4437193, 4174463, 6949354, 10998766, 13811212, 14786944, 14837131, 13990624, 11211176, 6606709, 2040022, -976714, -2566890, -3171310, -2553948, -1057804, -254845, -776272, -711898, 1776152, 4959685, 5206262, 2283353, 285625, 2031001, 4886647, 4357113, 297989, -3089903, -2843268, -182927, 2120243, 2748751, 1631475, -826076, -3114868, -3187913, -1032356, 936228, 1329735, 1827403, 4063566, 6293391, 5585892, 2132695, -1289417, -3411302, -5150986, -6451743, -5638795, -2689582, -298888, -194241, -614034, 678244, 2550234, 1976671, -1362990, -4232206, -3935641, -1746583, -1322518, -4208181, -7782676, -8074264, -4319226, 112068, 1689704]
43352A689704j027804o80976J121845J530612M20957l07548k35332p33252k045349
43343b67143k364749l42476K996574N364504N259857K775638o26338l011525l502779
43334F281563k993530k780841k915858k695189k087984j457891m83685J138179
43326g995236K329748J648979m14664j709536j013263R74735K982296L957844
43318G60903K899934n4029k426805j608056J359478K562012M69979k083671k304002
43309d24257j164150q44548q88801L15810J903898J624303j64742q24028K53124
43300b13391P64073m89061j718039j493897j130098j785539j699633R16895M015322
43291b833368M069431J442068j74302L55735Q4082k628757m910651l802192q69536
$$ y = [1689704, 661900, -19076, 1102769, 2633381, 3054338, 2746790, 2511458, 1778206, -267143, -2631892, -2974368, 22206, 5386710, 10646567, 13422205, 12795867, 9784342, 6281563, 3288033, 507192, -2408666, -5103855, -7191839, -8649730, -9133415, -7995236, -5665488, -4016509, -4431173, -6140709, -7153972, -6179237, -3196941, 760903, 3660837, 3606808, 1180003, -428053, 931425, 3493437, 3963416, 1879745, -424257, -1588407, -2432955, -3321756, -3005946, -1102048, 522255, 357513, -466515, -213391, 550682, 61621, -1656418, -3150315, -4280413, -6065952, -7765585, -6848690, -2833368, 1236063, 2678131, 2503829, 2859564, 2943646, 314889, -4595762, -8397954, -9267490]
43282i267490N36587L03452M15394N19569j315121m071610m203196j020320K032025
43273a6070710K416331J498845J339119J740544K121482L275678N171128N600710
43265G093127L340371N08081m45395j04873k91218r67223j339558k071230l714629
43256B007453m609232l058014j80477J860427K778891K809747P66091l073129
43248f98243m388496J71954O528796O799601l81630p698476q200764k684746L007947
43239g544057M628533K257166p18717l56735L751287O992223N058010K30801j548885
43230A2749626M26984Q47551k629971n411711l609409k55476K00998p74813Q82887
43221B426666M092173L823653r16150n238682m879126r52739K437723K703271
$$ y = [-9267490, -8730903, -8427451, -8012057, -7492488, -8807609, -12879219, -17082415, -18102735, -16070710, -13654379, -12155534, -10816415, -9075871, -6954389, -3678711, 1492417, 7093127, 10433498, 10941579, 10496184, 10391311, 10100093, 9132870, 7793312, 5722082, 2007453, -2601779, -5659793, -5840270, -3979843, -1200952, 1608795, 2374886, -698243, -5086739, -4914785, 1614011, 8413612, 8031982, 333506, -7867258, -10552004, -7544057, -2915524, -658358, -1377075, -1733810, 2017477, 9009700, 14067710, 14298511, 12749626, 13176610, 14024161, 11394190, 5982479, 2373070, 2117594, 2318592, 1543779, 2426666, 6518839, 10342492, 9426342, 4187660, -691466, -1644205, 793518, 3496789]
43213C496789K48658k567830l291486j320083J679000L606772L566298J523059
43205F941177j997977n058870n067352j788918J991198L989262M640245M552212
43197H200977K449783k041301n962896o316144m049464j933419k05255K464233
43189g393486N166428N584782L860295K187847J102664m20407j624550n22762
43181G940811K003230K388335m42091l351294l621458k357995j788310j784199
43173a012971j022378K61866P27563J52639l88723j38972N26036O82711q9865
43164c02094j025936p84090P73187K102504K196214K302909L893692N757135N147557
43155B0061078J451220l195938o496365p179489m396850J114879N390265M192255
$$ y = [3496789, 3745447, 1177617, -2113869, -3433952, -1754952, 1851820, 5418118, 6941177, 4943200, -115670, -5183022, -6971940, -4980742, -991480, 3648765, 8200977, 10650760, 8609459, 2646563, -3669581, -7719045, -9652464, -9857719, -7393486, -2227058, 3357724, 7218019, 9405866, 10508530, 10088123, 8463573, 7940811, 9944041, 12332376, 11890285, 8538991, 4917533, 2559538, 771228, -1012971, -2035349, -1773483, -1045920, -893281, -1282004, -1420976, -894940, -212229, -302094, -1328030, -2112120, -1338933, 763571, 2959785, 5262694, 9156386, 14913521, 20061078, 21512298, 18316360, 11819995, 4640506, 243656, 1358535, 6748800, 10941055]
43147A0941055j379210n219620l659761Q6237Q75337j322629k129273P18503M495088
43138C405727N308947K706342l84388j240522M8230J339572J072279l75418j749858
43129A0130911k418008k328792j350576L63446J767217J632787j71509k440788
43121E184688l280246j187083L079584N648643L007591k687128m741532m79536
43113D544981M433546L552277j341830l476391j298942L73637j106367k736564
43105B944347k030575r04993j145753r71196J011286K663834K224152J576208
43097E367310K399061K641878M55539j654727p04577J492780J305811o86791j280670
43088I335614n66658j287027l126657k763532J41236J736369q0031k470720k083589
$$ y = [10941055, 9561845, 4342225, 682464, 768701, 1644038, 321409, -1807864, -1089361, 3405727, 8714674, 11421016, 11036628, 9796106, 9844336, 11183908, 12256187, 11880769, 10130911, 7712903, 5384111, 4033535, 4396981, 6164198, 7796985, 7625476, 5184688, 1904442, 717359, 3796943, 9445586, 12453177, 9766049, 5024517, 4544981, 8978527, 12530804, 11188974, 7712583, 6413641, 6787278, 5680911, 2944347, 913772, 8779, -1136974, -2108170, -1096884, 1566950, 3791102, 5367310, 7766371, 10408249, 10863788, 9209061, 8504484, 9997264, 11303075, 10616284, 9335614, 8768956, 7481929, 4355272, 1591740, 1732976, 3469345, 3389314, 918594, -1164995]
43079a164995M36991K221242K148688J222347N07890K48658K10668M1924j78644
43070E694769K75399J573702K307392J063663j346763k915878l370175m050285
43062g68176m914804m004043n61029L246925M696100L295768N79857j654143k354507
43053b438052j600351m88423J55503Q73388K300371L253356J952128q77728k279231
43044H50961r86783R33844J205831K09428m01174k38777J08737N76250J222856
43035C481173J228012j36230j994402k679141j837738o40230m3013J16326K32936
43026b272307J05357n26802j136706q21415L46664J072691O65796O06986K772596
43017H12860N889896N871692J149349m211496n241780k709297j763066m217528
$$ y = [-1164995, -728004, 1493238, 3641926, 4864273, 5372163, 5620821, 5831489, 5873413, 5694769, 5970168, 7543870, 9851262, 10914925, 9568162, 6652284, 3282109, -768176, -5682980, -9687023, -10248052, -7001127, -2305027, 990741, 1570598, -83545, -2438052, -4038403, -4526826, -4371323, -3497935, -1197564, 2055792, 4007920, 3130192, 850961, -135822, 798022, 2003853, 2213281, 1812107, 1573330, 1682067, 2258317, 3481173, 4709185, 4572955, 2578553, -100588, -1938326, -2578556, -2621569, -2505243, -2272307, -2166950, -2693752, -3830458, -4651873, -4305209, -3232518, -2566722, -1959736, 812860, 6702756, 12574448, 13723797, 9512301, 4270521, 1561224, -201842, -4419370]
43009d419370o016953l596185P56829K408266Q05356o36792K68307K427057M138043
43000c865442N004115M893709L329460P54526j138910j164731K19864J844588
42992I877179K792045K221005k76210l365936m371246k253613O56188J332157
42984F611569o1982o62188P22962J774633L08224j940388j413174J868007L589590
42975A0797253P75433l913342n379680k500875Q72411J185256p17138j573894
42967d54576k04105J505588J619451O85030O53466J959906K861103K154169J429892
42958A2209924K858417M943093L118562l909110j0622027j0267703l031281M227274
42950d72851O093921L513026M31215j160513j554429j414191j341067j588218
$$ y = [-4419370, -10436323, -14032508, -13275679, -10867413, -10062057, -10698849, -10430542, -8003485, -3865442, 1138673, 6032382, 9361842, 10116368, 8977458, 7812727, 8032591, 9877179, 12669224, 14890229, 14614019, 11248083, 6876837, 4623224, 5279412, 6611569, 6549587, 5887399, 6610361, 8384994, 8693218, 6752830, 5339656, 7207663, 10797253, 11572686, 7659344, 2279664, -221211, 651200, 1836456, 1119318, -454576, -658681, 846907, 2466358, 3151388, 3804854, 5764760, 8625863, 10780032, 12209924, 15068341, 20011434, 23129996, 19220886, 8598859, -1668844, -4700125, -472851, 5621070, 9134096, 9565311, 8404798, 6850369, 5436178, 4095111, 2506893]
42942B506893j071844J289492L413283J349493m415567p436404l378200L292931
42934d449923M966067J116853k196020j895704j006397j744987j657539R02294
42926e965356K754458J191861p29524J203384N172732N679251J672198k497467
42918H481537l849317l830019m032650l276263p09553J656218J881567J136079
42910b542401J428057K117930J209056j002944k115582j182683P9818K7173o05214
42901b586790l7649J700949K406134N40640k247770k741848n68102P98627r97725
42892c733534l031880j032112L489649M556117R25288j183915K453176O658752
42884I101541M179944k711434m814486M20261N086151K590911l067186l965617
$$ y = [2506893, 1435049, 2724541, 6137824, 7487317, 3071750, -4364654, -7742854, -4449923, 516144, 1632997, -563023, -2458727, -3465124, -5210111, -6867650, -5965356, -3210898, -2019037, -2748561, -1545177, 3627555, 9306806, 10979004, 8481537, 4632220, 802201, -3230449, -6506712, -7216265, -5560047, -3678480, -2542401, -1114344, 1003586, 2212642, 1209698, -905884, -2088567, -2008749, -1981576, -2586790, -2624439, -923490, 1482644, 2023284, -224486, -2966334, -3534436, -2735809, -3733534, -6765414, -7797526, -4307877, 248240, 1173528, -10387, 2442789, 9101541, 13281485, 10570051, 5755565, 6175826, 11261977, 13852888, 10785702, 6820085]
42876F820085K01539K652181l21157m955420o051758l399877n86687K84633N78667
42867d777794K160076L904040K579769k267286n940749l587653K912409O441259
42859A424071L804502l30555o45124J556079J840251J80748j769J395529Q95716
42850A0119448k140007m023194k651637l24043Q13076J752066L022329K385696
42842H953734q54423k882339m69739L617260M263781J098683k112312l621358
42834G993287m655691m872255j932602L402459O269230M000679M2419j044006
42826I203520J59809k21864k965920m697031k960951N04419K145337M40646l030038
42817a422073n011968l062185J867025N428629M337729Q05780M2897K885690M214648
$$ y = [6820085, 7021624, 9673805, 9352648, 4397228, -1654530, -5054407, -5641094, -5356461, -4777794, -2617718, 1286322, 3866091, 1598805, -4341944, -7929597, -5017188, 1424071, 5228573, 4898018, 4252894, 5808973, 7649224, 7829972, 7828203, 9223732, 10119448, 7979441, 3956247, 1304610, 980567, 1793643, 3545709, 6568038, 8953734, 8099311, 5216972, 4747233, 8364493, 12628274, 13726957, 11614645, 7993287, 3337596, -1534659, -3467261, -64802, 6204428, 10205107, 10247526, 9203520, 9363329, 9141465, 6175545, 1478514, -1482437, -978018, 1167319, 1607965, -1422073, -6434041, -9496226, -7629201, -2200572, 2137157, 2942937, 2985834, 5871524, 10086172]
42808A0086172N81841l975911l449457J075059K794459q52975m832635m326842
42800b900289j036407R06450J126004J386485J021744j405536l715677k210691
42792f827917K310288M926389L184511m05309k703809l002681j264558K590148
42784a192938O306715O146846K244124l10923J659945M470807K698511k974250
42776A9048837o680018n063960o96334K046658J738914L8396j052745j203218
42768H176530j549385k661803l098633j209194J749375K513702M73702j164000
42760C230294j91076J446814J364147O87785J314470J836395N0208k411840k340324
42751D986873o12013q37320k797487k332521J567361M549349L503853R71929N05657
$$ y = [10086172, 10668013, 6692102, 3242645, 4317704, 7112163, 6259188, 1426553, -2900289, -3936696, -3030246, -1904242, -517757, 503987, -901549, -4617226, -6827917, -4517629, 408760, 3593271, 3187962, 484153, -2518528, -3783086, -1192938, 5113777, 11260623, 13504747, 13193824, 14853769, 19324576, 22023087, 19048837, 12368819, 7304859, 6608525, 8655183, 10394097, 10432493, 9379748, 8176530, 6627145, 3965342, 866709, -342485, 1406890, 3920592, 4394294, 3230294, 3039218, 4486032, 5850179, 6537964, 7852434, 9688829, 9739037, 7327197, 4986873, 4374860, 3537540, 740053, -1592468, -25107, 4524242, 8028095, 9000024, 9505681]
42742I505681J374902Q99657q54397j942588k066325k202859k143394j051440
42734A519237O57911K199010L847581N336602M486921K30735m284942m808336
42726I184719j631875Q82037J68165k126742l588487l713031k533944K59570L398461
42717B98873L893933Q69540k298364j831484J595026L867426K617984n15102k541046
42708E956786k237515l97125J573041K619483K393419J263326j61576j465662
42700I544177k095393j160288J311617L104536J566705k471095m171954j77168
42692E451137O039455P046519M96652p245211q605843m100494r53037l029811
42684d900633o051760m200936J864685O494552O556960M014621J672272q5040
$$ y = [9505681, 10880583, 11780240, 10925843, 8983255, 6916930, 4714071, 2570677, 1519237, 2177148, 4376158, 8223739, 13560341, 18047262, 18277997, 13993055, 9184719, 7552844, 8434881, 8603046, 6476304, 2887817, -825214, -3359158, -3099588, 298873, 4192806, 5062346, 2763982, 932498, 2527524, 6394950, 9012934, 8497832, 5956786, 3719271, 3322146, 4895187, 7514670, 9908089, 11171415, 11009839, 9544177, 7448784, 6288496, 7600113, 10704649, 12271354, 9800259, 5628305, 5451137, 11490592, 18537111, 19033763, 11788552, 3182709, -917785, -1870822, -4900633, -10952393, -15153329, -13288644, -6794092, -237132, 3777489, 5449761, 5364721]
42676E364721j619157k102765r53089O20708J176601R65396Q74111N35904q48423
42667D014007k473525k483133n37530J542655J919034N51458j262803k238557
42659i68394j732021J13734K243774L096188J790525q24617k484762j413864J617811
42650A438374L544441K210099q77674k291537j236299m82702j910038l224616
42642b829952j163243L430726O349114N364317K308220k20546j711411k671972
42634H855253k947613k315001j324766n95034k75979n48811j303081j181484J149362
42625d87154M321084N005362K200489j324437k880543k872777k633470j753931
42617d25377L28405K152924K068289P47315k46658q04913j079423Q3747K839212
$$ y = [5364721, 3745564, 1642799, 689710, 1310418, 2487019, 3452415, 4326526, 4862430, 4014007, 1540482, -942651, -1480181, 62474, 1981508, 2532966, 1270163, -968394, -2700415, -2586681, -342907, 2753281, 4543806, 3719189, 1234427, -179437, 1438374, 4982815, 7192914, 6315240, 4023703, 2787404, 2304702, 394664, -2829952, -3993195, -562469, 5786645, 11150962, 13459182, 13238636, 11527225, 8855253, 5907640, 3592639, 2267873, 1672839, 1396860, 848049, -455032, -1636516, -487154, 3833930, 8839292, 11039781, 9715344, 6834801, 3962024, 1328554, -425377, -96972, 2055952, 4124241, 4871556, 4624898, 3819985, 2740562, 2824309, 5663521]
42608E663521M352023K293424j257251k851173l055346m667138o699316n180105
42600a1401361j33900L242705J842172j056460p70333K645830N238538L975415
42592C582606m86195m063368k318768M166056Q246260M049818m199623o661597
42584B315189j572102K304163q43501n250505l219327K924178N219939K125002
42576D003036j098579j532938j012014n56609Q99010K344078J207223j574993
42568B678214k223607k10936J273487J194299J772650L131608K358040p11961
42560I261794k119534k65546J168309o62638l242255l263181j657731p11402K76220
42551a215964K678281M724178L936847J422530O8323p9070j198908l513015m947760
$$ y = [5663521, 10015544, 12308968, 11051717, 8200544, 5145198, 478060, -6221256, -11401361, -11535261, -8292556, -6450384, -7506844, -8277177, -5631347, -392809, 3582606, 3096411, -966957, -3285725, 880331, 9126591, 13176409, 8976786, 2315189, 743087, 3047250, 2203749, -3046756, -6266083, -3341905, 1878034, 4003036, 2904457, 1371519, 359505, -197104, 701906, 3045984, 4253207, 2678214, 454607, 243671, 1517158, 2711457, 4484107, 7615715, 9973755, 9261794, 7142260, 6876714, 8045023, 7382385, 4140130, 876949, -780782, -1492184, -1215964, 1462317, 6186495, 10123342, 11545872, 11614195, 11535125, 10336217, 6823202, 1875442]
42542A875442m413201k671051m01417K048387L304634J864397j382795l364194
42534c139798k003891J695923M594023L919195k04890l994493l201403J734790
42526f00544N381500L817755l78127k055937p08401k21001k037873k796848l4466
42517C66058L346525L070964j22111j421990J152859L984591L042104o45210k903347
42508I870443k396938j726813k575716k987118j065966J221708O83906k083186
42500a059680l290228j113421K368747M244241L359315R2344l729189m724565
42492c852436r25977M557499N985655K166762j864132j766266O62829J131340
42484F095274q75827k387573j640159N01118K769657M478819M748419K962036
$$ y = [1875442, -2537759, -5208810, -5610227, -3561840, -257206, 1607191, 224396, -3139798, -5143689, -3447766, 1146257, 5065452, 4860562, 866069, -2335334, -600544, 4780956, 8598711, 8220584, 6164647, 5456246, 5235245, 3197372, 400524, 366058, 3712583, 6783547, 6661436, 5239446, 6392305, 10376896, 13419000, 12773790, 9870443, 7473505, 5746692, 3170976, 183858, -882108, 339600, 1023506, -1059680, -4349908, -5463329, -3094582, 1149659, 4508974, 4601318, 872129, -3852436, -4778413, -220914, 5764741, 7931503, 6067371, 4301105, 4963934, 6095274, 5219447, 2831874, 1191715, 1692833, 4462490, 8941309, 13689728, 16651764]
42476A6651764Q108k273229k750898j532396L18392J110613l4380j484507o79020
42467I334447J800157K135074j277267m796756m225466m23265K421237K486986
42459G455147J363010M71808n30994k022233l487314m404042m422020k930755
42451h507393J59932L626586N963885O493035M873050J198984k477777l093825
42443H236477p44988N47269j540536l884034k753447J95305P40180j042717j433134
42434a679625K73149O55359j883526m413529l976235j388572Q77453J963999K390541
42425g180986K528508K463285K113747J130264j79349k77181J614465L667807
42417E880560L655390K234675J639891J857101R08097j461141l204866k946650
$$ y = [16651764, 16659872, 14386643, 11635745, 10103349, 10421741, 11532354, 11497974, 10013467, 9334447, 11134604, 13269678, 11992411, 7195655, 2970189, 2546924, 4968161, 7455147, 8818157, 9289965, 8758971, 6736738, 3249424, -1154618, -5576638, -8507393, -8347461, -4720875, 1243010, 7736045, 12609095, 13808079, 11330302, 8236477, 7491489, 8038758, 6498222, 2614188, -139259, 56046, 796226, -246491, -1679625, -1406476, -751117, -2634643, -7048172, -11024407, -12412979, -11535526, -9571527, -7180986, -4652478, -2189193, -75446, 1054818, 875469, 598288, 2212753, 5880560, 9535950, 11770625, 13410516, 15267617, 16175714, 14714573, 11509707, 8563057]
42409H563057j054603J739766M217067M071908N64704l087990l418004j815537
42401I780368j928765l073216j456057K319799L078668m32245k970902j210727
42393D106923R24934j013870m708119n036527j965584K10712m82269j925562j662377
42384a1551739P41082M156386O332888N120606J318845j272379o50150M85901
42376D681440j058933l939687m387427j812627Q76070J720768J480774J116165
42368a323457P9677k261789m856466n239257j663524M429256Q458325O928495
42360D551260J636627k353395k863459k041107j672686q44465P10355R79292o28367
42351b525945j592809n09457N95716N00024J320385L854110M588589J242967k590651
$$ y = [8563057, 7508454, 9248220, 13465287, 17537195, 18101899, 15013909, 11595905, 9780368, 7851603, 4778387, 3322330, 5642129, 8720797, 8288552, 5317650, 4106923, 5031857, 4017987, -690132, -5726659, -7692243, -7481531, -7963800, -9889362, -11551739, -10810657, -6654271, -321383, 4799223, 6118068, 4845689, 4195539, 4681440, 3622507, -317180, -4704607, -6517234, -5641164, -3920396, -2439622, -1323457, -1243780, -3505569, -8362035, -13601292, -15264816, -10835560, -2377235, 4551260, 6187887, 3834492, 971033, -1070074, -2742760, -3587225, -2876870, -1897578, -2525945, -4118754, -4628211, -4032495, -3532471, -2212086, 1642024, 6230613, 7473580, 4882929]
42342D882929k801501j091922r00592n78814L086447P164870N612949q75042m999067
42333I500257l235776Q5237J11292k601107m866527m855720j977742L004557O720884
42324A885355O075750K955646J804557K423492N51574l791420m976358r15620
42316F012976K805909J453697j871529k156488m11467m63994j777722j213856
42308B377526Q01095J582286J685397L350843M731158J709472m584119p851335
42300C802323n257579r31113O94535K73918N3202n00525k139811k437077P39513
42291e702614M455366L988894R9686j517101J495053M736718L686410N8500j471075
42282I829837k83945L01199j002577j713663j27801J999662K527487J778830Q19371
$$ y = [4882929, 2081428, 989506, 88914, -489900, 2596547, 9761417, 15374366, 14499324, 9500257, 6264481, 6349718, 6461010, 3859903, -1006624, -5862344, -7840086, -4835529, 1885355, 7961105, 10916751, 12721308, 15144800, 15696374, 11904954, 6928596, 6012976, 8818885, 10272582, 8401053, 6244565, 5833098, 5369104, 3591382, 2377526, 3178621, 4760907, 6446304, 9797147, 14528305, 16237777, 11653658, 3802323, -1455256, -2386369, -1691834, -1417916, -1364714, -1865239, -4005050, -6442127, -5702614, -1247248, 2741646, 2841332, 1324231, 2819284, 7556002, 11242412, 11300912, 9829837, 9545892, 9847091, 8844514, 7130851, 7003050, 9002712, 11530199, 13309029, 14128400]
42273A4128400n25632k148950k549557j377381r32686k692297m340227l128810
42265c567140m83406Q0764j579273k491050j629771q95236j008242k50555J927029
42256i896880L439922K891967J484630M59192n97923j620897j031122J400755
42248c470356L067481K021366K18321J101444M862773P809111O198184J24095
42240B1932419n949902o873086k330096J983195R10235l168631l309128K042482
42232E237488O499321M684622o62387l523437k899587k236126k973444l199013
42224I27437j879325m25143J04683K82918M81269L14247L16457J870033M666142
42215F658718N962184L447775j852462o140225o228356k554407J109644J538283
$$ y = [14128400, 13602768, 11453818, 8904261, 7526880, 6594194, 3901897, -438330, -3567140, -4050546, -3969782, -5549055, -8040105, -9669876, -10565112, -11573354, -11823909, -9896880, -6456958, -3564991, -2080361, -1621169, -2219092, -3839989, -4871111, -3470356, -402875, 1618491, 1836812, 2938256, 7801029, 15610140, 21808324, 21932419, 15982517, 9109431, 6779335, 8762530, 9672765, 6504134, 3195006, 5237488, 11736809, 16421431, 15759044, 12235607, 9336020, 7099894, 4126450, 927437, -951888, -1377031, -1272348, -989430, -508161, -193914, 122543, 1992576, 6658718, 12620902, 16068677, 14216215, 8075990, 1847634, -706773, 402871, 1941154]
42207A941154m09380j208100N34482K603657K825485J760269P06950m41170j658693
42198F654654j530759K69626J380632L3660k097799k891543l302515m586983m307110
42189a0378137L03485O180897O868503J518088l339987k475171J700008L571455
42181C949141J681715j091052k341539k187574j610912j085792n69480M12697
42173b842796K258273M189191M478602K406471q42072l576713m812220l952605
42165b693869r89227K354372L462509J881053L2381j51768L55477k7635n97515
42156C625778Q6287J049006N8190k322568k653683N00821L839126L238431q01751
42147F619637l716581k652835M18587K076173J903824J633643J176462j356390
$$ y = [1941154, 1531774, 323674, 858156, 3461813, 6287298, 8047567, 8754517, 8313347, 6654654, 5123895, 5393521, 6774153, 6807813, 4710014, 1818471, -1484044, -6071027, -10378137, -10074652, -3893755, 2974748, 4492836, 1152849, -1322322, 377686, 3949141, 5630856, 4539804, 2198265, 10691, -1600221, -2686013, -3255493, -2842796, -584523, 3604668, 8083270, 10489741, 9647669, 6070956, 1258736, -2693869, -3683096, -1328724, 2133785, 4014838, 4047219, 3895451, 4250928, 4223293, 3625778, 3712065, 4761071, 4819261, 2496693, -156990, 343831, 4182957, 7421388, 6619637, 2903056, 250221, 668808, 2744981, 4648805, 6282448, 7458910, 6102520]
42139F102520n372836o818236l387420J710856L827243K937255K470672L301665
42131D771719K885265M29708j206880k06400J108238M6930k316654l346970l030048
42122h65092l088682l424141k501279n44383N56629L73675M28587J468887K556437
42113e039362L050673L238917K711176N70804k030300k140277P75054L070369
42105D207054J368063k791607m878793k896131J105910M156325M713680K510068
42097G494569j237432l385004j435907K646542L819451M56171l104615k479179
42089B774596P68717K090001J072481J444953M259361N576730K577446j680443
42081A8883842k469431m6899J156868j082737m378562n568174m163721j483093
$$ y = [6102520, 729684, -6088552, -9475972, -7765116, -3937873, -1000618, 1470054, 4771719, 7656984, 8086692, 6879812, 6673412, 7781650, 7828580, 5511926, 2164956, -865092, -3953774, -7377915, -9879194, -10423577, -9866948, -9493273, -9064686, -7595799, -5039362, -1988689, 1250228, 3961404, 4532208, 2501908, 361631, 1136685, 4207054, 5575117, 2783510, -2095283, -4991414, -3885504, 270821, 4984501, 7494569, 6257137, 2872133, 1436226, 4082768, 7902219, 8358390, 5253775, 2774596, 3543313, 5633314, 6705795, 8150748, 12410109, 17986839, 20564285, 18883842, 16414411, 16367512, 17524380, 16441643, 12063081, 6494907, 2331186, 848093]
42073H48093J216280K693832J828731o87414k085856o35460J743998J709374r57341
42064E674237k849974j372835J975157L790820K992317J265336k8570j288962
42056A0157526k752980l279673k337030j551616k377014l320314j872590J229786
42048f103905K412375M35766j489983j83392L030702M317226K406421n23550k274855
42039B026805k684831k341339j334542P1260R52798Q03274L64064O88543J715244
42030B61276K246607J302829o56347j939822j249901Q67817K521719K497278J364810
42021G216266M81927M58857Q49299Q57387J08215r26122j320735r67563r87860
42012E769671j948446k346565n76555K016867K431563N23706n56969O71209J646127
$$ y = [848093, 2064373, 4758205, 6586936, 5899522, 3813666, 3178206, 4922204, 6631578, 5674237, 2824263, 1451428, 3426585, 7217405, 10209722, 11475058, 11446488, 10157526, 7404546, 4124873, 1787843, 236227, -2140787, -5461101, -7333691, -6103905, -3691530, -3255764, -4745747, -4929139, -1898437, 2418789, 4825210, 4301660, 2026805, -658026, -2999365, -4333907, -4262647, -3309849, -2506575, -2142511, -1453968, 261276, 2507883, 3810712, 3154365, 1214543, -35358, 832459, 3354178, 5851456, 7216266, 7698193, 8157050, 9006349, 9863736, 9971951, 9045829, 7725094, 6757531, 5769671, 3821225, 1474660, 898105, 2914972, 5346535, 5870241, 5313272, 5984481, 7630608]
42003G630608J19994k016083j940723n37482m99780j517351j106780O37972J007946
41994A778321o38066j794333j006215J22735J10099j72674K11566L62967l71938
41985a397538n69074J051917L110392L251301J393547m92931j265309j567005
41977C515300k046386k197202j547223r66548j623033k709992j579219K726148
41969f428155O941581O637357J888510k437702k840350j048554k20117j94345
41961B298225O76611J508835O45198j79131J947737N238160M503612q73352n026071
41952A0739824l681123p0339K04268k830503m302730j798439J592142J646687
41944A499787j785319m743048l657830N51891L323402J768744j800907k972072
$$ y = [7630608, 7750602, 5734519, 3793796, 3256314, 2756534, 1239183, 132403, 770375, 1778321, 1140255, -654078, -1660293, -1537558, -1427459, -1600133, -1388567, -1025600, -1397538, -1966612, -914695, 2195697, 5446998, 6840545, 6347614, 5082305, 3515300, 1468914, -728288, -2275511, -3242059, -4865092, -7575084, -9154303, -6428155, 513426, 7150783, 9039293, 6601591, 3761241, 2712687, 2492570, 2298225, 2974836, 4483671, 5128869, 4949738, 6897475, 12135635, 16639247, 15765895, 10739824, 7058701, 6988362, 7192630, 4362127, 59397, -1739042, -146900, 1499787, -285532, -5028580, -8686410, -8134519, -4811117, -3042373, -4843280, -7815352]
41936g815352q37930J635855K164538J323297L08431n30492n62873Q38091K302158
41927a174277J575058p60354j613911r3561J318767J093149N86848N12533n86911
41918H57341k540421k274505J084426L536012J676606k426819m958293n674533
41910a0720186n964389m787562q64427L484720N113696M861749N376974N864513
41902B365088L569405o62180k907226j784145M66691J972529K427805J067482
41894F515449k286983m577893k330035K849271N809067M928850L223221K217202
41886A6348149j69508m366608o784584n146269k242642j654286k817357k969992
41878i803097j469446L65069J748351K562884K545860K007315J898179K070230
$$ y = [-7815352, -8653282, -7017427, -4852889, -3529592, -3221161, -3751653, -4314526, -3476435, -1174277, 400781, -359573, -1973484, -2067045, -748278, 344871, 931719, 1444252, 857341, -1683080, -3957585, -2873159, 662853, 2339459, -87360, -5045653, -10720186, -16684575, -21472137, -22336564, -18851844, -13738148, -8876399, -3499425, 2365088, 5934493, 5272313, 2365087, 580942, 1047633, 3020162, 5447967, 6515449, 4228466, -349427, -2679462, 169809, 5978876, 10907726, 14130947, 16348149, 16178641, 11812033, 5027449, -118820, -2361462, -4015748, -6833105, -9803097, -11272543, -10907474, -9159123, -6596239, -4050379, -2043064, -144885, 1925345]
41870A925345J299150r1509k5974J753077K612487J169530k46342M93967J455589
41861A0345320m17651m191969n799141l274951J241732M291337M049046J085064
41853G328787k130036k922610r68712J304900J698975N65413p40511k091255l672756
41844a627805m343145l045499r62178j76328p12313p63572N50693K350251L487741
41835e242155L304061J532845p35008p37749K850998O736139N836799P4544m468967
41826I151507k950743J925867L671379P39192k035426j046918P35910j422759
41818H768009o264510p605761l032766K454026L168684m4909k065941o59112K149084
41809c133196M519470O450929O961155L853124k191078o637250o377828l550989
$$ y = [1925345, 3224495, 3132986, 3107012, 4860089, 7472576, 8642106, 8395764, 8889731, 10345320, 9927669, 5735700, -63441, -3338392, -2096660, 2194677, 6243723, 7328787, 5198751, 2276141, 1307429, 2612329, 4311304, 4876717, 4136206, 2044951, -1627805, -5970950, -9016449, -9978627, -10154955, -10867268, -11630840, -11080147, -8729896, -5242155, -1938094, -405249, -1140257, -1878006, 972992, 7709131, 13545930, 13620474, 9151507, 6200764, 8126631, 11798010, 12537202, 10501776, 9454858, 10190768, 8768009, 2503499, -5102262, -8135028, -5681002, -2512318, -2557227, -4623168, -5282280, -3133196, 1386274, 7837203, 14798358, 18651482, 16460404, 9823154, 3445326, -105663]
41801a05663j998418k173906k065063j231131p89871m45462J158751L237755L132273
41792a280735M80940j595977q93344N28847m14432k632869j876960K823978O652586
41783A792034M923557k56417k288521J182966N159190M216617m36396l441283
41775A0851747k682530p29845N2233l0511n33040k102674m046798l865506r17809
41766d004733J967567K333870J361444J389783K142644J656709l87052k409338
41758D050894l149901k409824m01081K046362L322469K522222O06632q62484j367940
41749D357349j071593k3651J256053J637285Q93669J68932K8129m86510j884863
41740D874800l027410k999572k285298r47761J879719N042702M879276M36324
$$ y = [-105663, -2104081, -4277987, -6343050, -7574181, -8364052, -8809514, -7650763, -4413008, -1280735, -799795, -2395772, -3289116, -2760269, -3174701, -5807570, -7684530, -4860552, 1792034, 6715591, 6459174, 4170653, 5353619, 10512809, 14729426, 14293030, 10851747, 8169217, 7439372, 7491605, 7461094, 6928054, 4825380, 778582, -3086924, -4004733, -2037166, 296704, 1658148, 3047931, 5190575, 6847284, 6460232, 4050894, 900993, -1508831, -1909912, 136450, 3458919, 5981141, 6587773, 5725289, 4357349, 3285756, 3262105, 4518158, 6155443, 7049112, 7218044, 7246173, 6759663, 4874800, 1847390, -1152182, -3437480, -4385241, -2505522, 2537180, 7416456, 7852780]
41732G852780l508689k253123K039824L457229Q21800j535763r81700K75645m1990
41723F126013p52245j45030R56909J064636N14054L61217O46498J031157J496685
41714A1299894J572657O48584l90978N8186J401314J173577j018382k694842k695697
41705I354313l024729m748940n259690k324873J771970L388792K823560K909144
41697D889547L759884K916023K47106j341001o56982n7781j255254k436602j513395
41688D551545K32243J99349j418612k150305j119855P6527L39749O67505K078119
41679C456265L613227L592638J981931L64418j63090k06168j106177l157936m915602
41670C459506m417625j501431J284467J094240j550376k756437N5011M541070
$$ y = [7852780, 4344091, 2090968, 4130792, 7588021, 8409821, 6874058, 5892358, 6168003, 6126013, 5373768, 5228738, 6185647, 7250283, 7764337, 8125554, 8772052, 9803209, 11299894, 12872551, 13521135, 13130157, 13188343, 14589657, 15763234, 14744852, 12050010, 9354313, 6329584, 1580644, -3679046, -6003919, -4231949, -843157, 1980403, 4889547, 8649431, 11565454, 11812560, 10471559, 9814577, 9756796, 8501542, 6064940, 4551545, 4783788, 4983137, 3564525, 1414220, 294365, 370892, 710641, 1378146, 3456265, 7069492, 10662130, 12644061, 13008479, 12845389, 12639221, 11533044, 8375108, 3459506, -958119, -2459550, -1175083, -80843, -1631219, -4387656, -4332645, 208425]
41662B08425O114038L538382j79077k302553l267158m248126m242426j604618
41654e983113K725351N642966N311980K762228K01683j099524j275130j164042
41646G122399j313149j371874p98727k46886j154779l366293m517994l003122
41638h650425l23531J107143J399049K316965L704075L425615J106130o13035
41630C471986L60463K629549L381849K154338Q98299Q36068Q82944m42636k599791
41621A1573069l496849k304943q28813j262702l077224l448646q98511K891627
41613h52992N351016N548187L620747m83117n915675r789211r227648m299433
41605a6048126K248834P321899Q474546M476646k650112p458101o027330p28122
$$ y = [208425, 6322463, 9860845, 9681768, 7379215, 4112057, -136069, -4378495, -5983113, -3257762, 2385204, 7697184, 10459412, 10661095, 9561571, 8286441, 7122399, 5809250, 4437376, 3638649, 3391763, 2236984, -1129309, -5647303, -8650425, -8973956, -7866813, -6467764, -4150799, -446724, 2978891, 4085021, 3471986, 3832449, 6461998, 9843847, 11998185, 12896484, 13732552, 14615496, 14172860, 11573069, 8076220, 5771277, 4942464, 3679762, 602538, -2846108, -3744619, -852992, 4498024, 10046211, 13666958, 13183841, 7268166, -2521045, -11748693, -16048126, -13799292, -6477393, 1997153, 6473799, 3823687, -3634414, -9661744, -10389866]
41597a0389866K685047K267184J083029J530255K302494J805580R22769P12973
41589B919465L54106p58982j422891r44112o27758j170302j140702p7850k37617
41580c106643k487633l264610N43434N665857N909787P76203l938686m385106
41572d287397k991840l154852l725696j655476K534343N293418N014325L576876
41564F03701K997112K841271J661671m59602j863988j408134R2557P09311l84562
41555D789337j817925j561711M86429K157084J594220m88810j817469j333068
41547B008087k9594P97762J031085J171371J279090J086409M86570o53447k379919
41538D797414l621444k354463J709500N367936M989295J299632j205140k25443
$$ y = [-10389866, -7704819, -5437635, -4354606, -2824351, -521857, 1283723, 2206492, 2919465, 3273571, 2514589, 1091698, 147586, -480172, -1650474, -2791176, -2869026, -3106643, -5594276, -8858886, -8315452, -2649595, 3260192, 4036395, 97709, -4287397, -7279237, -10434089, -14159785, -15815261, -13280918, -7987500, -2973175, 603701, 3600813, 6442084, 8103755, 7644153, 5780165, 4372031, 4464588, 5173899, 4789337, 2971412, 1409701, 1896130, 4053214, 5647434, 5158624, 3341155, 2008087, 1978493, 2776255, 3807340, 4978711, 6257801, 7344210, 7830780, 7177333, 4797414, 1175970, -1178493, 531007, 5898943, 10888238, 12187870, 10982730, 10757287]
41530A0757287J432011L46534k430086l217336j168346R99366J282334O18999
41522H620763M52774M14246m86605j798914j955913k61663J937569K149416o39861
41513H431812l979856l841024N38100N061179N528349K555875k39319j424448
41505A2630668k250434l041713k625516j246892o40772q55755k50332R28079M83405
41496C130738j427417j740165L29227J407398n13330k342615p52047K258053K344570
41487B694412o23386k700441j470328J704968M335912M884728K753402j174442
41479A0404825m212938m204685j898729N18700K224745L204717K320180j217183
41471G139632n045562n260761j150956L720187N403548L067278j075040l703208
$$ y = [10757287, 12189298, 12535832, 10105746, 6888410, 5720064, 6719430, 8001764, 8620763, 9073537, 9487783, 9001178, 7202264, 5246351, 4984688, 6922257, 9071673, 8431812, 4451956, 610932, 1149032, 6210211, 11738560, 14294435, 14055116, 12630668, 10380234, 7338521, 4713005, 3466113, 2825341, 1969586, 1719254, 2647333, 3130738, 1703321, -36844, 292383, 1699781, 1186451, -1156164, -1908211, 349842, 2694412, 2071026, -629415, -2099743, -394775, 3941137, 8825865, 11579267, 10404825, 6191887, 1987202, 88473, 607173, 2831918, 6036635, 8356815, 7139632, 2094070, -3166691, -4317647, -597460, 4806088, 7873366, 6798326, 3095118]
41463C095118k632919J174454M066136L516452R38857n78096k35414N36821R40278
41454A0821687J358845J798375J906039J848739J294591j192085n328040p249825
41446E258326l887558J776522L731847R58825j657948p94090J221835J104270
41438G712029n85367j536578j400051q47660N93007L055200M488302L029404J46485
41429A4654771j083548l54628n86340l784375p955901q887415m696386J743375
41421a0950447N350275M041466O29932j083397p24557k73613r8732J081934K932568
41412I05429L491731K579032J960270J642410m77136m227593o101152m320300
41404d547309j473048J01505J932323N324883P078222L710639k112139m138262
$$ y = [3095118, 462199, 1636653, 5702789, 9219241, 10158098, 9580002, 9344588, 9881409, 10821687, 12180532, 13978907, 15884946, 17733685, 19028276, 17836191, 12508151, 5258326, 1370768, 3147290, 6879137, 7837962, 6180014, 5385924, 6607759, 7712029, 7126662, 5590084, 4190033, 3342373, 3935380, 6990580, 11478882, 14508286, 14654771, 13571223, 13216595, 12630255, 8845880, 889979, -7997436, -12693822, -10950447, -5600172, -1558706, -928774, -2012171, -2736728, -3010341, -3109073, -2027139, 905429, 4397160, 6976192, 8936462, 10578872, 10101736, 5874143, -227009, -4547309, -6020357, -5918852, -3986529, 1338354, 8416576, 12127215, 10015076, 5876814]
41396E876814q15896L261763M105312K440196M85400j492594l770374n139775
41388D950846m255400j464234J873032M489436N007821K519077j574289l966961
41380G579328k952822k39388J668165K313152K321207J398136o80645k317058
41372I090075j784870k26077m73120k691946l677631j459302J613399K156179
41364B546707N34609j3700J605611K802032J235318j868247l487972k422968J31551
41355A062941K463614L344745J998081j202986m179462m724572k769845j18605
41347d126089J882171L207266L816623L019281Q14870j160545r51479J593238
41339H095336M285934M246339N57745m304717o367815m322014j169589o00030
$$ y = [5876814, 5060918, 8322681, 12427993, 14868189, 15353589, 13860995, 10090621, 4950846, 695446, -768788, 1104244, 5593680, 10601501, 13120578, 11546289, 7579328, 4626506, 4387118, 6055283, 8368435, 10689642, 12087778, 11407133, 9090075, 7305205, 7079128, 6606008, 3914062, 236431, -1222871, 390528, 2546707, 3081316, 3067616, 4673227, 7475259, 8710577, 6842330, 3354358, 931390, 1062941, 3526555, 6871300, 8869381, 7666395, 3486933, -1237639, -4007484, -4126089, -2243918, 963348, 4779971, 7799252, 8614122, 7453577, 6502098, 8095336, 12381270, 16627609, 17185354, 12880637, 6512822, 2190808, 1021219, 421189]
41331D21189k346308k790240m6423L422676L938937J089455j849964j540969J819773
41322B118126M531845L340789n97500k820929j169873J492772J675229L31851
41314H902310O94530K461647K078201j247989l838206k983942o36047O7336r38401
41305D559439j868240k156978k125702j460436q4579R42254J076694J288407J945950
41296B116809J623045k53942j584877n37446J494789K113982J394054P88941L08603
41287G463958n14906m34588J622191L644697K846289J68024r26607J46186M27663
41278A4442907j521230l335938k716554p30674K36412l01849j268083j982449
41270B822542k346164k067418q52260J078302L053109M037419K910490k63146
$$ y = [421189, -1925119, -4715359, -4761782, -1339106, 2599831, 3689286, 1839322, 298353, 2118126, 6649971, 9990760, 9393260, 6572331, 5402458, 6895230, 8570459, 8902310, 9596840, 12058487, 14136688, 12888699, 9050493, 6066551, 5430504, 5497840, 4559439, 2691199, 534221, -1591481, -3051917, -3136496, -2194242, -1117548, 170859, 2116809, 3739854, 3485912, 1901035, 1363589, 2858378, 4972360, 6366414, 7155355, 7463958, 6949052, 6514464, 8136655, 11781352, 14627641, 14795665, 13869058, 14015244, 14442907, 12921677, 9585739, 6869185, 6138511, 6374923, 6073074, 4804991, 2822542, 476378, -1591040, -2443300, -1364998, 1688111, 5725530, 8636020, 8372874]
41262H372874l426950m284923k800740p58250P99949K089501K850468K188904
41254E030833M88500l85020N44719K147490K751288J720375n32966k621865k456767
41245F686587N10990L235340J747211l393445o791012m681911M52292L409745
41237A175797K532817L83184m91225j17432J25447o05739j998741k747461j575226
41228c318579J047353K781731J988352k32861j597523j451188p54061l7391R33281
41219f40886J819116J788829R66585K61524k82319j344818k441392k103302m23921
41210b400584P04192Q58477K170557N234167O352253K281036l603967m315232
41202G280899J113637N464285K919100l097971n211206k316024K41767n90776
$$ y = [8372874, 4945924, 661001, -2139739, -2897989, -2098040, -8539, 2841929, 5030833, 5519333, 5134313, 5679032, 7826522, 10577810, 12298185, 11765219, 9143354, 6686587, 7197577, 10432917, 12180128, 8786683, 1995671, -2686240, -2233948, 1175797, 3708614, 4091798, 3600573, 3483141, 3608588, 3002849, 1004108, -1743353, -3318579, -2271226, 510505, 2498857, 2265996, 668473, -782715, -1536776, -1574167, -640886, 1178230, 2967059, 3933644, 4195168, 3912849, 2568031, 126639, -1976663, -2400584, -1696392, -837915, 1332642, 6566809, 12919062, 15200098, 11596131, 7280899, 8394536, 13858821, 16777921, 13679950, 8468744, 6152720, 6394487, 5803711]
41194E803711j965548r54934Q01351N17490j132075j626923o03654M13412Q73029
41185B125859J507319K688368M123569N221002M609325R40640m306667o740884
41177A0168531l960338R71112L272731K329083J319653K141180L533788L666638
41169B3442378J946390j351779m790312n592869k447517J760305K786284O10281
41161A6363161o79571J016066K767666R12259l823643p119470n964005j784950
41153A687513R42074p33217m609398n295063q56193M172180M531578J228916n21279
41144E47111Q46799J764230N4577j511307J24052L502625M780337K548724j270766
41135A1386382l864238l713480j674460m09983j388662k699540j841658Q0552
$$ y = [5803711, 3838163, 2883229, 3684580, 4202070, 3069995, 1443072, 839418, 1252830, 2125859, 3633178, 6321546, 10445115, 15666117, 20275442, 21216082, 16909415, 10168531, 6208193, 7179305, 10452036, 12781119, 14100772, 16241952, 19775740, 23442378, 25388768, 24036989, 19246677, 13653808, 11206291, 12966596, 15752880, 16363161, 15683590, 16699656, 19467322, 20379581, 16555938, 9436468, 3472463, 1687513, 2629587, 1896370, -2713028, -8008091, -8864284, -4692104, -160526, 1068390, 547111, 1393910, 3158140, 3212717, 1701410, 1825462, 5328087, 10108424, 12657148, 11386382, 7522144, 3808664, 2134204, 1724221, 335559, -2363981, -4205639, -4125087]
41127d125087P8319j345582p24218K146865L260998J105046m64402J515616M386810
41118E834365M546810K893997J946424J090015j061394k543024j019408J242301
41110A2930086K95310k865226l464166k91368K686986K406991M15222m07475L41116
41101A2047476J190001J008141k02873j225788k74990K774456N174884M011826
41093B4503133k60663m431717n888284m014390J91248L904336L710517k13853
41085A7500327k808362k40213M185011M092660r41169m790434l173824J537676
41077A5361672M565172M074252J351009j189926j347195P08279J398871j906177
41069B3015957n679375l854587K689922N628689N70174o136328o021279K785L950316
$$ y = [-4125087, -4046768, -5392350, -6116568, -3969703, -708705, 396341, -68061, 1447555, 5834365, 10381175, 13275172, 15221596, 16311611, 15250217, 12707193, 11687785, 12930086, 13225396, 10360170, 6896004, 6604636, 9291622, 11698613, 12113835, 11706360, 12047476, 13237477, 14245618, 14042745, 12816957, 12541967, 15316423, 20491307, 24503133, 24242470, 19810753, 13922469, 9908079, 10099327, 14003663, 17714180, 17500327, 14691965, 14451752, 18636763, 22729423, 21788254, 16997820, 13823996, 15361672, 19926844, 24001096, 25352105, 24162179, 22814984, 23523263, 24922134, 23015957, 17336582, 13481995, 16171917, 21800606, 22370780, 16234452, 10213173, 10215958, 14166274]
41060A4166274K330154l68833K52221K212484J177939k536381m310661j725090
41052A1198107K194540L233070J565071P72386J916483J927387p75785k512206
41044A9519053L83346M873046M610338o61534m271955k012564K556667M178980
41036B9175377K845391J666510J363355N98658l88567j046J938326M131602N574503
41027D6904109N733048M504084L500534N283352R556393J2459141J1601012R197386
41019A08739059Q051833P613912O981294Q345031J3263132J8470882K0448325
41012A91913468K1927490K8194358L8315962M6161483M9619666N2095280N3834803
41005D82062510M8485699L1486433P207185j5516201l1556398m0614100m3595853
$$ y = [14166274, 16496428, 16127595, 16379816, 18592300, 19770239, 17233858, 12923197, 11198107, 13392647, 16625717, 18190788, 18963174, 20879657, 22807044, 22031259, 19519053, 19902399, 24775445, 29385783, 28724249, 24452294, 22439730, 24996397, 29175377, 32020768, 33687278, 35050633, 35649291, 35260724, 35259678, 37198004, 41329606, 46904109, 52637157, 57141241, 60641775, 65925127, 75481520, 87940661, 99541673, 108739059, 116790892, 124404804, 131386098, 139731129, 152994261, 171465143, 191913468, 213840958, 242035316, 280351278, 326512761, 376132427, 428227707, 482062510, 530548209, 562034642, 569241827, 553725626, 522169228, 481555128, 437959275]
40998D37959275m1149557l4069853k3290020j0964201j451735K535371N286101
40991C34855381J4373909K9332609L9250812L5151807J9951161K031031j5605606
40984D59341104l3387384m6923346m9638022m2854622l5329159l1838839k8979700
40977A90390032k3621259j8615879j7038540j6508142j3439068r008928o838380
40970H5319836p481311q757001r366846r056874p156269l932191j708222j898767
40962C5962355k555529j457694J55128j72941j814025k245722j291781q18402
40954B5761389j059393o54192J48775k30230j366154j223501p1573m21157k340524
40945A8543440k553322J79013K225413K68775l267425l385597J06686K005912
$$ y = [437959275, 396809718, 362739865, 339449845, 328485644, 327033909, 329569280, 334855381, 349229290, 378561899, 417812711, 452964518, 472915679, 474946710, 459341104, 425953720, 379030374, 329392352, 286537730, 251208571, 219369732, 190390032, 166768773, 148152894, 131114354, 114606212, 101167144, 92158216, 85319836, 77838525, 69081524, 59714678, 50657804, 43501535, 39569344, 37861122, 35962355, 33406826, 31949132, 32104260, 31931319, 30117294, 27871572, 26579791, 25761389, 24701996, 24047804, 24196579, 23966349, 22600195, 21376694, 21305121, 20883964, 18543440, 15990118, 16169131, 18394544, 18663319, 15395894, 12010297, 12116983, 14122895]
40937A4122895j009525n398819m959483J258914P517221Q179383M008434J20969
40929B3839989r93032j531106l389848m623377k933571K9745R87455j6953m16068
40920A0953234J49664l05832j745962j568258Q45010K649043J922989L74020R4690
40911A3368598N20358M49965M34544J005898Q18918j090820l024069k896072j321850
40902H265470l18682l06446m30610n10268n58822L55021K507651L816183K080170
40893A4899667j640031l905945k806910N09808L559307M431859K962695J365066
40885A9375516K419124N514355O225007K007197l413008m295508l45388L462231
40877C0949526M010971L316102M108875N554242N090522K347464p08422k492697
$$ y = [14122895, 13113370, 7714551, 2755068, 4013982, 11531203, 19710586, 23719020, 23839989, 22846957, 21315851, 17926003, 13302626, 10369055, 10398800, 11386255, 11369302, 10953234, 11102898, 10797066, 9051104, 7482846, 8327856, 10976899, 12899888, 13273908, 13368598, 13888956, 14338921, 14773465, 15779363, 16598281, 15507461, 12483392, 9587320, 8265470, 7946788, 7640342, 7209732, 6699464, 6140642, 6495663, 9003314, 12819497, 14899667, 13259636, 9353691, 6546781, 7056589, 10615896, 15047755, 18010450, 19375516, 21794640, 27308995, 33534002, 35541199, 32128191, 27832683, 27487295, 30949526, 34960497, 38276599, 42385474, 47939716, 53030238, 55377702, 54669280, 52176583]
40869E2176583l139254l496513l899209m165119m292559m466528m127961k013949
40861B2575491J693915M221809L374613J231687J590604L830965L458253k68856
40853D1708481k144578J016795N069608N078318K702658K073624K365230O43834
40845E8513970j288354k85688L17696n091783j3092918j3513537m613514L051264
40837B3997136J413333m628300o396424l825661k209318k190986n77854K077196
40829G659122K051210o42391k149314j283271q69108k316891l393607k280285
40821c224535l34368K69388p64143k173009k367092k69416L334324N461000L748320
40812C680469m03268k992331j699450K048623M960568M889339K427093K40941
$$ y = [52176583, 49037329, 45540816, 41641607, 37476488, 33183929, 28717401, 24589440, 22575491, 24269406, 28491215, 31865828, 33097515, 34688119, 38519084, 41977337, 41708481, 39563903, 40580698, 45650306, 50728624, 53431282, 55504906, 57870136, 58513970, 57225616, 56939928, 57257624, 52165841, 39072923, 25559386, 20945872, 23997136, 25410469, 20782169, 14385745, 10560084, 8350766, 6159780, 5581926, 7659122, 9710332, 9067941, 6918627, 5635356, 4766248, 2449357, -944250, -3224535, -3558903, -3289515, -4053658, -6226667, -8593759, -8863175, -5528851, -67851, 3680469, 3277201, 284870, -1414580, 634043, 5594611, 10483950, 12911043, 13151984]
40804A3151984L05709J584206J506337l56274k023610k645195l626989n338726
40796B557442n521841k606798J685970M591702N024093L003853q66171m080127
40788C788123l591945k37186J461477k87509k018839j017609M52491j11242r35710
40779b497949M3172J052549O70862J628702N257062O759665K436256k645124j866679
40770A0838516J656568O5235n345095n605623P00437M412501K83410n309238n108506
40761c411795r58972J827947K808576L660284L195279P53967m57129J244164J950757
40752A0613078j241234m244975k419706J319921J362795j248888j490615L25338
40744B975714k96126k863631j966154K973896N530446J976871l087396l799936
$$ y = [13151984, 13457693, 15041899, 16548236, 16191962, 14168352, 11523157, 7896168, 2557442, -2964399, -5571197, -3885227, 706475, 5730568, 8734421, 7868250, 3788123, 196178, -41008, 1420469, 1132960, -885879, -1903488, -1450997, -1562239, -2497949, -2454777, -1402228, -731366, 897336, 6154398, 12914063, 15350319, 12705195, 10838516, 12495084, 12560319, 7215224, 1609601, 2310038, 6722539, 7005949, 1696711, -3411795, -4370767, -2542820, 265756, 3926040, 7121319, 7875286, 7418157, 8662321, 10613078, 9371844, 5126869, 2707163, 4027084, 5389879, 4140991, 2650376, 2975714, 2679588, -184043, -2150197, 823699, 6354145, 8331016, 5243620, 1443684]
40736A443684p80229J546292J508929M42811r01654k479409k896852n58122L366943
40727F92393N465882L891419L52112j887609j187424J383523L497594L662273
40719A5870163J918121r03452l649222m650699k677671R72507K797337J103208
40711A0780292j391822r77182J746552K495395n93901l986314l166515J499763
40703F406268N021948L645893p40917k733124J52883M056105L052655l258103
40695A5603608q510181p117845j153843K614960J337667j352227j306924Q53564
40687I68779J779030L11176j681134k179547r02926J108433K332850J515288j168119
40678B083830l785821m439167l225391j566004M0019K244795M772183N687395
$$ y = [1443684, 663455, 2209747, 3718676, 4161487, 3259833, 780424, -2116428, -2674550, 692393, 6158275, 10049694, 10401806, 8514197, 7326773, 8710296, 12207890, 15870163, 17788284, 16884832, 13235610, 8584911, 5907240, 6879747, 9677084, 10780292, 9388470, 8411288, 10157840, 12653235, 12059334, 8073020, 4906505, 6406268, 11428216, 15074109, 14333192, 11600068, 11752951, 15809056, 18861711, 15603608, 7093427, -24418, -1178261, 1436699, 2774366, 1422139, 115215, 968779, 2747809, 3058985, 1377851, -801696, -1704622, -596189, 1736661, 3251949, 2083830, -1701991, -6141158, -9366549, -10932553, -10892534, -8647739, -3875556, 1811839]
40670A811839L671964Q8693k254907j868246O92166M038660O623011O834917M193093
40661B3831190L75577k581649m956085q060139j0336320q031668j172324M530346
40653f401072M560980J589446Q64486J997753M47580l827124n252905j310661
40645g331517L272968L640914J373897L40153k082k360655n250903m326783N22300
40636a0121708M208434L226080l47319k615592k430272q16871J445558L694561
40628c757129M542934L199737R73635L4090R13753K115546K011413M93674j210183
40619I317470j965820j849079j827941k373090k707906j706861O92191L263138
40611H42102M529246L895922K015487J60498r39920j506849j739944j106129N42648
$$ y = [1811839, 5483803, 5572496, 3317589, 1449343, 2141509, 6180169, 12803180, 19638097, 23831190, 24206767, 21625118, 16669033, 8608894, -1727426, -9759094, -10931418, -6401072, -1840092, -250646, 613840, 2611593, 3059173, -767951, -6020856, -7331517, -4058549, -417635, 956262, 1296415, 1294333, -1066322, -6317225, -10644008, -10121708, -5913274, -2687194, -3034513, -5650105, -8080377, -8897248, -7451690, -3757129, 785805, 3985542, 4959177, 4993267, 5907020, 8022566, 10033979, 10527653, 9317470, 7351650, 5502571, 3674630, 1301540, -1406366, -3113227, -2421036, 842102, 5371348, 9267270, 11282757, 11443255, 10503335, 8996486, 7256542, 6150413, 6693061]
40602F693061J874358J626083P90557J247285K318520J228886k340802m773938
40594H664010l053904J321174M577892M959586L118808J43392k712668l835640
40586A3182650k928037j776370j692591j667916p34201j42806r21175j357211
40578A962343J90977J890723J214156n83269o67877J10393j203256l541459k535722
40569c162991K086095N011992K958665p95717j830827n40109J58248l16453q24274
40560B744629j355969k076871j592846P70594K704811J918144j13640l53611J199425
40551C844666K177395J927180J630421J141218p78201l233779l643881j826919
40543A238100n81657j477407k824031k688718j346088K56075J948526L091324
$$ y = [6693061, 8567419, 10193502, 10984059, 12231344, 14549864, 15778750, 13437948, 8664010, 5610106, 6931280, 11509172, 16468758, 19587566, 19730958, 17018290, 13182650, 10254613, 8478243, 6785652, 5117736, 4383535, 4240729, 3319554, 1962343, 2153320, 4044043, 5258199, 4674930, 4007053, 4117446, 2914190, -627269, -3162991, -1076896, 3935096, 6893761, 6098044, 4267217, 3727108, 3885356, 3568903, 2744629, 1388660, -688211, -2281057, -1510463, 1194348, 3112492, 2998852, 2645241, 3844666, 6022061, 7949241, 9579662, 10720880, 9942679, 6708900, 3065019, 1238100, 656443, -820964, -3644995, -6333713, -7679801, -7423726, -5475200, -2383876]
40535b383876K379787L78562j43770J805193L396061K012982q19076k053168j692140
40526B880555j730003k165014j588359o03720p51170p50363J676924M338272K277973
40517C585095l774500o373135j826604L571798K443709k880573m496056r11241
40509a0661507K125939J677776J114053K691279L549098J642250j73267N76069
40501B541690J438362k48776k080495n20034K792530L315789M06404k404897k824644
40492B415929j754976o53048k05333q78728j920945r20898K672948N046105K591719
40483F392773k263070l887096j315416J144935R12870j34227n69797j970443m547879
40474f237350m782244o96321L767080L490061m78606k114778J440314O185898
$$ y = [-2383876, -4089, 374473, 230703, 2035896, 5431957, 7444939, 6625863, 4572695, 2880555, 1150552, -1014462, -2602821, -3206541, -3957711, -4708074, -3031150, 1307122, 3585095, -189405, -6562540, -8389144, -4817346, -2373637, -5254210, -9750266, -10661507, -8535568, -6857792, -5743739, -3052460, 496638, 2138888, 1965621, 2541690, 3980052, 3731276, 1650781, 1130747, 3923277, 7239066, 7645470, 5240573, 2415929, 660953, 7905, -197428, -1076156, -2997101, -3917999, -1245051, 3801054, 6392773, 4129703, 242607, -1072809, 72126, 984996, 850769, 280972, -1689471, -6237350, -11019594, -11715915, -7948835, -4458774, -4937380, -7052158, -5611844, 574054]
40466E74054O566730K279329j964722k783114k152533l868469p274789p344660
40458a5968174j621017N835288R438256Q537954O035893K841450k013061o734566
40450F352023p223817l045328J163562J810198N03226L99768J600122K478360
40442D038114K957908L626866L257259J65337m395041o550718m052645Q48010
40434a04910L332559Q61760l956671n919795l016611J374365K909310J358104
40426c161889m13407q86549p10862k92573L59720J41288j549319k340214L24662
40417h529143M221538M252447l42204m736079n175092k807965K8234K903284N036704
40408e148276M292959Q76882j510026n72412J669202K823796L446639M185062
$$ y = [574054, 7140784, 9420113, 7455391, 4672277, 2519744, -1348725, -8623514, -15968174, -17589191, -11753903, -2315647, 6222307, 12258200, 15099650, 13086589, 6352023, -871794, -3917122, -2753560, -943362, -440136, -40368, 1559754, 4038114, 6996022, 10622888, 13880147, 14045484, 9650443, 3099725, -952920, -104910, 3227649, 4089409, 132738, -5787057, -8803668, -7429303, -4519993, -3161889, -3575296, -4461845, -5172707, -5465280, -5105560, -4964272, -6513591, -8853805, -8529143, -4307605, -55158, -397362, -5133441, -10308533, -13116498, -13088264, -10184980, -5148276, -855317, 21565, -1488461, -2060873, -391671, 2432125, 5878764, 10063826]
40400A0063826L373780M14609j743937p23046J382814J223484j093882l210142
40392I687506m044388l646210k002193k82345o29709k646331l140118j262454
40384g966242o7562q14057m68779K089545K741646o80661l249007o20608L029721
40375f006004J545555k777008k926421J526535M778885M493672L149938J034050
40367D819202l691432q204413o858148p48136K573046N24610j083561J770894
40359a0897938N329624N356007L428238K126255K02145l141556m598638j959692
40351d155555J516216K211721J612127K631091M357517M552505L789604L060958
40343A9576184P55479l755976o825309n302238j738704l47991m72507J130337
$$ y = [10063826, 13437606, 13852215, 12108278, 11385232, 12768046, 13991530, 12897648, 9687506, 5643118, 1996908, -5285, -287630, -917339, -3563670, -6703788, -7966242, -8033804, -8847861, -9316640, -7227095, -4485449, -5166110, -8415117, -9035725, -6006004, -4460449, -7237457, -10163878, -8637343, -3858458, 635214, 3785152, 4819202, 1127770, -7076643, -13934791, -14682927, -12109881, -11585271, -12668832, -10897938, -5568314, -212307, 3215931, 5342186, 5544331, 2402775, -2195863, -4155555, -2639339, -427618, 1184509, 3815600, 8173117, 12725622, 16515226, 19576184, 20331663, 16575687, 9750378, 4448140, 2709436, 2361445, 1888938, 3019275]
40335C019275L779305L816393P30710k422501l841031l911518k278689J485315
40327C77259M710604L664140q63541l886154k776205j50166N07770q84846k056247
40318a357386j390437Q74230K792115J996601j479284m146390k897742P38040
40310d870253K663386J869904R57806J269075J117101m25774j463978n87782N96811
40301A126296K24738q18291q80048p53752k268783m588145m660139j552110J893994
40292a2276240K640684J146775J82178R14054J930570K070111K239531L357963
40284B205626M061981K406015q78266l027489l025596k407866k007969o34852
40276c308416J822624K692735J89780l155357l449760o81190J730524J965288
$$ y = [3019275, 6798580, 10614973, 11345683, 8923182, 5082151, 1170633, -1108056, 377259, 5087863, 8752003, 7888462, 4002308, 1226103, 1075937, 1583707, 698861, -1357386, -2747823, -1873593, 918522, 2915123, 1435839, -2710551, -5608293, -4870253, -2206867, -336963, 620843, 1889918, 3007019, 2581245, 1117267, 529485, 1126296, 1351034, 532743, -347305, -1101057, -3369840, -7957985, -12618124, -14170234, -12276240, -9635556, -8488781, -8306603, -7392549, -5461979, -3391868, -1152337, 2205626, 6267607, 8673622, 7795356, 4767867, 1742271, -665595, -2673564, -3308416, -1485792, 1206943, 1396723, -1758634, -5208394, -5889584, -4159060, -2193772]
40268b193772J497638J754527J953774J150847J19064j84280m01792j525552k907202
40259g36748k995541j534911K52412J438290K178508K744108K936078K840992
40251G123188L102157L648596L010368J14752l678634n728523n146523l190034
40243g44653q19214J945469L934404L045637K8465r26874K085905N067617L582072
40234A7198828n95916k654326k564728m103368o893829o055267q49358K939330
40226c578634J979056O70290L384479O715914M886698q84642m329194l222437
40218E621530r04526L4251K27145P7290j274571l177595l708231l067932l160170
40209i332809l542448j491654L206378O894163O547029L083268n36617k224739
$$ y = [-2193772, -696134, 1058393, 3012167, 4163014, 4282078, 4097798, 3696006, 2170454, -736748, -3732289, -5267200, -5014788, -3576498, -1397990, 1346118, 4282196, 7123188, 10225345, 13873941, 16884309, 16999061, 13320427, 7591904, 2445381, -744653, -1563867, 381602, 4316006, 7361643, 7390108, 6463234, 8549139, 13616756, 17198828, 16602912, 13948586, 11383858, 7280490, 386661, -5668606, -6517964, -3578634, -1599578, -929288, 2455191, 9171105, 14057803, 13173161, 8843967, 5621530, 4717004, 4751255, 4978400, 5055690, 3781119, 603524, -3104707, -6172639, -9332809, -12875257, -14366911, -11160533, -4266370, 2280659, 5363927, 4827310, 2602571]
40201B602571j438770P05796J752700N57324n94348Q87892L193168K094922k281953
40192G479302m824836k756000M18735N01894j295958j020060J503517K415668
40184B422262m43044m457843n552219k989862J23990P71269m82603p79450O44281
40175a0743219J397327J47444o35918J352036L627993K026422k557083m792519
40167a0177517k390412J277433K888043L319685M403222N312054M592477K871052
40159A2096037J249318m44739j836780j327282N26141J48993l488810n540622
40151A382256j606144M857586O250145J032183m555062n166197k249525O183O49209
40142F00634J335063K245771J741067n10446k378629j809625N79442K259965J904672
$$ y = [2602571, 1163801, 1869597, 3622297, 4179621, 3585273, 4473165, 7666333, 9761255, 7479302, 2654466, -101534, 317201, 819095, -476863, -1496923, 6594, 2422262, 1979218, -2478625, -8030844, -11020706, -10896716, -10125447, -10608050, -11387500, -10743219, -9345892, -9198448, -9834366, -8482330, -4854337, -2827915, -5384998, -10177517, -12567929, -11290496, -8402453, -5082768, -679546, 4632508, 9224985, 12096037, 13345355, 12900616, 11063836, 9736554, 10262695, 10411688, 6922878, 1382256, -223888, 4633698, 10883843, 11916026, 7360964, 2194767, -54758, -48575, 600634, 1935697, 4181468, 5922535, 5412089, 3033460, 1223835, 1803277, 4063242, 5967914]
40133E967914P51269K10430p56566l770148o853101n465126O84967N164255K596683
40124a469423l313156m188461J291219N369671K185256m259861o269383k785023
40116a3439161Q82647J504598J067521J655560J958949N08411j067476m02201
40108g331152K076145M129616M696493L924035J709739j450903l302511k214821
40100B236641j38197l52049k478664k914147o52061Q39276r16943l324464k648184
40091a0348792M68223K508974K371468J741783J200308l74816k545321k949863
40083g928036j042569P22091O77380L80321J571682K781798J286361k544006n136531
40074i231509m045602p44747J570788J916121J987756K827962K736097J487l354220
$$ y = [5967914, 6719183, 6929613, 6173047, 2402899, -4450202, -9915328, -9230361, -4066106, -1469423, -4782579, -8971040, -7679821, -2310150, -124894, -4384755, -10654138, -13439161, -12556514, -11051916, -9984395, -8328835, -6369886, -5861475, -6928951, -7331152, -5255007, -1125391, 3571102, 7495137, 9204876, 7753973, 4451462, 2236641, 2098444, 1746395, -732269, -3646416, -4298477, -3459201, -4376144, -7700608, -10348792, -9880569, -7371595, -5000127, -3258344, -2058036, -2432852, -4978173, -7928036, -8970605, -8248514, -7571134, -7190813, -5619131, -2837333, -1550972, -4094978, -9231509, -13277111, -14021858, -12451070, -10534949, -8547193, -5719231, -2983134, -2981647, -6335867]
40065f335867l325962K17976K461981Q8695l950927m685761j773146J439820L547505
40056a2315686N523689O585029M518173M63753j296011M37941K018153J120740
40048G055781M57166K621219M882560K850970k814563o950119o161766j810784
40040A30464K551478M413970L432783J226283n6906Q6557K85547m33176j507539
40031A0129461k359940l093448l056713j187358J213000J008308j787893k789341
40023a923924L76868L543094J531287m069908o916269m471904k87516J916425
40015a0301847K305981K500770K624707K109986J113200L2561q63063r70742n3944
40006a502391O44072k26955j733576j599782M50092K308081K585471K061948J709530
$$ y = [-6335867, -9661829, -9443853, -6981872, -6893177, -10844104, -15529865, -17303011, -15863191, -12315686, -6791997, -206968, 4311205, 4774958, 3478947, 3916888, 5935041, 7055781, 7512947, 10134166, 15016726, 17867696, 15053133, 8103014, 1941248, 130464, 2681942, 7095912, 10528695, 11754978, 11698072, 11784629, 12070176, 11637000, 10129461, 7769521, 4676073, 1619360, 432002, 1645002, 2653310, 865417, -1923924, -1547056, 1996038, 3527325, -542583, -7458852, -11930756, -12218272, -10301847, -7995866, -5495096, -2870389, -760403, 352797, 385358, -477705, -1448447, -1502391, -858319, -1085274, -2818850, -4418632, -3968540, -1660459, 925012, 2986960, 4696490]
39997D696490J291497N91530L04045P84944J074006m0528k540673m971235n364941
39988d174865k904469O79413K305766J174687j0758J070464K726737J809840j263039
39979A413776l006721j979506l06042J95038M56464J769257L334416L542581K176353
39970G595616L15720r37688j173840r75612j392435k200471j596095P62523J766999
39961B164717j251135n504063n322352P6199N188118N548643K730959M14363q23133
39952C222316k112273k749267j554408J960m80979k246268k106838P75855L418820
39943c831082K868721k50900k716026k146228J039631M431092N873973M970080
39935A0239261K608795k53156k599074k904892m72664K697204L265805M68401
$$ y = [4696490, 5987987, 6579517, 6883562, 7668506, 8742512, 8701984, 6161311, 1190076, -4174865, -7079334, -6399921, -4094155, -2919468, -2930226, -1859762, 866975, 2676815, 1413776, -1592945, -3572451, -3878493, -3683455, -3226991, -1457734, 1876682, 5419263, 7595616, 7911336, 6973648, 5799808, 4824196, 3431761, 1231290, -364805, 397718, 2164717, 913582, -4590481, -9912833, -9836634, -4648516, 900127, 3631086, 4045449, 3222316, 1110043, -1639224, -3193632, -3191672, -3672651, -5918919, -8025757, -7249902, -3831082, -962361, -1213261, -3929287, -6075515, -5035884, -604792, 5269181, 10239261, 12848056, 12594900, 9995826, 7090934, 6618270, 9315474, 12581279, 13049680]
39927A3049680k957680m449492m379390m094750l242776r84999J493360J990519
39919c575528M22127q80484r0101K068198L248810J802418j579715m085134l289392
39910e958801J4782K364897J682721k91199o08527R64534K138407J531122J96294
39901B034230k91657Q2547R1781r75196k309652k403345r66445L65950K0464j154385
39891e505708r20056R29601K059758J168414K0702N22393J631353J269152r791
39882A165818K18045K295334L727695K622794j3932j911423k042894j064016l79874
39873D617547j085632k830521l608956j816300J353479K916787J921144P87185
39865B254733J878117M001318L949406J025376j835815j956529l62650J5814j287833
$$ y = [13049680, 10092000, 5642508, 1263118, -2831632, -6074408, -7059407, -5566047, -3575528, -3153401, -4033885, -4123986, -2055788, 1193022, 2995440, 1415725, -2669409, -5958801, -5944019, -3579122, -1896401, -2187600, -2796127, -1831593, 306814, 1837936, 2034230, 1742573, 1825120, 1916901, 941705, -1367947, -3771292, -4737737, -4371787, -4351323, -5505708, -6425764, -5496163, -3436405, -2267991, -2247289, -1724896, -93543, 1175609, 1165818, 1383863, 3679197, 7406892, 10029686, 10015754, 8104331, 6061437, 4997421, 4617547, 3531915, 701394, -2907562, -4723862, -3370383, -453596, 1467548, 2254733, 4132850, 8134168, 12083574, 13108950, 11273135, 9316606, 8953956, 8969770, 7681937]
39856G681937j744833M3900J796912P17906k145880l069548q90939J419402J141230
39847D950087n01186o50275P44600J054400q57271k744683k004393P11766K197075
39838B900120Q29870j178474n80930K330114L544239M75713m145358n239463j556512
39829b620681L095430M707531L138829R41528K1962L34684N64543n91898k833981
39820F757947l916170k360876k12888p07208l131537l209236M30400L755951L447363
39811H53746K032217L469658O254279N380233O6946m899907n670107l400010j176999
39802B910056k46712m85320j747891l057774k525989J83449K669271K519721K34897
39793D53708j735472k004866j169027l26343J64197M96284P63432Q84170J104343
$$ y = [7681937, 5937104, 5981004, 7777916, 8495822, 6349942, 3280394, 2389455, 3808857, 4950087, 4448901, 3798626, 4543226, 5597626, 4740355, 1995672, -8721, 703045, 2900120, 3729990, 2551516, 1970586, 4300700, 7844939, 8320652, 4175294, -1064169, -2620681, 474749, 5182280, 8321109, 9262637, 9284599, 9619283, 10183826, 9591928, 6757947, 2841777, 480901, 268013, -439195, -3570732, -6779968, -6349568, -2593617, 853746, 2885963, 6355621, 12609900, 17990133, 18057079, 13157172, 7487065, 4087055, 2910056, 2663344, 2178024, 430133, -2627641, -5153630, -4970181, -2300910, 218811, 453708, -1281764, -3286630, -4455657, -4782000, -4617803, -4121519, -3358087, -2473917, -1369574]
39784a369574K118843M014174N204701L668300j92533l207601k996714p76421
39776F463175N22375k50864k165705l969718m386617k205556J549938K997286
39768a445686K3719l548784k225445L114053N794527K667634j669963j921475
39760G88580Q07700K035241P18118q22213j603912k419216k588275m27535K910966
39751f00546L725199R06400k038596j561833J351584K766409O80010l093197n161328
39742c025898l559963R19022N330729O703234M437323P92190j308817r66942K72223
39733I593101L92071j059044k840225l555012l010839k005371j099721j61600
39725c746640P79474R88266J05278o62638K82791K267675K286402j095355m739937
$$ y = [-1369574, 749269, 4763443, 9968144, 13636444, 13443911, 10236310, 7239596, 6463175, 6985550, 6734686, 4568981, 599263, -3787354, -5992910, -4442972, -1445686, -1421967, -4970751, -7196196, -4082143, 1712384, 4380018, 2710055, 788580, 1596280, 3631521, 4349639, 3527426, 1923514, -495702, -3083977, -3511512, -600546, 3124653, 4031053, 1992457, 430624, 1782208, 4548617, 5228627, 2135430, -3025898, -6585861, -5666839, -336110, 6367124, 10804447, 11596637, 10287820, 9320878, 9593101, 9985172, 8926128, 6085903, 2530891, -479948, -2485319, -3585040, -3746640, -2967166, -1978900, -1873622, -2536260, -2253469, 14206, 2300608, 1205253, -3534684]
39716c534684m061489O73965L753702J341489k854712k314807L009078O225616
39708B238158K981463k746439m718349k787053j365242j841057j392568J077160
39700h553927K700199J563748j58157j03688M32134p81097k675057k399270J76906
39691i798209K222936J668250r43564l741906m707712k270181K955484P286921
39683g327981P147585L279107k41712j230812j244659j826345j869115l84832
39675c698764O17752j211138m312639m615063j015623L200461M868754M379459
39667a786801L558035K533948P85822m03058O19010K478869J760413j963379m606344
39658B976515k636787K026485M112419J189629l929011o571177m539911O33581
$$ y = [-3534684, -7596173, -6922208, -3168506, -1827017, -4681729, -6996536, -3987458, 2238158, 5219621, 2473182, -2245167, -5032220, -6397462, -8238519, -9631087, -8553927, -5853728, -4289980, -4448137, -4551825, -4119691, -4900788, -7575845, -9975115, -9798209, -7575273, -5907023, -6850587, -10592493, -15300205, -17570386, -14614902, -7327981, -180396, 3098711, 2856999, 1626187, 381528, -1444817, -3313932, -3698764, -3081012, -4292150, -8604789, -13219852, -14235475, -11035014, -6166260, -1786801, 1771234, 4305182, 5091004, 4687946, 5306956, 7785825, 9546238, 7582859, 2976515, 339728, 2366213, 6478632, 7668261, 3739250, -2831927, -7371838, -6738257]
39650f738257N238997O095373L024785r70552k683630j772143j67271Q85324J582473
39641D495099J669184R1749k627641l696297j404384K075644L166067J537017
39633E306438J98594Q78853J513716m82623m062005n686184m130517j916092j383079
39624i762899j461650k9173K104812K272406N51832J41193K259516L695047J542254
39615A313338j992881k537264P1640J791373M60920j561611j538636k4358J086801
39606b930678J656216K441327K962960K415945J469120R88702k9856k718989n020012
39597A234735l190400K562507O776074N106165Q5928k285439p59632r5129l444634
39588E990175p129052n673003K94452M776956M178437P24153j885099k599703
$$ y = [-6738257, -1499260, 4596113, 7620898, 6650346, 3966716, 2194573, 2027302, 2912626, 4495099, 6164283, 6256032, 3628391, -67906, -1472290, 603354, 3769421, 5306438, 5505032, 6383885, 7897601, 7414978, 3352973, -2333211, -6463728, -8379820, -9762899, -11224549, -11253722, -9148910, -6876504, -6324672, -6183479, -3923963, -228916, 1313338, -679543, -3216807, -3145167, -1353794, -892874, -2454485, -3993121, -4017479, -2930678, -1274462, 1166865, 4129825, 6545770, 8014890, 9003592, 8973736, 6254747, 1234735, -1955665, 606842, 7382916, 12489081, 12575009, 10289570, 9529938, 9434809, 5990175, -1138877, -6811880, -6517428, -1740472, 2437965, 3162118, 1277019, -1322684]
39580a322684k000354o61162K0516j401910l166388j311594L882604O399441K745035
39571C183504k205882k244875P64168N93624k590959k533655K417478O456097
39563C839500N672574L320778K924436K412126q00318m059719l713705j353573
39555H242099q87073k109373j987580l48098M11726k0418K7655K01518j510873
39546B019583m481000n419537l246222p80019n94317j589015q59329K391814N654870
39537f903172N460939J137860l660277m424812j193716J537669J158493L22082
39529f564934J945758L862877K048894k670068n186976k931644J227255K990119
39521e278719J113288k015981k571489J117073N652819N156869j083902o218361
$$ y = [-1322684, -3323038, -3984200, -3963684, -5365594, -8531982, -9843576, -5960972, 438469, 3183504, 977622, -1267253, -503085, 90539, -2500420, -5034075, -2616597, 3839500, 9512074, 12832852, 15757288, 18169414, 17369096, 13309377, 9595672, 8242099, 7355026, 5245653, 3258073, 2909975, 3321701, 3301283, 3328938, 3530456, 2019583, -2461417, -7880954, -11127176, -11907195, -12501512, -14090527, -14949856, -12558042, -6903172, -1442233, -304373, -3964650, -8389462, -9583178, -8045509, -6887016, -6564934, -4619176, -756299, 1292595, -1377473, -6564449, -9496093, -8268838, -5278719, -4165431, -6181412, -8752901, -7635828, -1983009, 3173860, 2089958, -4128403]
39513d128403m480962N40379J210426k655256l982213J53067M143130K799463
39505f400369j186358k050468J072365M635375O097144N292200K484299j498476
39497H445712m177562l333414M6778K409706J358834j905931l776400j942698
39489b874975J801600L391679J817260N70634J922766K631208p55253m851051
39481C653868l579106J698910L250391j011779m045946j002803L201160K388173
39473D552868j041275j169946J113352K56572l919870n698506k546236J597380
39465f855661K734637J337078n07929k050413k694597j479012Q99054K270848
39457f345995K075088J862480K404571K867866L030353L482277L309039N89420
$$ y = [-4128403, -8609365, -8068986, -6858560, -9513816, -13496029, -13342962, -9199832, -6400369, -7586727, -9637195, -8564830, -3929455, 2167689, 7459889, 9944188, 8445712, 4268150, 934736, 981514, 3391220, 4750054, 2844123, -932277, -2874975, -1073375, 2318304, 4135564, 4706198, 6628964, 9260172, 8504919, 3653868, 74762, 1773672, 5024063, 4012284, -33662, -1036465, 2164695, 4552868, 3511593, 2341647, 3454999, 3711571, -208299, -5906805, -8453041, -6855661, -4121024, -2783946, -3291875, -5342288, -8036885, -9515897, -8616843, -6345995, -4270907, -2408427, -3856, 2864010, 5894363, 9376640, 12685679, 13275099]
39449A3275099m067088p245649o871378m209755j126386J925260M277500M257321
39441B14924J646092j150800j911686r90865J36047R88879J696314K150184K545091
39432E324180L228983L312918J280562k213772m230363l328273j436510p17357
39424A220368p02112j38284L95048k20430j342151j650832j279880r92112n55007
39415e265392J51131r6554j668964k092512Q42799M871459N392603J739003j785443
39406B088130j659426P94670J977021K92812l147738o054951o129721k620652
39398a4459855K129999M398363L393162K091421K740591L720901K523958l03681
39390F234859k439551l185616k984501j163381K571368N361629L664934j409966
$$ y = [13275099, 9208011, 1962362, -4909016, -9118771, -10245157, -8319897, -4042397, 214924, 1861016, 710216, -1201470, -2192335, -2056288, -1067409, 628905, 2779089, 5324180, 8553163, 11866081, 13146643, 10932871, 6702508, 3374235, 1937725, 1220368, 518256, 379972, 775020, 554590, -787561, -2438393, -3718273, -4710385, -5265392, -5114261, -5210815, -6879779, -8972291, -8129492, -3258033, 2134570, 3873573, 2088130, 428704, 1223374, 3200395, 3493207, 345469, -5709482, -11839203, -14459855, -12329856, -7931493, -4538331, -2446910, 293681, 4014582, 6538540, 6234859, 3795308, 609692, -2374809, -3538190, -966822, 4394807, 8059741, 6649775]
39382F649775m688268l491574m43764J132403J272975J314216J039273K13539
39374B998575K87450J815321K309724l03246l688251l784788n46995K092148J513256
39365B693194j136638l400928l681183j283086K803524N256771L538374j62776
39357D627252j121628J449187L434213K147137K7773J90375J529454J073362r63033
39348A2394092j632109J08654J876253J101686j775119l734670k459214P05217
39340F584790J645615j480160m994609l988075O06803K911824P47743r83322K077194
39331C127803O760878O869529J903532l019766m315835k738572o0986K644861
39323A1171444L544936J045176l024356m643444k847681p46795o05619j037785
$$ y = [6649775, 1961507, -1530067, -1973831, -841428, 431547, 1745763, 2785036, 2998575, 3286025, 5101346, 7411070, 7107824, 3419573, -365215, -912210, 1179938, 2693194, 1556556, -1844372, -5525555, -6808641, -4005117, 1251654, 4790028, 4627252, 3505624, 4954811, 8389024, 10536161, 10563934, 10754309, 12283763, 13357125, 12394092, 10761983, 10870637, 12746890, 13848576, 12073457, 8338787, 5879573, 6584790, 8230405, 6750245, 1755636, -2232439, -1625636, 1286188, 2033931, 1050609, 3127803, 9888681, 16758210, 18661742, 15641976, 11326141, 8587569, 8526583, 11171444, 14716380, 15761556, 12737200, 8093756, 5246075, 4499280, 3893661, 2855876]
39315B855876j59720J538751K993369M395849N322486L678004q98956m535153
39307A5190506l118879K037716N409283M025495L72270j998731l103844m936346
39299A3877470o974899o219268j960598K045728J885336j455528l468147j932027
39291d201933R72511K320210J692098J37560j621533k692219j926400R9804J007849
39282d212053J47763O6949K438219M752657L741535K13381k516041l372397l371551
39273b111538k202581J033691M334249M174708O09105k526518k750478r82424
39265d21786J475807M151640N239641K416506k996145o434272n978224m235788
39257f782621l140328j091219K657452N025398L688452J197526J019514K263830
$$ y = [2855876, 2696156, 4234907, 7228276, 11624125, 16946611, 20624615, 19725659, 15190506, 12071627, 14109343, 19518626, 23544121, 23916391, 21917660, 18813816, 13877470, 6902571, 683303, -1277295, 768433, 2653769, 1198241, -2269906, -4201933, -3229422, -909212, 782886, 920446, -701087, -3393306, -5319706, -5219902, -4212053, -4064290, -3997341, -1559122, 3193535, 6935070, 7148451, 4632410, 1260013, -2111538, -4314119, -3280428, 1053821, 5228529, 5837634, 3311116, 560638, -421786, 1054021, 5205661, 10445302, 12861808, 9865663, 3431391, -2546833, -6782621, -9922949, -11014168, -8356716, -3331318, 357134, 1554660, 2574174, 4838004]
39249D838004K007531N12309J47051P65482K33518j251687j160057J178021L527751
39240A0797923M002351K750675M15402k529400m654245m149147j238869J531972
39232F926662J963351K09532j836762k298571q04207R60509Q09320j115161k144590
39223B670083o05475J932792L188037L219083L132597K415945L735l065618m476501
39214H414678l444785p47694K949615O548984P547130M456670m77266l641464
39206B1605868m440131m645742m418001k492134J33640O43784j051137j882700
39198C453447n18699Q05347L49088p58987j528834k843939m315939l121768J209086
39189g271198M122298J834430k557719k928367J211698M252799K603734q73828
$$ y = [4838004, 6845535, 7357844, 7504895, 8270377, 8503895, 7252208, 6092151, 7270172, 10797923, 14800274, 17550949, 17966351, 15436951, 10782706, 6633559, 5394690, 6926662, 8890013, 9099545, 7262783, 4964212, 4160005, 5120514, 5929834, 4814673, 2670083, 2064608, 3997400, 7185437, 10404520, 13537117, 15953062, 15956797, 12891179, 8414678, 4969893, 4222199, 7171814, 13720798, 21267928, 25724598, 25247332, 21605868, 17165737, 12519995, 8101994, 5609860, 5743500, 6387284, 5336147, 3453447, 2934748, 3740095, 4089183, 3330196, 1801362, -1042577, -5358516, -8480284, -7271198, -3148900, -1314470, -3872189, -6800556, -5588858, -1336059, 1267675, 393847]
39181C93847j756976p4478P74409p73463k677551k247786P87572M300202N879377
39172D605153M641029J535684j562894l098169k730285j542322j186371k185609
39164a523784l070922j936293J026750L489910L870510L124949K776478K286927
39156A0044525R2209l172038m581550k726670Q5882P65336n49186j132050K37285
39147i36257J933387K458507K488551K758770J981061r04754l749427l389479
39139B640359n14322P65558j135999k773207o77602L649292N954386M590956J261009
39130A3760430k144889m721426n391506l454530l73930J229294O43921n68666
39122a021302j196088j485359j590731q86022O87196K103456K554007K153005
$$ y = [393847, -1363129, -1437607, -663198, -1436661, -4114212, -6361998, -5574426, -1274224, 4605153, 9246182, 10781866, 9218972, 6120803, 3390518, 1848196, 661825, -1523784, -4594706, -6530999, -5504249, -2014339, 1856171, 4981120, 7757598, 10044525, 10136734, 6964696, 2383146, -343524, -257642, 507694, -41492, -1173542, -936257, 997130, 3455637, 5944188, 8702958, 10684019, 9779265, 6029838, 2640359, 2126037, 2891595, 1755596, -1017611, -1695213, 1954079, 7908465, 12499421, 13760430, 11615541, 6894115, 1502609, -1951921, -2325851, -1096557, -452636, -1021302, -2217390, -3702749, -5293480, -6179502, -5492306, -3388850, -834843, 1318162]
39114A318162J225831k9907j206364j927128k091093j198748J369623M266490
39106A726866M287277P69868k087170n06530K955755K898027p04433k832337j753903
39097D753420j206079l022774l554361l06355L142267K847201Q26204J105084
39089D584607K852669K490545K63641m50082R46328J813078J022064r6602j036581
39080A2389667k360064l113840j894549j00217k23964j357061o27377J209075
39072C921670M95729k630562l541208n63658K002111P43720j721629j787276q70530
39063c951633k092979m046327k841525J165943L517244K242587R2465l71797k34680
39054f520702j358897k850700k442826K8554K377829K860037J966519J406645
$$ y = [1318162, 2543993, 2514086, 1307722, -619406, -2710499, -3909247, -2539624, 1726866, 6014143, 6784011, 4696841, 4190311, 7146066, 10044093, 9339660, 6507323, 4753420, 3547341, 524567, -3029794, -3336149, -193882, 2653319, 3479523, 4584607, 7437276, 9927821, 10191462, 9741380, 10687708, 12500786, 13522850, 13426248, 12389667, 10029603, 6915763, 5021214, 4920997, 4697033, 3339972, 2712595, 3921670, 4417399, 1786837, -1754371, -2318029, -315918, 427802, -1293827, -3081103, -3951633, -6044612, -10090939, -12932464, -11766521, -8249277, -6006690, -5914225, -6286022, -6520702, -7879599, -10730299, -13173125, -13144571, -10766742, -7906705, -5940186, -4533541]
39046d533541K013588K980881L030235J981712P99157J88436k15288j003088j872723
39037C369369j836961m24590J506674K192130O08759j929406k537546j00618K776625
39028C624436K643881l02147k443412j534739P92430J903152J436150N41563l47299
39019F314015j352742j922586j333892J22902J392799J496016j83322l146319
39011A386871m959111l128607J294418M069027K982362M87447m35922l79988j000037
39002C16460j104542J041366L328797K090623j895438m018702k558198n81828
38994c381462m01377l47124J258686K667911J744826l19727r87469j95651J62541
38985B01154p42999k075977k642210j477598J446663L978854L194668m90533k800716
$$ y = [-4533541, -2519953, 460928, 3491163, 5472875, 6272032, 6460468, 6245180, 5242092, 3369369, 1532408, 1107818, 2614492, 4806622, 5415381, 3485975, 948429, 847811, 3624436, 6268317, 5966170, 3522758, 1988019, 2780449, 4683601, 6119751, 6661314, 6314015, 4961273, 3038687, 1704795, 1827697, 3220496, 4716512, 4533190, 1386871, -3572240, -6700847, -5406429, -1337402, 1644960, 2132407, 1696485, 1316497, 316460, -788082, 253284, 3582081, 5672704, 3777266, -241436, -2799634, -3381462, -3782839, -4129963, -2871277, -203366, 1541460, 1221733, 234264, 38613, 201154, -541845, -2617822, -5260032, -6737630, -5290967, -1312113, 1882555, 1392022, -1408694]
38976a408694j093068J908236K345335R37616J089944K879267K945458P384l326420
38967F285058m708780m644230m009092k093375J216874L645560L034308N13786
38959g59891n47008J525090M686102N071742R90759m665271o767716l661451N45183
38950c582461J075709j308781j831178J307113M883476N806751M631925K822722
38942A3805276J71190k995734m264783k520708l39641j82016n87226O43877J844232
38933E574467K05824k544598k117696J133451K192633n44553k306778N40993M418726
38924F552469L689707j065559m207239k988595j59616J070569P46334L4351j282669
38915B389752l379076m667217l610204j109263P09748J400412K247392L793307
$$ y = [-1408694, -2501762, -593526, 1751809, 2689425, 3779369, 6658636, 9604094, 9611478, 6285058, 1576278, -3067952, -7077044, -9170419, -7953545, -4307985, -1273677, -759891, -1306899, 218191, 4904293, 9976035, 10966794, 6301523, -466193, -4127644, -3582461, -2506752, -3815533, -5646711, -4339598, 543878, 6350629, 10982554, 13805276, 13976466, 10980732, 6715949, 4195241, 3855600, 3673584, 3086358, 3730235, 5574467, 5780291, 3235693, 1117997, 2251448, 4444081, 3899528, 1592750, 2133743, 6552469, 10242176, 9176617, 4969378, 1980783, 1821167, 2891736, 3638070, 3672421, 2389752, -989324, -5656541, -9266745, -10376008, -9666260, -8265848, -6018456, -2225149]
38907b225149M941658M603225K853484K24793k742848m719304l902955m44991
38899a412087K441836J568776k175449m444638k498546J584667L399542J064541
38891d71358l056345m885085k396513K567881N817581M720099R55577j293504
38883A958333j76695J843844J474690j184662l248483l115116k188118k431395
38875g067602l660954m031507k560527l52191Q28619Q25944J268164L097970M746788
38866f905296M062416J626972K06540O86629R04915m96057j609020n76632R67227
38857a132306N55740p98659l83767J172100N32791k699474m772321l042490Q41023
38848i727363M072531N849189O006679L657417o74106m053466m580429l902817
$$ y = [-2225149, 2716509, 7319734, 10173218, 10398011, 7655163, 2935859, -967096, -1412087, 1029749, 2598525, 423076, -4021562, -6520108, -4935441, -1535899, -471358, -3527703, -8412788, -10809301, -8241420, -2423839, 2296260, 3251837, 1958333, 1781638, 3625482, 5100172, 3915510, 667027, -2448089, -4636207, -7067602, -10728556, -14760063, -17320590, -17672781, -16844162, -16018218, -14750054, -11652084, -6905296, -2842880, -1215908, -1009368, -322739, 582176, 86119, -1522901, -2099533, -1132306, -576566, -1375225, -1758992, -586892, -54101, -2753575, -7525896, -10568386, -9727363, -5654832, 194357, 6201036, 9858453, 9184347, 5130881, 550452, -3352365]
38840c352365m206227m622025k982369M38651L385440M673798M629605L611520
38832A576028K172748J533244J821767J153837j298976k860303q48508K733738
38824E983575L455547Q02468j415920j097260m62832j541225k504581p28868K685943
38815E176847L929887J313564k562604l574876o22393K681441J671809l344033
38807D669642o274165k393437N098033Q623538N511713J37063l008417m098641
38799H265329m862089n037348m170796l388833k776219j63770M565191P023858
38791e44677L808660j972376m605307l320884j715186j128877M01251K829785
38783f247611K875018n16312l502040k210257K416887O379219P144694N075085
$$ y = [-3352365, -7558592, -12180617, -15162986, -14724335, -11338895, -6665097, -2035492, 1576028, 3748776, 5282020, 7103787, 8257624, 6958648, 4098345, 3249837, 5983575, 9439122, 10241590, 8825670, 7728410, 7265578, 5724353, 3219772, 2490904, 5176847, 9106734, 10420298, 7857694, 4282818, 3660425, 6341866, 8013675, 4669642, -1604523, -3997960, 1100073, 9723611, 15235324, 15372387, 12363970, 8265329, 3403240, -1634108, -5804904, -9193737, -11969956, -12133726, -7568535, -544677, 3263983, 1291607, -3313700, -6634584, -8349770, -9478647, -9077396, -6247611, -3372593, -3888905, -7390945, -9601202, -7184315, -805096, 6339598, 11414683]
38775A1414683K144526L48979O46o83861k607875l038396R42264O357162O281297
38766B1159425n82995o918143o382342j999500o93932k872437l103817N36483
38758h57258L962065M132672K971994K603191J509043j748509m579446l639911
38750D353841p3279J762015j5533k954981l886182k419172n69345m6482l59525
38741d208643M58995L033096N009629L502062q89280m213983l785038r32392J469535
38732e56019K237331J607969j26439j989229k066140J03270K171179J919874K83160
38723C584956n52488o54266j430924k306854j292941J426721L272092K791486
38715D837782J066669m70690j310591r30971Q79297K497149J841371k46553o20938
$$ y = [11414683, 13559209, 13908188, 13908834, 13224973, 10617098, 7578702, 8520966, 14878128, 21159425, 20576430, 13658287, 7275945, 5276445, 4582513, 1710076, -1393741, -857258, 3104807, 7237479, 10209473, 12812664, 14321707, 12573198, 7993752, 4353841, 4280562, 6042577, 6027044, 3072063, -814119, -3233291, -3802636, -3849118, -4208643, -3749648, -716552, 4293077, 7795139, 6905859, 2691876, -1093162, -2025554, -556019, 1681312, 3289281, 3162842, 1173613, -892527, -789257, 1381922, 3301796, 3584956, 3032468, 2378202, 947278, -1359576, -2652517, -1225796, 2046296, 4837782, 5904451, 5433761, 4123170, 3192199, 4071496, 6568645, 8410016, 8163463, 7542525]
38706G542525J451389K902733J333144j679327l208833k701028j508152o83208
38698C449243p48242j811418k542835r95442K246326M011326L053386J846581
38690H508925J952751R32509k913895n812057l117317L126243O207498L723197
38682A2607854k97915k280948l045631l725159k736612N39160K925572J654963
38674E641284j156151j550954M78278J521210J27832j523777j351589j34955J79376
38665B230554q09196j919170k171867j711539j122318m75255M59255J192845P26933
38656c599758n59340m20582K242231M775443L615685m52016k756286j061633J591574
38647C375318J700946j23003j552238k521964l648177l184661K16030L190067
$$ y = [7542525, 8993914, 11896647, 13229791, 11550464, 8341631, 5640603, 4132451, 3449243, 2701001, 889583, -1653252, -2648694, -402368, 3608958, 6662344, 8508925, 10461676, 11394185, 8480290, 2668233, -449084, 2677159, 8884657, 12607854, 12309939, 10028991, 6983360, 3258201, 521589, 1060749, 3986321, 5641284, 4485133, 2934179, 3412457, 4933667, 5061499, 3537722, 2186133, 2051178, 2230554, 1421358, -497812, -2669679, -4381218, -5503536, -5978791, -5519536, -4326691, -3599758, -4159098, -4579680, -2337449, 2437994, 6053679, 5601663, 2845377, 1783744, 3375318, 5076264, 4953261, 3401023, 879059, -2769118, -5953779, -5737749, -2547682]
38639b547682J048869m572262o472318j660262M227007M832443J456804j54062
38631c841463J440026K373842Q5648l465368n421568n266898l658248j068131
38623a8822160J265717J632842M32269K32037J930928L132452J929343n6335n57965
38614h880872l48682j224590k142700q60209J651569K288368J069470J347107
38606g100539M140012O088503M516782J182620r27828j595368j921776j494207
38598B888199L82209K575044L723106M225013M374498K555806j910891n969685
38590A2843299o129360l274396r96980l54398K46011R96693N03508p68644q88740
38581B176993l09101j221048k714410j089650L701119O360997L390651j730830
$$ y = [-2547682, -1498813, -6071075, -12543393, -14203655, -9976648, -5144205, -3687401, -3841463, -2401437, -27595, 58053, -3407315, -8828883, -14095781, -17754029, -18822160, -17556443, -15923601, -15491332, -15259295, -13328367, -10195915, -8266572, -8322907, -8880872, -9229554, -10454144, -12596844, -13457053, -11805484, -9517116, -8447646, -7100539, -2960527, 3127976, 7644758, 8827378, 7899550, 6304182, 4382406, 2888199, 3270408, 5845452, 9568558, 13793571, 18168069, 20723875, 18812984, 12843299, 6713939, 3439543, 2442563, 2088165, 2334176, 3330869, 3834377, 3065733, 2176993, 1867892, 646844, -2067566, -3157216, 543903, 6904900, 10295551, 8564721]
38573H564721l480242j617810l04150j689474l661778l431299r20861J562580
38565d978313J896108M16823l21597J097146K449298Q11569k482525l121666m14066
38556d647223J364715l12561k332568j413894M66863l3142j458086n6092L400701
38547e021287M341814J493103j339782j096710P85863J521163P59007k04789p79486
38538D58896j182002j466469j409888p16445P65557K364984K690404J465493M12029
38529C382559Q31217J252834m99479l532802m504398k040219J490842K962631
38521f56815J687617o76760k085695j544476N56779L092215N099385N668329L595592
38512A4736171r99430m822389m026825L77795K848177O53236k521613k688405
$$ y = [8564721, 5084479, 3466669, 3162519, 1473045, -2188733, -5620032, -6540893, -4978313, -3082205, -2665382, -2986979, -1889833, 559465, 1371034, -1111491, -4233157, -4647223, -3282508, -3595069, -5927637, -7341531, -6874668, -6907810, -8365896, -8421988, -5021287, -679473, 813630, -526152, -1622862, -836999, 684164, 1443171, 1238382, 458896, -723106, -2189575, -3599463, -4315908, -3550351, -1185367, 1505037, 2970530, 3382559, 4213776, 5466610, 4967131, 1434329, -3070069, -5110288, -3619446, -656815, 1030802, 354042, -1731653, -3276129, -2719350, 372865, 5472250, 11140579, 14736171, 13736741, 8914352, 4887527, 5265322, 8113499, 8766735, 6245122, 3556717]
38504C556717j430018j940302k798427q25729K374889K548745Q6201o94550J011356
38495A888882J636356j41206j783042k448239m175770o268422m545823J539844
38487a4297420O509271O337800L529780J998918J626697R63657P31000J126357
38479H526060j28412l390541m828883k436312k15433j885797m295299k415271
38471a1069888K199027L768827J101655j696480k150614j601958j005914K92906
38463a0162439J494731O51407j532013k135969n68347R70010J650636K853531
38455f778453M489764M252439J392943j885627l518081l322037j458820J760356
$$ y = [3556717, 2126699, 186397, -2612030, -3437759, -1062870, 1485875, 1572076, 877526, 1888882, 3525238, 3384032, 1600990, -847249, -5023019, -11291441, -15837264, -14297420, -7788149, -1450349, 2079431, 4078349, 5705046, 6668703, 7399703, 8526060, 8397648, 5007107, 178224, -2258088, -2473521, -4359318, -8654617, -11069888, -8870861, -5102034, -4000379, -5696859, -7847473, -9449431, -10455345, -10162439, -8667708, -8016301, -9548314, -11684283, -12252630, -11282620, -9631984, -6778453, -2288689, 1963750, 3356693, 1471066, -2047015, -5369052, -6827872, -5067516]
$$ [...]
##END NTUPLES=NMR SPECTRUM
##END=
