##TITLE=31Pdec_DE-136_21_TFA
CDcl3, 64 sc
 27.3.2026
##JCAMPDX= 6.0         $$ Bruker NMR JCAMP-DX V2.0
##DATA TYPE= NMR SPECTRUM
##DATA CLASS= NTUPLES
##ORIGIN= UXNMR, Bruker Analytische Messtechnik GmbH
##OWNER= root
$$ XWIN-NMR		Version 3.5
$$ Fri Mar 27 14:48:35 2026 Russian Standard Time (UT+4h)  she@DPX200
##.OBSERVE FREQUENCY= 81.013821
##.OBSERVE NUCLEUS= ^31P
##.ACQUISITION MODE= SIMULTANEOUS
##.ACQUISITION SCHEME= undefined
##.AVERAGES= 64
##.DIGITISER RES= 17
##SPECTROMETER/DATA SYSTEM= spect
##.PULSE SEQUENCE= zgpg30
##.SOLVENT NAME= CDCl3
##.SHIFT REFERENCE= (INTERNAL, CDCl3, 0, 197.392)
##AUDIT TRAIL= $$ (NUMBER, WHEN, WHO, WHERE, WHAT)
$$ ##TITLE= Audit trail, XWIN-NMR		Version 3.5
$$ ##JCAMPDX= 5.01
$$ ##ORIGIN= Bruker BioSpin GmbH
$$ ##OWNER= she
$$ F:/spectra/data/she/nmr/P31/2/pdata/1/auditp.txt
$$ ##AUDIT TRAIL=  $$ (NUMBER, WHEN, WHO, WHERE, WHAT)
(   1,<2026-03-27 14:47:38.68 +0400>,<she>,<DPX200>,
      <continue with go, POWCHK disabled, PULCHK disabled
       configuration hash MD5:
       00 E9 B6 7A A2 85 ED C7 34 08 36 98 17 FE 4E 26
       data hash MD5: 32K
       AF DD E5 C9 52 49 56 1D 5C BC 60 55 52 19 86 3D>)
(   2,<2026-03-27 14:47:40.92 +0400>,<she>,<DPX200>,
      <Start of raw data processing
       efp BC_mod = 2 LB = 1.5 FT_mod = 6 PKNL = 1 PHC0 = 1465.262 PHC1 = -72.69934 SI = 64K 
       data hash MD5: 64K
       0E 5B 92 C1 8D 87 AB FF 28 76 9A 81 C9 4D 0C 70>)
(   3,<2026-03-27 14:47:59.56 +0400>,<she>,<DPX200>,
      <pk PHC0 = -14.52385 PHC1 = 0 
       data hash MD5: 64K
       63 AE C7 AF 9C 85 CD 36 BD B3 43 2A 36 21 55 0B>)
(   4,<2026-03-27 14:48:05.32 +0400>,<she>,<DPX200>,
      <abs ABSG = 5 
       data hash MD5: 64K
       91 89 38 F5 A8 CA 85 E5 81 E6 89 C7 FC 3D 04 3D>)
$$ ##END=
$$ 
$$ hash MD5
$$ 08 62 7F CC C9 36 CA B1 46 BC 0A 05 C4 E6 EC 61
##$RELAX= 
##$RELAX= 
##$RELAX= 
##$RELAX= 
##$RELAX= 
##$RELAX= 
##$RELAX= 
##$RELAX= 
$$ Bruker specific parameters
$$ --------------------------
##$DU= <F:/spectra>
##$EXPNO= 2
##$NAME= <P31>
##$PROCNO= 1
##$TYPE= <nmr>
##$USER= <she>
##$AMP= (0..31)
100 100 100 100 100 100 100 100 100 100 100 100 100 100 100 100 100 100 
100 100 100 100 100 100 100 100 100 100 100 100 100 100 
##$AQSEQ= 0
##$AQ_mod= 1
##$AUNM= <au_zg>
##$AUTOPOS= <>
##$BF1= 81.014009
##$BF2= 200.13
##$BF3= 200.13
##$BF4= 200.13
##$BF5= 200.13
##$BF6= 200.13
##$BF7= 200.13
##$BF8= 200.13
##$BYTORDA= 1
##$CFDGTYP= 0
##$CFRGTYP= 5
##$CHEMSTR= <none>
##$CNST= (0..31)
1 1 145 1 1 1 1 1 1 1 1 1 1 1 1 1 1 1 1 1 1 1 1 1 1 1 1 1 1 1 1 1 
##$CPDPRG= <waltz16>
##$CPDPRG1= <>
##$CPDPRG2= <waltz16>
##$CPDPRG3= <>
##$CPDPRG4= <mlev>
##$CPDPRG5= <mlev>
##$CPDPRG6= <mlev>
##$CPDPRG7= <mlev>
##$CPDPRG8= <mlev>
##$CPDPRGB= <>
##$CPDPRGT= <>
##$D= (0..31)
0 1 0 0 0 0 0 0 0 0.06 0 0.03 2e-05 3e-06 0 0 0.0002 0 0 0 0 0 0 0 0 0 
0 0 0 0 0 0 
##$DATE= 1774608375
##$DBL= (0..7)
120 120 120 11 120 120 24 19 
##$DBP= (0..7)
150 150 150 150 150 150 150 150 
##$DBP07= 0
##$DBPNAM0= <>
##$DBPNAM1= <>
$$ [...]
##$SUBNAM3= <"">
##$SUBNAM4= <"">
##$SUBNAM5= <"">
##$SUBNAM6= <"">
##$SUBNAM7= <"">
##$SUBNAM8= <"">
##$SUBNAM9= <"">
##$SW= 400.765351723535
##$SWIBOX= (0..15)
0 1 3 0 0 0 0 0 0 0 0 0 0 0 0 0 
##$SW_h= 32467.5324675325
##$TD= 32768
##$TD0= 1
##$TE= 0
##$TE2= 300
##$TE3= 300
##$TEG= 300
##$TL= (0..7)
0 120 53 12 22 120 120 120 
##$TP= (0..7)
150 150 150 150 150 150 150 150 
##$TP07= 0
##$TPNAME0= <>
##$TPNAME1= <>
##$TPNAME2= <>
##$TPNAME3= <>
##$TPNAME4= <>
##$TPNAME5= <>
##$TPNAME6= <>
##$TPNAME7= <>
##$TPOAL= (0..7)
0.5 0.5 0.5 0.5 0.5 0.5 0.5 0.5 
##$TPOFFS= (0..7)
0 0 0 0 0 0 0 0 
##$TUNHIN= 0
##$TUNHOUT= 0
##$TUNXOUT= 0
##$USERA1= <user>
##$USERA2= <user>
##$USERA3= <user>
##$USERA4= <user>
##$USERA5= <user>
##$V9= 5
##$VALIST= <valist>
##$VCLIST= <CCCCCCCCCCCCCCC>
##$VD= 0
##$VDLIST= <DDDDDDDDDDDDDDD>
##$VPLIST= <PPPPPPPPPPPPPPP>
##$VTLIST= <TTTTTTTTTTTTTTT>
##$WBST= 1024
##$WBSW= 4
##$XGAIN= (0..3)
0 0 0 0 
##$XL= 0
##$YL= 0
##$YMAX_a= 6277
##$YMIN_a= -11225
##$ZGOPTNS= <>
##$ZL1= 120
##$ZL2= 120
##$ZL3= 120
##$ZL4= 120
##$ABSF1= 197.3918
##$ABSF2= -203.3724
##$ABSG= 5
##$ABSL= 3
##$ALPHA= 0
##$AQORDER= 0
##$ASSFAC= 0
##$ASSFACI= 0
##$ASSFACX= 0
##$ASSWID= 0
##$AUNMP= <proc_1d>
##$AZFE= 0.1
##$AZFW= 0.5
##$BCFW= 0
##$BC_mod= 2
##$BYTORDP= 0
##$COROFFS= 0
##$CY= -3
##$DATMOD= 1
##$DC= 0
##$DFILT= <>
##$DTYPP= 0
##$F1P= 0
##$F2P= 0
##$FCOR= 1
##$FTSIZE= 65536
##$FT_mod= 6
##$GAMMA= 0
##$GB= 0
##$INTBC= 1
##$INTSCL= 9.790993e-09
##$ISEN= 30
##$LB= 1.5
##$LEV0= 0
##$LPBIN= 0
##$MAXI= 10000
##$MC2= 0
##$MEAN= 0
##$ME_mod= 0
##$MI= 50
##$NCOEF= 0
##$NC_proc= -9
##$NLEV= 6
##$NOISF1= 182.463
##$NOISF2= 159.3651
##$NSP= 0
##$NTH_PI= 0
##$NZP= 0
##$OFFSET= 197.3918
##$PC= 4
##$PHC0= 1450.738
##$PHC1= -72.69934
##$PH_mod= 1
##$PKNL= yes
##$PPARMOD= 0
##$PSCAL= 0
##$PSIGN= 0
##$REVERSE= no
##$SF= 81.014063255964
##$SI= 65536
##$SIGF1= 159.3651
##$SIGF2= -187.1042
##$SINO= 113.3802
##$SIOLD= 16384
##$SREGLST= <1H.CDCl3>
##$SSB= 0
##$STSI= 65536
##$STSR= 0
##$SW_p= 32467.5324675325
##$SYMM= 0
##$S_DEV= 0
##$TDeff= 32768
##$TDoff= 0
##$TI= <>
##$TILT= no
##$TM1= 0
##$TM2= 0
##$TOPLEV= 0
##$USERP1= <user>
##$USERP2= <user>
##$USERP3= <user>
##$USERP4= <user>
##$USERP5= <user>
##$WDW= 1
##$XDIM= 65536
##$YMAX_p= 190084615
##$YMIN_p= -291144569
$$ End of Bruker specific parameters
$$ ---------------------------------
##NTUPLES= NMR SPECTRUM
##VAR_NAME=  FREQUENCY,     SPECTRUM/REAL,   SPECTRUM/IMAG
##SYMBOL=    X,             R,               I
##VAR_TYPE=  INDEPENDENT,   DEPENDENT,       DEPENDENT
##VAR_FORM=  AFFN,          ASDF,            ASDF
##VAR_DIM=   65536,         65536,           65536
##UNITS=     HZ,            ARBITRARY UNITS, ARBITRARY UNITS
##FACTOR=    0.49542278885378, 1,            1
##FIRST=     15991.5117654749, 0,            0
##LAST=      -16476.0207020576, 0,           0
##MIN=       -16476.0207020576, -291144569,  0
##MAX=       15991.5117654749, 190084615,    0
$$ Real data points
##PAGE= N=1
##DATA TABLE= (X++(R..R)), XYDATA
$$ [...]
##PAGE= N=2
##DATA TABLE= (X++(I..I)), XYDATA
9416 6265011 3312446 -2735118 -10128042 -12458988 -7415706 -487564 2376251 1660143
9408 1660143 870156 258783 -1557726 -2537944 684111 6444513 8919637 5737829 377815
9399 377815 -3657449 -6633349 -9161126 -9433863 -6793016 -4982225 -8393808 -16324264 -23350524
9390 -23350524 -24600019 -19221911 -10053859 -1673933 2198993 1160403 -2128872 -5061845
9382 -5061845 -7042965 -8263154 -8423654 -7459874 -5791827 -3140940 896512 4339184 3457625
9373 3457625 -2536292 -9692691 -13904820 -15099279 -15111931 -13925978 -10541001 -5475391 353188
9364 353188 7351206 14826418 18651370 15255188 7377422 2163834 3146480 6880195 7869203
9355 7869203 4288841 -1716113 -7088710 -10072472 -10576134 -9195874 -5915774 -527047
9347 -527047 5423187 9047849 9819213 10712456 13557926 15530241 13326943 8806710 6390741
9338 6390741 6084772 3853553 -1082274 -4187672 -2147814 2587336 5616401 5678775 4146726
9329 4146726 2460963 2103509 4442662 8330048 9997798 7539757 3692090 2156539
9321 2156539 2949890 3572877 3244678 3580493 5881843 9519842 12173230 10526603 2607934
9312 2607934 -8435277 -14601792 -10228713 1336029 10698708 12041342 7759894 3809263
9304 3809263 3099095 4196870 4188995 1163855 -4906342 -12047739 -17236050 -18481482 -16112371
9295 -16112371 -11745823 -6423158 -401852 5466432 9211122 9326267 6639046 3935927
9287 3935927 3605633 6025346 10038363 13974035 15995805 15006581 12442081 11910025 15119795
9278 15119795 18852018 18273910 13174117 8370671 7374486 8352621 7886209 6343679 7038146
9269 7038146 11315152 16931654 20722516 20690183 15960359 7402026 -1054741 -4007957 785430
9260 785430 9943016 17448470 19829798 18310163 16678337 17377598 19046807 17820655 11868052
9251 11868052 4496303 1283784 3840014 8231259 10468088 11403328 14160712 18374387
9243 18374387 19957133 16138922 8018888 -1597268 -9780555 -12966938 -9167859 -2367863
9235 -2367863 -534538 -6033321 -11381070 -8610438 -99170 5035868 3505195 591945
9227 591945 437953 240039 -3574299 -8781224 -10509425 -7447176 -1918379 3208524 5057117
9218 5057117 1437639 -5841508 -10995688 -10500115 -6820800 -3662699 -1227185 534725
9210 534725 -1720990 -9950030 -19507031 -24546687 -26313931 -29803392 -33859855 -31820750
9202 -31820750 -22095965 -11201089 -4816542 -1785802 1088084 3751628 4946004 4941328
9194 4941328 3569009 -574770 -6393087 -9179833 -5802007 1565456 8432021 11950202
9186 11950202 11165862 7340357 5409344 10611766 21182187 28244336 25539913 15766413
9178 15766413 5140683 -3910269 -11453782 -15851314 -15534403 -12435281 -9567218 -6994236
9170 -6994236 -3454868 -15653 1057478 -579586 -3817385 -7675154 -10441084 -10110367
9162 -10110367 -7907232 -7868065 -10274679 -9782288 -3819948 1777160 881551 -3160497 -2603180
9153 -2603180 2424639 4236998 -392399 -5742015 -5942996 -2407979 -196674 -1050214 -2367158
9144 -2367158 -834274 4123259 9164411 9771436 5878732 3204478 6323299 12287825
9136 12287825 14666305 12249350 9643619 10388105 13587968 16415484 16057152 10482061
9128 10482061 1396153 -5132023 -5386834 -3326616 -4238060 -5885223 -2740028 3420479
9120 3420479 5825892 4670988 6892384 12985641 14566442 8565484 3663936 6638554
9112 6638554 11160543 8126889 380616 -2028277 2810083 7166118 5921693 2326992
9104 2326992 1386263 3849171 7678016 10591317 9995518 4138241 -5150422 -12802055 -14380763
9095 -14380763 -9232370 -989526 4380214 3341534 -1003067 -1945796 2353189 6834112
9087 6834112 7566922 7087374 8483363 9185189 6001288 2606618 5612627 15062260 24662456
9078 24662456 30069026 31282453 28237489 20670018 12403531 9230347 11074060 11695849
9070 11695849 7860582 3629093 3222589 4439978 2720172 -1528361 -3585491 -1128628
9062 -1128628 2645040 2610903 -2783780 -9645754 -12365407 -9726193 -6320606 -6603904 -9151775
9053 -9151775 -9443613 -7083270 -6507606 -10335273 -15299495 -15760161 -9306326 1162070 9117717
9044 9117717 9241515 3320930 -28260 4878077 12879261 14731720 10495240 9305353
9036 9305353 15136152 20581941 18306023 11858040 9640483 13111831 17161083 18696038
9028 18696038 18335412 15782583 10371909 5645885 6851539 12963287 16842567 15106212
9020 15106212 12891960 16114238 22894061 26119533 22197374 14098167 6970526 3345377
9012 3345377 2114871 364615 -3534510 -7752754 -8855611 -6585731 -4958080 -6967194
9004 -6967194 -10212673 -10502131 -8228359 -7357600 -8597314 -8266996 -5276651 -4490028 -9673077
8995 -9673077 -16582109 -17921770 -13439257 -9711215 -10026933 -10117374 -5762286 354914 2886648
8986 2886648 1466345 88206 988269 3158612 5625571 8081470 8745164 5795951 1569193
8977 1569193 1568765 7628945 14670135 16121062 10961577 3964978 306857 1288518 4353678
8968 4353678 5866001 4085307 239958 -3091631 -4372196 -3614004 -1403321 1294809
8960 1294809 2814018 1872015 -903866 -3735882 -5918306 -8084203 -10551042 -13012517
8952 -13012517 -15839875 -19827092 -24038408 -25411657 -21624199 -13950818 -6700504 -3561310
8944 -3561310 -4085559 -4100373 -889952 2392720 287178 -6405764 -9812371 -5534879 273489
8935 273489 -560286 -5956223 -6885619 -1588426 1739319 -2129481 -7697872 -7685271 -3400476
8926 -3400476 -1118776 -2560935 -4272797 -3625441 -813427 2859305 4690021 1063397
8918 1063397 -7479914 -13900628 -12057272 -4891208 -729206 -2826891 -7399795 -11043587
8910 -11043587 -14639341 -19424258 -24054181 -26984906 -28102113 -26775568 -21696671 -14148843
8902 -14148843 -8540133 -7822488 -10135611 -11187082 -8600899 -3413699 1185602 2178452
8894 2178452 -875370 -5495940 -9024012 -10753260 -10385034 -6674317 -189295 4803631
8886 4803631 4969076 2840789 2979894 4753450 4089579 1272347 494139 1489904 -985076
8877 -985076 -7243809 -9653923 -3674951 4410762 6088138 1718837 -2829831 -6037426
8869 -6037426 -10094788 -13673217 -13358911 -11167631 -12904424 -18565161 -21255888 -17015166
8861 -17015166 -9614010 -3958409 -743063 29520 -3645705 -11061708 -16302974 -14963814
8853 -14963814 -9695411 -4856023 534930 9135269 17598949 19307118 14126958 9136315
8845 9136315 8738919 9726148 8249335 6575046 9094836 14867993 18550189 17636614 15122349
8836 15122349 14891233 17179117 19197764 18275143 13557874 6130131 -1314099 -5724924
8828 -5724924 -6165884 -5402387 -8019399 -15769921 -24708241 -28043368 -22710248 -12628989
8820 -12628989 -4658557 -1889707 -2059864 -1936646 -1118426 -906124 -1357566 -1160591 211297
8811 211297 1604946 1457025 -784443 -4529773 -8848729 -13089474 -16435000 -17012797 -12848065
8802 -12848065 -4997158 1561607 2879789 1780900 5482625 16275274 27336508 29764633
8794 29764633 21651298 8354118 -3678225 -10611927 -11186532 -7065022 -2608276 -941213
8786 -941213 -418557 2431653 7400530 11199511 12535362 12663796 11597946 8521501 5976254
8777 5976254 7989649 12502509 11393446 1239317 -10827012 -16035437 -14456607 -11569540
8769 -11569540 -8034692 281727 13005494 22506458 22073614 12797033 1010250 -7797091
8761 -7797091 -11277591 -9530862 -4165934 3156545 11827033 20729254 26297041 24976970
8753 24976970 17987202 10877412 7513525 6848925 6233437 4936648 2988156 -528438
8745 -528438 -5565871 -9430525 -9573602 -6933160 -4290255 -2325467 303411 3661268 6059193
8736 6059193 7042527 8324010 10862779 13129818 13665349 13596247 14490833 14640130 10098852
8727 10098852 -83716 -11628246 -19003928 -20304421 -17365804 -12782668 -8439743 -5614406
8719 -5614406 -4316280 -3163615 -1811260 -2472567 -6447867 -10151273 -8353540 -1477005
8711 -1477005 4392575 5734086 5578895 7403939 9498027 8768878 6446649 5669948 5988178
8702 5988178 4825291 2653879 2204552 3778945 5724434 8341253 12481763 15173338
8694 15173338 12244739 5547030 1929260 3780628 5907840 3786181 -209591 -1747373
8686 -1747373 -1174512 -1259039 -1479510 1111483 6740159 12021332 13750732 11689002 8331723
8677 8331723 6960341 8535190 9885783 7155844 1669428 -698891 2745826 7876197
8669 7876197 9693568 8135354 5218728 432702 -6660020 -12167796 -11497229 -6118367
8661 -6118367 -2047734 -1919012 -2691797 -1363087 846839 835917 -2598630 -7968212 -12106584
8652 -12106584 -12040259 -7822234 -3045759 -510071 1584465 6400676 12526071 14904066
8644 14904066 11452255 5039449 -1427467 -8021458 -14791430 -19390717 -19862356 -17409395
8636 -17409395 -14427008 -11505100 -8033091 -4400403 -2129459 -2601972 -6194359 -11504160
8628 -11504160 -15227541 -14534080 -10091083 -5178290 -1626416 1394911 4461199 6499655
8620 6499655 7121555 7575821 8049065 6724043 3316540 906444 1793442 3676153 2757572
8611 2757572 -965240 -4426710 -6207930 -7326054 -8064090 -7423049 -5802437 -5108115 -5672401
8602 -5672401 -5918352 -5821767 -7742475 -12403735 -16754754 -17858462 -16653718 -15397788 -13312048
8593 -13312048 -8069613 -707515 4586738 5960294 5907172 6627912 6298812 2088145 -5095287
8584 -5095287 -11279908 -13742687 -12571008 -9014363 -4698278 -1791681 -1241637 -823269 2561651
8575 2561651 8358255 12527807 12609190 9958967 6290893 1261502 -4579997 -7428901 -4097019
8566 -4097019 3132888 8576256 9544635 8152282 7152878 6709943 5754872 4301477 3216968
8557 3216968 2639752 1366012 -2305851 -8725199 -15468126 -18751729 -17304436 -13927901
8549 -13927901 -12065341 -11926083 -11404266 -9368860 -5917086 -782305 5519378 9822257
8541 9822257 9286208 6429569 7355373 13663195 19681881 20065942 17175309 17494439 22289907
8532 22289907 25595882 21630336 11264440 195736 -7012677 -9511350 -8533674 -5850311
8524 -5850311 -3897194 -4924507 -8284073 -9811867 -6128064 728302 5249143 5293498 4314404
8515 4314404 5675200 7818875 7848933 7594429 11903214 21129587 29156316 30080541 24277361
8506 24277361 16603336 10845790 7636990 6183741 5718217 5292423 3727520 734225
8498 734225 -2092884 -2296095 685330 4452755 6733046 8668880 12186257 14405984 9536677
8489 9536677 -1563400 -9039518 -6100889 775100 412416 -7009819 -10759333 -5850603
8481 -5850603 657689 1842135 366026 809094 326029 -5544855 -12806813 -13240349 -6638307
8472 -6638307 -914095 -86355 703315 6398450 14004439 16699751 12757491 7169299 5581726
8463 5581726 8707151 12511712 12852237 9470818 5246285 2279967 607375 805118 4624092
8454 4624092 11045363 14689570 11693132 5583677 3640293 8100688 14356195 17447292
8446 17447292 16808330 14345331 11274387 8061033 5098628 2323128 -266770 -1391635
8438 -1391635 314508 3619978 5332590 4277262 2752524 3152190 4684029 4553465 1631597
8429 1631597 -1860637 -2341656 1235329 5580597 6447969 4134468 3378846 6577085 10058186
8420 10058186 9801835 7908353 9016270 12295794 12666185 9686754 9170805 14205392 19719175
8411 19719175 18932080 11489186 2346060 -4086200 -5562184 -992410 7816021 14782439
8403 14782439 13915757 5221440 -5880510 -14266479 -17983208 -16690797 -10938458 -3604907
8395 -3604907 981897 1225281 113144 1238157 3774200 3284863 -2328053 -9612907 -13750552
8386 -13750552 -14610163 -15984128 -19043082 -20282727 -17643321 -14720431 -14928482 -14392338 -6551005
8377 -6551005 6721699 14815520 10898864 -250007 -9168991 -11877784 -10276361 -6921662
8369 -6921662 -3720311 -2831982 -4511730 -5894211 -5357998 -5729160 -9315948 -12460742 -10216741
8360 -10216741 -4727794 -3016627 -6723446 -10005747 -8645691 -5607360 -5296879 -7153052
8352 -7153052 -8131750 -7866387 -7824482 -7955573 -7637803 -8093431 -10544420 -13198903 -13139841 -10440518
8342 -10440518 -7691460 -6160342 -5214004 -4959369 -6109004 -6921506 -3855288 2880325 7082478
8333 7082478 2857814 -7610231 -15363505 -14419269 -8439334 -6359776 -12233836 -21026892
8325 -21026892 -24592488 -20239604 -12278286 -6154411 -3040968 -375115 4243175 10957385
8317 10957385 18157255 23286677 23655191 18488364 10794067 5772621 6168488 9541119
8309 9541119 10791120 7187675 655523 -4343974 -4740666 -1305540 2105813 2297764 582095
8300 582095 2247024 10706689 22307870 28827633 25960090 17896523 12384670 12614064
8292 12614064 15638332 17559832 17402651 15613188 11711474 5544868 -500227 -2960827
8284 -2960827 -1163618 1798808 2374004 -71316 -3504401 -5909516 -6901638 -7143488 -7273629
8275 -7273629 -7728942 -8750301 -9657566 -8555187 -4148975 1804767 5321027 4589891 2382026
8266 2382026 2269316 3274882 1091097 -4859229 -8702447 -5000753 3332004 7473144
8258 7473144 3330799 -3347932 -4287818 1045446 5473312 3916384 -246325 -306533 4699746
8249 4699746 9087203 7899088 1882180 -5305960 -11331156 -14759196 -13589997 -7671443
8241 -7671443 -934463 2330490 2565354 2950745 3478960 1707295 -737058 1688660 9695953
8232 9695953 16177274 15916166 13620199 16845327 24273156 27683205 24137801 19072146
8224 19072146 16663539 14057481 7894754 876992 -2327851 -1895161 -1306337 -1645664 -1491702
8215 -1491702 -506821 926304 4183104 10303651 16271554 17716484 15230195 13808873
8207 13808873 15743785 18553983 20905236 25408498 32742697 37590843 34934126 27475541
8199 27475541 21818417 18967480 14093916 5459824 -2165420 -4627841 -4004772 -4178913
8191 -4178913 -4636693 -2530426 1532155 3945853 3307350 1419928 -498533 -3063931 -5989806
8182 -5989806 -7534500 -7662558 -8852053 -12314293 -15710036 -16109048 -13212189 -8230726 -1898370
8173 -1898370 4236315 6709107 3688726 -1123305 -1531183 3742835 9457417 10613229
8165 10613229 8177670 6210379 5519090 3460080 -387901 -2003584 1687739 7310096
8157 7310096 7894853 1144659 -7601031 -11493089 -9359294 -5424200 -3447079 -3278045 -2668126
8148 -2668126 -296194 3450251 7312616 10235893 12258168 14121792 15181238 12617731
8140 12617731 4774880 -4931048 -9924081 -7208881 -524685 3911222 3079142 -1933228
8132 -1933228 -8120996 -11914257 -10477334 -4368028 1845261 3861774 2293029 1285409
8124 1285409 2858498 4646038 3592321 109370 -2558111 -2375252 -817049 -821277 -2896212
8115 -2896212 -4237935 -2356012 1307586 2866392 725929 -2960930 -5424494 -5583477
8107 -5583477 -3032785 2255076 7910459 9767681 6713970 2734199 1972311 4131811
8099 4131811 7185205 11453414 16734564 17868467 9287552 -5898026 -17001929 -17607477
8091 -17607477 -11724364 -6183538 -1893892 3393504 7558922 5430019 -2918337 -10429230
8083 -10429230 -11237842 -7094027 -3492281 -2161803 -722719 1515615 1752165 -1110012
8075 -1110012 -3163635 -509276 4795362 7982102 9469582 13882813 20402471 20620812
8067 20620812 10108756 -3019227 -7339566 -3086555 -967069 -6916026 -15291088 -18593372
8059 -18593372 -17250960 -16227644 -16768977 -15947279 -11706018 -4450728 4922147 15463666
8051 15463666 25285307 32171984 34568680 31531656 23784018 15626353 12774777 16246623
8043 16246623 20921315 22405603 22670894 25885048 30919859 31877281 25296691 13660556
8035 13660556 2054364 -6065690 -10049140 -11341025 -11696620 -10884684 -7159071 -1392862
8027 -1392862 1291048 -3055013 -11230945 -15424934 -11410020 -1819417 7868840 13580744
8019 13580744 13511194 8485747 2149198 -2089843 -5009373 -9930365 -16737280 -20712086
8011 -20712086 -18644262 -13217009 -9161864 -7036969 -3344247 3947839 12219921 16950536
8003 16950536 16626860 14150610 13157978 13587407 12430363 9098377 7412316 10183195 14155387
7994 14155387 13835793 9013600 4434245 2710206 2272317 2463499 5117849 9345697 10217357
7985 10217357 5879623 1295901 907623 1895387 -229275 -3177495 -1597136 3082035
7977 3082035 4000464 -183553 -3128168 -1140676 1240381 -845592 -5027387 -6435639
7969 -6435639 -5314184 -4827135 -4840521 -3654444 -3678224 -9037281 -17850184 -22754579 -20283488
7960 -20283488 -14892122 -11875727 -10551388 -7167487 -1352605 3604165 5163931 3515219
7952 3515219 299048 -2313179 -2104833 1399179 5782504 7809057 6497481 3464451
7944 3464451 1137986 1435782 4702675 8419776 8358741 3135871 -3215731 -5341401 -2615235
7935 -2615235 1137447 3451533 5861881 10115315 14336283 14723757 9993299 2835410
7927 2835410 -2668391 -4534948 -4208428 -4659669 -6885959 -8683727 -7595648 -4387234 -2199589
7918 -2199589 -2597058 -4093925 -4557246 -3323342 -747506 2331975 3812470 789389 -7514845
7909 -7514845 -17710441 -24151457 -23137480 -15642145 -6710710 -1853223 -2624288 -5410343
7901 -5410343 -5518088 -2446707 70336 -871551 -3963562 -5833603 -5036101 -2968265 -1694845
7892 -1694845 -1668859 -1433714 370557 2586342 2183626 -1798978 -6415228 -8498770 -8449861
7883 -8449861 -7919631 -5762359 -291140 5665523 7056850 4150734 2624193 5091642
7875 5091642 7868114 8018213 8001746 10254740 12637187 13397659 15336100 19582116 20142717
7866 20142717 11880805 631361 -2817278 2550519 7511570 6828617 5296202 7502757
7858 7502757 9866666 7498502 2717908 1007039 2632424 4019740 4661065 6751214
7850 6751214 9207981 7875777 2416729 -1499527 1285443 9415835 17105771 20341488
7842 20341488 19625058 17969730 17696252 18632058 18382904 14567801 7352759 -521066 -6563508
7833 -6563508 -10633890 -13335645 -13164151 -7447712 3082261 12578459 15047672 10530757
7825 10530757 4570018 1903418 2663044 4532354 5873777 5861065 4051651 1422298 40099
7816 40099 331509 434195 -491102 -464694 2096999 5533422 7385003 7648580 7328448 5899827
7806 5899827 2983092 515402 17786 -541545 -3584260 -7241411 -8039845 -7224772 -9660322
7797 -9660322 -16356030 -22558790 -24073448 -21580467 -17801189 -14255229 -12129570 -12659182
7789 -12659182 -14787222 -15523181 -14465395 -15057527 -19215534 -23352751 -22522669 -16915725 -11475552
7780 -11475552 -9561925 -9284528 -6680099 -1190279 3545566 4815434 5118112 8721292
7772 8721292 14467200 16258876 12081044 7505715 6799228 5828302 -361540 -7537180 -8026910
7763 -8026910 -3637427 -3160034 -7629747 -8465296 -1902763 5247665 8001840 11055779 18170544
7754 18170544 23022390 18958284 10578447 6208153 4512350 -879330 -7269781 -5425457
7746 -5425457 4079393 8574948 627677 -11326419 -14632647 -8192398 -788420 2161993
7738 2161993 3611141 7472202 11825324 11911881 7393321 3319382 3426420 5110012 3353446
7729 3353446 -2024179 -6561166 -7902286 -7905163 -7575761 -5099291 -828131 1093324 -669912
7720 -669912 -1483371 1504096 3260663 -1745496 -9755394 -11874795 -5955993 1792056 5646981
7711 5646981 5023646 1476825 -2985197 -5021881 -2777459 781226 2158693 3669913
7703 3669913 9692059 17811272 20795489 17469116 14248536 14599445 14377746 10222473 5478621
7694 5478621 3632239 1758711 -4218822 -11766905 -14694389 -11848779 -8329186 -8774424
7686 -8774424 -12736789 -16562859 -17615014 -16229787 -14314387 -12538481 -9943553 -6708752
7678 -6708752 -4801744 -3791938 835814 10991970 20227414 20522195 13478145 8117019
7670 8117019 7823102 6875216 1208847 -4936998 -6123847 -3014991 882694 4058446 5202354
7661 5202354 2379859 -2187849 -2332775 2760587 5429763 830602 -4824069 -4001110 -104570
7652 -104570 -1292023 -5874805 -3995046 6791705 17074550 18585013 14059888 11098999
7644 11098999 12005974 13512121 12912904 10937875 10075203 11782033 14285563 13250557 6882122
7635 6882122 -29637 -548792 5500853 10734224 9653381 5404454 4720037 8891448 13142394
7626 13142394 13681140 11632247 9413323 6578511 1914027 -2036472 -516206 6573727
7618 6573727 13064193 14302848 13220304 14500686 15710477 10927171 2306001 -378068
7610 -378068 5781355 10814388 5621449 -4773694 -8778399 -4337472 786550 2184833
7602 2184833 3170251 5843178 6282383 1429495 -5376629 -9152553 -9382053 -8497532 -7587461
7593 -7587461 -6273260 -4366764 -1560291 2413247 5865762 5858485 2470433 58219 2370160
7584 2370160 8135511 13049470 14452641 12555032 8673402 4046103 -542085 -5259584
7576 -5259584 -10633897 -15743802 -18086532 -16076152 -10813485 -4960485 -1041666 -1106232 -5992532
7567 -5992532 -13352795 -17713281 -14721155 -5661863 3368027 7299873 6596332 5500920
7559 5500920 6361450 7043446 4572747 -127744 -3060159 -2070130 1387090 5139006 7935584
7550 7935584 7816239 2751064 -4992730 -8531717 -3590050 6206305 14107824 17872551
7542 17872551 19303250 18813247 15254939 9996625 6277667 4408936 1769494 -2014297
7534 -2014297 -3803075 -1867001 1111354 1220401 -2638808 -8532933 -13506979 -15638854
7526 -15638854 -15510795 -15025335 -13671581 -8405556 229965 5215917 1225125 -6554692
7518 -6554692 -7938327 -1337085 4582581 3096179 -3373887 -9591290 -14233800 -17345969
7510 -17345969 -16994701 -12491803 -6689533 -1590190 4445470 11999487 17317470 17398079 14545466
7501 14545466 12024368 8947650 3886302 73518 1568470 6182605 7413128 2711772
7493 2711772 -4253622 -8934005 -9899703 -8107127 -5489997 -4073349 -4080939 -3565591 -1775726
7484 -1775726 -1229713 -3979484 -7591410 -7795067 -3746865 2032543 7257633 10467906 9961220
7475 9961220 5847407 1962344 2181729 5663416 8742411 10110317 10732355 10343544 8251240
7466 8251240 6381079 6906608 7576375 4276384 -1914078 -5232350 -3227337 746834 3924144
7457 3924144 7694893 12699314 15317394 12547083 7080125 4039750 4671936 5925608
7449 5925608 4557294 -491556 -7886939 -13777974 -13587562 -6469379 2877703 8691279
7441 8691279 9653670 8603748 7965187 7168409 4021660 -2523293 -10514193 -15567126 -14529204
7432 -14529204 -9046133 -4077782 -2633204 -3879331 -6423249 -10162760 -13720319 -13783016
7424 -13783016 -9654941 -5364982 -3938513 -2422768 3023145 9219647 8733208 270391
7416 270391 -9218018 -13961605 -15681951 -18034220 -19584136 -16760145 -10954552 -7576831
7408 -7576831 -8604096 -10328715 -9024782 -5357506 -2002159 174745 1660291 2054787
7400 2054787 543359 -2279013 -4850047 -6410436 -6857356 -5390454 -1244035 3959449
7392 3959449 6374824 3756708 -1366938 -3309811 1724349 12163492 22203124 26114009
7384 26114009 21947737 12168146 1654507 -4992390 -5624775 -1661100 2941711 5123412
7376 5123412 5524681 6773217 8755993 7511597 285854 -9688848 -15563986 -13717104
7368 -13717104 -6773771 -347399 1590504 -1314519 -6172948 -8912875 -7802343 -5436732
7360 -5436732 -5968268 -10358456 -15775636 -19264283 -19906691 -17671952 -13101632 -8809025 -8298026
7351 -8298026 -11721723 -15095773 -15187331 -12850373 -9903764 -5499287 1616591 9272774 13627919
7342 13627919 13781961 11701204 8336449 3049554 -3137566 -6924021 -6361559 -2952226
7334 -2952226 771919 3948282 6777393 9010850 10538990 12446600 15765294 19172581
7326 19172581 19283604 14210937 6549644 1615052 1965558 4560512 4687088 2050695 970043
7317 970043 4687848 11959780 19642678 25581624 27553595 22764044 11567580 -313930
7309 -313930 -6670792 -6958680 -4921301 -2546599 1038526 5474303 8160980 7920507 6191184
7300 6191184 3726284 -493921 -5656285 -7813435 -4827120 -459753 -573140 -6066995
7292 -6066995 -12059717 -13971925 -12345268 -10899532 -11027940 -9621271 -2935607 7800143
7284 7800143 16046520 16385274 10580255 5557697 5498405 7909115 8071270 5270395 2965228
7275 2965228 3997943 7571865 10656865 10780051 7468126 2596320 -201930 1896229
7267 1896229 7643439 12048848 11481522 7723257 5068764 4051355 1078014 -5149257
7259 -5149257 -10451756 -10701121 -7489404 -4895864 -3077635 374528 4184567 4047925 -184529
7250 -184529 -3260545 -1818775 1812586 4817556 8074761 12580572 16092050 16511263 15085118
7241 15085118 13612160 12380274 13351866 20150682 30813935 35884130 29527659 18348189
7233 18348189 12682407 12652038 10126945 1966614 -6748760 -11704928 -13725885 -13984920 -12153937
7224 -12153937 -10351666 -12381118 -17577183 -20982138 -20517351 -18462455 -15612742 -10582365
7216 -10582365 -5616473 -5578443 -9112447 -8324918 -512579 6847151 6988289 3275995 2631817
7207 2631817 4987746 5138548 1302076 -3766465 -7813290 -10707056 -12755635 -14546031
7199 -14546031 -16422670 -16054478 -9786947 1241568 10124639 12072150 9492336 6698875
7191 6698875 4195814 1488915 596597 2390182 3718988 2569849 1909531 4037871 5837306
7182 5837306 4847049 5365723 12253007 22460507 29016001 29906338 26821951 19394956 8465225
7173 8465225 1308852 4179293 11363243 11001607 1255614 -8506196 -12710512 -15829257
7165 -15829257 -21648412 -26082002 -25246089 -22944210 -24326667 -27254114 -25430419 -17090324
7157 -17090324 -6646033 -6137 -621440 -7253572 -13489125 -12420840 -3900733 5257839
7149 5257839 9149810 7606587 2926457 -3166352 -7634849 -6630114 -1239677 1595582
7141 1595582 -2240360 -7877086 -7955714 -2549966 1605828 120927 -4734889 -8036251 -7357944
7132 -7357944 -3867773 -303411 1731383 2860839 3961073 3841325 984275 -2804084
7124 -2804084 -3604430 -701864 2517485 3705945 4022469 4314208 2819498 -1189806 -5100886
7115 -5100886 -6970916 -8737577 -12562823 -16705210 -18027422 -16267213 -12907335 -8140684
7107 -8140684 -2268001 1783526 1044084 -3075105 -5769757 -3943591 1396104 6831826
7099 6831826 9041044 7070683 3874800 4043242 8249726 11714952 10044461 4602426
7091 4602426 -53517 -1947516 -2322066 -2533110 -3319713 -5568550 -8705993 -9670204 -6689038
7082 -6689038 -2965701 -3173265 -6913476 -9076879 -6527336 -1174129 3713590 6948700
7074 6948700 8389838 7360842 3639618 -1598867 -6830034 -10964047 -12687601 -10661542
7066 -10661542 -5314070 655736 4542422 5917794 6069835 5587510 3370012 -1398016
7058 -1398016 -6540448 -7591494 -2656433 4028669 5442776 -921985 -10623957 -17218500
7050 -17218500 -17754580 -13324675 -6952045 -2097469 -886140 -2245039 -3362825 -3538246
7042 -3538246 -4101182 -4126815 -367405 6396646 9194014 3136961 -6849534 -11010319 -5986418
7033 -5986418 2967824 9811067 13475329 16009812 18783368 21150951 20577079 14563409
7025 14563409 4939846 -1062504 2096013 10409181 13714438 7704716 -1125622 -3884779
7017 -3884779 639628 6400852 8276686 7234512 7828278 12122406 16698490 16151655 9776486
7008 9776486 3415951 3247542 8898030 14618653 16124799 13701081 9353433 4252912
7000 4252912 -454448 -3099703 -3133403 -1955694 -1390605 -2094707 -3208064 -2605695 1499986
6991 1499986 7485516 9964674 5027690 -4608209 -11992247 -13047415 -9108530 -3357428
6983 -3357428 2103387 5894860 7451153 8051753 9186415 9662294 6975742 1661143 -2657645
6974 -2657645 -3884744 -3200390 -1895403 251453 2655703 3273752 1597274 -382523 -1247651
6965 -1247651 -1466052 -779179 2413396 7448540 10269922 8165675 3477076 662250 1422754
6956 1422754 4103390 6006819 5199319 2130380 232409 2235595 5239775 3232632
6948 3232632 -3930488 -8433510 -4433495 3837865 8119232 7252321 7175022 11330714 16371696
6939 16371696 17684894 15038191 11724162 10916117 13560119 17623595 19113409 15888085
6931 15888085 10398810 6433968 3505058 -2448965 -12263994 -20727019 -22410803 -18191252
6923 -18191252 -13741846 -12621537 -12898771 -10318469 -3089417 6728439 15206318 19146785
6915 19146785 17768075 13328550 10036913 10743723 13839195 14554493 10409519 4254672
6907 4254672 537092 -43214 174751 740298 3856461 9965698 15954711 19035282 19708245
6898 19708245 19450247 18003268 14726478 10490598 6462133 2905478 656642 1424137
6890 1424137 4654870 6399411 3769316 -1217803 -4522955 -5105279 -4818472 -5114966 -6304186
6881 -6304186 -8332216 -9732861 -7628257 -1595806 4316816 6592929 7388528 10923298
6873 10923298 16281889 18189329 14282982 7313367 373133 -5601131 -9183801 -7877518
6865 -7877518 -1906664 4433831 6645842 3393334 -3645924 -10316298 -11075084 -4023895
6857 -4023895 4616218 5585524 -2558617 -11804681 -15008854 -12855047 -8517862 -1266626
6849 -1266626 10031531 21288032 26753837 26242195 24097527 22505734 20389997 17812366
6841 17812366 16591722 16538761 15406502 13195693 12669838 14454309 14924902 10757361 3510915
6832 3510915 -1836097 -1851319 2290040 5528411 2957440 -5034865 -11819719 -10797979 -2557955
6823 -2557955 6366705 11424211 13543794 14590211 13600923 9799759 6033086 5794916 8436194
6814 8436194 10280129 9446355 6869526 3455709 -641105 -3944911 -3855610 86919 5007656
6805 5007656 7552682 6598266 3006297 -1306830 -3527369 -1497679 3473922 7174583
6797 7174583 7499416 7223563 9687016 13313370 13549948 9644485 5691013 3999925 1233010
6788 1233010 -5979736 -14131839 -15845871 -9652825 -2892162 -3262948 -10147657 -16576488
6780 -16576488 -17976742 -16044047 -14566211 -14620540 -14826128 -13880961 -11115058 -6137673 12676
6771 12676 4267510 4243579 1331136 -807910 -581973 896057 3336712 8068237 13922119
6762 13922119 15829829 10944103 4100011 2871730 7602088 10683569 6670284 -934290
6754 -934290 -5007578 -3431675 554487 3821929 5334623 4409494 1442473 63576 4175785
6745 4175785 11855629 16036272 13110132 7663924 6293413 9476530 12590859 12660222 10082788
6736 10082788 4952576 -3380130 -12311300 -16136235 -12818050 -7503455 -6087077 -7361918
6728 -7361918 -5379553 1142757 5806240 1992848 -9309806 -20485083 -24366966 -19455895
6720 -19455895 -9934455 -1857719 1740953 2771881 4365971 5930899 4754726 2522527
6712 2522527 5466053 15186910 23447965 20966264 9218538 -1446592 -4034450 -107158
6704 -107158 5859192 10617011 10362659 2381526 -8638569 -12539008 -6215160 1302846
6696 1302846 1065795 -3982095 -5649487 -3918544 -5139475 -9563709 -10485608 -6177105 -3421988
6687 -3421988 -6473204 -10484505 -10028352 -7228550 -5985938 -3748105 4129368 15142248
6679 15142248 21654357 20810474 16442462 11790156 6492559 1524656 1028340 6246669
6671 6246669 11783790 11695833 7218518 4965134 8147638 12575708 12018552 5778989 -296139
6662 -296139 -103865 6068426 11611088 10431366 3336650 -2928288 -2791026 2753990 7931803
6653 7931803 8549451 5937528 4705888 7169910 10665970 10812551 6962015 3133736 2980004
6644 2980004 5036327 4506604 -501915 -6217551 -7441817 -3548544 947015 1645880 -1118712
6635 -1118712 -3656972 -4152490 -4827000 -8168375 -12459530 -13157626 -8642172 -2339478 1961784
6626 1961784 5021367 10265745 17920178 23688319 23861842 19699372 15400581 13045001
6618 13045001 11228031 8084061 3710810 -688825 -4349206 -6672950 -6753656 -4604302
6610 -4604302 -2015866 -542610 708029 3115752 4789081 2068129 -4097503 -6835363
6602 -6835363 -1563016 6809456 9059914 3212293 -3507620 -4708801 -2294702 -1862393
6594 -1862393 -4494605 -6564868 -5531591 -2393568 700356 2299467 1544115 -1149891
6586 -1149891 -3418444 -3288359 -2136956 -2982924 -5703650 -6571615 -3476809 673003 1392323
6577 1392323 -1921830 -5549901 -5674546 -1726288 3833944 7608688 7392236 3846839 689927
6568 689927 2076160 8507611 15459965 17221180 12730603 7062797 6456566 12189877 19849872
6559 19849872 23891984 21894262 15307139 8214229 5222903 7858421 12110914 12135143
6551 12135143 7852788 5985454 10865198 16947637 14849245 3774126 -6840688 -8537508
6543 -8537508 -2349232 5070744 9410585 10375362 9347140 9034690 12745143 19939219 24212508
6534 24212508 19839972 9347298 430278 -3972097 -7670050 -12973365 -16001653 -12755479
6526 -12755479 -5315619 1826941 8330777 16289632 23889902 26002637 21362877 14964423
6518 14964423 11974233 12124362 11455492 7407853 944028 -4618747 -5882559 -2162362
6510 -2162362 2936465 4145627 -294667 -7090998 -11709353 -12112928 -8609800 -2467333
6502 -2467333 4219388 9277362 12286361 14229059 15107120 14305501 13389135 14702966 16153831
6493 16153831 12240165 3043946 -2822913 988610 8816851 9977515 2751724 -5138416
6485 -5138416 -8244584 -8301521 -7714998 -5509062 -1027553 4717366 12633603 23835510 32895305
6476 32895305 30776721 18159652 8267771 10883957 19748532 22106202 15318216 6655531
6468 6655531 921744 -3216608 -6746295 -8479471 -9374243 -11633049 -13396154 -10755473
6460 -10755473 -5258810 -3000272 -5566126 -8195445 -8027888 -7714786 -8982340 -9162774 -7254046
6451 -7254046 -7497452 -12634136 -18177277 -18054435 -12786551 -7896192 -6755519 -8827529 -12620760
6442 -12620760 -16320115 -17081706 -13610448 -8778139 -6745086 -8110790 -10095922 -10287761
6434 -10287761 -7946023 -3200032 2254534 4974237 3273712 -40035 -1345836 -1632029
6426 -1632029 -4868996 -11496438 -17399572 -19931091 -21207595 -23694463 -25609680 -23574338
6418 -23574338 -18171571 -13587942 -11698338 -9433786 -3579198 3837259 7829286 7732581
6410 7732581 8628473 13710525 18392829 15958295 7662305 2251214 4619208 9590412
6402 9590412 9486328 4183456 -21222 770735 4577695 8120989 10825601 13225013 14093925
6393 14093925 11199577 4503245 -2383925 -4662673 -956487 4739712 6842491 3824643
6385 3824643 -1288678 -5404433 -7462964 -6097149 311075 8908486 11856139 4897582
6377 4897582 -5823792 -10069657 -5580566 474290 1711354 -308941 -94298 4246415
6369 4246415 9360580 10721388 7267860 2929691 3168575 8598875 13246936 11490702
6361 11490702 5247644 812580 -69074 -937650 -2557846 -395969 7189391 13569221
6353 13569221 11414642 2748627 -3396968 -2209523 2247678 3434691 -396339 -6230301
6345 -6230301 -10584981 -11854308 -9897551 -5580352 -1060557 875000 -777589 -3507540
6337 -3507540 -3521987 -533283 1335250 -910005 -4407251 -4089346 132164 3605300 3962022
6328 3962022 3359826 3065505 1091390 -2359581 -2283996 3998893 11117941 12332312 9190782
6319 9190782 8747211 12918618 17028669 18497971 20168121 23683625 26016633 25351511 24736758
6310 24736758 25969696 24728237 16941671 6586298 1361343 2409991 4045246 3015649
6302 3015649 2211072 4303722 7060667 7309599 5470044 3211888 -338212 -6681292 -13975487
6293 -13975487 -18030991 -16509131 -10148262 -1198643 6930691 9944732 6215674 107506
6285 107506 -1646555 1917406 4083025 -1497155 -12514709 -19852754 -17188175 -7231462
6277 -7231462 1470450 2748437 -2375646 -8096872 -10031129 -8678110 -7334315 -8009948
6269 -8009948 -10242622 -12825376 -14946799 -15774069 -14606030 -11902239 -8996114 -6463916
6261 -6463916 -3828614 -972136 1446848 3078894 3870427 2820762 -1354903 -7778857
6253 -7778857 -13547992 -17026298 -18914792 -19185956 -15676285 -7739149 956221 5936739
6245 5936739 6864021 6592926 6667249 6373254 5132639 2973570 -558789 -4972470 -6929668
6236 -6929668 -3144743 4715899 11136658 13114583 12506758 11814221 11222096 10992432 13166346
6227 13166346 18367779 23238113 23677621 19451388 13695104 8912606 5098996 961983
6219 961983 -4378947 -10285791 -14444518 -14859894 -12603886 -11048530 -11491420 -11295881 -7718465
6210 -7718465 -2008289 1958029 2032486 -608146 -3123837 -2918812 964478 6747377 10799546
6201 10799546 10709887 7000939 1680459 -3262653 -5647533 -4202140 -1391600 -2270838 -7942331
6192 -7942331 -12594300 -10331722 -3088994 2001876 1770706 -745019 -2549882 -4178266
6184 -4178266 -5973590 -5610732 -1923082 2082723 3019725 1838406 1998097 4446801 7144146
6175 7144146 8553835 8804144 7797376 5030369 1672478 145165 436785 -859319 -5702436
6166 -5702436 -10317545 -8797283 -1080724 5689956 5437387 582185 -1433893 2020288
6158 2020288 5641464 3358596 -4169589 -10723488 -11399492 -6707508 -965186 1826471
6150 1826471 1040383 -523104 210590 3239512 6017022 6994313 6905827 6576875 5881967
6141 5881967 5401555 6310302 7589019 6547242 3846439 4474641 10902056 18478975 21178933
6132 21178933 19058029 15971018 12740753 7793770 2503733 -126988 -1206154 -4185079
6124 -4185079 -7479824 -5399833 2535310 9674309 11596241 11089759 11011089 8750244 2461855
6115 2461855 -2797406 -1411189 3789258 5235476 1577761 -1088743 1267525 5012250
6107 5012250 3907891 -3390086 -11932078 -15013670 -10314617 -2718599 133594 -3635684
6099 -3635684 -8058683 -7401922 -3436647 -1774138 -3834163 -6516350 -7714439 -7500891 -5173604
6090 -5173604 -112536 4799901 5402956 2225445 -19500 715988 1699027 710220 -1026790
6081 -1026790 -2475732 -5045287 -9231927 -12693166 -13923212 -14606673 -15810928 -14711781
6073 -14711781 -8155764 2325719 11836477 17332689 19181620 18286938 14101691 6211951
6065 6211951 -2968531 -8238086 -5857458 1591711 6631823 5315164 2350849 4641920
6057 4641920 11577169 16523271 16989038 17095102 19044998 18784700 13187934 5770164 973561
6048 973561 -2384655 -6883374 -9853357 -7230315 -1655968 -196652 -4433367 -8395988
6040 -8395988 -6831717 -945338 4872776 8064989 8413181 6520101 3181016 -1155449
6032 -1155449 -6373845 -11177482 -13314348 -13365348 -15679234 -21801576 -25510680 -19988246 -8856108
6023 -8856108 -3678887 -9729950 -20155715 -25820890 -25038722 -20957239 -15222081 -8692985
6015 -8692985 -4100010 -2867285 -1901736 1956401 6394597 6905468 3840759 1549537 1492073
6006 1492073 1032853 -859132 -1350048 1466662 5046036 5601787 2703615 -872145 -2451823
5997 -2451823 -1612447 -196455 -743761 -3722338 -6136932 -4526182 268800 3235349 1056927
5988 1056927 -3827549 -6457373 -5399058 -3723381 -4361202 -6378410 -6639356 -4259834 -2212357
5979 -2212357 -4054633 -9426106 -13660283 -12522554 -7046220 -2797429 -4065335 -9361881
5971 -9361881 -13095671 -11320374 -5369870 -146169 438624 -3652846 -9103692 -11659807
5963 -11659807 -8597406 -448193 8925186 14794638 15093254 11494915 7079718 3917426
5955 3917426 3100415 5135932 8623262 10033148 7250808 2649258 130830 -370577 -2340030
5946 -2340030 -6555485 -9202107 -7515857 -3966522 -2450565 -2974347 -3033356 -2282494 -2390323
5937 -2390323 -3103562 -1707331 3457864 11174887 18878472 23834023 23068708 14904737 1625818
5928 1625818 -10920733 -17440767 -16720793 -11628051 -6628225 -4610867 -4670233 -3323741 1043730
5919 1043730 5954160 8453312 9303892 10912297 12320019 9992320 3624944 -2584864
5911 -2584864 -5410236 -5917634 -5938611 -4744315 -1666594 948072 728996 -705529 -352750
5902 -352750 592632 -2250715 -9499262 -15738196 -15931506 -11486969 -7551835 -6002310 -4295682
5893 -4295682 -988082 1249347 57764 -1734442 825667 7439691 11933158 10043163
5885 10043163 4561142 574466 -1576049 -5270265 -11355346 -16876980 -19537320 -19630440
5877 -19630440 -17408578 -12421727 -6522044 -3838775 -5711779 -8358493 -7666720 -4022450
5869 -4022450 -244581 3097564 7547075 13125558 17363725 17718831 13670975 7162669
5861 7162669 1840121 425351 1752813 2223566 1435727 3705209 11460888 19591524 20263433
5852 20263433 12406216 2706606 -2446739 -2243149 1346500 7087511 13103335 15461249
5844 15461249 11749055 5138071 2083063 5561686 11970332 15077786 12203308 6071312
5836 6071312 1132537 -1013855 -2069413 -3612143 -4744234 -3830006 -1557839 -1053169 -4928674
5827 -4928674 -12504315 -19666057 -21783909 -17991634 -12553226 -10336952 -10955190 -9932950
5819 -9932950 -6063547 -3720249 -5714153 -7929352 -5195383 543784 3191779 1777766
5811 1777766 844399 2229528 2894959 1682395 1634160 3359450 2471500 -2599735 -5873866
5802 -5873866 -1971846 5349578 8506087 6666459 4923408 5267728 5196125 4419613 5924458
5793 5924458 9533522 10883788 8859781 8261659 11954696 15198012 11756682 2201866
5785 2201866 -7775133 -14516368 -17848153 -17732993 -14126037 -9210491 -5552101 -2247773
5777 -2247773 3367173 10205982 13510720 11326195 7578908 7291652 11254328 16718458
5769 16718458 21022206 23024881 22838035 21535162 19712011 15825458 8273410 -277946
5761 -277946 -4127436 -2087050 -296658 -4253427 -11106674 -14307849 -13579344 -14481824 -18671100
5752 -18671100 -20831656 -16788013 -9283742 -3189055 396612 2227821 1609856 -793303
5744 -793303 -645165 4280335 8658129 6023434 -753549 -2254888 3654481 7766368 2290684
5735 2290684 -8083449 -12576119 -7851873 229840 6035313 9188504 10318374 7851616
5727 7851616 1721428 -3614856 -3499278 1142434 5176201 5574146 3824440 2495917 2191291
5718 2191291 2477455 3331457 4195943 3493986 1179607 597302 5143403 13018070 17685781
5709 17685781 14500274 5293725 -4407979 -10942355 -13889691 -13613463 -10076649 -4210199
5701 -4210199 1497645 4823167 5693334 5770261 6287805 6449983 4210292 -978519 -6597624
5692 -6597624 -9368121 -9028141 -8185897 -8179411 -7443231 -5230198 -4325854 -7281690 -11499583
5683 -11499583 -11332818 -4706934 5045164 13502912 18340768 18503703 14024711 7797363
5675 7797363 4268756 4498167 4930589 2842088 589447 2138361 7316865 12266601 14448714
5666 14448714 14490787 13676901 12352189 10947476 10120431 9086003 5744263 -252378 -5819271
5657 -5819271 -7449649 -5610945 -4615694 -7458412 -11764319 -12217514 -6881092 487589 5075060
5648 5075060 6295651 6845907 7827395 7428990 4295187 -472442 -5440669 -10701268 -16267904
5639 -16267904 -20281329 -20464360 -16753043 -11692645 -8830486 -10652209 -16418359 -21614094
5631 -21614094 -21629358 -17111168 -13787211 -15597172 -19836929 -20860021 -16901395 -11074379
5623 -11074379 -6945057 -5617687 -6477918 -8299078 -9581586 -9594348 -8975541 -7909123 -4584786
5614 -4584786 2207817 9382008 11410398 6725090 -69278 -3657704 -3764559 -3759876 -5132985
5605 -5132985 -5968222 -4693442 -2688124 -1891887 -1581839 385755 3861343 6387421 7084361
5596 7084361 7823607 9313422 8975851 5452126 2704314 5251096 10295387 9737228 979272
5587 979272 -8969360 -12335749 -9543908 -6474402 -6141494 -6699790 -5533728 -1898835 3020129
5578 3020129 5955315 3394006 -3424939 -7483751 -3736402 3626813 5626896 -805134
5570 -805134 -10423494 -16934634 -18377737 -15899882 -11977572 -10202630 -12335551 -14818429
5562 -14818429 -12508356 -6672102 -4484244 -8973323 -14399492 -14384282 -10169137 -7054214
5554 -7054214 -6322102 -5367310 -3510555 -2614365 -2548082 -608647 3720792 6708522 4507479
5545 4507479 -2372805 -9634016 -13101149 -11618493 -7143958 -2731098 -176928 721346
5537 721346 1087337 1820848 3246621 4703924 4442149 1323276 -3229301 -6691622 -9042668
5528 -9042668 -12464874 -16497023 -16394544 -8822660 2650373 10596493 11425429 7693779
5520 7693779 3684869 1558286 1639143 3489943 5848478 7647819 9862644 14296121 19611205
5511 19611205 20861483 14934475 5011484 -2636026 -5410451 -5356009 -3782186 1270922
5503 1270922 10261399 18082865 18956464 14410358 11740491 13750248 14941537 10768668
5495 10768668 6040203 8469293 16129680 18329927 10034777 -589823 -2182149 6391197
5487 6391197 16339864 19870780 16717717 11228084 7160085 5811314 6406544 7028238 6170713
5478 6170713 3929753 1512158 134858 693996 3314038 6452272 7663959 6105152
5470 6105152 3042854 -597643 -5040934 -9055867 -9586437 -6488570 -4915670 -9161269
5462 -9161269 -15702426 -16727575 -10233411 -2337398 959817 120321 -1181972 -1551465 -1334539
5453 -1334539 423844 4849773 10199183 12945992 11718746 8216946 4718186 2651182
5445 2651182 3155225 6585307 10936915 12620969 9715363 3509529 -3296478 -8485458
5437 -8485458 -10281203 -7650494 -2021965 2927755 4953119 5529256 6719791 7245651 4517496
5428 4517496 -208275 -2396187 -521686 1859785 1958206 2176712 5858961 11309022 13716611
5419 13716611 11577099 7653285 4455187 2248053 961520 454722 -908529 -4225287
5411 -4225287 -6556927 -3610667 3335611 7505319 5296228 877464 -187843 1863046
5403 1863046 3358981 3697967 5549989 10134623 15766857 20397733 22966804 22805103 19807523
5394 19807523 14797861 8623956 2136606 -2226960 -1590894 2713289 4624692 520043
5386 520043 -5543206 -7197639 -4079632 -633949 1400822 4045863 7247579 7573807 3825635
5377 3825635 -705867 -3348864 -5500588 -8831220 -11428898 -10508889 -6748632 -3343784
5369 -3343784 -2179324 -2961081 -4742715 -6164621 -5207265 -1060539 3899176 5870706 3765313
5360 3765313 373521 -1049683 -277766 811473 1920742 4970626 10047366 12853961
5352 12853961 9398924 2862998 1810094 9819141 20196359 23815748 19659106 14166281
5344 14166281 12240600 13219669 14672797 15255242 13297064 7143297 -1261513 -6584171
5336 -6584171 -6244757 -4068043 -5558573 -10927440 -14730517 -11864842 -2897541 6126575
5328 6126575 8922128 4741343 -1141744 -3398592 -2062447 -434701 727753 3418170
5320 3418170 7174146 7977937 3866961 -1801820 -4897968 -5588076 -6256015 -6581565 -4094088
5311 -4094088 1142903 5662827 7043025 6944463 8366471 11156815 12181173 10046152 7594371
5302 7594371 7860306 8742796 4980937 -3958369 -11474411 -11529930 -5810835 -87792 3936341
5293 3936341 8801080 14861291 18673785 17805767 13022858 5605682 -3189297 -9730205
5285 -9730205 -9928301 -4787514 432437 3927158 9272298 17455989 22324971 18202602
5277 18202602 8418316 1665361 1973794 6206511 9740359 10624308 8942825 5644351
5269 5644351 2175947 -795560 -3957226 -7277144 -8709250 -6958768 -4400445 -5069983
5261 -5069983 -10213366 -17128384 -21640474 -21023979 -16144249 -11693333 -12274632 -17039351 -20395904
5252 -20395904 -19087239 -15502329 -12394254 -8419961 -2382191 1707464 -1054634 -8677027
5244 -8677027 -13712438 -12199737 -7214704 -3667635 -3334845 -5255687 -7418664 -7186109 -3032257
5235 -3032257 2995693 6787608 7135639 7363064 10988826 17063879 20822101 18571928 11627560
5226 11627560 5268873 3209379 3407171 1093071 -4023310 -6513115 -2489806 5067807
5218 5067807 10778281 13858558 17260265 21821723 25092776 25016839 21607641 16036587 11118033
5209 11118033 11195262 17612203 25071559 26466924 21170911 15060261 12732937 13416480 14296585
5200 14296585 13838061 11465835 7602951 4346963 2812660 323552 -5503071 -10521786
5192 -10521786 -7798862 1565831 7809289 5334177 19413 -488898 1746524 -702085
5184 -702085 -8379684 -14010092 -12718660 -6969780 -1004001 4137883 8625457 11531844
5176 11531844 12861452 14544453 17030694 17572044 14391345 10263435 8961459 9707756
5168 9707756 8501646 4314383 495449 -378515 102994 -856517 -3444088 -5851555 -6525457
5159 -6525457 -4303884 1303885 7924224 10819042 8365304 4964854 5335052 8061971
5151 8061971 8808465 7693428 7888181 8112042 3546931 -4896636 -9318146 -5575352 859628
5142 859628 3245848 2033362 920880 223627 -484590 1759319 8305241 13706154 12530951
5133 12530951 8483426 9504639 15746681 19831717 18109581 14322742 12172170 11324647
5125 11324647 11370580 12830930 12935730 7067391 -3368152 -10304491 -8814478 -2688515
5117 -2688515 1999969 4079790 5473088 6676206 7246863 7741154 8652862 9653091 11038649
5108 11038649 13314905 14918363 13616748 10294622 7526193 4569897 -1441946 -9205998
5100 -9205998 -13578841 -12855384 -10112614 -6710448 -1037912 5015746 5831519 972799 -2968583
5091 -2968583 -2720389 -2924698 -6276651 -7428312 -3010715 45505 -5406597 -14204213 -15605707
5082 -15605707 -8487153 -673771 3903382 7804780 11284694 10550366 5513793 1092979
5074 1092979 -686483 -2956417 -6972294 -9396752 -8506144 -7212658 -7766950 -8710190 -9194865
5065 -9194865 -11268954 -15359353 -17990786 -16744229 -13794008 -12174225 -12066309 -12929819 -15475769
5056 -15475769 -18718958 -18490180 -12335357 -3768528 1207237 267048 -4370971 -8957824
5048 -8957824 -9987356 -5481533 2676972 9476328 12241895 13263841 14400168 12128308
5040 12128308 2724048 -9460157 -15181372 -12482406 -9523846 -12378065 -15572188 -10189161
5032 -10189161 2167696 10544857 9183509 3960341 2561066 4563571 5225260 4188915
5024 4188915 4828759 7582973 9626334 10263975 11635826 14134348 15498588 14721681 12962019
5015 12962019 10379568 5983765 982558 -1645791 -1555055 -1427726 -2680602 -4518357 -7114338
5006 -7114338 -10993021 -12956299 -8243568 1699841 9010158 9178754 5958259 4017948
4998 4017948 2062856 -2988063 -9396861 -12552042 -10814906 -6245114 -1867473 -192424
4990 -192424 -1470065 -2074863 1503263 6079123 4423839 -4010743 -11350679 -12736949 -12362689
4981 -12362689 -14244768 -14517841 -8835573 -1111658 1874560 -205143 -3238292 -5069136
4973 -5069136 -4241980 1844230 10935820 14046504 7221227 -482517 827432 7277706
4965 7277706 8403618 3943444 2472616 6625313 11019278 12996192 14327335 13290750
4957 13290750 6155431 -3383795 -6738320 -3019420 508462 661071 969910 1987262
4949 1987262 137475 -2250537 2806074 15347273 24495805 23326311 17642542 15580617
4941 15580617 16831560 16895561 14682988 11131160 6305194 1749466 414086 1684393
4933 1684393 1895461 1060683 2637369 5863294 6180952 4484965 7082590 14147655 17232008
4924 17232008 11629951 2906863 -2307988 -4041717 -4338719 -3152869 -2301975 -5483031
4916 -5483031 -11058555 -12810817 -10569511 -11223466 -16309584 -18364191 -13346070 -6838275
4908 -6838275 -3736396 -1764517 287081 -1691026 -7821908 -10771701 -7259777 -3593786
4900 -3593786 -4710186 -7510001 -9603270 -13786231 -19019554 -18539106 -11998565 -7543286
4892 -7543286 -7464891 -5402426 -1817334 -5752085 -15802150 -18111017 -10547715 -8259027
4884 -8259027 -16334992 -20348368 -15571163 -19058928 -36999109 -49196711 -46616122 -52191903
4876 -52191903 -77564498 -96803592 -103312695 -152493441 -282764789 -416989550 -422916249
4869 -422916249 -279009968 -108393254 -26706746 -22295954 -19980877 1394876 11517937
4862 11517937 4796791 7383702 23062734 27489740 14695313 6228080 11676093 15550898
4854 15550898 8041878 -669968 -2408172 -2835238 -5740049 -5883648 -2290821 -1520768 -4639894
4845 -4639894 -6251194 -7330379 -13455808 -20349582 -17686129 -7701759 -3185814 -5861880
4837 -5861880 -3963497 6347747 14456286 14326545 13627534 17919536 20444363 14826416
4829 14826416 5693030 -262848 -3390094 -5444815 -4723477 -2208812 -3255047 -8086140
4821 -8086140 -9373047 -3792009 2549552 4177397 2995580 1337689 -2429744 -7322661
4813 -7322661 -8116338 -4617543 -3231020 -5059615 -2656147 6154633 11976409 8376654
4805 8376654 2715849 4193482 9993906 12422440 11997176 13549953 15615461 13831865
4797 13831865 10277382 10043914 12353344 13590939 14995989 18437854 18691517 10001854
4789 10001854 -2437137 -7899084 -5521090 -4075485 -6968897 -8178081 -4422911 -909909
4781 -909909 -1401714 -1559055 2806625 7965023 8458546 5755107 4789655 5558034 4229079
4772 4229079 821404 41488 4120505 8927486 8787094 3249748 -2249522 -2022177 4088922
4763 4088922 10733646 12986582 11514158 10670329 12133518 12825589 9826615 5095499 3433991
4754 3433991 6766882 12178894 15328773 14496876 11364868 9039545 9627124 12812973 16120315
4745 16120315 16840961 14218213 9845167 6032376 4190213 4759258 7605750 11428244
4737 11428244 13487168 11772364 7820146 5761576 7681717 11263436 13088165 12801846
4729 12801846 12342515 12290422 11382022 9260854 7181132 5412537 2028603 -4409297 -11974811
4720 -11974811 -16409430 -15036085 -9399233 -4069773 -2600886 -4435791 -6169996 -5819191
4712 -5819191 -4671044 -4470109 -4400622 -2246608 2552379 8447933 13527905 16489092 16911701
4703 16911701 15857954 15093533 14547382 12048803 6850862 1369020 -2265223 -4865711
4695 -4865711 -7116023 -6855352 -2946101 970148 1182449 161825 2715579 7437693 8249496
4686 8249496 4131122 710450 1170316 2021857 99396 -2144378 -1450441 1026967 2591661
4677 2591661 2909491 1997290 -1441350 -6221002 -7293916 -2274808 3946008 5321218 2747148
4668 2747148 2029188 6032989 12775135 19334381 23769633 24733551 22830330 21101247 21133893
4659 21133893 20402630 16536798 12061243 11149198 13511060 15501527 15669566 14916682 12531611
4650 12531611 6983942 293517 -3141182 -2573508 -1778405 -3299722 -5443474 -5655105 -3488501
4641 -3488501 465294 5175940 7724037 4705366 -3087857 -9849004 -10431950 -5288175
4633 -5288175 1302231 6142414 8999684 11014141 12811082 14090092 14635056 15355540 17124202
4624 17124202 18098379 14340915 5073344 -4543918 -8654743 -7326884 -4808088 -2651317
4616 -2651317 1053269 6002396 8402361 7011511 6293390 10761117 18603487 23341046
4608 23341046 20462575 11188780 1400802 -2180063 2984891 12368176 18040614 16400942
4600 16400942 10828675 6321421 4254451 3655675 4397417 6350031 7564439 6419521
4592 6419521 4325245 3421708 2557783 -1320832 -7992526 -13207392 -13795677 -11158875 -8598063
4583 -8598063 -7055270 -5135166 -2386681 -674743 -1827464 -4926796 -7112109 -7270857
4575 -7270857 -7769800 -11205543 -16001212 -17430709 -13743651 -9106275 -8550987 -11532239 -13283959
4566 -13283959 -12079088 -11674207 -15161900 -19260728 -17747303 -9550731 -253191 4853866
4558 4853866 6349828 7920336 10523024 11973321 10992189 8455728 4773705 -698002
4550 -698002 -6733543 -9773614 -8228215 -4841987 -2575384 -373431 3964756 8422217
4542 8422217 8296080 3009450 -2305509 -3034589 1429 3109923 4557132 4961931 4879980
4533 4879980 4367571 4127112 5219667 7894383 11733382 16253833 20230957 21310711 18062608
4524 18062608 12350687 8164929 7626519 8987942 8954613 6409233 3528261 3573301 7757368
4515 7757368 14001632 18660883 19712076 18310167 16969115 16255821 13883106 7587802
4507 7587802 -1432706 -8851859 -11276930 -9323087 -6239802 -4328409 -3616692 -3271037 -2703138
4498 -2703138 -1375530 838323 2718429 2556265 445462 -1610365 -2277294 -2021471 -1232208
4489 -1232208 700497 3374626 4567511 3075391 536080 -1328190 -3271886 -6005084
4481 -6005084 -7077154 -3526740 3356860 9136227 11607275 12032812 11359294 8552795 3062409
4472 3062409 -4008587 -11630426 -18885261 -22893987 -20128419 -11276434 -2103371 2300583
4464 2300583 2243898 1193341 912463 375343 -2072072 -6785324 -11803169 -13161978 -8087511
4455 -8087511 1353256 9717836 13941596 15346730 15436567 13208851 8646136 5545299 7387401
4446 7387401 12097601 14198698 11391612 6336770 2594975 1513597 3033765 7073672
4438 7073672 13197296 19937423 25044654 26671892 25182834 23594259 24282638 24951558 20754817
4429 20754817 11855408 5614327 8208028 16347310 20957226 17726092 10336724 4211688
4421 4211688 1332247 1476940 4290050 8186762 9945090 7659087 3027388 -518806
4413 -518806 -1216333 60729 1493174 2683072 5541298 11854964 19178649 21242280 15210781
4404 15210781 7193228 6558234 14588084 22816502 23973182 20581052 19766974 22654871
4396 22654871 23538262 19037878 13466990 12786477 15745487 14816399 6481926 -2711588 -3560781
4387 -3560781 3633811 8886113 5726073 -252700 13908 5799500 8455633 5231521
4379 5231521 3368630 8115302 13609457 10913584 767628 -7842041 -9787641 -8156526
4371 -8156526 -6435406 -2447446 6928915 18628440 25167748 23213933 17604388 15604601
4363 15604601 18332226 19760428 14648255 5426528 -1025393 -2219457 -2018617 -3474506
4355 -3474506 -4139880 -992633 3740293 5635560 4500767 3466950 3483382 3571399 5375242
4346 5375242 11565057 19168181 20400425 12472197 1860112 -3930031 -4633844 -4103492
4338 -4103492 -3072832 408362 5912455 10577023 12758576 12201132 8393422 2675596
4330 2675596 33443 3844627 9820163 10361562 4663476 -969991 -3217505 -5935383
4322 -5935383 -12155063 -17744596 -16982923 -10294733 -2306278 4472202 9640267 11390938
4314 11390938 8258499 3292625 1661047 3987859 5866568 4141888 32633 -4521036
4306 -4521036 -9906859 -16439170 -21326756 -20313131 -12023949 -79968 8988837 10693828
4298 10693828 6483755 1883184 -247456 -2795914 -8679046 -14246976 -12438416 -2011248
4290 -2011248 10427570 18030579 19579361 17064204 11768274 5127641 166970 -1150560
4282 -1150560 -508075 -960984 -3315111 -6303684 -8710925 -9562920 -7788744 -3686572 362185
4273 362185 2248743 2093503 600386 -2763078 -7982511 -12476412 -13380266 -11019441 -7794300
4264 -7794300 -4335716 504783 5782903 7433681 2754912 -5279586 -9929601 -7363787
4256 -7363787 -883846 2382800 -586232 -4999700 -3765391 3879671 11271372 12033312
4248 12033312 6782301 1379478 448123 3769616 7471274 7437551 2644598 -3874854 -8101396
4239 -8101396 -9020775 -8090576 -5464445 -47637 6310971 8785459 5671866 927109 -1809925
4230 -1809925 -4055721 -8057661 -11194935 -9616185 -5213344 -3747471 -6853580 -10585248
4222 -10585248 -11585656 -10241324 -7615789 -3767303 -103020 543936 -2163711 -4900558
4214 -4900558 -4766813 -2227104 883518 3789931 6118005 7020400 6274969 4849169 3733611
4205 3733611 3556309 5397516 10108430 16491127 21792903 24161383 23240683 19022721 12343769
4196 12343769 5982033 2430182 534171 -2780663 -7059343 -7658133 -1811376 6951673
4188 6951673 12034010 10224626 4140177 -725943 -992682 1704986 2804862 262742
4180 262742 -3261637 -4658971 -4772174 -6280512 -8970255 -10137861 -8635634 -5636384 -2253817
4171 -2253817 1075975 4098567 7964669 14844106 23576526 28592931 26717604 21693607
4163 21693607 17833996 13726175 8028530 6123718 12553844 21737954 26807933 33130847
4155 33130847 49608048 70367554 83026316 94356263 124296455 166654392 179872132
4148 179872132 135409425 59132020 3286695 -12264584 -9111483 -8801714 -9061239 -2906658
4140 -2906658 3507905 2558886 -1731546 -3208532 -5066159 -12212141 -20677730 -23409250
4132 -23409250 -20410651 -16039479 -11711974 -7462119 -5622309 -7230697 -9315961 -10489668
4124 -10489668 -14137687 -21249263 -25741642 -22879093 -17313934 -16018549 -17291219 -14233972
4116 -14233972 -6710816 -2285960 -5494676 -12250157 -15870741 -14596439 -12147286 -13100928
4108 -13100928 -17823367 -20966644 -16578169 -5850990 2886412 3559188 -1576031 -7165637
4100 -7165637 -11470691 -14201186 -12481614 -5109282 1880818 567244 -8440408 -16295367
4092 -16295367 -16509594 -10506603 -2746561 4474077 10127231 12769794 12131642 10087025
4084 10087025 8512984 7569791 6544337 4955513 2869422 1534962 3071044 7689733
4076 7689733 11947021 11800934 6794444 -501882 -7654327 -12278343 -10472014 279382
4068 279382 16177164 28605960 31919331 27767280 21271799 15298829 9481797 3011226
4060 3011226 -3122014 -6511283 -6050623 -4346196 -5787652 -10904978 -14512668 -11740706
4052 -11740706 -4316948 1902791 4137233 3965453 2625200 -546908 -4780191 -7128970
4044 -7128970 -6221635 -3541963 -86065 4903450 10656133 13773732 12419846 8943291
4036 8943291 6437377 5227794 4708866 5773811 8415117 9132462 4613837 -2707945 -6482009
4027 -6482009 -4367873 -1140324 -2536252 -8240918 -12964836 -13115662 -9852976 -5674649
4019 -5674649 -834326 5146222 10283526 11327964 7979592 3355619 -216647 -3378209
4011 -3378209 -6803585 -8922395 -8639413 -8006063 -9333520 -11097560 -9736978 -4715450 1231742
4002 1231742 6518998 12143264 18179451 21769694 20197714 14488831 8608410 5496691
3994 5496691 4337431 1705598 -4068703 -9573738 -8942304 -890858 8586687 12382211
3986 12382211 9729132 5538652 3797033 4153872 4081151 1863378 -2097841 -5152592 -4463291
3977 -4463291 -504031 3402064 6342770 11132689 17848264 20670422 15944493 9019762
3969 9019762 6514284 5639736 -315101 -8794877 -11082646 -8148809 -11190639 -23301305
3961 -23301305 -32456058 -28949694 -19556534 -16024534 -17878722 -16624207 -10969781 -6933954
3953 -6933954 -6117328 -4513278 -1890981 -2600869 -6484424 -7507609 -3031557 2731160 6340950
3944 6340950 9726068 14799994 19082993 19539151 16553078 11751424 5625013 -539158
3936 -539158 -3824600 -3177154 -1308097 -1363344 -3553958 -5866607 -6050982 -2767664 2586875
3927 2586875 5198640 1247183 -6544073 -11026441 -8954272 -4087292 -1558765 -2824250
3919 -2824250 -7119153 -13807917 -20955368 -24602722 -22303943 -16069770 -10198975 -7264458
3911 -7264458 -6918037 -7193466 -6408269 -4859763 -4312189 -4598764 -2420505 3792281 9670736
3902 9670736 9628869 4590084 300469 -1106550 -2116930 -2783589 96771 5026258 4352374
3893 4352374 -5250390 -16602134 -20873326 -17983203 -13646775 -10455998 -7235268 -4010399
3885 -4010399 -2139456 -1403118 -1308921 -3194088 -7014155 -8576706 -4455183 2612523 7676335
3876 7676335 10395785 13002248 14241968 11643895 8042505 8750885 12514180 12342118 6349739
3867 6349739 1028235 1498757 4520050 4365441 602504 -3771955 -7834182 -11946689 -14204978
3858 -14204978 -12284056 -7863555 -5477636 -6832192 -8720281 -6970507 -1043067 5524232
3850 5524232 8476920 6617233 2473828 -899198 -3227532 -6141343 -9688154 -11705799
3842 -11705799 -10842330 -8232312 -5403036 -2033933 3183999 10184325 16519350 18488066
3834 18488066 14022544 5525880 -1202879 -2747048 -1967390 -3904092 -8689610 -11668951
3826 -11668951 -10350762 -7588009 -6963247 -8310107 -9241676 -8201541 -4335948 2804400
3818 2804400 11150679 16012254 14754346 10236678 7399049 7503357 7580668 4460348 -2285504
3809 -2285504 -10042593 -14154414 -11193040 -3875498 -1002073 -8622434 -21464283 -27094114
3801 -27094114 -19820156 -7144663 -350765 -1696481 -4485777 -3945942 -2759007 -4688517
3793 -4688517 -7702249 -7485813 -5012185 -5309026 -9110349 -11059843 -7660256 -2295292 226756
3784 226756 -44593 -736997 -2042808 -4528223 -5212665 -1344700 3876870 5116110 3178574
3775 3178574 3352498 6100875 6297302 2524297 143887 2848867 7461670 10066781 11326844
3766 11326844 12066496 9420069 2281092 -4199304 -5044654 -2788386 -3074042 -6085500 -7962233
3757 -7962233 -8253854 -9952019 -13249189 -14693396 -12387081 -8036485 -4420666 -3930839 -7704055
3748 -7704055 -12530350 -11319950 -1608016 8863558 10926734 6284110 4198227 7368633
3740 7368633 9441884 7100839 5685860 9419040 13582650 11554384 4317785 -2308032
3732 -2308032 -6079689 -8774367 -10788437 -10262115 -6599139 -1232717 4506825 9801754
3724 9801754 13559429 15259927 15600717 14916368 12532029 8893821 6128813 5027687 4058592
3715 4058592 3049088 4531243 8721837 10661634 6602323 790761 814904 7254973 13193420
3706 13193420 14161164 13223074 14399767 15953710 14058911 10102980 9351457 12790371 15008401
3697 15008401 11994629 7423201 7604703 12080333 13957255 9929141 5086588 5284172
3689 5284172 8908761 10350037 8502236 6394053 4170383 -1065040 -8175012 -11196634
3681 -11196634 -7678357 -2429875 -290382 -51692 1175948 2214422 755546 -1520074
3673 -1520074 -1354160 1144461 4211419 8605128 15480179 22048540 24233185 22552420
3665 22552420 20900859 20388687 18798880 15395525 11654569 7573687 1926676 -3851103
3657 -3851103 -6944634 -8825038 -14410026 -23951793 -30738668 -29732213 -24480850 -21822646
3649 -21822646 -22568758 -21665174 -16471650 -10760083 -9470664 -11969670 -12660085 -8103841 -1636117
3640 -1636117 856897 -1103618 -2125220 596011 2366946 -2022246 -9663687 -13219924
3632 -13219924 -11701448 -11307623 -15086544 -18046585 -14973456 -7870583 -2110382 827542
3624 827542 2846317 4394888 4259640 2519955 205686 -2837285 -6750606 -9375431 -8015627
3615 -8015627 -2886239 3367241 8609296 11586459 10918845 6781910 2800050 3027709 6958212
3606 6958212 10191159 10199993 8802114 8492181 9125577 9533962 10126276 11804961 13503861
3597 13503861 13020136 10164808 7187131 5432598 3208767 -1442300 -6855550 -9194977
3589 -9194977 -8041873 -7483792 -9875891 -11611951 -8696790 -4240716 -5001620 -10634355 -12318325
3580 -12318325 -4374661 7509536 13044365 8895889 107230 -6960307 -9204691 -6710180
3572 -6710180 -2437770 -753489 -2589578 -3242442 1552821 8885572 12158130 10237176
3564 10237176 8500679 10975796 15957818 19766672 20393752 16604808 7969871 -2331722
3556 -2331722 -8316586 -6868411 -224660 7810525 14673283 17423645 13223608 4081139
3548 4081139 -2921138 -3529700 -1395549 -2061208 -5054799 -5962536 -3777886 -1485317 -729713
3539 -729713 -517121 -699927 -2439411 -4989361 -5762950 -4170297 -2301165 -1467267 -1161692
3530 -1161692 -1764480 -4889051 -10198542 -15055423 -18289307 -20937515 -21913109 -16944100 -5020505
3521 -5020505 6787767 9058043 235397 -11480063 -16440382 -12073165 -3541687 2248043
3513 2248043 2965756 1933965 2984593 4879169 2909221 -3653492 -9028280 -8163153 -3616085
3504 -3616085 -1446513 -2122030 -406125 5798902 11480173 11128240 5580952 -26465 -2339982
3495 -2339982 -1533558 503615 1036866 -2533743 -9607106 -15322763 -15085539 -9479574 -2802449
3486 -2802449 2035970 4861738 5854462 4883275 2783281 696157 -1385572 -3067686 -1835242
3477 -1835242 3635339 9459860 10370916 7438800 6852133 10244441 12129979 9155192 5389522
3468 5389522 3963388 -284179 -12478172 -26171435 -29269446 -20554218 -11365130 -9570965
3460 -9570965 -10511364 -7232610 -1597719 737011 209914 706117 923000 -3362190 -9868147
3451 -9868147 -10875780 -4607764 1631260 1959465 -704695 -1090125 259206 158811 -49559
3442 -49559 3455360 9692524 13442780 12717569 10553749 9056003 6738969 3192236 1485099
3433 1485099 3098596 4431318 2156478 -791519 889347 6441215 9338546 6176503
3425 6176503 872404 -1433606 -944446 -1111282 -2597108 -2806761 -705160 1115396 156803
3416 156803 -2089266 -1725516 2288181 6054507 5329676 1705522 1581110 7233419 11322795
3407 11322795 4505209 -11558094 -23512678 -20839648 -7292139 5369581 11453302 14003057
3399 14003057 15640054 13944351 7560612 963145 -751566 1650691 4096880 5697931
3391 5697931 8395587 11494720 11231835 6315353 253953 -3114791 -3785746 -3981372 -4708898
3382 -4708898 -5688366 -7124732 -9623365 -12990064 -16393092 -19200059 -20884334 -21008620 -20103105
3373 -20103105 -19290793 -17916236 -13253204 -4775274 2572784 2613108 -4482979 -12004000 -14920175
3364 -14920175 -14941334 -15327084 -14023222 -6286086 6970404 18161526 21514146 19043412
3356 19043412 16157523 14286630 10925529 5233696 -185772 -3245487 -5123867 -8010961
3348 -8010961 -12155579 -16339817 -19652681 -21401560 -20620331 -17492884 -14571508 -14661133 -17462713
3339 -17462713 -19814022 -19382348 -16650704 -13037504 -8923819 -4582591 -1426426 -527844
3331 -527844 -750373 -257190 532054 -407472 -3003818 -4372516 -2745125 26520 1557703
3322 1557703 2668965 5443835 8568914 8043867 3287622 -496935 1644030 7568367
3314 7568367 9930140 4823122 -3782352 -9077940 -9060264 -7418759 -7755084 -9341921 -9191915
3305 -9191915 -6210638 -1535201 3929684 9778700 14120791 14123657 9734960 4961640 3982134
3296 3982134 7226257 12293941 16980950 19868007 19770105 16873924 13179912 9713440 4840690
3287 4840690 -2024012 -6815915 -4872342 2062249 7109708 6852492 4633325 4519221 6171916
3278 6171916 7364021 7743853 7799812 7213434 6483752 7328152 9420893 9791447 7546798
3269 7546798 5630397 5295045 2953747 -3569377 -9506781 -9052984 -4042605 -1038927 -1641718
3260 -1641718 -1918792 -747420 -2049121 -7524602 -12856543 -13485829 -10042300 -5829105 -2323176
3251 -2323176 537505 2149287 1534976 -1350768 -5316098 -7806181 -5942682 -149769
3243 -149769 4345647 3245167 -293059 731105 7074680 11783228 9778935 3984773
3235 3984773 124021 9533 2258504 5455942 8000275 8452331 8372615 11112393 15618459
3226 15618459 15806289 9098338 1303166 -812082 1824912 3334599 1027602 -3284322
3218 -3284322 -7146111 -8407197 -5049869 1527618 5508171 3459685 -108279 1235992
3210 1235992 6250385 7708334 2620964 -4331582 -7370927 -5277349 -490962 3723231
3202 3723231 5116971 4177903 3376783 2739079 -1347449 -9833712 -16811306 -16311266 -10549520
3193 -10549520 -6093332 -4475213 -2744771 -726368 -125940 1946798 9835835 19720329
3185 19720329 22044565 14912363 6307864 832034 -6281163 -17682557 -25650231 -22142317
3177 -22142317 -10347351 918983 8853460 15250268 18188913 14103959 6341396 3349149
3169 3349149 7714328 13009039 12480529 6335774 -376446 -3514817 -2921306 -2431950 -6596754
3160 -6596754 -14986819 -20779695 -17849426 -8141656 1063071 5881180 8048639 9318243
3152 9318243 8186946 3180331 -3801105 -8897266 -9634118 -6601052 -3002747 -2109247 -3908638
3143 -3908638 -5103790 -3439850 -308977 2380162 5404954 9697276 12867240 11609822
3135 11609822 6149977 -681727 -7120449 -12099426 -13426287 -10564545 -7648739 -9000122
3127 -9000122 -12556491 -12661757 -8863468 -6482816 -7971733 -9366597 -7264972 -4403716
3119 -4403716 -5230051 -9309006 -12249866 -11107288 -6362601 20437 6395955 11807690
3111 11807690 15588949 16651775 14125524 9802541 8072787 10701218 13303278 10742333
3103 10742333 4677210 958579 350028 -1983714 -6937260 -8274021 -2351593 4462107
3095 4462107 2951212 -7504561 -18794953 -23160629 -19087318 -10496215 -3607722 -2871850
3087 -2871850 -6779756 -8962722 -5709949 -314734 2431297 3049042 4842242 7061907
3079 7061907 5742371 780875 -2573953 -164296 6444333 12516296 14667981 12423857
3071 12423857 8091892 5983938 9131119 15119609 16932442 9988995 -1990652 -9586182
3063 -9586182 -6645150 3833391 13250607 16342317 15248040 14688272 15816663 16987807
3055 16987807 18040800 19606056 19297207 13773570 5060837 -371276 -256461 914836
3047 914836 -65013 -368093 2217767 3835192 898852 -3134011 -3477546 -2296091 -4208548
3038 -4208548 -6776913 -3553686 4922436 11245188 12028309 11065986 11187791 10561665 8518842
3029 8518842 7760314 8471731 6950678 2827656 1233070 4428528 7300894 5233512 1239388
3020 1239388 928233 4771085 9474037 12957001 14030289 11258274 6294159 4308061
3012 4308061 6774304 7916123 3021900 -3895789 -6207370 -4478060 -3835878 -4830690 -4062422
3003 -4062422 -1674137 -555880 916106 7397499 17184909 21725063 16717973 7828276
2995 7828276 2828098 2908397 4312727 4365592 3026744 1473490 1522079 4398609 8778901
2986 8778901 11871647 12600604 11538454 8761287 5408788 6090605 14334075 25704889
2978 25704889 31362901 29240388 25483169 23648852 20073223 13080209 8707224 11223408
2970 11223408 14399934 9983019 693928 -3470762 168639 4144736 2471782 -2024847
2962 -2024847 -3418981 -333219 3867499 4730656 -433842 -10018192 -17906356 -18924478
2954 -18924478 -14610166 -10596580 -9126885 -8182447 -7063765 -7274218 -7438814 -3348779 4835381
2945 4835381 10712931 9967116 6148619 4820427 5923871 5992776 4729050 4596835 5551968
2936 5551968 4745557 1311676 -1825787 -1195412 3998583 11334338 16370723 15749926 10997593
2927 10997593 7708708 8862708 10840754 8811157 3967475 1313021 1260052 -1700746
2919 -1700746 -10945721 -22133469 -27591921 -24109496 -15145254 -7253640 -5243005 -8712211
2911 -8712211 -11982580 -9047323 137518 9389623 12865982 10286023 5115566 5506
2903 5506 -4246868 -7150251 -8415427 -8652616 -8223357 -6034019 -1521781 2522177 1656862
2894 1656862 -4701506 -11168291 -11371576 -4544282 4040948 8937463 9323090 7471152 4288660
2885 4288660 -1186178 -7997123 -11989534 -10343425 -5718027 -3288356 -4300043 -5136557
2877 -5136557 -2613996 2558345 7989776 12392288 15016614 14938403 12617401 10079665 7898865
2868 7898865 4202517 -1336114 -4911197 -2864699 3200322 8670441 11769376 13658272
2860 13658272 14025415 11086749 5985123 2787558 3235763 5473600 8866877 15325196
2852 15325196 23673675 27625805 23438319 16065127 12947107 14070051 13342020 8436777
2844 8436777 3558367 2266885 3102373 3959298 5929008 9941545 13308385 13097898 10495554
2835 10495554 8381609 6450693 2550534 -2104574 -3237639 461100 5220710 7610167
2827 7610167 9063541 12454987 16180690 15253592 8375519 838040 -1121470 3058821
2819 3058821 9019562 13192160 15088053 14690282 11173596 5376030 654105 -799179
2811 -799179 -508446 -588356 -242410 1785154 3218671 758440 -4049091 -5654003 -1701857
2802 -1701857 4343244 8471146 10041934 9184351 4804869 -1895885 -5567843 -2258349
2794 -2258349 5296932 11273686 13731123 14639932 14949463 13861301 12071532 11454016 11496247
2785 11496247 9819135 6603686 4961000 6173061 7900410 8248347 8481342 9978907
2777 9978907 11162986 9911801 7573015 8021132 12646922 17891102 18836046 15161233 12199052
2768 12199052 14415313 18577598 16731547 6904906 -3163101 -5764560 -2815642 -1257259
2760 -1257259 -2253508 -1439283 1566038 1331316 -4587428 -11299716 -13200792 -10050881 -4760284
2751 -4760284 -55322 990244 -3430842 -9307663 -9255862 -2368857 3701260 3522358 738873
2742 738873 152711 -454989 -4451653 -7914151 -4809983 2905158 8057337 8836672 9238191
2733 9238191 10590306 10164893 7672410 6107302 6025822 5253537 4113881 4487964 3823834
2724 3823834 -2688763 -13024113 -18528769 -15185399 -8319402 -3972975 -1864673 443513
2716 443513 2512504 3667905 5458495 7826063 7297800 2488576 -2634463 -4258714 -3720287
2707 -3720287 -3998077 -4999284 -5276694 -4747217 -2992640 1248783 6332483 7838002 5221416
2698 5221416 3497281 5105067 5509510 1006671 -4721104 -7097104 -8251851 -11667396
2690 -11667396 -14056933 -10399440 -3763938 -1782595 -4943301 -6327432 -2495214 2736491
2682 2736491 5575132 6496942 6468066 5047878 3276825 3095372 3193495 575577 -3497454
2673 -3497454 -4727902 -3284142 -3976591 -8045051 -11197420 -11556909 -13061854 -18078876 -22476534
2664 -22476534 -21730042 -17257262 -13140450 -10594163 -8978828 -8523489 -8816080 -7972889 -6021446
2655 -6021446 -5497347 -6321570 -4647645 120300 2310969 -1526416 -5881712 -3800239 2574539
2646 2574539 5542688 3515841 2155555 4707104 7990237 8693328 7780040 7130626 6736951
2637 6736951 7051300 9688179 13425619 13291281 6663166 -2188843 -6397492 -3612505 3370310
2628 3370310 11115929 17646680 21002489 19174046 12476020 4116001 -2633329 -6756876
2620 -6756876 -8519055 -7905126 -5610171 -4302425 -6333637 -10172243 -11598142 -9128445
2612 -9128445 -5788548 -4418520 -4149071 -3506011 -3735010 -5696307 -6483836 -3753279 -884399
2603 -884399 -1945598 -3425675 1355140 9832198 11332671 3231627 -3201934 1388633
2595 1388633 10706590 12466623 5662855 -876093 -3077997 -4699748 -7382617 -7715955
2587 -7715955 -5199089 -4262284 -5936282 -5162145 308166 4984481 3701830 -795419 -2809442
2578 -2809442 -2002201 -2143653 -4635333 -7808980 -10819926 -14255444 -17620072 -18935221 -16399038
2569 -16399038 -9328355 837527 9368411 10720356 4311678 -4071551 -8267076 -7078135
2561 -7078135 -2638104 2986310 7150414 6209634 -326075 -7354511 -9594971 -7863614
2553 -7863614 -6642902 -7276395 -7607557 -7101927 -7805164 -10275850 -12578665 -13871920 -15604688
2544 -15604688 -18342042 -20209836 -19287980 -15271943 -8510929 -74149 6752193 8013589
2536 8013589 3608407 -1626656 -2569245 1586264 7480525 10429941 6885852 -3438991
2528 -3438991 -16433167 -25680516 -26588848 -18481085 -4253310 9960487 16684748 13083509
2520 13083509 5240641 2354031 5992890 9460368 8580482 7145245 8777486 9817060
2512 9817060 6130979 2030456 4374010 10172422 9082739 -1058681 -9654812 -7501935
2504 -7501935 1343513 6506377 4833429 1335879 85774 445078 1229199 3060955 5904506
2495 5904506 7968467 7870285 5602277 1584437 -2855605 -4806034 -2601357 1115122 2386109
2486 2386109 1736631 3374229 8369144 12460547 11610471 6216106 -1205115 -8547800 -12663549
2477 -12663549 -9793658 -821834 7124904 8201966 4959914 4468785 9138199 15027347
2469 15027347 17860338 16774962 12770116 7362274 3079591 2186373 4290903 7054503
2461 7054503 8791762 8591929 5625068 1339547 295325 4335448 7461595 2332246
2453 2332246 -8414281 -13943658 -9595510 -2561041 -326826 -558515 2238776 6196401
2445 6196401 6050759 4140201 8512208 19994105 28874484 26904174 17181038 9121609
2437 9121609 7390879 8939457 8775574 5861586 3759484 6363207 12665569 16802319
2429 16802319 15210513 12113238 13938833 19136840 19328868 12013104 5896680 9411290
2421 9411290 18824737 23728823 21316314 18089217 17946862 15929737 6271151 -8774682
2413 -8774682 -21797627 -28350070 -28669247 -24363310 -17848796 -13429923 -14069864 -16960117
2405 -16960117 -16410092 -11936890 -9463544 -12532193 -15953059 -11783454 93294 11053289
2397 11053289 13285190 7462098 493801 -1988632 100529 2895735 3075455 1105678
2389 1105678 336745 2696254 6086674 7265327 6403941 6498622 8389259 9190597 6726454
2380 6726454 3074932 1873556 3722684 6093932 6563800 4365306 -80616 -4968616
2372 -4968616 -6996303 -3703047 3687558 11030260 15059297 15688691 14970433 14965238 16533899
2363 16533899 19144118 21564884 22967137 23045516 21213493 17021826 11834061 8385842
2355 8385842 7557485 7171566 5391764 3643706 4299878 6990392 9437966 10685838 11089865
2346 11089865 10263415 7820419 5506980 5878616 9138239 13423019 17318075 19627962
2338 19627962 18059019 11667301 3884828 -574076 -1388385 -1591342 -1712862 442588 4605836
2329 4605836 8059222 11175670 16897779 23426852 24175937 17943803 12525115 13605227
2321 13605227 15831071 10763530 -761411 -10573414 -14136640 -13084828 -9312233 -3457883
2313 -3457883 1798100 3442454 3209354 5674149 11321951 16201792 17876144 16754392
2305 16754392 12337404 3888567 -5241077 -9697971 -8947531 -6748539 -3970552 1907095
2297 1907095 9817440 14475405 14078187 12060624 9782222 4797422 -1469961 -2614111
2289 -2614111 2231721 4738239 -454005 -7404991 -9037282 -8161780 -10106349 -10996946 -4116177
2280 -4116177 6012298 7661473 -627692 -7478401 -5162330 864122 2021245 -1809908
2272 -1809908 -5073157 -4933243 -2350854 1245588 4568333 6344470 6870072 7256591 6243530
2263 6243530 1447826 -5039008 -6672854 -361506 9250741 15673954 17464948 17023457
2255 17023457 15811945 13635764 10512215 6913431 3543048 1875349 3007560 5594178
2247 5594178 7419255 8939626 11953973 15134110 15465505 14187401 15648966 19377389
2239 19377389 19793360 15831754 13662517 16214092 17286666 11592959 4158448 2824741
2231 2824741 6669314 9528526 10724771 13713790 16869850 14662014 7208843 615747
2223 615747 -2066762 -2860454 -2085431 2496327 8794992 10265562 4883306 -1929848 -5235706
2214 -5235706 -5683128 -5209907 -3766254 -2186505 -2308672 -2342575 1558430 7070356 6256010
2205 6256010 -2384226 -9779778 -8861824 -4275402 -3532928 -4813242 -1359865 6174783 9998879
2196 9998879 5982527 -2548354 -10471223 -14426123 -12314837 -5438410 -138953 -1242717
2188 -1242717 -4468323 -1426636 8061804 15031734 13475023 7242644 3295578 3738321
2180 3738321 6793793 10459937 12155703 9126076 2748531 -870172 1984875 7560718
2172 7560718 9816974 8056694 5741529 3925059 560622 -4172646 -6553573 -4741477
2164 -4741477 -2083350 -2592480 -5220542 -5665911 -3293788 -2942963 -8440665 -16636670 -20458879
2155 -20458879 -16973112 -9696781 -3168489 1566320 5190737 7094320 6373089 3845267
2147 3845267 973973 -1658833 -3249588 -2417966 -56878 38788 -3648665 -6979733 -5701954
2138 -5701954 -2304820 -2777620 -7841104 -12449534 -13447058 -12232717 -9563634 -3867831 3321605
2129 3321605 6191654 2711509 -628020 3181765 11842436 16818603 14749082 10993379
2121 10993379 11666158 16105163 18758826 16340271 11429866 9498643 13035542 18674492
2113 18674492 20430969 15959627 9007338 5334401 6928101 10795477 12874192 12244222
2105 12244222 11037414 10232781 6872100 -2103235 -13047505 -16564608 -8394945 3600756
2097 3600756 8063920 4031031 506676 2742462 5958444 4585403 763382 -810509
2089 -810509 -1088178 -3741941 -7193006 -5832081 1633096 10058895 14206683 13603559 11262484
2080 11262484 10839889 14852294 22426332 28533760 28226037 22085077 15377937 11807746
2072 11807746 10308042 8088224 4530102 1362866 510372 2415986 5676981 8085777
2064 8085777 8384466 6849100 4459092 2608014 3089748 6038637 8053033 5693901 1345177
2055 1345177 1468596 7675759 14235557 16577459 16618161 16069262 11072008 -61116 -9493836
2046 -9493836 -9107523 -3535676 -4138878 -11678396 -15594459 -10963181 -5291285 -5590777 -8854236
2037 -8854236 -10112803 -10839042 -12992388 -12414981 -5835551 1094626 469503 -7047875 -14926683
2028 -14926683 -20538616 -24943310 -26134924 -20978339 -13018303 -10583120 -16077177 -22750146
2020 -22750146 -22879464 -14799112 -2179527 8837330 12157397 6567486 -1756148 -6100007
2012 -6100007 -8018615 -14040249 -24268283 -31039970 -29930048 -25328043 -22742111 -21765111
2004 -21765111 -19909241 -17780348 -16245054 -12938115 -6059153 1709547 7117400 11180367
1996 11180367 16213520 20795527 21677476 18512829 13250581 7339361 2970616 3932905
1988 3932905 10712007 17433299 18628923 16557385 16284690 16150725 10560182 1241666 -2850318
1979 -2850318 1450171 6486037 5310426 1580786 3063887 10385156 17680283 20709451
1971 20709451 18842533 11953056 1398306 -7423702 -9366632 -6152007 -3806910 -3834783
1963 -3834783 -2238514 2281050 5057342 2799188 -504877 1460110 9359565 18272323
1955 18272323 23496931 23430409 18690803 11741870 6403360 4630222 3955250 469792 -5843421
1946 -5843421 -10838432 -11071143 -6888012 -735717 5424506 10548273 14201011 16671305
1938 16671305 18330317 18519582 16154357 11612586 6788575 3002106 67497 -2342555
1930 -2342555 -3822837 -4210790 -4164386 -4288347 -4917566 -6994376 -11271681 -15813135 -16361879
1921 -16361879 -10909607 -2487849 4215136 7510482 8131968 6058712 1322726 -3035389
1913 -3035389 -3061411 520895 2776377 1911982 2002281 5799930 8896328 5546872 -2186658
1904 -2186658 -6387118 -3503278 2550037 7514874 11445536 14795512 15355347 12326994
1896 12326994 9200831 8690650 8070807 3637201 -2955267 -7226266 -8381614 -8464569 -7089459
1887 -7089459 -2815255 1321012 107634 -5618421 -9230986 -7907143 -5725349 -5372688
1879 -5372688 -3528411 2045747 7303054 8790837 10016196 14563380 17464340 11277412
1871 11277412 -1660190 -11052226 -12078023 -9468579 -7720306 -4969502 784224 5934312
1863 5934312 6107399 2677112 375370 965941 2624902 3665619 3843409 3149264 1811397
1854 1811397 935481 1448169 2687927 2862498 596673 -3782685 -7511153 -6706645 -515583
1845 -515583 6443603 8243818 4201544 -1070464 -3641344 -3268051 -1018740 2030819 3511045
1836 3511045 1593624 -989950 706127 6139991 8769036 5287299 422148 -272000
1828 -272000 2585883 5956184 10027648 15237608 18025249 15447311 10974103 9834105
1820 9834105 11094922 10425920 8576300 10285460 15744917 20096221 21617572 23769870
1812 23769870 27975268 30560460 28928558 25506850 23194007 21241654 17760565 12377733
1804 12377733 4807239 -4872556 -12782970 -12980802 -5366101 2557981 4865793 3837605
1796 3837605 3958685 3945653 -19236 -6309768 -9146715 -6765360 -3069121 -1219395 -32672
1787 -32672 2642660 6598117 10359036 13054101 14397160 14684845 15062382 15945750 15182331
1778 15182331 9905948 676585 -7862358 -10861221 -6731280 2766718 13911221 22305175
1770 22305175 24773097 21230141 14304417 6911008 397285 -5511959 -11543198 -17002642
1762 -17002642 -18827814 -14248170 -5416529 952293 942019 -1425934 528920 7198965
1754 7198965 12804452 13586757 11377557 8910453 6707616 6222418 10896209 20577270 28727509
1745 28727509 29374698 24184944 18554437 13412660 6279578 -1171739 -3120034 2122727
1737 2122727 9456973 14194005 16670752 17512034 13984196 5286042 -3049286 -5418664
1729 -5418664 -3782789 -3466849 -3840036 51805 7473426 11082968 7401010 1503692 -1404544
1720 -1404544 -2990780 -6439859 -9489262 -8265007 -4500451 -3144095 -4774745 -5759604
1712 -5759604 -4633638 -2964359 -515497 4794058 11357302 13393426 7960980 -1090770
1704 -1090770 -7852865 -10025970 -8484961 -4414693 863616 5314326 7507469 7436188 5227167
1695 5227167 778846 -4454622 -7264569 -5656508 -1018517 3205986 4078514 924149
1687 924149 -3550032 -4513308 -112944 5012094 4545686 -1261570 -5950932 -5725596 -3421167
1678 -3421167 -2480770 -2058010 -695461 -65580 -1193269 -827583 3910226 10020352 12163663
1669 12163663 9504514 4864338 -528518 -6423755 -9517503 -6072094 1315391 4906769
1661 4906769 1054442 -5829105 -9710162 -9567565 -8051569 -6934668 -6253827 -5996105 -6562831
1652 -6562831 -8187613 -10490151 -12008769 -10956813 -8117192 -7739022 -12418355 -17589281
1644 -17589281 -15138298 -3498898 9467343 15427484 14247827 11316470 9000123 4550499
1636 4550499 -4120258 -13965736 -19439550 -18380485 -14114569 -11664350 -12461079 -13595471
1628 -13595471 -12348124 -10042833 -10137799 -13453998 -17102887 -17851845 -14953210 -9926969 -5276608
1619 -5276608 -3290620 -4285961 -5817502 -5034869 -1746443 2173452 5699878 8827689 10351425
1610 10351425 8454746 4205388 1918022 4577115 10219352 13760381 11582803 4365266
1602 4365266 -3279732 -6177749 -3305373 918230 1510022 -1615181 -4985023 -7017604
1594 -7017604 -8786358 -10068263 -8886074 -5541882 -3075393 -2614097 -2089845 -722139 -429959
1585 -429959 -904511 2040362 10001588 17881514 20112583 17706955 15010639 12527474 8021093
1576 8021093 2779698 1357212 5449787 12271705 18497150 21809296 19566888 11135196
1568 11135196 1680527 -1777717 465005 470123 -6329256 -14374851 -15468497 -9176846 -1612012
1559 -1612012 3411067 6981038 9899468 10161550 6951416 3337490 2495334 3206569 1471457
1550 1471457 -4201001 -10936955 -14601109 -13319981 -8109115 -1492767 4114345 7631664
1542 7631664 9388458 9715364 8162769 5376182 4798871 9585842 17311338 21040893 17604125
1533 17604125 11819162 9578111 9544216 6090418 -1290149 -6960674 -7440818 -5294115 -3545663
1524 -3545663 -1435370 1917363 4299316 4217284 4279968 7072603 10369994 10073475 5919325
1515 5919325 1162015 -1521051 -1100290 2529879 7470634 10378821 10837013 12149240 14780126
1506 14780126 13305941 4854142 -3626947 -3630746 2068077 3109797 -2841761 -7235326 -4844783
1497 -4844783 -2114006 -7327612 -19153363 -29643940 -33544524 -30133489 -20448415 -7948221
1489 -7948221 1160093 3249863 1245511 -105954 -474873 -1959275 -3645545 -2608858
1481 -2608858 1297149 5628465 8983502 10930496 10012039 5816686 1736526 1536036 4008539
1472 4008539 4907577 3199424 1135880 -968246 -4738639 -8128482 -5291643 5550298
1464 5550298 17873739 23081871 18719177 9108989 630212 -1970219 2365208 9725834
1456 9725834 13609126 11056224 5655411 3041630 4768499 8159731 10511530 11021391
1448 11021391 9505871 6030967 2287710 1374535 4945267 10958890 14895102 13519032
1440 13519032 7717167 1517054 -2032517 -3572470 -5310506 -7096360 -6624311 -3414085
1432 -3414085 33258 1964509 3618849 5919226 6382415 2335001 -4158417 -7903306
1424 -7903306 -6724687 -2937862 1169253 5710544 10187964 11827916 9256916 5098751
1416 5098751 2101581 -1098750 -6812924 -12377789 -11968317 -4876962 2030279 2082774 -3674870
1407 -3674870 -8796362 -9050714 -5318424 -622679 2702295 3362033 1233302 -2473892 -6474290
1398 -6474290 -10304329 -12665022 -10550910 -3135184 4323421 4712899 -1789262 -6693762
1390 -6693762 -3488270 4300172 8246234 5456731 -120434 -5126656 -10544858 -17419983
1382 -17419983 -23097734 -24103131 -20554806 -15604883 -11748060 -9318895 -7629056 -5949366
1374 -5949366 -3873542 -2007315 -1854462 -3779280 -5540409 -4519709 -1596263 -1020147 -5206241
1365 -5206241 -10786968 -11823686 -7010318 -1697336 -1630320 -6296221 -10488725 -11370645 -10936711
1356 -10936711 -11333822 -11331708 -9354902 -6997672 -6343812 -5849517 -2939116 165426 -2161616
1347 -2161616 -10870423 -19626767 -22157945 -18872242 -13922557 -9022790 -3701668 645594
1339 645594 1423477 -877305 -2739629 -2205466 -396194 1680024 4473322 7134214 6657692
1330 6657692 1709380 -4840357 -8931663 -9116463 -6063934 -663966 5223468 8292085
1322 8292085 7115374 4854082 5722307 9417816 12014660 11976303 11819501 13228953 13933934
1313 13933934 11206344 6029429 1730141 111439 897796 3712939 8383753 13686005
1305 13686005 17519337 18449657 16395124 12428822 8762181 7935102 10478008 13700835
1297 13700835 14158185 11370571 8201344 7518042 9128485 10119454 8065623 3955217 1371585
1288 1371585 1917372 2473089 -649581 -5318909 -5173389 1164991 6727475 5384959 1010489
1279 1010489 2620543 12087979 21908881 24897123 21034556 13973052 5795953 -2324097
1271 -2324097 -7858862 -8398793 -4078918 2670000 8399340 9921564 7274568 5446601
1263 5446601 9184611 15341564 15147381 6085856 -3476267 -4980365 -562514 1357137
1255 1357137 -2137215 -6559192 -7743729 -5740522 -1776715 3337518 7511175 8514637
1247 8514637 7351360 6893514 7247290 6411697 5267111 6873429 9881691 7945264 -1642331
1238 -1642331 -12813511 -17482733 -14565274 -9195988 -5464199 -3488131 -2205619 -1265646
1230 -1265646 16423 2949916 7900826 13607928 18329517 20952454 21029890 18312617 12382508
1221 12382508 3112117 -7751691 -15986755 -17768115 -13724275 -8655422 -6593416 -7561312
1213 -7561312 -9602136 -11708235 -13193348 -12144137 -7087622 352641 6628099 10178494
1205 10178494 12537295 15270750 17423476 17091635 14742553 13431996 15150967 17897590
1197 17897590 17732499 13674100 8955004 6727576 6130667 4050422 -459325 -5305207
1189 -5305207 -8019204 -7528501 -4244847 -467722 329619 -2758279 -5769710 -4191087 1121384
1180 1121384 5723391 8574106 12554446 17511849 18282905 12323540 4773479 2119496
1172 2119496 4136024 6234001 7080633 8799495 10695141 8110215 -1102779 -12268389
1164 -12268389 -17957436 -15196730 -7885439 -2766578 -3196974 -6592716 -8258038 -7126160
1156 -7126160 -5773079 -4943176 -1731257 4913323 10423635 9962217 5336894 2605779 3993566
1147 3993566 6144342 5873829 3703162 1409959 -408342 -1558023 -1884525 -2337197 -3786748
1138 -3786748 -4327874 -764908 6120557 10654017 8587020 2514080 -1055565 792964
1130 792964 4430623 4250184 -610900 -4669842 -1861106 7086225 14523814 14093865 7402041
1121 7402041 891840 -1957252 -2505735 -2586209 -2250061 -1879459 -2743026 -4289935 -3795080
1112 -3795080 -160512 4020413 5449951 3629104 679423 -740926 1076687 5700885
1104 5700885 10368388 12518059 12501420 12013359 10494011 6033263 -283828 -4546882 -5285244
1095 -5285244 -4902679 -4484073 -1108699 6887302 15027163 16735126 10959465 2882135 -2146942
1086 -2146942 -2936106 -1346360 576987 1795871 1903495 452914 -2840226 -6804417 -8716980
1077 -8716980 -7280362 -5122587 -5819662 -8507979 -8517326 -3981078 1407151 3433083 1948467
1068 1948467 -1197681 -5468816 -10413880 -13886196 -14227081 -12110062 -7936646 -26963
1060 -26963 11597759 21926284 25060848 20536479 12967504 6968512 5010763 8103260
1052 8103260 14698207 19876914 19240695 13472229 6638397 1016847 -3670060 -7195154
1044 -7195154 -8372533 -7008295 -3451461 2703482 10286007 14257768 9921743 -710446
1036 -710446 -10224291 -13279294 -9795622 -2000354 7160559 13107659 12393037 7593120 5233717
1027 5233717 7561238 10202502 9075559 5380187 2009438 -749950 -3259089 -3696404
1019 -3696404 -357648 5205984 9698922 11290705 10139599 7735759 6568308 7926077
1011 7926077 9360299 7497275 4031214 4694259 10725679 16121647 16071343 13363570 12607705
1002 12607705 12702073 10321734 7320594 8342980 12921570 16113749 16171200 15629395 14962498
993 14962498 11379488 5064454 788040 950566 1872747 -35861 -2463891 -1001071 4392818
984 4392818 10415814 15527568 20001047 22378336 20351997 15333891 12280912 13623193
976 13623193 16133935 15599825 12530034 10905921 12345660 14112566 13049780 9263292
968 9263292 5006973 1768794 71837 904506 5131716 11602187 17572620 21152743 21991494
959 21991494 19844100 14510536 7516944 1791007 -1206353 -2559295 -3782740 -5547112
951 -5547112 -8700641 -13649297 -17625999 -15898467 -8090761 -496316 1074677 -1361592
943 -1361592 -1320467 2999328 6932625 6142862 1336026 -3916065 -6521411 -4618867 1505396
934 1505396 8151139 10747322 8867646 6273919 5111645 3000946 -2503948 -9276871
926 -9276871 -12874517 -11879009 -8817932 -6644061 -6049333 -5789070 -4377196 -1600487 1161597
917 1161597 2461403 2433265 2003753 1093087 -480024 -751905 2781591 8726847 12037358
908 12037358 10119318 5857877 2741387 6757 -4516248 -9360135 -11151350 -10012161
900 -10012161 -9117164 -9196944 -7574884 -3368240 193321 429231 -911482 -1004408 -973221
891 -973221 -4179790 -10113465 -13398612 -10139341 -3150416 1078608 -144996 -3126267 -2666014
882 -2666014 2191640 7981415 10853282 9381876 4369947 -2181879 -7936081 -11627103
874 -11627103 -13868482 -15458591 -15221771 -11418403 -5438836 -1776582 -3154230 -7318487
866 -7318487 -9927853 -9304705 -7175237 -6019590 -6960540 -9110178 -9834416 -6956180 -1917186
857 -1917186 824611 -796866 -3186659 -1292060 5229774 12324258 16743840 18167622
849 18167622 17194907 14828308 13886759 17040715 22181358 23036683 16469213 6792769 701518
840 701518 6859 2005564 5226897 10860816 18224443 22557606 19902353 12703218 7768790
831 7768790 8374105 10580046 8800904 3509150 871146 4759171 11820914 15818012 14661390
822 14661390 10895116 6789735 2178411 -2907389 -6442342 -6404023 -2937554 2148873 6698165
813 6698165 8886809 8447909 7487083 7998433 8340136 5045225 -995781 -3794919 -191925
804 -191925 4696779 3834737 -1935559 -4959873 -883360 6931434 13277000 16487628 16466904
795 16466904 12240907 4902196 -405887 465016 5456912 9535673 11251605 12392072
787 12392072 13160573 12692682 13137984 17065350 20556557 15911825 3665637 -5099050 -3103249
778 -3103249 2669131 1486873 -5217952 -7190423 -1710758 3567338 4069727 3984763 5668415
769 5668415 3693101 -4494864 -10557981 -6274583 3439256 7817278 6574639 8644941
761 8644941 15929329 18995074 11231961 -1317333 -8179808 -6294468 79297 5878029
753 5878029 7418161 2427419 -7243931 -15309381 -17248419 -15168726 -13811587 -13893745 -12438268
744 -12438268 -8098767 -3278134 -1700459 -5385058 -12620180 -17973372 -16743345 -10698277
736 -10698277 -6380758 -6060785 -4312196 3303127 11983152 12891794 4399637 -6741149
728 -6741149 -14227189 -17333752 -17457886 -14393541 -7719011 768330 7396125 8533944 2848635
719 2848635 -6736025 -14422145 -16922415 -16350799 -15948455 -15232477 -12581580 -10378536 -12750278
710 -12750278 -18685284 -21934259 -18327321 -9771063 -833253 5236496 7115568 5821397
702 5821397 4958169 7123698 9775433 8088418 1915994 -4039931 -7131731 -9323391 -12103598
693 -12103598 -13578273 -12275254 -9720043 -7516887 -5579642 -4430181 -5063451 -5554186 -2930925
684 -2930925 247834 -2428212 -10283126 -13448199 -6565763 2152680 2500604 -2668556 -2748417
675 -2748417 3753756 7685473 4111922 -976873 -1117135 1562768 1891650 395497 1371518
666 1371518 5356459 8014466 5575730 -1203420 -7933446 -10249915 -7536016 -3610457
658 -3610457 -2618397 -4317545 -5097803 -3269023 -846305 -31489 -600504 -1230308 -873006
649 -873006 1700847 7104640 13301643 16798505 16771864 15951849 16869631 19371633 22030848
640 22030848 23305120 20957443 13611174 4001891 -2344065 -3094976 -1155009 273752
632 273752 1346488 2675247 2445080 -617563 -4031906 -4547114 -2699648 -1642698 -2790141
623 -2790141 -5039078 -6946067 -7336736 -5204225 -1514195 255790 -1865499 -4909653 -4590659
614 -4590659 -1719723 -1693831 -7178152 -14095470 -16157618 -11779552 -5221740 -1442379 -755918
605 -755918 867311 6077738 11929020 13260812 9711128 6188269 5656076 5216449 1637903
596 1637903 -2845333 -4089411 -2802142 -3040651 -5270140 -5969628 -4123753 -3054613 -4366893
587 -4366893 -4416992 563577 8668481 14298054 14207492 9468364 2990105 -2460175 -4529069
578 -4529069 -2174405 2804861 6149926 4185285 -2897855 -10743860 -14531902 -13578813 -11710662
569 -11710662 -12558688 -15595778 -17843700 -17942183 -16369538 -12760402 -6154227 1857135 7199255
560 7199255 7899201 6730836 7835350 11723294 14713180 12851143 5926667 -2093616 -6770042
551 -6770042 -7561895 -7497574 -8039308 -6770567 -2489596 117468 -4383275 -13177239 -16744754
542 -16744754 -10482156 107884 7742238 11850439 15295400 17071140 13721429 6146376
534 6146376 -203202 -1932338 -820700 -200535 -1263098 -3177409 -4227767 -2586704 1697244
525 1697244 5375101 5054780 1812927 310304 2780451 6294980 6946144 4582106 2023985
516 2023985 1271243 2103808 3348074 3812382 2350591 -1436517 -6050408 -8327030 -5612118
507 -5612118 1834921 10577323 16554040 18214632 17035471 15251796 14013923 13690669 14201260
498 14201260 14072566 10949692 4962829 294794 761058 4218688 4265020 -1806184 -9246472
489 -9246472 -11485091 -7685357 -2815185 -1307724 -2881101 -4674278 -5535698 -6877189 -9861791
480 -9861791 -13139948 -14085678 -11808096 -8011031 -4772998 -2458239 -417102 1199815 1645209
471 1645209 1373961 2224152 5145511 8469296 9320968 6808492 3291290 2094280 4128598
462 4128598 7302009 9218137 9430781 8552566 6641324 4149904 3417391 6693479 12770974
453 12770974 18006328 20791968 22322429 22748908 20268554 15380474 12133073 12519012 13036354
444 13036354 10105208 5838050 4545704 6318930 8651690 11792563 16666075 19238773
436 19238773 13999890 3239769 -4036561 -3955176 -2012693 -3175802 -4552145 -2158477
428 -2158477 927293 -830706 -6407384 -9916686 -9273927 -7595760 -7126767 -7074878 -7349270
419 -7349270 -9721912 -14396822 -18768057 -20364905 -18757101 -14693278 -9772651 -6558999
411 -6558999 -6457993 -7895496 -8887542 -10153547 -12492152 -12538544 -5964751 4888626 11344774
402 11344774 7907705 -2161075 -12017797 -18035001 -19576203 -16292628 -9423207 -3321409
394 -3321409 -1774194 -3623392 -4764734 -3607393 -1959454 -1259349 -817982 61886 630560
385 630560 71831 -1229268 -2442136 -3216638 -3391431 -2747461 -1646765 -1281378 -2604098
376 -2604098 -5074684 -6768602 -5868003 -2197186 2497471 5621947 5146297 618884 -6111715
367 -6111715 -11044329 -10511897 -5010932 273705 542243 -3293174 -6038576 -4702872 -1363281
358 -1363281 761381 1620021 3278881 6279709 8928352 9621137 8576390 7427570 7643487
349 7643487 8961845 9315195 7222546 4265506 3741916 6491004 9604254 9811513 6523154
340 6523154 1075187 -4790185 -8667836 -8280354 -4484398 -1421867 -1535373 -2497375 -1628088
331 -1628088 -1032322 -4484283 -10633223 -14027905 -13023414 -12081449 -14814239 -18726322 -19185491
322 -19185491 -15523154 -10409857 -5398910 -77219 5663929 11252939 16605042 21390378
314 21390378 23861295 22751060 19830028 18094015 17561913 15456504 10856223 6464955
306 6464955 4730667 4657295 4128483 3329425 3563693 4073047 2832855 145810 -1261701
297 -1261701 -170540 1454941 1636920 1093577 1293389 1582407 366463 -1841266 -2817503
$$ [...]
##END NTUPLES=NMR SPECTRUM
##END=
