##TITLE=31Pdec_DE-136_2
, 64 sc
 26.3.2026
##JCAMPDX= 6.0         $$ Bruker NMR JCAMP-DX V2.0
##DATA TYPE= NMR SPECTRUM
##DATA CLASS= NTUPLES
##ORIGIN= UXNMR, Bruker Analytische Messtechnik GmbH
##OWNER= root
$$ XWIN-NMR		Version 3.5
$$ Thu Mar 26 13:28:48 2026 Russian Standard Time (UT+4h)  she@DPX200
##.OBSERVE FREQUENCY= 81.013821
##.OBSERVE NUCLEUS= ^31P
##.ACQUISITION MODE= SIMULTANEOUS
##.ACQUISITION SCHEME= undefined
##.AVERAGES= 64
##.DIGITISER RES= 17
##SPECTROMETER/DATA SYSTEM= spect
##.PULSE SEQUENCE= zgpg30
##.SOLVENT NAME= CDCl3
##.SHIFT REFERENCE= (INTERNAL, CDCl3, 0, 197.392)
##AUDIT TRAIL= $$ (NUMBER, WHEN, WHO, WHERE, WHAT)
$$ ##TITLE= Audit trail, XWIN-NMR		Version 3.5
$$ ##JCAMPDX= 5.01
$$ ##ORIGIN= Bruker BioSpin GmbH
$$ ##OWNER= she
$$ F:/spectra/data/she/nmr/P31/2/pdata/1/auditp.txt
$$ ##AUDIT TRAIL=  $$ (NUMBER, WHEN, WHO, WHERE, WHAT)
(   1,<2026-03-26 13:27:46.48 +0400>,<she>,<DPX200>,
      <continue with go, POWCHK disabled, PULCHK disabled
       configuration hash MD5:
       00 E9 B6 7A A2 85 ED C7 34 08 36 98 17 FE 4E 26
       data hash MD5: 32K
       0C CD 1C C4 15 43 B3 CE B3 8F E1 FE 2A 2E FE C6>)
(   2,<2026-03-26 13:27:49.26 +0400>,<she>,<DPX200>,
      <Start of raw data processing
       efp BC_mod = 2 LB = 1.5 FT_mod = 6 PKNL = 1 PHC0 = 1395.554 PHC1 = 93.90066 SI = 64K 
       data hash MD5: 64K
       EC 98 87 6E 62 28 10 A9 BE E2 59 AB 27 0F 48 0A>)
(   3,<2026-03-26 13:28:11.39 +0400>,<she>,<DPX200>,
      <pk PHC0 = -9.817225 PHC1 = 0 
       data hash MD5: 64K
       27 50 EA A8 81 A9 BE 4F 4F 16 9E 19 DC 6F D5 F0>)
$$ ##END=
$$ 
$$ hash MD5
$$ 56 B8 FF 3E 0C 29 20 16 47 04 74 7D D7 DD B6 CE
##$RELAX= 
##$RELAX= 
##$RELAX= 
##$RELAX= 
##$RELAX= 
##$RELAX= 
##$RELAX= 
##$RELAX= 
$$ Bruker specific parameters
$$ --------------------------
##$DU= <F:/spectra>
##$EXPNO= 2
##$NAME= <P31>
##$PROCNO= 1
##$TYPE= <nmr>
##$USER= <she>
##$AMP= (0..31)
100 100 100 100 100 100 100 100 100 100 100 100 100 100 100 100 100 100 
100 100 100 100 100 100 100 100 100 100 100 100 100 100 
##$AQSEQ= 0
##$AQ_mod= 1
##$AUNM= <au_zg>
##$AUTOPOS= <>
##$BF1= 81.014009
##$BF2= 200.13
##$BF3= 200.13
##$BF4= 200.13
##$BF5= 200.13
##$BF6= 200.13
##$BF7= 200.13
##$BF8= 200.13
##$BYTORDA= 1
##$CFDGTYP= 0
##$CFRGTYP= 5
##$CHEMSTR= <none>
##$CNST= (0..31)
1 1 145 1 1 1 1 1 1 1 1 1 1 1 1 1 1 1 1 1 1 1 1 1 1 1 1 1 1 1 1 1 
##$CPDPRG= <waltz16>
##$CPDPRG1= <>
##$CPDPRG2= <waltz16>
##$CPDPRG3= <>
##$CPDPRG4= <mlev>
##$CPDPRG5= <mlev>
##$CPDPRG6= <mlev>
##$CPDPRG7= <mlev>
##$CPDPRG8= <mlev>
##$CPDPRGB= <>
##$CPDPRGT= <>
##$D= (0..31)
0 1 0 0 0 0 0 0 0 0.06 0 0.03 2e-05 3e-06 0 0 0.0002 0 0 0 0 0 0 0 0 0 
0 0 0 0 0 0 
##$DATE= 1774517173
##$DBL= (0..7)
120 120 120 11 120 120 24 19 
##$DBP= (0..7)
150 150 150 150 150 150 150 150 
##$DBP07= 0
##$DBPNAM0= <>
##$DBPNAM1= <>
##$DBPNAM2= <>
##$DBPNAM3= <>
##$DBPNAM4= <>
##$DBPNAM5= <>
##$DBPNAM6= <>
##$DBPNAM7= <>
##$DBPOAL= (0..7)
0.5 0.5 0.5 0.5 0.5 0.5 0.5 0.5 
##$DBPOFFS= (0..7)
$$ [...]
##$SUBNAM3= <"">
##$SUBNAM4= <"">
##$SUBNAM5= <"">
##$SUBNAM6= <"">
##$SUBNAM7= <"">
##$SUBNAM8= <"">
##$SUBNAM9= <"">
##$SW= 400.765351723535
##$SWIBOX= (0..15)
0 1 3 0 0 0 0 0 0 0 0 0 0 0 0 0 
##$SW_h= 32467.5324675325
##$TD= 32768
##$TD0= 1
##$TE= 0
##$TE2= 300
##$TE3= 300
##$TEG= 300
##$TL= (0..7)
0 120 53 12 22 120 120 120 
##$TP= (0..7)
150 150 150 150 150 150 150 150 
##$TP07= 0
##$TPNAME0= <>
##$TPNAME1= <>
##$TPNAME2= <>
##$TPNAME3= <>
##$TPNAME4= <>
##$TPNAME5= <>
##$TPNAME6= <>
##$TPNAME7= <>
##$TPOAL= (0..7)
0.5 0.5 0.5 0.5 0.5 0.5 0.5 0.5 
##$TPOFFS= (0..7)
0 0 0 0 0 0 0 0 
##$TUNHIN= 0
##$TUNHOUT= 0
##$TUNXOUT= 0
##$USERA1= <user>
##$USERA2= <user>
##$USERA3= <user>
##$USERA4= <user>
##$USERA5= <user>
##$V9= 5
##$VALIST= <valist>
##$VCLIST= <CCCCCCCCCCCCCCC>
##$VD= 0
##$VDLIST= <DDDDDDDDDDDDDDD>
##$VPLIST= <PPPPPPPPPPPPPPP>
##$VTLIST= <TTTTTTTTTTTTTTT>
##$WBST= 1024
##$WBSW= 4
##$XGAIN= (0..3)
0 0 0 0 
##$XL= 0
##$YL= 0
##$YMAX_a= 10246
##$YMIN_a= -19429
##$ZGOPTNS= <>
##$ZL1= 120
##$ZL2= 120
##$ZL3= 120
##$ZL4= 120
##$ABSF1= 0
##$ABSF2= 0
##$ABSG= 0
##$ABSL= 0
##$ALPHA= 0
##$AQORDER= 0
##$ASSFAC= 0
##$ASSFACI= 0
##$ASSFACX= 0
##$ASSWID= 0
##$AUNMP= <proc_1d>
##$AZFE= 0.1
##$AZFW= 0.5
##$BCFW= 0
##$BC_mod= 2
##$BYTORDP= 0
##$COROFFS= 0
##$CY= -3
##$DATMOD= 1
##$DC= 0
##$DFILT= <>
##$DTYPP= 0
##$F1P= 0
##$F2P= 0
##$FCOR= 1
##$FTSIZE= 65536
##$FT_mod= 6
##$GAMMA= 0
##$GB= 0
##$INTBC= 1
##$INTSCL= 9.790993e-09
##$ISEN= 30
##$LB= 1.5
##$LEV0= 0
##$LPBIN= 0
##$MAXI= 10000
##$MC2= 0
##$MEAN= 0
##$ME_mod= 0
##$MI= 50
##$NCOEF= 0
##$NC_proc= -8
##$NLEV= 6
##$NOISF1= 182.463
##$NOISF2= 159.3651
##$NSP= 0
##$NTH_PI= 0
##$NZP= 0
##$OFFSET= 197.3918
##$PC= 4
##$PHC0= 1385.737
##$PHC1= 93.90066
##$PH_mod= 1
##$PKNL= yes
##$PPARMOD= 0
##$PSCAL= 0
##$PSIGN= 0
##$REVERSE= no
##$SF= 81.014063255964
##$SI= 65536
##$SIGF1= 159.3651
##$SIGF2= -187.1042
##$SINO= 113.3802
##$SIOLD= 16384
##$SREGLST= <1H.CDCl3>
##$SSB= 0
##$STSI= 65536
##$STSR= 0
##$SW_p= 32467.5324675325
##$SYMM= 0
##$S_DEV= 0
##$TDeff= 32768
##$TDoff= 0
##$TI= <>
##$TILT= no
##$TM1= 0
##$TM2= 0
##$TOPLEV= 0
##$USERP1= <user>
##$USERP2= <user>
##$USERP3= <user>
##$USERP4= <user>
##$USERP5= <user>
##$WDW= 1
##$XDIM= 65536
##$YMAX_p= 220623355
##$YMIN_p= -201072502
$$ End of Bruker specific parameters
$$ ---------------------------------
##NTUPLES= NMR SPECTRUM
##VAR_NAME=  FREQUENCY,     SPECTRUM/REAL,   SPECTRUM/IMAG
##SYMBOL=    X,             R,               I
##VAR_TYPE=  INDEPENDENT,   DEPENDENT,       DEPENDENT
##VAR_FORM=  AFFN,          ASDF,            ASDF
##VAR_DIM=   65536,         65536,           65536
##UNITS=     HZ,            ARBITRARY UNITS, ARBITRARY UNITS
##FACTOR=    0.49542278885378, 1,            1
##FIRST=     15991.5117654749, 0,            0
##LAST=      -16476.0207020576, 0,           0
##MIN=       -16476.0207020576, -201072502,  0
##MAX=       15991.5117654749, 220623355,    0
$$ Real data points
##PAGE= N=1
##DATA TABLE= (X++(R..R)), XYDATA
$$ [...]
##PAGE= N=2
##DATA TABLE= (X++(I..I)), XYDATA
9483 -1256436 -1365950 -3196479 -4251306 -2430501 1036294 2746840 1423497 -199374
9475 -199374 1208704 5200152 8217571 8235227 6667146 5364758 4038215 1838189 -619780
9466 -619780 -2694004 -5511013 -9973588 -14046677 -14569722 -11366638 -7314033 -4617409 -3202598
9457 -3202598 -2517826 -2508014 -2728570 -2795736 -3778696 -6654063 -9278511 -7973841 -2956728
9448 -2956728 972470 749820 -906559 -86433 2255039 2041583 -1598531 -5222170 -6043851
9439 -6043851 -4958979 -3977761 -3107425 -1187311 1549091 3294636 2822241 899390 -676286
9430 -676286 -1098106 -1251780 -2391122 -4582183 -6853116 -8430379 -9110187 -8769207 -7485782
9421 -7485782 -5977661 -4900676 -3877490 -2317758 -857281 -466286 -404872 903828 2841656
9412 2841656 2826124 352430 -1552312 -276871 3028719 5708975 7308071 8889582 10054532
9403 10054532 9094344 5646743 1290477 -2313775 -4570845 -5720780 -6642054 -8230084
9395 -8230084 -9867149 -9460858 -6328909 -2973936 -2303857 -3945388 -5122364 -4520976 -3408830
9386 -3408830 -3340218 -4511637 -6131249 -6950212 -5885579 -3511883 -2161773 -2953222 -3774687
9377 -3774687 -2329632 -116695 -563402 -3707479 -5920480 -5209393 -3725270 -4087177 -5933852
9368 -5933852 -7469681 -8176361 -8422399 -8144208 -7506499 -7550225 -8714433 -9682593 -8948449
9359 -8948449 -6825159 -4964203 -4471883 -5123070 -5842694 -5594181 -4354451 -3163841 -2504547
9350 -2504547 -1250544 1410570 3833639 3870032 2382384 1985378 2519914 1383127 -1072309
9341 -1072309 -679304 4073558 8643467 8453382 4941064 2004336 -534282 -5190901 -10518875
9332 -10518875 -12037472 -9296731 -7011330 -8175856 -10279237 -9923589 -7613963 -5940691
9324 -5940691 -5832938 -6743315 -8329986 -9871918 -9759212 -7512945 -4965743 -3850413 -3598437
9315 -3598437 -3019561 -2601769 -3323392 -4534006 -5042693 -5302020 -6461207 -7982434 -8240836
9306 -8240836 -7057507 -5734751 -4866898 -3932076 -2855805 -2156579 -1578530 -380106 871773
9297 871773 501617 -2011024 -5513815 -9067161 -12544711 -14983226 -14392363 -10298779 -4951383
9288 -4951383 -855857 1632650 3260910 3932964 3387659 2762573 3637480 5783081 7177230
9279 7177230 6127825 2603451 -1885217 -4745930 -3623537 1074058 5461572 5773317
9271 5773317 2597471 -75931 92515 1599419 2208085 2113460 2879885 4720536 6211058
9262 6211058 5954185 3589270 -161592 -3721339 -5691715 -6302737 -6963205 -7832324 -7169022
9253 -7169022 -4102593 -605219 923188 854312 1004847 937613 -1608270 -6317075 -9126369
9244 -9126369 -6969488 -1857794 1581839 1511532 -35970 -732406 -361305 515441 2088476
9235 2088476 4232800 5349492 4131882 2019944 1938962 4211191 5552455 3325788 -678610
9226 -678610 -2647411 -2103707 -2305918 -5053875 -7813895 -7523332 -5113767 -3875598 -4540092
9217 -4540092 -4725544 -3038832 -1084875 -822462 -2113785 -3812868 -5325463 -5821481 -3707997
9208 -3707997 1210867 6172137 8091624 7207269 6140019 5700422 4007642 174171 -3629801
9199 -3629801 -5281875 -5970738 -8093570 -10897434 -10950859 -7203516 -3090736 -2391454 -4843387
9190 -4843387 -7546748 -9292134 -11189321 -13607535 -15122315 -14997274 -14467271 -14427270 -13659205
9181 -13659205 -10944502 -7617493 -6066175 -6327174 -6132411 -4286019 -2197928 -1642860 -2501221
9172 -2501221 -3514763 -4209381 -5094343 -6533547 -8318646 -10144839 -11788991 -12829198 -12810184
9163 -12810184 -11949179 -11256284 -11422392 -11666195 -10389661 -7356162 -4516771 -3828983 -4802734
9154 -4802734 -5476988 -5467797 -6160010 -7594584 -7451502 -4478561 -1036006 -226836 -1776985
9145 -1776985 -2968123 -2768445 -2601753 -3401389 -4356990 -4673663 -4378124 -3238179 -1105391
9136 -1105391 495359 -319258 -2294579 -1619785 2695234 6556343 5749472 1107247 -3322776
9127 -3322776 -5388473 -5619302 -4419365 -1682226 1023490 788503 -3270719 -8666677 -12169659
9118 -12169659 -12538570 -10340652 -6492158 -1838257 2476654 4931176 4173556 291467
9110 291467 -4049282 -4901361 -985703 4217562 6081307 4325919 2918500 4326860 6315349
9101 6315349 5681546 2991431 1313935 1458331 1239726 -552486 -2169967 -1976621 -1353168
9092 -1353168 -2631254 -5455990 -7529184 -8417612 -9967727 -12530837 -13473744 -10953445 -7032163
9083 -7032163 -4884564 -4479806 -3634605 -2243881 -2228169 -3474534 -3368904 -1315403 -437312
9074 -437312 -2856354 -5935411 -5804008 -2790486 -491062 -519537 -1164018 -988750 -878399
9065 -878399 -1820164 -2841980 -2343426 -285104 1876430 2773286 2119794 624516 -788686
9056 -788686 -1939473 -3403087 -5177734 -5921202 -4460500 -1705363 83196 -106302 -1162985
9047 -1162985 -1576122 -1046825 -271753 7976 -431053 -1045148 -890091 122023 662310
9038 662310 -345460 -1805068 -1570584 403095 1480399 -462800 -4371165 -7327727 -7738774
9029 -7738774 -6349668 -4660808 -3385884 -2507223 -2072972 -2452027 -3913268 -6224025 -8714975
9020 -8714975 -10536136 -10791494 -8967416 -5868787 -3710711 -4076982 -5667148 -5430121 -2549559
9011 -2549559 40364 -784956 -4329314 -6985843 -6401387 -3271974 441052 3368967 4901275
9002 4901275 5166340 5296715 6545949 8620257 9667472 8347136 5417326 3030885 2761382
8993 2761382 4306682 5850851 5762895 3955781 1274644 -1994899 -5755048 -8459248 -8085206
8984 -8085206 -5613281 -5178706 -8897187 -13467362 -14269176 -11234560 -7873198 -5785530 -3562419
8975 -3562419 -670915 1113826 678455 -837543 -2029333 -2496903 -1939773 -501622 -121733
8966 -121733 -2656305 -6336899 -7266465 -5060921 -3536523 -4662624 -5538166 -3360658 27210
8957 27210 1207936 -20175 -1805285 -3756629 -6090066 -7145793 -5191801 -1668856 354219
8948 354219 191180 -616579 -1514904 -3073308 -4430510 -3568097 -298628 3345568 5861107
8939 5861107 7398155 8071595 7149426 4403603 1001015 -1181806 -571353 2941229 6929578
8930 6929578 7901787 5301575 2477160 1863858 1295726 -2057711 -6177897 -6797817 -4375107
8921 -4375107 -3491883 -5129369 -4835889 -305820 4183110 4106751 1560560 1637203 4516616
8912 4516616 5822078 3805213 1569156 1681411 2527149 1685074 78141 362522 2632425
8903 2632425 4159175 3233986 1430688 1478015 3943554 6754790 7443992 5175427 950388
8894 950388 -3295660 -5843184 -6379640 -6348710 -7378037 -9103601 -9464490 -7578853 -5201070
8885 -5201070 -4465878 -5250784 -6026584 -6459282 -7528659 -9430973 -11043124 -11578326 -11371749
8876 -11371749 -10746065 -9281596 -6612330 -3099610 536320 3600148 5482561 6096071
8868 6096071 6130204 6130349 5653577 4224705 2601670 1854797 1643897 855890 -443995 -1360784
8858 -1360784 -2093128 -3442159 -4483661 -3195676 -13551 1620441 -559662 -4829511
8850 -4829511 -8032529 -9018413 -8076283 -5020460 -245996 3541663 3430328 156776 -2204371
8841 -2204371 -862090 2724548 4835722 3373288 -516099 -3715505 -3635417 -241869 3766944
8832 3766944 5055967 2371074 -2612051 -6898079 -8490112 -7487153 -5502320 -4230105
8824 -4230105 -4337562 -5304010 -5953333 -5211652 -2958129 -479737 457939 -459812 -1546928
8815 -1546928 -1051402 954485 3309486 5514392 7513779 8474427 7522668 5497537 4276604
8806 4276604 4322748 4464147 4034236 3407728 2393413 274401 -2135601 -2783740 -1576635
8797 -1576635 -1065085 -2784935 -5061112 -5863080 -5701768 -5878768 -5875576 -4800286 -3874208
8788 -3874208 -4896827 -7163715 -8290614 -7445227 -5623998 -3506435 -1431076 -897674 -3368138
8779 -3368138 -7564566 -10480819 -11375906 -12378065 -14602100 -16057784 -14486037 -10382733
8771 -10382733 -6010938 -2884565 -1322002 -1116819 -1382594 -767117 910444 1919147 583338
8762 583338 -2532053 -5288225 -6292186 -5669518 -4076994 -2154372 -933283 -1654139 -4521643
8753 -4521643 -8005094 -9979425 -9770258 -8866901 -9275115 -11119645 -12274528 -10669261 -6688144
8744 -6688144 -2914911 -1668312 -3086287 -5377282 -6499926 -5699315 -3855428 -2524923
8736 -2524923 -2642867 -4122228 -6309163 -8301041 -9173089 -8833894 -8490448 -9079454 -9376399
8727 -9376399 -7393206 -3886019 -2208825 -3653195 -5316741 -4444569 -2615462 -2854077 -4323648
8718 -4323648 -3460788 270640 3444734 3759949 2664232 2026345 1303195 -492825 -2542564
8709 -2542564 -3659054 -4036170 -4050357 -3171861 -1609491 -1197398 -2844244 -4686076 -4639886
8700 -4639886 -3311163 -2349363 -1403187 693399 2637047 1549952 -2673968 -6405557 -6486891
8691 -6486891 -3782001 -1743186 -2523276 -5154253 -6951476 -6402758 -4922005 -5328842 -8092252
8682 -8092252 -10101492 -8511808 -4917525 -3600657 -5827349 -8222055 -7370813 -3864645
8674 -3864645 -631000 849816 967500 62804 -1672123 -2868914 -1795469 1049863 2793461
8665 2793461 1497274 -1430464 -3050296 -2392014 -1088116 -866463 -1599855 -2080094 -1765153
8656 -1765153 -1099617 -588571 -217648 385376 1637089 3523273 4942765 4082291 486719
8647 486719 -3491229 -4698053 -2954812 -1491228 -2934358 -6191500 -8437301 -8929175 -9077298
8638 -9077298 -9525742 -9471720 -8962296 -9535038 -11660499 -13521813 -13810670 -14144977 -16650677
8629 -16650677 -20055438 -20616845 -16987000 -11953843 -8710708 -7403852 -6606809 -6436291 -8079013
8620 -8079013 -10973529 -12718955 -12010213 -9900637 -7673623 -5214545 -2571120 -1611028 -4189962
8611 -4189962 -9027153 -12147822 -10866680 -6294615 -1551337 1478327 2987625 3782734
8603 3782734 4147826 4036253 3415757 2091467 -224857 -3220043 -5730878 -6787600 -6799032
8594 -6799032 -7011824 -7605297 -7111143 -4455722 -1095487 2725 -2302960 -5862734 -7464683
8585 -7464683 -5865635 -2291582 1177885 2916458 2085660 -1092877 -5124459 -7900735
8577 -7900735 -8002527 -5511683 -1820745 1308604 2969857 3643124 4144485 4123561 2574846
8568 2574846 131900 -522262 2276639 6525518 8380553 6336584 2428407 -480600
8560 -480600 -1423077 -1414419 -1902842 -3255170 -4117292 -2511002 1739407 6176295 8177407
8551 8177407 7592009 5894045 3809348 1598012 730779 2544188 5179693 4652315 -66675
8542 -66675 -5209987 -6619090 -4255997 -1254100 -153234 -1331737 -3785058 -6163213 -7903330
8533 -7903330 -9891395 -12743670 -14344696 -11490616 -4834048 581889 1442973 162617
8525 162617 496742 1955524 2021711 1699435 4143752 8297863 8733333 3109005 -3915962
8516 -3915962 -6231416 -3214453 881397 2578829 2008748 1049456 672041 281828 -1240162
8507 -1240162 -4114052 -7227187 -9214999 -9593893 -8444801 -5864277 -2767379 -1204518
8499 -1204518 -2089055 -3323637 -2402577 -424974 -772542 -3705543 -5470603 -3822744 -1317153
8490 -1317153 -1208848 -2824892 -3683796 -4116514 -6418276 -10311000 -12592855 -11533079 -8958653
8481 -8958653 -7262691 -6451600 -5243910 -3600937 -2801082 -3562161 -5104843 -6138285 -6377334
8472 -6377334 -6790389 -8107484 -9367206 -8925471 -7167019 -6827583 -9469261 -12711401 -12661630
8463 -12661630 -8629700 -3731139 -1025084 -862697 -2090370 -3703024 -4444948 -2709561
8455 -2709561 1502827 5528615 6530790 4649408 2487458 1869394 2372405 2846508 2933845
8446 2933845 2731054 2120559 1173511 593440 1090382 2541517 4065243 4644584 3648158
8437 3648158 1439659 -255209 460184 3304171 5458144 4715728 2405736 1621214 2742151
8428 2742151 2695623 -735252 -5768613 -9067518 -9760997 -9224056 -7993711 -5309168 -1566670
8419 -1566670 1058456 1120678 -503479 -2170246 -3359831 -4450048 -5733020 -7143787 -7948754
8410 -7948754 -6624346 -2648062 1339005 1409288 -2524066 -5715637 -4521209 -1218570 -359961
8401 -359961 -2103123 -2717309 -965559 163852 -1138847 -2223782 -202398 3395750 4880734
8392 4880734 3463936 1280885 -367484 -1725592 -2071775 132946 3863253 5192551
8384 5192551 2031180 -2712942 -4637367 -3241791 -1701963 -1929727 -2334649 -979851 1172711
8375 1172711 1699983 348301 -538821 787822 3266479 4595422 4091192 2982712 2160679
8366 2160679 788052 -2291909 -6361650 -8949797 -8342579 -5475415 -2927420 -2226371 -2571605
8357 -2571605 -2267985 -1006665 -308730 -1699965 -4809495 -7635373 -8670868 -8382496 -8362355
8348 -8362355 -9398568 -10927203 -12172865 -12911008 -12806972 -11012435 -7432832 -3901707 -2805234
8339 -2805234 -4380060 -6397731 -6854281 -6024516 -5385442 -5531940 -6050276 -6666546 -7301059
8330 -7301059 -7323145 -6035609 -4013744 -2839526 -3050811 -3175224 -1417826 2162684 5690394
8321 5690394 7327229 6569007 4042314 909214 -1290592 -1096247 1468432 3946372 3133406
8312 3133406 -1364569 -5960150 -6753220 -4109865 -2066298 -3047191 -5017035 -4699074 -1747934
8303 -1747934 1894437 5250225 8556442 11007594 10879413 8171253 5015095 2925225
8295 2925225 1430030 -55235 -924050 -880974 -1051358 -2355157 -4016240 -4784746 -4479132
8286 -4479132 -3299831 -980450 1982000 3487131 2064887 -639033 -1295722 1365434
8278 1365434 5471764 8316391 8516026 6220766 2580197 -923770 -3551797 -5659389
8270 -5659389 -7423906 -7975662 -6812624 -5119596 -4057386 -2505886 1326023 6248223
8262 6248223 8431646 5937073 884663 -3600494 -6590133 -8428232 -8620451 -6523271
8254 -6523271 -3030383 157596 2267011 3078263 1775007 -1904645 -5820990 -6925195
8246 -6925195 -4988086 -3095537 -3756659 -6013225 -7324572 -6930720 -5907812 -4797585 -3025754
8237 -3025754 -605390 1287998 2016678 2459100 3417700 4056616 3096840 930529 -812891
8228 -812891 -1551266 -2147897 -2942374 -2981587 -1869286 -937323 -1421456 -2514181 -2576165 -1520822
8218 -1520822 -489633 293556 1547359 2957435 3203672 2460512 2876011 5324717 7283370
8209 7283370 5791528 1687400 -1140598 -614775 1396471 2364499 2710014 4644061 8295411
8200 8295411 10784163 9431144 4808860 120277 -1781312 -333956 3051377 6399362
8192 6399362 8389174 8829541 8177502 6624425 4043155 1011792 -927005 -956261 -477885
8183 -477885 -1636774 -4321258 -6012873 -5163082 -3434432 -3504294 -5502905 -7028010 -6450561
8174 -6450561 -4858991 -4407244 -5717809 -7513372 -8201916 -7067908 -4158573 3593 4123438
8165 4123438 6349767 5971421 4769717 5234867 6974483 6586376 2360485 -2638089 -4488894
8156 -4488894 -4126526 -5800346 -10071203 -12299810 -9379972 -4262687 -1333341 -433127 1106932
8147 1106932 2789620 1578338 -2590052 -6031103 -6512262 -5956259 -7043060 -9693089 -11978706
8138 -11978706 -12520545 -11014446 -7991408 -4849976 -2880328 -1903228 -1051297 -623390 -1382527
8129 -1382527 -2333881 -1614182 254955 586950 -1439198 -3547334 -4011159 -3928467 -4642587
8120 -4642587 -5422993 -5312289 -4997475 -5001526 -4058286 -1349156 1348592 1865363 599517
8111 599517 -711487 -1817847 -3433431 -5045050 -5493676 -5011312 -4697795 -4623136 -4281299
8102 -4281299 -4225026 -5307850 -6771939 -6926155 -5477889 -3703149 -2652920 -2476256 -2951242
8093 -2951242 -3434557 -3053388 -2216528 -2870761 -5711480 -8312264 -7912672 -5004934 -2131385
8084 -2131385 -269838 1155782 1723362 517365 -1162950 -704995 1841951 3381917 2040611
8075 2040611 -401812 -1035485 1057064 4627580 7417194 7223548 3690765 -697471 -3174506
8066 -3174506 -4138833 -5903654 -8282045 -8465529 -5871528 -3906142 -5331201 -8396677 -9426469
8057 -9426469 -7363516 -4054820 -1641776 -1276006 -3037718 -5621351 -7166367 -7398493 -7671818
8048 -7671818 -8242868 -7480058 -4859141 -2535404 -2336488 -3306769 -4164507 -6006194 -9869826
8039 -9869826 -13256684 -12336035 -7089681 -1473644 1375118 1614762 535414 -1280246 -2909676
8030 -2909676 -2583002 226374 3303852 3524467 -98964 -5588336 -9788275 -10767208 -8919735
8021 -8919735 -6104221 -3885438 -2839529 -3169584 -4820574 -6691267 -7074566 -5747822 -4567192
8012 -4567192 -5093462 -6746164 -8306811 -9872898 -11787734 -12850686 -11616039 -8837066
8004 -8837066 -6682313 -5907292 -5625766 -5473180 -5885819 -6291191 -5275643 -3096078 -2085210
7995 -2085210 -3655109 -6373328 -7969738 -8063654 -7845790 -7916874 -7665720 -6634395 -5607849
7986 -5607849 -5904851 -7657479 -9241290 -9079987 -7968456 -8487644 -11542681 -14587846 -14276792
7977 -14276792 -10009884 -3924360 1489937 4480348 4062432 969955 -2127152 -3216683
7969 -3216683 -3102484 -3242076 -2670579 274859 4136382 5652825 4651817 3937127 4013822
7960 4013822 2133815 -2116830 -4695371 -3162978 -885211 -1462763 -2288452 1341127 7497571
7951 7497571 8677198 1902314 -7145489 -11637188 -11227188 -9870600 -9336334 -8326205 -6415001
7942 -6415001 -5258518 -5655979 -5897144 -4035363 -573261 1981837 1681407 -1292670 -5225370
7933 -5225370 -8385279 -9798523 -8940330 -5463556 84938 5484482 7845117 6140719
7925 6140719 2371484 -458623 -1293761 -1272952 -1325476 -816154 884075 2672801 2900865
7916 2900865 1832450 1424855 2494507 3510154 2816138 847325 -778547 -1396147 -1455304
7907 -1455304 -1378907 -1479077 -2347231 -4004078 -5202982 -4945903 -4086065 -3818414 -3299956
7898 -3299956 -1025424 1818194 2289873 469134 188008 3497767 7174718 7004813 3351245
7889 3351245 -261032 -2396805 -4322236 -6357804 -7250282 -7336134 -8931337 -12463799 -14965312
7880 -14965312 -13997907 -10947163 -8608108 -7248320 -5306445 -2927103 -2213423 -3877834
7872 -3877834 -5793441 -5794231 -4582893 -4583387 -6352091 -7397432 -5135277 -541688 2048058
7863 2048058 -703909 -7332232 -12822886 -13652530 -10774064 -7384084 -4931892 -2561719
7855 -2561719 121482 1632832 594022 -2253822 -5235710 -8070154 -11483262 -14927767
7847 -14927767 -16598931 -16052693 -14901412 -13952053 -11546829 -6569515 -1669026 -883527 -4405455
7838 -4405455 -8215352 -9164997 -8062596 -7114974 -6775438 -6420850 -5995384 -5205802 -2835728
7829 -2835728 1032817 3420225 1441130 -3718915 -7925133 -8835108 -7645183 -6541731
7821 -6541731 -6543761 -7785535 -9736310 -10745192 -9263370 -6079468 -3785955 -3680577 -4831929
7812 -4831929 -6384338 -8544189 -10514275 -9922382 -6065401 -1880253 -531297 -1273799 -1033773
7803 -1033773 670301 1059141 -1474846 -4738445 -5664568 -4194124 -2755252 -2800257 -3455484
7794 -3455484 -3438741 -2887340 -2758448 -3281810 -3776159 -3644081 -2823788 -1359730 695281
7785 695281 2703110 3430167 2190239 -258965 -2429894 -3614562 -4361487 -5532616 -7110814
7776 -7110814 -7914921 -6582056 -3176818 325372 1908098 1928971 2643195 4939998 6787912
7767 6787912 5832116 2456557 -965987 -3001969 -3932837 -4372882 -4841210 -6317766 -9362425
7758 -9362425 -12574463 -13515315 -11436718 -7869437 -4561700 -2262362 -1399182 -2062043 -2940479
7749 -2940479 -2083993 549187 2698405 2529962 464749 -2041957 -3950501 -4442542 -3119733
7740 -3119733 -1155358 -452734 -764965 434288 4004576 7020884 6345852 2805453 -81599
7731 -81599 -367368 1236933 3554875 6067996 8135652 8917606 8310454 7012495 5766143
7722 5766143 5112264 5303503 5796223 5513266 4099340 1965926 -1107845 -5617384 -9914220
7713 -9914220 -10508405 -6410411 -1135899 1495598 1535533 812895 -808337 -3815895 -5707364
7704 -5707364 -3490610 1201409 3612074 2512456 1495636 3129889 5566034 6102608
7696 6102608 4830429 3236790 1966367 1544181 2918347 5672571 7668673 7790560 7171150
7687 7171150 6675930 5406031 3024251 1336202 1853523 3554397 4603292 4653532 4079076
7678 4079076 2671495 557928 -1205032 -2234058 -3301976 -4177886 -3253530 -709891 550326
7669 550326 -895475 -2481209 -1854633 -1015773 -3020743 -6672318 -8284164 -7297878 -6110484
7660 -6110484 -5167313 -2599629 1160786 2743268 1003500 -791634 256367 2492907
7652 2492907 2347778 -801266 -4418367 -6295221 -6564902 -6737009 -7722003 -8618180 -7405145
7643 -7405145 -3502520 712439 2199829 805653 -995051 -1558139 -1245035 -262154 2025182
7634 2025182 4831401 5489998 2782809 -1011444 -2870995 -2422236 -1259100 -341797 297149
7625 297149 369951 -365700 -1137510 -856735 535596 2283122 3749227 4339383 3384650
7616 3384650 1151175 -832172 -1517309 -1594983 -1939279 -1856859 -475078 926924 12377
7607 12377 -3206527 -5806732 -5196716 -1650509 2725713 6307230 8595557 9470255 8715397
7598 8715397 6275251 2827015 76577 -114809 2309447 4801827 4388623 727514 -3828156
7589 -3828156 -7142461 -9123798 -10472444 -11126741 -11019922 -11347532 -13472767 -16641428 -18109743
7580 -18109743 -16040335 -11546042 -7435672 -5509721 -5535958 -6286700 -6751924 -6461162 -5433308
7571 -5433308 -4181947 -3471096 -3808611 -5186286 -7164444 -8990990 -9893271 -9696198 -8956690
7562 -8956690 -8019927 -6372321 -3806892 -1763794 -1944902 -3509075 -3567324 -1306536 312846
7553 312846 -1383984 -4564648 -4990266 -1540835 2773194 5124344 5730191 5924703 5619706
7544 5619706 3935639 1054774 -1684292 -2949611 -2314114 -771144 -348278 -2047847 -4240663
7535 -4240663 -4615675 -3630516 -3900880 -5830509 -6523707 -4370517 -2136211 -3151313 -6284672
7526 -6284672 -7635070 -6322294 -5434859 -6933387 -8431652 -6548831 -1877511 1312952
7518 1312952 241662 -2887892 -3487960 -279924 3091603 2933612 442409 -427750 825638
7509 825638 551635 -2876837 -5780588 -4353182 -322794 1683005 534978 -1126128 -1909510
7500 -1909510 -3226113 -5895511 -8538491 -9880402 -9986860 -8835214 -6320476 -4106118
7492 -4106118 -4615226 -7337841 -8838864 -7447868 -5238948 -4159161 -3174080 -1174184 125039
7483 125039 -1059971 -3034551 -2962961 -1446066 -1583837 -4046530 -6135846 -5873676 -4371219
7474 -4371219 -3588853 -3981490 -5179283 -7108498 -9297206 -10395532 -9603229 -7886583 -6902153
7465 -6902153 -7157588 -7831167 -7984602 -7380038 -6337701 -5298059 -4591511 -4414473 -4760698
7456 -4760698 -5147219 -4639984 -2851375 -1023752 -1190006 -3705585 -6463567 -7303010 -6352310
7447 -6352310 -5136445 -4513749 -4951771 -7660245 -12944659 -17635129 -16971604 -10119108 -1779508
7438 -1779508 2943566 3536250 2562953 1167550 -1371411 -4527684 -5900984 -4251350 -1214709
7429 -1214709 765517 868180 -254792 -1580812 -1857882 -32382 3218121 5314056 4473217
7420 4473217 2007529 632666 906765 813517 -1143321 -3919752 -5496002 -5352006 -4670062
7411 -4670062 -4720105 -5643992 -6469101 -5985320 -3947250 -1514688 -43057 461495 884236
7402 884236 1127915 29990 -2481711 -4644534 -5202429 -5185394 -6101721 -7530035 -8125004
7393 -8125004 -8044396 -8303827 -8214775 -5869299 -1459097 2120244 2821394 1742710 784050
7384 784050 -289122 -2812381 -6337826 -8610344 -8199268 -5850743 -3221012 -1184797 516436
7375 516436 2450797 4249849 4107256 353695 -5885241 -10581475 -10540494 -6750064 -2902342
7366 -2902342 -1144540 -782437 -880706 -2060029 -4853727 -7802861 -8714802 -7407606 -6066926
7357 -6066926 -6849835 -9800308 -13096255 -14733073 -13930717 -11566397 -9591700 -9579061 -11268291
7348 -11268291 -12592710 -11614692 -8624189 -6033233 -5945650 -8014407 -9975782 -10157862 -9081962
7339 -9081962 -8571704 -9668017 -11622582 -12669871 -11441090 -7691865 -2175970 3617149
7331 3617149 7630688 8063823 5003940 1027988 -982756 -955397 -1502482 -4172326 -7104362
7322 -7104362 -7568440 -5715261 -4030108 -3642463 -3267332 -1880749 -339109 360029 604513
7313 604513 880268 483421 -1064594 -2370209 -1512161 1370677 4039875 4531405 2787169
7304 2787169 265479 -1327868 -1264364 -426390 -412911 -1582066 -2563833 -2171025 -939132
7295 -939132 -70567 194675 163447 -448788 -1967838 -3725385 -4868048 -5622723 -6384916
7286 -6384916 -6160790 -3701104 -16670 2095429 1367872 -627131 -1873214 -2128708 -2190622
7277 -2190622 -2412273 -2884650 -3934510 -5302560 -5555574 -3426063 583039 4679634 7485798
7268 7485798 8610609 8126622 6576722 5304415 5531318 6728888 6911676 5277659 3758771
7259 3758771 4727763 7438233 8308576 5278183 392686 -3168537 -5308588 -8133088 -11483489
7250 -11483489 -12189441 -8526727 -2932808 1250771 3708969 5790006 6880290 4948254
7242 4948254 226714 -4205117 -5783041 -4572540 -1980796 704959 2224156 1750933
7234 1750933 79528 -1161470 -2035917 -4365483 -8528446 -12020343 -12534469 -10966184 -9591815
7225 -9591815 -8300440 -4855130 1133872 6528796 7910171 5457043 2573838 2125753
7217 2125753 3987937 6108980 6780537 5410763 2274049 -1218656 -2666517 -818214
7209 -818214 2415941 3758906 2613191 1434425 1593072 1323089 -809500 -2907608 -2637927
7200 -2637927 -1151469 -1066459 -1900347 -1018861 1490537 2638623 1403435 121041 168145
7191 168145 -292617 -2821110 -6051567 -8400450 -10712513 -13945299 -16391042 -15732106 -12455530
7182 -12455530 -8980475 -6448830 -4357064 -2451549 -1099398 -394420 -380318 -1447034 -3204545
7173 -3204545 -3896848 -2410803 -104182 737511 -410831 -2276225 -3528422 -3447448 -1952576
7164 -1952576 -221327 -116539 -1638561 -2240287 -282456 2186192 2124149 -139891 -1578210
7155 -1578210 -848507 434219 772413 969654 2714525 6303141 10152110 11957259 10631741
7146 10631741 7587751 5234308 3765837 1185944 -2532407 -3954410 -1261639 1588588
7138 1588588 -499428 -6290337 -9541984 -7414969 -3254473 -554834 1263871 3266107
7130 3266107 3376997 -349364 -5352851 -6941952 -3984932 528848 3917151 6104021
7122 6104021 7494120 7083543 3907150 -793750 -4126810 -4329035 -2551749 -1632196 -3119929
7113 -3119929 -5810140 -7374338 -6967305 -5674546 -4718346 -4003986 -2542344 34575 2367258
7104 2367258 1948953 -2298491 -7835874 -10303648 -8378546 -5439374 -5174407 -7103552 -8273871
7095 -8273871 -7793286 -6980350 -6030110 -3814834 -990184 -183065 -2406700 -5855630 -8935373
7086 -8935373 -11899693 -14545331 -14968304 -12323431 -8892412 -7624708 -8851117 -10745133
7078 -10745133 -11844521 -11862628 -10971661 -9402493 -7214119 -4106547 -334108 2356040 2426816
7069 2426816 1360626 2575331 6695597 9915373 8259676 1893906 -5725848 -11187582
7061 -11187582 -12575468 -9721654 -4861767 -1672319 -1852760 -3400450 -3420346 -1683641 -318295
7052 -318295 -926707 -3053591 -4798816 -4381611 -1993162 -306933 -1865537 -5873126 -9141282
7043 -9141282 -10012278 -9187821 -7063652 -3498437 -467097 -992042 -4242617 -5751204 -4257295
7034 -4257295 -3879100 -6802465 -8651510 -5467908 -1065761 -1642839 -5909213 -7132191 -3765229
7025 -3765229 -1304150 -3120718 -5720336 -5098344 -2693836 -2075432 -3322276 -3929630 -3250004
7016 -3250004 -3229977 -5416520 -8811716 -10541437 -8492242 -3924365 -886769 -1754753 -4240489
7007 -4240489 -4682250 -3179898 -2781236 -4382820 -5778792 -5731877 -5625435 -6512072 -7555062
6998 -7555062 -8153358 -8834001 -9314825 -8473830 -7046788 -7481048 -10013354 -11621295 -10166806
6989 -10166806 -7101028 -4753924 -3322486 -1958028 -686500 140618 430296 -642595
6981 -642595 -4137501 -8829492 -11312718 -9721245 -5455278 -606939 3901729 6971359
6973 6971359 7116359 4898947 2858573 1792850 -30248 -2825536 -3997301 -2713274
6965 -2713274 -2105245 -4356353 -7003584 -7093281 -5738393 -5111916 -4097739 -1168850 994887
6956 994887 -1361431 -6796164 -10215589 -9863801 -8377463 -7445152 -5990232 -3833920 -2801266
6947 -2801266 -3266316 -3259759 -2110385 -1800844 -3544540 -5811732 -6917479 -7049729 -6571842
6938 -6571842 -4694179 -1270690 1888672 2837437 1459103 -1024905 -3252685 -4112723 -3397556
6929 -3397556 -2367960 -2331724 -2752692 -2383077 -1905856 -3149155 -5605959 -6296150 -3783198
6920 -3783198 -78755 2312814 3174664 3400363 2962271 1398570 -900986 -2894522 -3570858
6911 -3570858 -2257151 511459 2497919 1852957 -281791 -1221213 -790201 -1482376 -4199750
6902 -4199750 -6589571 -6624212 -5270608 -4336512 -4116863 -4581092 -6306047 -8373504 -7884674
6893 -7884674 -4031822 -563288 -1384573 -5229841 -7552759 -6500818 -3973679 -1591191
6885 -1591191 918023 3157974 3220979 690934 -1818649 -1822848 -437929 -1167739 -5571075
6876 -5571075 -11146922 -13749260 -11842976 -8026310 -5962394 -6134185 -5809327 -3373634 -875776
6867 -875776 -978094 -2956986 -3901322 -3090724 -2703725 -4147044 -6068953 -6743318 -6385819
6858 -6385819 -5870566 -4737696 -2160102 940187 2453996 1674171 55924 -728471 -433283
6849 -433283 305520 1043217 1337667 377136 -1980670 -4090113 -3810650 -1249144 950565
6840 950565 660175 -1482215 -3701206 -5695332 -8044578 -9889682 -9469718 -7197375 -6206410
6831 -6206410 -8841144 -13700499 -16971262 -16015487 -11310205 -5733436 -2322752 -1964434 -3034636
6822 -3034636 -3859051 -4996714 -7769391 -11150316 -12383370 -10807892 -8616613 -7244059
6814 -7244059 -5637191 -3170746 -1469879 -1585466 -2031758 -1900265 -3264724 -7355461 -10559649
6805 -10559649 -8297485 -1879943 2610289 2199910 -98075 -820524 -589817 -1448355 -2717645
6796 -2717645 -1962234 1420582 5427409 7473533 6253289 2610443 -706618 -1274337 364286
6787 364286 1375365 338811 -1172368 -1269748 -320282 221437 181985 579975 1967801
6778 1967801 3836709 5146375 5004286 3526613 2106980 1753088 1324425 -836547 -3570255
6769 -3570255 -3737255 -1095784 559294 -1156483 -3409562 -2526184 -37115 -746332 -5611200
6760 -5611200 -10152144 -10268259 -6708872 -3021128 -1515005 -2306133 -4289781 -5658261 -4837672
6751 -4837672 -2269936 -467494 -1338839 -4101739 -6510384 -7411413 -7400724 -7614936 -8573192
6742 -8573192 -9734552 -9680008 -7256451 -3071306 592680 1815207 636956 -1575306 -3658389
6733 -3658389 -5097688 -5717342 -5814346 -6296049 -7846354 -9877250 -10791235 -9415585 -6041253
6724 -6041253 -2177477 574407 1684285 2049928 3043299 4947040 6455442 5916026 2975352
6715 2975352 -1049750 -4212257 -5329849 -4737434 -3842759 -3682083 -3896222 -3538448 -2800692
6706 -2800692 -3066173 -4885188 -6805179 -7046738 -5746128 -4505911 -4016369 -3294736 -1458588
6697 -1458588 737305 1651817 508094 -2014147 -4570193 -6199802 -6811641 -6862744 -6571717
6688 -6571717 -5715642 -4525652 -4280475 -6024596 -8740744 -9954035 -8592930 -6276452 -5128686
6679 -5128686 -5182581 -4770708 -2787813 340868 3339439 4739864 3439464 -148513 -3762191
6670 -3762191 -5340488 -5331527 -5834497 -7633276 -9541582 -10757605 -12056919 -13819572 -14411944
6661 -14411944 -12010505 -7371909 -3439347 -2214924 -2805775 -2648545 -322326 2820080
6653 2820080 3804092 1131377 -3384670 -6451261 -6757884 -5748382 -5274112 -5937810 -7709779
6644 -7709779 -10152503 -11353530 -8788752 -2786418 2470642 3176792 27115 -3416994
6636 -3416994 -5186777 -5909452 -6614359 -7778796 -9733192 -11811383 -11824188 -8642130 -4560483
6627 -4560483 -2618653 -2370369 -1324150 6299 -1747640 -7236601 -12681400 -14826533
6619 -14826533 -14281669 -12695946 -10106322 -6927630 -5168636 -5165999 -4052949 -248296 3230415
6610 3230415 3037955 618236 -500538 -473645 -2194806 -5921735 -8949627 -9978517 -9917994
6601 -9917994 -8777526 -5765478 -2478289 -1911709 -3726860 -4327722 -2414993 -541724 13730
6592 13730 1743363 6129478 10076614 10068780 7200155 5094461 4829115 4710302 3476362
6583 3476362 1163190 -1799498 -4042491 -3361786 230003 3178397 2766185 1205596 2304741
6574 2304741 5546031 7188961 6345216 5734706 6351322 5662580 2222696 -1700049 -3814822
6565 -3814822 -4887786 -6068722 -6040626 -3529880 -600995 -575199 -3787824 -7787288 -10781718
6556 -10781718 -12580098 -12895701 -11205716 -8190005 -5311007 -2947844 -557132 1535316
6548 1535316 2216830 1299380 -537904 -3264926 -7040563 -10430481 -11405729 -10381162 -9850985
6539 -9850985 -10423338 -9876665 -7317380 -5432914 -6458488 -8315839 -7688831 -5241862 -4347843
6530 -4347843 -5495639 -5722903 -3763858 -2043213 -2375331 -2950076 -1528725 997606 2611891
6521 2611891 3673715 5710602 8143406 9128515 8850232 8970178 9054548 6722579 1962064
6512 1962064 -1621070 -1232771 1667931 3839244 4094851 2815719 -378395 -5616974 -10344120
6503 -10344120 -11022831 -7649847 -4051302 -2813380 -2165957 596289 4435451 5616948
6495 5616948 2760937 -1372880 -3333721 -2437091 -259144 1678974 2611128 2052551 112849
6486 112849 -2047636 -3228443 -3574427 -4088940 -4959803 -5357124 -4838182 -3923155 -3176911
6477 -3176911 -2700871 -2635274 -3051545 -3141405 -1816671 413156 1568606 1011135 686089
6468 686089 2287363 4446487 4508206 2350562 503926 694293 2139893 3503014 4817918
6459 4817918 6706171 8718431 9281959 7113678 2746882 -1073297 -1305977 2057852 5344946
6450 5344946 5326472 3266875 2896552 4942359 6411054 5474602 3916534 3489756 2852879
6441 2852879 388782 -2305739 -2742942 -1962711 -3382903 -7561841 -11074925 -11068748 -8497444
6432 -8497444 -5950571 -4234189 -2359300 397491 3762501 7144756 10009147 11840940
6424 11840940 12402534 11890588 10517471 8194158 4915957 1254904 -1774559 -3330485
6416 -3330485 -3357809 -2824459 -3106875 -4618140 -6096540 -5846178 -3856856 -2191822 -2872828
6407 -2872828 -5535165 -7502177 -6307795 -2135229 2265132 4039479 2520493 -758440
6399 -758440 -3686982 -4839102 -3850082 -1611874 63654 28090 -897234 -1135838 -733939
6390 -733939 -1133437 -2474510 -2979610 -1866296 -1110189 -2769192 -5719641 -6813808 -4811230
6381 -4811230 -1738160 -526678 -2261324 -5433812 -7145832 -5511126 -1483750 2330412
6373 2330412 4966451 7811846 11386751 13428341 11832846 7819711 4107297 1350273
6365 1350273 -1361447 -3860262 -5471104 -7086857 -9624059 -11276581 -9761566 -6816414
6357 -6816414 -6529615 -8959243 -9572411 -6173352 -2378617 -2185737 -4531074 -5802774 -5030609
6348 -5030609 -3849861 -3372190 -3638001 -4486980 -4767031 -2482958 2018338 4897268 3326439
6339 3326439 -660511 -3395211 -4584177 -5837607 -6176313 -3462423 356331 144734 -5395664
6330 -5395664 -11341891 -12514857 -8848393 -3611416 677312 2784624 1928777 -1088945
6322 -1088945 -3504036 -3556098 -2776505 -3458332 -4922918 -4488630 -1649392 967978 1123273
6313 1123273 -347622 -1144469 -529817 428392 1018733 1789316 2823585 2289541 -1772457
6304 -1772457 -8193592 -12753382 -12509752 -9120672 -6618002 -6536323 -6848589 -5571074 -3580922
6295 -3580922 -3130686 -4855851 -7294988 -8677302 -8205828 -5937406 -2456548 1005844 2714011
6286 2714011 1469057 -2085746 -5481272 -6463823 -5257698 -4239427 -5098764 -6985085 -7820715
6277 -7820715 -6593036 -3757025 -373655 2185107 2643545 1268447 190569 863485 1910101
6268 1910101 1198904 -604244 -837099 902581 1849641 164421 -2325844 -2810973 -1211595
6259 -1211595 356827 634509 102715 -495935 -1033098 -1608357 -2319292 -3246336 -3982713
6250 -3982713 -3612626 -1959052 -432757 -646677 -2268819 -3143624 -1788146 773466 1986096
6241 1986096 374656 -3035702 -5818360 -6304107 -4423095 -1008415 2555564 4012413
6233 4012413 1466901 -3749786 -6955999 -4989479 -444417 1254648 -1385128 -4697577
6225 -4697577 -5436182 -4536497 -4286727 -4596263 -3989328 -2272961 -237616 1676957 2515188
6216 2515188 223679 -5762931 -12450104 -16040687 -15982512 -14257846 -11660413 -7379772 -1899970
6207 -1899970 2343488 3606843 2339583 13441 -1819591 -1602746 866429 3085740
6199 3085740 2106252 -1582695 -4630543 -5474457 -5709351 -6217620 -5233992 -2160900 -417886
6190 -417886 -3468169 -9589327 -13579238 -12884162 -9392376 -5768739 -2952636 -1389211 -1828871
6181 -1828871 -3852051 -5644884 -6297869 -6693629 -7266180 -6751142 -4510817 -2470157 -2946725
6172 -2946725 -5593589 -8225872 -9830659 -10876173 -11263089 -10199209 -8165510 -6954816
6164 -6954816 -7256806 -7884681 -7889421 -7697180 -7437548 -6010005 -3082201 -462135 129744
6155 129744 -435964 -35072 1703895 3322444 3761438 3031558 1246045 -1252390 -3179086
6146 -3179086 -3554185 -3527829 -5165867 -8353054 -10589958 -10013989 -7078443 -3284242 -45104
6137 -45104 1203147 -64993 -2036358 -2233227 -1168171 -1975570 -5530960 -8572549 -8331564
6128 -8331564 -6622792 -6910656 -8958911 -9153422 -5526523 -134141 3530180 3867358 1946382
6119 1946382 97677 -356546 -511079 -2335910 -5368702 -6476130 -3868414 399550 3375678
6110 3375678 4790795 5674111 5227290 2014318 -2598030 -5092572 -3784920 -9696 4159815
6101 4159815 7045830 6832951 2805383 -2706359 -6073186 -6323431 -5295417 -4135096 -2303711
6092 -2303711 -66260 1012102 611158 -5254 -707215 -2690802 -5336818 -6125723 -4830481
6083 -4830481 -4411761 -5981377 -6275163 -2725014 1949351 3485562 2119357 1242011 1635393
6074 1635393 1075625 -898720 -1854343 -681614 424282 -465162 -1910737 -1162654 2282595
6065 2282595 6635955 10219332 12494608 13284318 12381343 10178301 7904851 6644649 6202735
6056 6202735 5454464 4019153 2897845 2703946 2025179 -823366 -4597765 -5848174 -3581662
6047 -3581662 -1084737 -1599277 -3952221 -4501664 -2114732 1130157 3308724 4025239 2712914
6038 2712914 -1379115 -6562765 -8620203 -5235653 771441 4375661 3796694 1446011
6030 1446011 -63763 -777859 -1685445 -2075515 -576419 1770761 1834613 -1442896 -5110216
6021 -5110216 -5925397 -4497387 -3675651 -4077407 -4112016 -3917824 -5654720 -9087008 -10382618
6012 -10382618 -7244743 -2478650 -147283 -495649 -1252036 -1853095 -3231106 -4834750 -5181300
6003 -5181300 -4648334 -4674653 -4686315 -2793566 733211 3556079 4621876 4583957 3256029
5994 3256029 5418 -3333506 -3723296 -1779630 -1557509 -4238104 -5869814 -3389922 739082
5985 739082 2610816 2364824 2250522 1877421 -531295 -3704676 -4325719 -1996205 472070
5976 472070 1671135 3011333 5118913 6181535 4992105 2888489 1368307 159071
5968 159071 -960335 -770301 1059799 2175242 374080 -2985211 -4708212 -4080076 -3067036
5959 -3067036 -2601933 -1341091 1339647 3486494 3039302 597034 -1694586 -2835858 -3013519
5950 -3013519 -1875861 1265704 5601082 8880086 9688607 8514296 6406336 3932993
5942 3932993 1791477 868516 803868 -187613 -2892210 -5545733 -6040053 -4848557 -4199099
5933 -4199099 -4821492 -5224185 -4249857 -2812210 -2558510 -3758785 -5036458 -4741578 -2489321
5924 -2489321 306886 1702093 1455423 1350312 2546899 3642696 2873689 1380604 1968813
5915 1968813 4619197 5714474 2703055 -2384578 -5420226 -4861020 -2651159 -1479507
5907 -1479507 -2519186 -5277522 -8333606 -10203881 -10200717 -8626656 -6284074 -4257041 -3702751
5898 -3702751 -4493454 -4149144 -85466 6338422 9963324 7468666 1380368 -3215064 -4635059
5889 -4635059 -5185147 -6735582 -8386657 -8683588 -7764071 -6355965 -4335158 -1512225 1237953
5880 1237953 2946670 4080129 5773166 7559196 7121041 3024949 -2955891 -7263521
5872 -7263521 -8242205 -7410511 -6828979 -6512409 -5468810 -4111042 -3737553 -4035866 -3275336
5863 -3275336 -1296211 -166734 -910087 -1451952 687625 4954877 8538329 9628064 8408119
5854 8408119 5583053 1640548 -2504596 -5385127 -5788825 -3456647 523739 3844736
5846 3844736 4628589 3537284 3026737 3888763 4192041 2652495 990832 1127354 1947883
5837 1947883 1330492 -108361 -152304 1189398 2034852 2015174 1968733 817149 -3212472
5828 -3212472 -7899073 -7929419 -2169167 3740212 4460274 1467443 -402030 -214349 -1056772
5819 -1056772 -4421344 -8299511 -10620700 -11367232 -10889411 -8791761 -5403417 -2507861 -1660077
5810 -1660077 -2846495 -5171858 -7706115 -9349053 -9132926 -7302843 -5258258 -3918395
5802 -3918395 -2804553 -1127350 813457 1759368 773499 -1741490 -4138650 -4840420 -3889095
5793 -3889095 -2887255 -3019845 -3660739 -3548095 -2673694 -1988331 -1722540 -1263531 -482588
5784 -482588 141436 675815 1593035 2330511 1555253 -594038 -2021836 -1315670 414417
5775 414417 1406388 1745860 2536037 3472285 3125157 1505789 609258 1885103 4283836
5766 4283836 5383987 3795300 156276 -3616314 -5861863 -6530216 -7040444 -8240453 -8955999
5757 -8955999 -7785986 -5892873 -5802949 -6967896 -5201919 1564867 9124602 11499225 8465211
5748 8465211 5219846 4769158 4436558 1141236 -3344582 -5014068 -3297972 -1224065 -1112798
5739 -1112798 -2854327 -5754923 -9236087 -11678417 -11220027 -8359358 -5694984 -4402015
5731 -4402015 -2930244 -71677 2647699 3049256 1288911 -835881 -2520894 -4206261
5723 -4206261 -5802209 -6423965 -5971018 -5641343 -6438964 -7887256 -8577915 -7710548 -6040403
5714 -6040403 -5421444 -7090001 -10118829 -12018944 -11354981 -9382677 -8534685 -9582377 -10890638
5705 -10890638 -10319521 -7392226 -3757198 -1864301 -2832720 -5143836 -5801017 -3356392 525257
5696 525257 3076241 3556790 3555490 4475241 5798801 5999449 4309880 1311240 -1540361
5687 -1540361 -2712173 -1649987 481566 1606569 766494 -970593 -1941918 -1764012 -1276335
5678 -1276335 -1083067 -1062066 -1350197 -2837690 -5985809 -9622676 -11840882 -12170089 -12021180
5669 -12021180 -12566973 -13018169 -11927738 -9651204 -8102384 -8002962 -7926899 -6778749 -5721106
5660 -5721106 -6223725 -7331738 -6960136 -5538178 -5924527 -9023018 -11739355 -10948571 -7930794
5651 -7930794 -6614405 -8042564 -9000001 -6514449 -1710014 1809985 1968305 -612175 -4340204
5642 -4340204 -7979164 -10575653 -11469900 -10679151 -8675678 -5872812 -2845314 -612398 212276
5633 212276 303603 721063 1379106 1495727 1261935 1579267 2142328 1555991 -169643 -1101648
5623 -1101648 -340707 287426 -971869 -2772820 -2412281 262443 2669420 2727166 456998
5614 456998 -3102922 -6450529 -7402202 -4888175 -1356427 -852970 -3735798 -5717895 -3757961
5605 -3757961 -691157 -1514277 -6393329 -10365650 -10013415 -7757567 -8344863 -12716789 -16985469
5596 -16985469 -17022434 -12780385 -7871708 -5683670 -6483579 -8036019 -8254542 -6839286 -4806564
5587 -4806564 -3243139 -2717457 -3407395 -5309536 -8088905 -10605656 -10952635 -7956769 -3098352
5578 -3098352 73599 -469745 -2810798 -3365138 -1008891 2407695 5007319 6395438 6464321
5569 6464321 5046779 3247826 2870221 3608096 2967493 217956 -1738680 -212095 3450213
5560 3450213 5989268 6499852 5992909 4105332 -335767 -5675619 -7806292 -5280769 -1596593
5551 -1596593 -932027 -3241323 -4916986 -3126394 1676574 6543489 8185351 5196766
5543 5196766 -581771 -5302950 -6701893 -6156659 -6369457 -7531597 -7173776 -3969332 -255621
5534 -255621 342540 -2745286 -6321115 -7207284 -5647073 -4252201 -4475799 -5373552 -5489657
5525 -5489657 -4484123 -2651253 -187050 2392784 4100139 4441585 3797990 2450073 318252
5516 318252 -1774468 -2010792 67710 2241405 2060901 -201931 -2441778 -3733505 -4741746
5507 -4741746 -5594626 -5256280 -3253780 -685439 813632 355762 -1710030 -3695799 -3479351
5498 -3479351 -801436 1688790 1104950 -2106769 -4646877 -4330724 -2164548 -371574 296313
5489 296313 900890 2800681 5848143 7603967 5132496 -1309416 -7335093 -8931102 -7260922
5480 -7260922 -7013386 -10425678 -15139053 -17763869 -17181392 -14170271 -10126409 -6625594 -4278370
5471 -4278370 -1841475 1558195 3780603 2226332 -1177360 -1510370 1806356 3562422
5463 3562422 643038 -2913721 -1993892 2089801 4393351 4010301 4125689 5815867 6773787
5454 6773787 6118081 5910361 6982491 7109234 4906868 2543741 2601834 4215256 4209457
5445 4209457 1054611 -3600535 -6788236 -7015846 -5617053 -5247325 -6537720 -7110487 -5086305
5436 -5086305 -2263312 -1558770 -2301849 -1248651 1902823 3713752 2674830 2022012 4741346
5427 4741346 8735829 9908385 8025812 6179705 5429264 3436156 -1346140 -7002644
5419 -7002644 -10767625 -12436230 -13857926 -16000303 -17690779 -17094159 -13881929 -9902567
5411 -9902567 -7703616 -8199914 -9871354 -10412798 -8921652 -6315618 -4189611 -3774866 -5424545
5402 -5424545 -8197689 -10096685 -9518108 -6570282 -2592977 1259153 4264235 5435333
5394 5435333 3917621 440987 -2635346 -3465831 -2504948 -1723202 -2429013 -4253181 -5904684
5385 -5904684 -6469555 -6182939 -6214119 -7363063 -8727661 -8322330 -5681510 -3174310 -3486386
5376 -3486386 -6011560 -7325981 -5699618 -3496563 -3823617 -6070134 -6804611 -4707087 -2321976
5367 -2321976 -2278876 -3769562 -4263229 -3444838 -3486042 -5651013 -8378106 -9250613 -7799715
5358 -7799715 -5691569 -4719884 -5198315 -6067904 -6137247 -5223508 -4226454 -4066230 -4594644 -4721562
5348 -4721562 -3614271 -1623282 -29224 46051 -1395594 -3199894 -4141379 -4184091 -4410055
5339 -4410055 -5412820 -6089615 -4679819 -1096970 2372648 3221156 1442937 -435226 -345678
5330 -345678 703250 -212714 -4039038 -8009195 -8688191 -6077492 -3305566 -2389613 -2020757
5321 -2020757 -206661 2446061 3502374 1980456 -573585 -2124350 -2182343 -1796441 -2313085
5312 -2313085 -4194397 -6565967 -8031473 -8206903 -7960096 -7803440 -7026103 -5297644 -4072881
5303 -4072881 -4847339 -6624971 -6948744 -5286843 -3457672 -2467909 -1066975 1579033 3665006
5294 3665006 2933485 82661 -1810170 -1045839 935796 1675146 457688 -1480445 -2840290
5285 -2840290 -3704246 -5003547 -6765296 -7430486 -5575602 -2197921 -285451 -1629948 -4843332
5276 -4843332 -7143755 -7323018 -6125049 -4558122 -3226722 -2887474 -3966882 -5393309 -5599151
5267 -5599151 -5241780 -7154305 -12319481 -17376745 -18081017 -14441866 -10229343 -7672934 -5296077
5258 -5296077 -1689127 1298070 1148770 -1309819 -3024915 -3051192 -3215232 -4559164 -5653384
5249 -5653384 -5136379 -3813937 -3030869 -2482788 -1015330 1344456 3327960 3760177 2144483
5240 2144483 -1290979 -5248318 -7825492 -8313998 -7996720 -8385935 -9342588 -9759303 -9329513
5231 -9329513 -8596116 -7852942 -7043657 -6233369 -5227542 -3415010 -1187842 -822802 -4271783
5222 -4271783 -10166837 -14620027 -15409532 -14173195 -13857064 -14881289 -14735496 -11249153 -5616647
5213 -5616647 -1632829 -1812031 -4875470 -7702131 -8976477 -9414226 -8933563 -6187236 -1588412
5204 -1588412 1849400 2400255 2151983 3433445 4662556 2682663 -2001662 -5590449 -6158421
5195 -6158421 -5285153 -4423540 -2839075 -98184 2078252 1958979 90021 -1795420 -2894255
5186 -2894255 -3469201 -3989874 -4849730 -5988370 -6373974 -4852018 -1811138 932874 2032578
5177 2032578 1525039 102534 -1481852 -2723278 -4195666 -7169049 -10902089 -11771279 -7674827
5168 -7674827 -2120386 -552551 -3244466 -5699947 -5877820 -6286771 -8034284 -8012013 -4584337
5159 -4584337 -1559419 -2844947 -6599322 -8630146 -8697596 -8986425 -8583423 -4727563 1226073
5150 1226073 4264172 2755148 667590 1406869 3145804 2355594 -847788 -3438007 -3832125
5141 -3832125 -2944574 -1669437 216564 2345989 2928340 905506 -1923102 -2450534 -39843
5132 -39843 2523475 2384398 -325292 -3679248 -6727937 -9379378 -10847260 -10802654 -11372879
5123 -11372879 -14885986 -19566619 -20784027 -17348587 -13279060 -11994153 -12055149 -10691113
5115 -10691113 -8449560 -7538256 -7853997 -7630703 -6461922 -5080886 -3565172 -2163910 -2424119
5106 -2424119 -5020003 -7839791 -8642754 -8181880 -8238825 -8190498 -6389459 -3524271 -1523925
5097 -1523925 -302902 1239302 2062225 307491 -2847555 -4143689 -2908754 -1643043
5089 -1643043 -1986844 -3027120 -3600464 -3506812 -2477557 -574935 574201 -438727 -2182586
5080 -2182586 -2252983 -1065107 -659676 -562930 1246069 3565603 2592460 -2079599 -6232751
5071 -6232751 -6853520 -5359335 -3894230 -2436288 -1295880 -2594943 -6800276 -10837511
5063 -10837511 -12057642 -11525111 -11295200 -11110194 -10130922 -9439427 -10117960 -10710284 -9190178
5054 -9190178 -6156220 -3953986 -3728893 -4938245 -6483758 -6989475 -5531464 -3367564 -3108616
5045 -3108616 -4895512 -5662471 -3862742 -2394037 -4405606 -8415508 -10565526 -10104865 -9415476
5036 -9415476 -9596575 -9396085 -8362050 -7915578 -8644997 -9021199 -7904707 -6552733 -6767431
5027 -6767431 -8050177 -8070012 -5895624 -3556909 -3573175 -5452583 -6007656 -3458425 284773
5018 284773 2412310 2722308 2682439 2520218 1750266 1551210 3504278 6187683 6122803 2446933
5008 2446933 -2101730 -5150760 -6846513 -7750138 -7621837 -6891142 -6396401 -5182305 -1781693
4999 -1781693 1831688 1402716 -3409617 -7926490 -9077538 -9131380 -10760949 -12421275 -11490166
4990 -11490166 -8613599 -5920514 -3851710 -2631915 -3967801 -8138492 -11891142 -12225119
4982 -12225119 -10051386 -7619680 -5061686 -2209964 -852979 -1960078 -3364508 -3352384
4974 -3352384 -3672914 -5643768 -6465428 -3506106 571146 1427036 -550015 -1881220 -1767849
4965 -1767849 -1529022 -342529 3281764 7062118 6975118 3055547 -1061054 -3373862 -4215546
4956 -4215546 -3254888 -470102 1222382 -714420 -3544759 -2745789 616627 1440605 -1202063
4947 -1202063 -3288611 -3140889 -3294087 -4300702 -2849650 1967462 5833025 5209727 2007454
4938 2007454 -119614 -582574 -700834 -726440 -275061 261352 269613 -417653 -1731999 -2858105
4928 -2858105 -2170773 460609 2551466 2414828 1787069 2271777 1858106 -1051767 -3014802
4919 -3014802 -201262 4628592 5705572 2978949 942568 337031 -1938657 -5542098
4911 -5542098 -6686578 -5249331 -4744662 -5326918 -4109376 -2254052 -3842137 -7556829 -7876615
4902 -7876615 -5054662 -5028080 -8409868 -9000557 -5078849 -2688056 -5251440 -9173240 -12180126
4893 -12180126 -16506964 -21386964 -22447141 -21016093 -23271257 -27877379 -26677074 -20198580
4885 -20198580 -18403180 -22612818 -22819467 -17705943 -18768485 -27630675 -30528122 -25291905
4877 -25291905 -29294861 -46262164 -54919447 -55143350 -92653138 -194144828 -298131869
4870 -298131869 -305989718 -203461881 -81395241 -23944231 -22898514 -23608756 -9580934
4863 -9580934 -2484925 -8017552 -7881943 3223685 9966617 5786660 1757676 3932404
4855 3932404 4944808 1545254 908930 5170168 6256352 878632 -3342992 -1319676
4847 -1319676 2121218 2602383 2958045 5249523 5877869 3229034 1666183 3589665 5107744
4838 5107744 3609911 2579069 4804657 7220179 6715799 5631200 7416086 11335732
4830 11335732 14904168 17421430 18093275 14761915 7745369 1556237 -202947 912810
4822 912810 1137800 -894591 -4129352 -7005179 -7847986 -5728438 -2107283 405062 1239514
4813 1239514 1535816 1169619 -611469 -2165443 -1193760 656693 -504490 -4258457 -5963314
4804 -5963314 -4151044 -2604590 -3598018 -4408786 -2879032 -1366140 -2061954 -2877953 -1598362
4795 -1598362 -369557 -2236915 -6186362 -9212367 -10702446 -11371725 -10426677 -7486189 -5182408
4786 -5182408 -6010921 -8120036 -7861525 -5295673 -3531101 -3433443 -2749371 -485326 1253237
4777 1253237 604638 -1387119 -2555465 -2395288 -1896815 -1383923 421904 4802668 10571070
4768 10571070 13998595 12352857 7249271 3027433 1775588 1549976 -432153 -4738552
4760 -4738552 -10014847 -14114841 -14610280 -10769900 -5780535 -4223926 -6157441 -6523259 -1996194
4751 -1996194 4496082 8149317 8305083 7386936 6334596 4502942 2583773 2268764 3624831
4742 3624831 5351565 6941543 8371400 8635797 6959267 4598948 3187386 2269984 796414
4733 796414 -169763 928464 2719814 2256374 -473072 -2281659 -1099707 1924069 4546813
4724 4546813 5255880 3274856 -535700 -2932102 -1400682 1806726 1786179 -2417944 -6492612
4715 -6492612 -6950971 -5140428 -3571551 -1624730 2250257 6377784 7367141 5027572 2784241
4706 2784241 2938580 3773355 2290516 -1530694 -4513165 -4171977 -1847369 -1126579 -3312072
4697 -3312072 -5760699 -5501276 -3164088 -1580477 -1377085 -503546 1775623 3174123 1909459
4688 1909459 -198305 -60238 2371648 3919768 1907999 -3181889 -8518417 -11395888
4680 -11395888 -11023140 -8601080 -5847679 -3571901 -2043467 -2189383 -4918920 -8997455
4672 -8997455 -11223100 -9736426 -6092797 -3110529 -1705892 -966696 -358211 -305211 -965162
4663 -965162 -1802936 -2368297 -2467867 -1589269 825357 4242616 6849472 6947903 4480526
4654 4480526 1185903 -756272 -569029 402294 27461 -2472966 -5973619 -8797617 -9946516
4645 -9946516 -9153950 -6826465 -4198828 -2463557 -1275741 843975 4107488 6658696
4637 6658696 6962869 5793592 4737463 3791911 1846687 -1172034 -4029621 -5553942 -5135771
4628 -5135771 -2682447 407427 1061406 -2489541 -7660948 -9602008 -6740242 -2344776
4620 -2344776 -36939 171542 263882 706795 649022 565168 2313332 6362970 10657873
4611 10657873 12902894 12962489 12269059 11498344 9780248 6334044 2289252 226890 1674669
4602 1674669 5367830 8394527 8886086 7090598 4092240 588047 -2705093 -4611327
4594 -4611327 -4616585 -3901577 -3998590 -4517168 -3496247 -298536 3188926 5068645 5951881
4585 5951881 7463749 8857445 7187114 1405843 -5437363 -9426462 -10172564 -10401642 -11697043
4576 -11697043 -12556415 -11002148 -7452638 -4002464 -1843027 -477513 965488 2494277
4568 2494277 3167375 1868157 -1440642 -5039381 -6818023 -6690187 -6591804 -7461478 -7670491
4559 -7670491 -5837452 -3849442 -4781662 -8279773 -10502368 -8998394 -5389462 -2455909
4551 -2455909 -793240 218389 50032 -2175359 -5405469 -7264793 -6804543 -5157003 -3592141
4542 -3592141 -2315528 -1135817 83089 1789318 4241926 6356270 6376010 4265388 2231957
4533 2231957 2023017 2668716 1982013 -342217 -2341442 -2302117 -565417 1307070 2272964
4524 2272964 2368310 2151505 1980598 1485320 -374516 -4094669 -8105974 -9241902 -5742636
4515 -5742636 300022 4377068 3723984 -360292 -4236961 -5167119 -2811642 1194033 4236864
4506 4236864 4161894 1081494 -2318366 -3232352 -1472147 965309 2611064 3472123 3449049
4497 3449049 1752669 -1229586 -3067060 -1812364 1401110 3730085 4100448 3846011 4097732
4488 4097732 4197352 3176159 1539633 722941 1367290 2768965 3710839 3465238 2271719
4479 2271719 1064677 444698 -140794 -1706319 -4082060 -5575784 -4708308 -1931173 760674
4470 760674 1719173 967502 -42151 187436 1704038 2848594 1949736 -549217 -2279236
4461 -2279236 -1643695 318524 1370178 758726 -463731 -1439915 -2610585 -4565457 -6769876
4452 -6769876 -8087918 -8095258 -7263113 -6056469 -4453352 -2509879 -1062091 -1453022 -4290838
4443 -4290838 -8465040 -11705978 -12452650 -11148871 -9545560 -8895472 -9068580 -9152965 -8410660
4434 -8410660 -6748660 -4805927 -3562597 -3288722 -2898430 -1102594 1645283 3231481 2358775
4425 2358775 157502 -1284670 -1280362 -678290 -334273 -455882 -1025941 -1829403 -2352503 -2642349
4415 -2642349 -3836066 -6547949 -9080833 -8930465 -6134208 -3314478 -2005197 -944047
4407 -944047 1071882 2739894 2396385 996374 734109 1622855 1757914 577353 -428120
4398 -428120 -287157 356597 1082071 2490662 4367807 4971787 3410951 1314565 826220
4389 826220 2018076 3532763 4708209 5508390 5142164 2711608 -741553 -2573449 -1579790
4380 -1579790 464443 1150093 500355 550109 2150509 3604123 3126061 1546772 1096539
4371 1096539 1861323 1365722 -1667270 -4930479 -5375745 -3174080 -1002055 -267969 -208116
4362 -208116 -227583 -584596 -569193 1367356 4717127 6388025 4463374 822606 -1374986
4353 -1374986 -1452304 -1130396 -1888231 -3746334 -5749563 -6545032 -5371793 -3388214 -3014859
4344 -3014859 -5145618 -8104989 -9961068 -10356649 -9426066 -7025426 -4306369 -3889762 -6660068
4335 -6660068 -10175744 -11988511 -12560742 -12994162 -12251902 -9319838 -5968304 -4162164 -2563536
4326 -2563536 801569 3963074 3213950 -1009748 -4690519 -6264555 -7814220 -10247205
4318 -10247205 -11747887 -11687735 -11803103 -12382092 -11313764 -8281003 -5979725 -5560972 -4723738
4309 -4723738 -2252907 -598993 -1547460 -2986171 -2861826 -3008426 -5644198 -8790027 -8857577
4300 -8857577 -5896741 -2858666 -1152804 -149646 162983 -774561 -2102640 -2246676 -1041984
4291 -1041984 842283 3513079 6825488 9063812 8945242 7745683 7238887 6905738 5505720
4282 5505720 3806731 3000432 1940329 -846508 -3612992 -3408990 -1018669 -302027 -2603488
4273 -2603488 -5071466 -4929282 -2605949 -136205 1083735 448599 -1790696 -4160342 -5360450
4264 -5360450 -5988112 -7158134 -7920076 -6284452 -2502826 1040819 3072150 4266735 5047817
4255 5047817 5001419 4502907 4565742 4985797 4808654 4474471 5148180 6168063 5772333 4188939
4245 4188939 3176939 2584896 555494 -2531318 -3669938 -1658767 1140964 2517783
4237 2517783 2925356 3087237 2145439 18710 -984815 910509 4218434 6249838 6406633
4228 6406633 5836176 5258117 4781039 4790521 5572632 6793552 8257826 10264759 12435412
4219 12435412 13159312 11035890 6321194 764861 -3258448 -3796598 -885798 3007284
4211 3007284 5404462 6367663 7289783 8045106 7561543 6546036 6793257 7842346 7286817
4202 7286817 4881185 3485601 4967890 7580987 8558437 7459602 5961212 5720793 7015450
4193 7015450 8439630 8014989 5550011 3050457 1694558 237702 -1768171 -1785582 1639262
4184 1639262 5261044 5559369 4278166 4878123 6016925 4301374 1393037 1768474 4852283
4175 4852283 6284022 5758367 6228462 6643549 3865349 781559 3133966 8881475 11025411
4166 11025411 10517971 14411430 21111730 21570078 16682658 17544601 25127970 27727093 23987064
4157 23987064 27639711 40473119 44594641 35943016 37716192 55088689 43412977 -37655161
4149 -37655161 -151357180 -211244535 -183880237 -122723106 -90089917 -86630424 -79009197
4142 -79009197 -60409564 -48956635 -47259234 -39737643 -23396645 -12251661 -12098858 -13591084
4134 -13591084 -11276785 -10656353 -14201202 -16123061 -13935151 -12473398 -13889412 -14323262
4126 -14323262 -12351032 -11322937 -12143719 -12313319 -12535510 -15868709 -20273865 -20401305 -16765997
4117 -16765997 -14941581 -15943484 -15791608 -14140698 -14407378 -15494069 -12808319 -7943785
4109 -7943785 -7588181 -11568617 -11946791 -6285864 -1961756 -3862899 -7203247 -7080626 -6575383
4100 -6575383 -9832368 -14373702 -16171147 -16438643 -17792886 -18751203 -17318547 -15562029 -15681185
4091 -15681185 -15555693 -12753034 -9191741 -7641006 -7321220 -6859392 -7563021 -9663596 -9482837
4082 -9482837 -4949212 -163263 271151 -2029188 -2943673 -2800349 -4356471 -6853917 -7659784
4073 -7659784 -7477809 -8401012 -8761121 -5609828 -956831 103504 -3242104 -7214742 -9794997
4064 -9794997 -12109786 -13883630 -13061698 -10406493 -9256845 -9811655 -8611262 -4971708 -2991944
4055 -2991944 -5098489 -8079933 -8286618 -6982956 -7305549 -8935811 -9458248 -8995354 -9679084
4046 -9679084 -11369548 -11428748 -8954814 -6386947 -6010530 -7018065 -7451621 -7597355 -9384517
4037 -9384517 -12654374 -14262256 -12162548 -8880745 -8632400 -11383576 -12529679 -9288892
4029 -9288892 -4682822 -3184440 -4618442 -5268538 -3740241 -2378734 -3105496 -5125264 -7386094
4020 -7386094 -10328024 -13813374 -15752497 -14721287 -12364710 -11254385 -11373052 -10628763 -8322769
4011 -8322769 -6227167 -6096964 -7559879 -8951223 -9311248 -9028671 -9050329 -9897928 -11183147
4002 -11183147 -11834592 -11052076 -9230860 -7687190 -7284891 -7632856 -7856903 -7694840 -7290166
3993 -7290166 -6329309 -4327188 -1706768 450104 1864316 3017908 3269768 730905 -4692606
3984 -4692606 -9641309 -10730373 -8784134 -7407568 -7850320 -7953815 -6329930 -4637235 -4569368
3975 -4569368 -5157319 -4913796 -4740457 -6469514 -9591888 -11533864 -10733931 -7821831 -4117185
3966 -4117185 -487366 2372748 3779298 3474360 1797905 -348039 -1629019 -1297760 -477574
3957 -477574 -1211537 -3504115 -4678005 -2825605 395838 1945269 1368721 855979 1910962
3948 1910962 3610946 3939021 1586213 -3173092 -8148686 -10214576 -7956257 -3161460
3940 -3161460 1174451 3646070 4337546 3267397 822484 -1112131 -732851 1110957 1870378
3931 1870378 782313 -469121 -611663 -369662 -887134 -2351684 -4594272 -7342181 -9351901
3922 -9351901 -8982028 -6414173 -3885457 -2908303 -2537650 -1245144 692580 1758019 1347048
3913 1347048 345982 -36055 684176 2079711 3155545 2976934 1173292 -2069828 -6063587
3904 -6063587 -9441375 -10778410 -10098185 -8883164 -7705518 -5138739 -547830 3531189
3896 3531189 4338988 3194043 3563936 5153843 3843616 -1611370 -6819292 -7797923 -6321658
3887 -6321658 -6276822 -7527391 -7239238 -5589676 -5922639 -9475767 -13548530 -15287316 -14316752
3878 -14316752 -11222475 -6523040 -2150742 -1023338 -3366086 -5640012 -5066709 -3446295
3870 -3446295 -4235015 -7121648 -8234553 -5545451 -1572048 35731 -1180692 -2746873
3862 -2746873 -2766647 -1775704 -1271951 -1539708 -1499773 -363366 1209315 1931814 1640755 1614474
3852 1614474 2814188 4212819 3544381 -174306 -5290957 -8902659 -9420235 -7695929 -5829432
3843 -5829432 -4996874 -4455197 -2828869 -398779 529312 -1719684 -5583182 -7577022 -6374297
3834 -6374297 -4179985 -3430678 -3692605 -3194882 -2020784 -1515065 -1172155 1113887 5211343
3825 5211343 7684111 5883354 1301337 -2552222 -4021636 -3510677 -1511103 1224484
3817 1224484 2501076 384051 -3775464 -6156939 -4856163 -1940460 -748312 -2534582
3809 -2534582 -6135379 -9515047 -11055779 -10452944 -8827813 -7047689 -3997011 1883411
3801 1883411 9086542 13152425 11473494 6428117 2413961 1196672 1713576 2905634
3793 2905634 4292959 4514939 2198565 -1251807 -2145445 1049516 5484996 7524690 7165274
3784 7165274 7089976 8134746 7923261 4401205 -967864 -4625825 -4775221 -2850742 -1473696
3775 -1473696 -1789317 -2870587 -3150283 -2128506 -775366 -373271 -1124362 -2128737 -2532395
3766 -2532395 -2088979 -704078 1422033 2750868 925795 -4304381 -9601184 -11181573
3758 -11181573 -8998286 -6103666 -4383215 -3216567 -2245645 -2467298 -3538716 -2879019 477708
3749 477708 3316106 2066568 -2268060 -5677770 -6655821 -7252138 -8876640 -9944596 -8485322
3740 -8485322 -5109363 -2350341 -2062108 -3988374 -6277107 -7341999 -7541517 -8354044 -9565141
3731 -9565141 -8978394 -6088238 -3800142 -4154314 -4538305 -1707820 2078574 1615664 -3051851
3722 -3051851 -6236993 -5302334 -4426086 -7347904 -11189509 -11177896 -7839120 -5185312 -4278554
3713 -4278554 -3132370 -1552521 -1551915 -3242279 -4217982 -3424371 -2518254 -2797174 -3357130 -3020231
3703 -3020231 -2110135 -1713617 -2593064 -4877524 -7475063 -8254945 -6524492 -4694405 -5384830
3694 -5384830 -7535545 -7998062 -6529479 -5933857 -6943791 -6549969 -2850802 1605921 3575643
3685 3575643 3794100 5196014 8029964 9661730 8621601 6085310 3110963 -1170360
3677 -1170360 -7462500 -13885957 -17210612 -16250089 -12927963 -9688887 -6706149 -2623305
3669 -2623305 2188717 4686427 2529622 -2571606 -6544739 -7738952 -8217201 -9926927
3661 -9926927 -11490092 -10130796 -5665153 -965784 1280933 1086710 472537 1291725 3962564
3652 3962564 7526252 10335178 10937706 8912877 5218936 1669486 -285443 -519308 71615
3643 71615 786430 1615315 2377064 2121634 201220 -2427489 -3936169 -3663107 -2600722
3634 -2600722 -1797991 -1172247 -188351 1121467 2335265 3215686 3490802 2489227 -229183
3625 -229183 -3837429 -6431139 -6728444 -5563488 -5263475 -7150880 -9902508 -11075862 -10264252
3616 -10264252 -9742451 -11495113 -14614479 -16583778 -16295369 -14490900 -11804808 -8092411
3608 -8092411 -3768857 -224648 1617390 2003825 1214007 -977104 -3959598 -5581674 -3977085
3599 -3977085 322059 4831246 7234141 6569971 3184790 -1375233 -4807766 -5600993 -4321898
3590 -4321898 -2702363 -1575007 -632892 -168996 -1564490 -5121335 -8524998 -9119946 -7413001
3581 -7413001 -6404036 -6976493 -6127828 -1534798 3777016 4278773 -738918 -5759304 -6032146
3572 -6032146 -3367443 -2978293 -6386306 -9965712 -9769465 -5581600 -360579 2652882 2404372
3563 2404372 928488 1441216 4444170 6682976 5484293 2762051 2270292 3968445 4417959
3554 4417959 2503277 1021827 1804390 2882088 2211204 1065540 1406397 2444615 2488836
3545 2488836 2175167 2909038 3566700 1906599 -1485796 -3694833 -3709035 -3400796 -4184822
3536 -4184822 -5343284 -6136082 -7057925 -8075161 -7799867 -5685740 -3338264 -2344105 -2272680
3527 -2272680 -2183194 -2624408 -4264781 -5600510 -4382279 -1157725 867285 38153 -1656241
3518 -1656241 -1753410 -827558 -1096484 -2720955 -3779147 -3573639 -3515020 -4294606 -4645718 -4142766
3508 -4142766 -4898913 -8279561 -11601607 -10991464 -6883763 -3753259 -4297361 -6757751 -8728900
3499 -8728900 -10704573 -13995348 -17165237 -16958860 -12151327 -4861707 1585962 5032616
3491 5032616 5330296 4016830 2884330 2124131 346379 -2964651 -5812840 -5506762 -1724181
3482 -1724181 3030309 5821753 5776287 4634179 5059585 7813412 10580962 10473612 7508233
3473 7508233 4212244 1988653 44873 -1796427 -2059223 -696902 -418252 -2707721 -4846863
3464 -4846863 -3678171 -494181 1029180 458579 533880 1971663 2124633 -524408 -3672127
3455 -3672127 -4281518 -2220869 301482 1373325 660395 -697867 -1069571 -229653 33536
3446 33536 -1402561 -2584493 -1104849 1530801 1355569 -2113666 -4876948 -4362487 -2908587
3437 -2908587 -3607389 -5755434 -6776460 -6102468 -4425720 -1149383 4311752 9887372 12450032
3428 12450032 11524030 9049516 6104231 2345461 -1655605 -4121717 -4384884 -3426095 -1790476
3419 -1790476 1134102 5274568 9026608 10992491 11291276 10471503 8242779 4173650 -902465
3410 -902465 -4887806 -5921730 -4102999 -1956708 -2544736 -6283617 -10072690 -10517181 -7633726
3401 -7633726 -4345167 -2760498 -2304477 -1318103 1019098 4531260 8358394 10949944 10916641
3392 10916641 8458974 5115506 1832712 -1673540 -5339431 -7885245 -8405390 -7865286
3384 -7865286 -7927178 -8740800 -8838617 -7119361 -4305867 -2343778 -2510372 -4051605 -4863042
3375 -4863042 -3942587 -2897168 -4151750 -7694512 -10689195 -10642213 -7956508 -4966763 -3592037
3366 -3592037 -4559912 -7630128 -11321765 -13242108 -12086116 -9021153 -6131327 -4030510
3358 -4030510 -2123699 -544850 -141747 -645750 -590624 481398 1063800 -452733 -3901458
3349 -3901458 -7711934 -10226283 -10399196 -8359525 -5700294 -4023679 -2791998 -122628
3341 -122628 3651602 5217991 2656500 -1150205 -1844460 633859 2226972 435300 -2873204
3332 -2873204 -4751326 -4762188 -4222951 -3878629 -3702929 -3593495 -3069205 -1537319 127820
3323 127820 -204309 -2817806 -4836122 -3811825 -1321144 -801924 -2712302 -4284890 -3721399
3314 -3721399 -2093515 -874432 -26487 668684 454577 -1026134 -2678715 -3454062 -3825075
3305 -3825075 -4767828 -6165373 -7091235 -6931235 -5645692 -3840835 -3013587 -4354781 -6560382
3296 -6560382 -6502580 -3462371 -1067599 -2847461 -6941627 -8030092 -4461091 -578956 -937988
3287 -937988 -4639347 -7324893 -7132475 -6107186 -6225613 -6785040 -6584700 -6481425 -7857041
3278 -7857041 -9645972 -9193629 -6130821 -3314691 -3068117 -4157620 -3845936 -1626544 841836
3269 841836 2531242 3470901 2725184 -1296836 -7650843 -12255988 -12037483 -8227749 -4216360
3260 -4216360 -1672761 -539088 -1316044 -4596173 -8676339 -10334793 -8631739 -5974000
3252 -5974000 -4646953 -4084248 -2683181 -767161 -110746 -1348636 -3476858 -5616504 -7734299
3243 -7734299 -9450673 -9576774 -7727897 -5666612 -5901088 -8764433 -11537226 -11006579 -6815140
3234 -6815140 -1869226 671362 392856 -713996 -1183534 -1796207 -4093945 -7896179 -11127268
3225 -11127268 -12026696 -10757746 -8588460 -6287100 -4117908 -2910023 -3744382 -6144811
3217 -6144811 -7724550 -6693947 -4185089 -2984691 -4193580 -6245383 -7140030 -6398844 -4673013
3208 -4673013 -2852386 -2133986 -3550292 -6360674 -8015013 -7015110 -4996286 -4533853 -5498062
3199 -5498062 -5295158 -2611524 758289 2176505 951372 -1563979 -3561065 -4048943 -3557043
3190 -3557043 -3964857 -6603820 -10135978 -11511381 -9650211 -6940196 -6193207 -7317461 -8180897
3181 -8180897 -7609420 -5874986 -3040144 1080192 5397933 7992441 8501353 8395979 8338528
3172 8338528 7031290 3684882 -26243 -2006593 -2519350 -3107118 -3548340 -2068850 1412836
3163 1412836 4223610 3715043 -204559 -5637918 -10339316 -12356439 -10793981 -7074662
3155 -7074662 -4157377 -3321096 -2913494 -1552060 -1052736 -3917065 -8690712 -10630624 -7502423
3146 -7502423 -2457134 -74853 -1296977 -3669952 -5230987 -6211943 -7346178 -8468575
3138 -8468575 -9434697 -11137035 -14297497 -17466455 -17606767 -13606340 -8455144 -6279031 -7085257
3129 -7085257 -6461827 -1669769 3960571 5113085 1683055 -1430473 -1649136 -2045249 -5752699
3120 -5752699 -10297226 -10613324 -6190102 -2008814 -2418610 -6430746 -9592070 -8955426 -5517785
3111 -5517785 -2539281 -1970862 -2543974 -1675095 961230 3044131 3082192 2351034 2141721
3102 2141721 1149072 -2060175 -5493303 -5774490 -3236641 -1695307 -2748393 -3468035 -1063260
3093 -1063260 2827826 4488768 2981290 549977 -768457 -961964 -963928 -1500899 -3039768
3084 -3039768 -5615699 -8405490 -10102061 -9886221 -7904178 -5145217 -3045405 -2570821 -3240338
3075 -3240338 -3631897 -3297275 -3484158 -5368343 -8285643 -10545845 -11464345 -11627882 -11394313
3066 -11394313 -10068417 -6730063 -1462860 4227326 8092125 8742429 7014638 5247182
3058 5247182 4672277 4117687 1995432 -1202912 -3695018 -5237385 -7333296 -10204352 -11402114
3049 -11402114 -8904142 -4531376 -2328721 -3612407 -5500920 -5077028 -3366713 -3625139
3041 -3625139 -6573718 -9375243 -9496198 -7805044 -6972372 -8006173 -9451807 -9312548 -6839050
3032 -6839050 -3049954 -412318 -1342644 -5766824 -10385732 -11453968 -8269526 -3192723
3024 -3192723 1325010 4539133 6496876 6851243 5158056 1639677 -2615413 -5818277
3016 -5818277 -6264388 -3975888 -1372935 -1134657 -3336386 -5740128 -6825011 -7233314 -8120669
3007 -8120669 -9465695 -10389261 -9988976 -7654701 -3919151 -1279835 -2540197 -7540910 -12815538
2998 -12815538 -15211190 -14610095 -12472761 -9387068 -5386981 -1458131 861110 916393 -890960
2989 -890960 -3639237 -5894278 -6254517 -4835280 -3218120 -2114571 -462376 2040785 3246002
2980 3246002 1420017 -1372908 -1154503 3096514 8531536 12127822 13188205 12154992
2972 12154992 9219571 4975621 986556 -1216684 -1111480 829975 3214000 4135505
2964 4135505 2982258 1715782 2698036 5195108 5951971 3617378 479073 -1109583 -1872270
2955 -1872270 -3516587 -5240427 -4716153 -1882944 582120 794145 -147719 -109718 1290802
2946 1290802 2733168 3138435 2478631 915549 -1794785 -5504995 -8665626 -8918322 -5319978
2937 -5319978 56869 3418690 2743417 -176510 -1727060 -443084 1774206 2660820 2769067
2928 2769067 4441614 8002390 10641399 9711537 5789627 1382249 -2229252 -5202864
2920 -5202864 -7055234 -6758040 -5135557 -4895858 -7232263 -10061172 -10782752 -9316365 -7151143
2911 -7151143 -4942907 -2808885 -1728664 -2427758 -3501037 -2854150 -816612 227205 -718214
2902 -718214 -2238199 -3060586 -3397106 -3195893 -1412364 1705581 3589175 2395616 -255221
2893 -255221 -1455854 -956296 -865915 -1871811 -2034652 189593 3593415 5926143 6716635
2884 6716635 7106226 7572307 7299681 5815740 3920387 2445496 1120601 -401044 -1105424
2875 -1105424 473797 4039858 7542459 9651458 10927217 11989171 11987027 10180771 7998894
2866 7998894 7724766 9341793 10309465 8762300 5642718 3177179 2325409 2483142 2959858
2857 2959858 3757844 4923870 5795948 5381602 3614636 1935927 1995167 3605313 4653464
2848 4653464 3440551 398260 -3059261 -6421723 -9695418 -11872608 -11430655 -8431180
2840 -8431180 -4887654 -2847360 -3038522 -5301879 -8984960 -12544586 -14047639 -12914468
2832 -12914468 -10509274 -8404228 -6637834 -4342350 -1735084 -678569 -2832209 -7284430
2824 -7284430 -10554956 -9741585 -5688396 -2081403 -1188564 -1821007 -2076666 -2212871 -3172021
2815 -3172021 -3938394 -2949348 -1328199 -1873689 -4850202 -7435628 -7736718 -6835151 -6212592
2806 -6212592 -5712115 -5149764 -5492914 -6801808 -7032176 -4842849 -2098573 -1539609 -2958370
2797 -2958370 -3682502 -2359228 -500137 -319563 -2322431 -5158218 -7062765 -7293642 -6415420
2788 -6415420 -5165474 -3399131 -844797 1583187 2579334 2315769 1832022 694886 -2492149
2779 -2492149 -6887481 -9271420 -8174033 -5851081 -4882240 -5084150 -5264269 -5585815 -6221036
2770 -6221036 -5957940 -4428301 -3536652 -4184246 -3946073 -1186570 794838 -2072948 -7733392
2761 -7733392 -10003532 -7224906 -4230703 -4962093 -7557177 -8465956 -7628312 -7113028 -7394182
2752 -7394182 -7564045 -7386322 -6918507 -5570542 -3522933 -2798080 -4946345 -8561176 -10854511
2743 -10854511 -11021356 -10419089 -9894911 -8594316 -5601320 -1751519 643326 -100704 -2998091
2734 -2998091 -4784179 -3232850 88074 1589019 81755 -2201098 -3141575 -3159186 -3255080
2725 -3255080 -2825051 -1125013 663624 845239 -248400 -1021081 -1297688 -2387820 -4744600
2716 -4744600 -7296553 -9105378 -10081581 -9828832 -7376483 -2884848 1395051 2919381 1424875
2707 1424875 -880528 -1708403 -908576 -136744 -583456 -1595758 -1722020 -415998 1902261
2698 1902261 4660986 6757612 5999713 968553 -6249399 -11152367 -11510871 -9314276 -7190654
2689 -7190654 -5030346 -1916831 661053 534855 -1038771 -272405 3695787 6997910 5908824
2680 5908824 1477421 -2231914 -3006007 -1803888 -193867 1369217 2596712 2512376 639414
2671 639414 -1625431 -1910069 608993 4019079 5411958 3761185 676524 -1817097 -3642252
2662 -3642252 -6121438 -9420882 -11781909 -11823589 -10582836 -10087292 -10355021 -9343160 -6204956
2653 -6204956 -3084316 -2468249 -3685260 -3725268 -1376783 1232033 1770726 790101 468972
2644 468972 1333738 1740278 264830 -2668575 -5487332 -6857792 -6534671 -5689173 -6105430
2635 -6105430 -8146089 -9989814 -10034238 -9400492 -10291553 -12229270 -12227264 -9067542 -5073715
2626 -5073715 -2717347 -1760898 -1261740 -2160724 -5411014 -8914909 -9170492 -5687087 -1414901
2617 -1414901 1187861 2242149 2353230 895691 -2399820 -5906894 -7719376 -7857771 -7545607
2608 -7545607 -7047478 -5714584 -3893111 -3230666 -4600762 -6703870 -7462278 -6369587 -4806227
2599 -4806227 -4184116 -4391794 -4177646 -2573072 295481 3313764 4833022 3436299 -921368
2590 -921368 -6423485 -10605385 -12293692 -12120634 -11290313 -10399693 -9410017 -8075004 -6271034
2581 -6271034 -4466444 -3773304 -4702110 -5950813 -5633911 -3941751 -3234129 -4975245 -7998100
2572 -7998100 -10554746 -12402797 -13546638 -12707582 -9347042 -6098048 -6352599 -9563191 -11623563
2563 -11623563 -10279186 -7445537 -5238067 -2637021 1697209 5452788 4638188 -1061494
2555 -1061494 -7574126 -11150431 -11476525 -9808272 -6641826 -2709764 -337327 -1486527
2547 -1486527 -4942199 -7224929 -6334593 -3397995 -764481 203216 -549752 -2125724 -2865510
2538 -2865510 -1490204 1202234 2771791 1922373 -186120 -2085708 -4064803 -6759994
2530 -6759994 -8887369 -8368652 -5360326 -2316273 -940012 -635489 -241893 123739 -482286
2521 -482286 -2403119 -4666207 -5164024 -2098203 3623840 8179280 8822342 7518307 8223956
2512 8223956 10846026 11093813 7043304 2407959 1331013 2819892 3098306 1367376 19480
2503 19480 260772 674314 -81900 -1623257 -2876685 -2908125 -1067076 1848035 3116494
2494 3116494 846214 -3294650 -6229332 -7677489 -9505883 -11299162 -10050552 -5070911
2486 -5070911 -38969 1508085 344836 -610039 -628258 -1087468 -2293744 -2796304 -1717241
2477 -1717241 968 1025294 1257006 1510326 1989992 1727865 31394 -1740568 -1167016
2468 -1167016 1690029 3221680 607792 -3872952 -5505133 -3643552 -2255742 -3421521
2460 -3421521 -3973892 -716102 4058719 5548366 3264535 1303449 2197972 3902707 3728572
2451 3728572 2515474 2964891 5205725 6225956 3859944 -174115 -2196984 -883991
2443 -883991 1665270 3252366 4300664 6056324 7508972 6427126 3082716 355467
2435 355467 -442139 -1456071 -4777076 -9038473 -11283470 -10953642 -10284415 -11440829 -14569210
2426 -14569210 -18016593 -19384221 -17130052 -12238560 -7690729 -5525367 -5301834 -5951549
2418 -5951549 -7448935 -9490162 -10376117 -9113243 -7233420 -6544626 -6416714 -5538367 -4986506
2409 -4986506 -6618299 -9203399 -9403637 -6564259 -3448614 -1888350 -840179 407348
2401 407348 301560 -1978900 -4210976 -4043971 -2378679 -1497480 -1168720 731652 4092835
2392 4092835 5547639 2334189 -4131580 -9370513 -10130904 -7264977 -4570332 -4999366 -8147867
2383 -8147867 -11448294 -13111796 -13023697 -11288178 -7615204 -2654851 1499001 3190485 2847620
2374 2847620 2024172 1592261 1641648 2291037 3460772 4266717 3683662 1752560 -424600
2365 -424600 -1595683 -854434 2025472 5808932 7855641 6187862 1577279 -3282939 -6687939
2356 -6687939 -9074286 -11163094 -12204605 -11030858 -8196532 -5715872 -4451865 -2947534
2348 -2947534 261497 3992466 5585041 4657070 3940770 5563355 8014552 8267275 5833461
2339 5833461 2896590 1079872 170750 -164886 290666 899604 332208 -1039549 -1023659
2330 -1023659 931421 2212604 726635 -1602417 -1286488 1796315 4324593 4069624 2296336
2321 2296336 1402147 2038456 3295100 4455614 5579821 6705546 7052234 5365474 1522962
2312 1522962 -2343580 -3523944 -2001064 -680645 -1530067 -3191783 -3873536 -4608208 -7062554
2303 -7062554 -9676602 -9579320 -7820726 -8608770 -12581264 -14857272 -11837498 -6636059 -4822143
2294 -4822143 -7048150 -9179515 -8434996 -6114106 -4633989 -4807415 -6304874 -8383859 -9576160
2285 -9576160 -8566201 -6056785 -4317534 -4434698 -5389970 -6166099 -7087369 -8350547 -8828810
2276 -8828810 -7581987 -5522102 -4274321 -3966685 -3373327 -2016981 -984720 -1426563 -3016379
2267 -3016379 -4398930 -4899381 -5327439 -6941675 -9848799 -12742669 -14161701 -13607309 -11451499
2258 -11451499 -8392694 -5234513 -2517677 -30734 2528088 4046196 2436940 -2375495
2250 -2375495 -7123971 -8495802 -6993141 -5706229 -5907532 -6192821 -5875635 -6512506 -9112487
2241 -9112487 -12013796 -12946489 -11741944 -9763089 -7898763 -6294533 -4987564 -3731208
2233 -3731208 -2129478 -718046 -701747 -1841745 -2125845 -603595 1083241 1366100 1262572
2224 1262572 2435633 4222884 4701218 3574837 1867289 -225271 -2823753 -4511114
2216 -4511114 -3538869 -618720 1670231 1957450 588708 -2190860 -6019989 -8902808 -8781964
2207 -8781964 -6600031 -5117670 -4834573 -4066917 -2945209 -3637538 -5950492 -6541498 -3930096
2198 -3930096 -730347 898419 2468352 5436099 7632865 6599590 3878515 2606424
2190 2606424 2894007 2998731 3246026 4962494 6721854 5685464 2358192 328122 1057427
2181 1057427 2162317 1347319 -809428 -2601769 -3198722 -2315836 -233373 1288422 425758
2172 425758 -1711966 -1796725 1134764 4041617 4036744 2223663 1803602 3718431 5833547
2163 5833547 5834369 3656547 1133258 -119890 -313834 -845011 -2056466 -2572990 -1526182
2154 -1526182 -172889 109062 216494 1692301 3658704 3842400 2104907 319077 -911405
2145 -911405 -2497548 -3984199 -3784961 -2713201 -3708807 -6957915 -8835029 -7457440 -5983029
2136 -5983029 -8042211 -12708942 -16589678 -18408978 -18703510 -17200860 -13733327 -10189838
2128 -10189838 -8452506 -7625019 -6187043 -5435894 -7328349 -9966746 -9258156 -5067053 -1939788
2119 -1939788 -2928225 -5876225 -6911817 -4847233 -848206 3705175 7287978 8095765 5811007
2110 5811007 2572209 876053 1238905 2659683 4232112 5295509 5035734 3190217 670769
2101 670769 -1353650 -2565429 -3146373 -2973501 -1899418 -432554 473856 149284 -1426801
2092 -1426801 -3520624 -4780358 -4123323 -1767144 1142411 3996986 6984000 9588607
2084 9588607 9843061 6064930 -770517 -6977967 -8827106 -5669264 -806840 1091310
2076 1091310 -1781163 -6668829 -9281966 -8304239 -6200633 -5926448 -7994330 -10728343 -12076845
2067 -12076845 -10863693 -7508903 -4077169 -2599515 -2889858 -3104904 -2803247 -3784355 -6841710
2058 -6841710 -9352138 -8036053 -3243151 1582719 4347403 6038728 7894447 9231387
2050 9231387 9177173 8574088 8365190 7413428 4173326 14895 -1539258 708850 4014961
2041 4014961 5420161 5127193 4699631 3717199 664591 -3702272 -6635550 -7208272 -7361647
2032 -7361647 -8407763 -8834716 -7061474 -4534847 -4076963 -6110545 -8394494 -9070031 -8373582
2023 -8373582 -7481197 -6969374 -6468786 -5013455 -1967778 1693093 3620788 2561764 -15101
2014 -15101 -1782171 -2289050 -2543422 -2690309 -1958080 -600906 -4831 -776821 -2377125
2005 -2377125 -4674647 -7980791 -11164245 -11690016 -8544211 -3798539 -360362 788402
1997 788402 461070 -356950 -1013197 -1055866 -730955 -1086802 -2675299 -4464444 -4750963 -3058284
1987 -3058284 -813927 -274006 -2717149 -7225937 -11221161 -12632134 -11492296 -9183375
1979 -9183375 -6820130 -5120887 -4891720 -6096515 -6982914 -5858258 -3435082 -1634428 -460720
1970 -460720 1630720 4343614 5279860 3658111 1578632 600403 -183463 -1296713 -1084465
1961 -1084465 1059401 2393479 692679 -1703590 -1115339 1643862 2433761 255771 -1263350
1952 -1263350 677229 4475558 7133325 8067726 8331610 8109814 6857981 4767580 2534040
1943 2534040 298890 -2075999 -4157702 -5190193 -4840774 -3191800 -447808 2859414
1935 2859414 5748535 7330014 7391940 6438948 5379010 4955566 5037471 4707053 3539445
1926 3539445 2353303 1962182 1737481 548872 -1258703 -2289169 -2463053 -3345767 -5620988
1917 -5620988 -7641657 -7350505 -4693804 -1372187 946923 1376485 -332335 -3423459 -5881204
1908 -5881204 -5712063 -2882346 487679 2135596 1645590 285376 -842300 -1913464 -3382825
1899 -3382825 -4478441 -3772963 -1397238 514808 421141 -456192 308830 3131827 6005959
1890 6005959 7080172 6408548 5099113 3883821 2827701 1639589 91222 -1282266
1882 -1282266 -1188950 725218 2525565 1825435 -924160 -2580769 -1263278 1359437 2579639
1873 2579639 2051003 1415725 1555087 1778442 1411573 809301 623052 952338 1460381 1793229
1863 1793229 1730666 1252386 490459 -565382 -2091383 -3803989 -4571263 -3334207 -617149
1854 -617149 1434459 1134867 -730018 -1718698 -905266 -357508 -2327073 -5545150 -6313590
1845 -6313590 -3719639 -1481046 -2917074 -5943891 -5794516 -1857642 1336309 153558
1837 153558 -4162378 -8504974 -11897031 -14437888 -14675561 -11142512 -5721410 -2649797 -3846061
1828 -3846061 -7078400 -9070494 -8769737 -7063195 -4890426 -2804504 -1546255 -1754438 -3045807
1819 -3045807 -4044130 -3565135 -1641666 548775 1541261 474275 -2336898 -5324003 -6530093
1810 -6530093 -5348218 -3487177 -3353685 -5095075 -6198674 -4770993 -2199122 -1250715 -2274615
1801 -2274615 -3036682 -2106288 -516353 266294 286826 304193 402758 162162 -829545 -3117483
1791 -3117483 -6840478 -10564969 -12026158 -10752420 -8714815 -7715021 -7489602 -7106590 -6647092
1782 -6647092 -6440776 -6094404 -5452562 -5178311 -5313781 -4822385 -3701973 -3613398 -4823986
1773 -4823986 -4724196 -1771038 1057237 -143561 -4455384 -7361421 -6975614 -5523280 -4862861
1764 -4862861 -4320097 -3539827 -3840083 -5413016 -6310871 -5813729 -5967448 -7910277 -9357437
1755 -9357437 -8122753 -5916993 -5874631 -7909472 -9439825 -9628233 -9758905 -9787408 -7789340
1746 -7789340 -3548955 31737 593197 -436702 20468 2410421 4261379 3820728 2053841
1737 2053841 442968 -1549279 -5186438 -9320358 -10711234 -8119065 -4334752 -2859999
1729 -2859999 -3938213 -5523611 -6835098 -8398672 -9247772 -7332186 -3273375 -646738
1721 -646738 -1114082 -1936460 -256679 2550391 3376474 2303790 1844437 2361132 1742084
1712 1742084 -513024 -2335141 -2900941 -4188108 -7212490 -9475532 -8437712 -5545813
1704 -5545813 -4069039 -4099353 -2769645 738896 3573412 3582019 2546690 3012243 3921245
1695 3921245 2340937 -1388300 -3726307 -3649566 -4801216 -9913021 -15875173 -17587232 -15156703
1686 -15156703 -13498715 -15070562 -16858032 -15515889 -12014311 -9210659 -7501317 -5432143
1678 -5432143 -2896370 -1165095 -694244 -1013233 -2010094 -3485162 -4294334 -3784920 -3165258
1669 -3165258 -3522889 -3583681 -1821961 185346 -531653 -3653968 -5706304 -5048775 -3657135
1660 -3657135 -3290565 -3007408 -1856290 -1305616 -3031336 -6094301 -7976653 -6998350 -2658354
1651 -2658354 4370678 11095644 13276947 9946600 5342720 4075496 5635411 6057297
1643 6057297 3874889 1540834 1253875 2141291 2110462 549062 -1449792 -2351959 -1501032
1634 -1501032 -108712 -519087 -3356544 -6210205 -6717457 -5955095 -6592783 -8635493 -9979072
1625 -9979072 -10746899 -13298226 -17124105 -17540372 -11664797 -2944988 2811740 3961301 3119851
1616 3119851 2460772 1764073 243175 -2334617 -5963559 -9645927 -10759295 -7407625 -1259244
1607 -1259244 3913368 6293326 6729029 5967899 3813497 1107737 -225963 32757 -197836
1598 -197836 -2206638 -4765148 -6278416 -6563801 -5639785 -3174414 -492577 -617691 -4238779
1589 -4238779 -7689057 -7277822 -3934981 -1176849 -244194 -139083 -812679 -2635445 -3699464
1580 -3699464 -1836287 813092 -341286 -5156951 -7959649 -5748495 -2847005 -4277445
1572 -4277445 -8081477 -8350572 -3636831 2018967 5311978 6666021 7212271 6765967 5558956
1563 5558956 4837505 4764972 4206046 3233177 3268798 4017011 3048122 -337589 -3435048 -3874020
1553 -3874020 -2703563 -2068727 -2118196 -2236182 -3107555 -4997287 -5827480 -3924625 -1373310
1544 -1373310 -1540898 -4160968 -6087864 -6313104 -6613387 -7229894 -5910564 -2360901 44228
1535 44228 -1047378 -3640374 -5124391 -6554828 -10072579 -14048036 -14535578 -10900297 -6603450
1526 -6603450 -4327783 -3364829 -2408826 -2087669 -3329399 -5217318 -6082442 -5650377 -4975755
1517 -4975755 -5057986 -6227182 -7970996 -8791842 -7338605 -4347524 -2312732 -2487102 -3409808
1508 -3409808 -3234933 -2170893 -1504771 -1565064 -2058594 -3165967 -4656594 -5110732 -3953370
1499 -3953370 -3134151 -4446643 -6155294 -5224367 -2412026 -1643627 -3877409 -5234279 -2732000
1490 -2732000 1339147 2977704 1778704 54273 -1324229 -3308186 -6148407 -9063230
1482 -9063230 -11441592 -12270207 -9925655 -5144631 -2414147 -4856291 -9034627 -9006829 -4744623
1473 -4744623 -1633379 -1551567 -172254 5035049 9637399 8636240 3799218 349509 -534798
1464 -534798 -1375598 -2848705 -3412703 -3206098 -3634928 -3646777 -943982 3095583 4137986
1455 4137986 1152698 -2165797 -3229397 -3776179 -5681717 -7369126 -6755379 -4738231 -3174830
1446 -3174830 -1805412 234082 1847245 1563443 190199 -523829 -597665 -978457 -1278539
1437 -1278539 -628828 376183 905969 1943688 4611453 7448039 8151222 7383416 7857180
1428 7857180 9827493 10514799 8251200 4228680 -446187 -6282057 -12618314 -16199922
1420 -16199922 -14868759 -10969035 -8822084 -9762359 -11531766 -11851779 -10765506 -9717277
1412 -9717277 -9817479 -11030995 -12107320 -11521720 -9331535 -7648471 -8211315 -9893212 -9904850
1403 -9904850 -7370128 -4413327 -3506568 -4882687 -6886481 -7778728 -6729975 -4205562 -2226776
1394 -2226776 -3206782 -7170090 -10656208 -9931132 -5325360 -963087 90095 -1151778 -2105461
1385 -2105461 -2346493 -3127579 -4449766 -5087675 -5291972 -6865131 -9816859 -11229948 -8909242
1376 -8909242 -4492375 -1242554 -38193 487451 707727 -744811 -4407739 -8544950 -10802651
1367 -10802651 -10144845 -6958451 -2541779 1087712 2101565 459470 -1853244 -2686903
1359 -2686903 -1665986 -260319 -210244 -1747588 -3190655 -2819617 -1419276 -1881111 -5412229
1350 -5412229 -9374599 -10456721 -8981119 -7921187 -8186135 -7474032 -4113121 378856 3479879
1341 3479879 4521950 4413720 4151827 4587723 6202050 8127973 8709409 7832841 7232275
1332 7232275 7624388 7248956 4525735 630763 -2082397 -3030894 -3354254 -4034051 -5437110
1323 -5437110 -7601447 -9510898 -9182982 -6112374 -2771722 -2132971 -4402854 -7430209 -9226121
1314 -9226121 -8667117 -5164159 247696 4505084 5396621 4107177 2918603 1544684 -1611616
1305 -1611616 -5535348 -7284852 -6452167 -5563242 -5598662 -4515330 -1335699 1513402 1774409
1296 1774409 652354 419475 853413 386808 -837347 -1534278 -1784809 -2477952 -2837189
1287 -2837189 -975538 2963699 6243429 6646458 4769539 2753821 1931489 2370675 3810552
1278 3810552 6022674 8342559 9558219 8778721 6469006 4248293 3294268 3163304 2605145
1269 2605145 1205370 -465383 -1975112 -3255467 -3873822 -3407924 -2731622 -3516991 -5883728
1260 -5883728 -7779738 -7431082 -5342042 -3168868 -1781447 -1340687 -2095343 -3781485 -4992013
1251 -4992013 -4449266 -2531946 -640873 422579 672299 368532 256779 1492432 4011459
1242 4011459 5711887 4752120 2093441 145395 -601099 -1600205 -3061123 -3088816 -772390
1233 -772390 1872474 2424711 1198723 395034 1028488 2340451 3854618 6218820 9578714
1224 9578714 12519078 13630097 13378055 13219397 13067583 11032509 6263508 908491 -2010087
1215 -2010087 -2142358 -1795710 -2524024 -3485102 -3683230 -3927647 -5081657 -5732304 -3705265
1206 -3705265 521714 3897457 4423241 3017322 1466602 276517 -679185 -1031146 -832060
1197 -832060 -1510178 -4246640 -7834847 -9716470 -9134454 -7819722 -7253064 -6683959 -4715168
1188 -4715168 -1746266 444269 1043560 822629 507525 -192376 -1641824 -3469810 -5197238
1179 -5197238 -6721805 -7629723 -7078426 -5232912 -3866747 -4418271 -6230468 -7882883 -9281608
1170 -9281608 -10700063 -10583351 -6800463 -182033 5567958 8100004 8418954 7982630 6327539
1161 6327539 3100038 177809 -499601 245973 389896 -125565 -168154 -409118 -2744858
1152 -2744858 -6894972 -10165883 -10899053 -9889304 -8048165 -5187663 -2110731 -1471517 -4581546
1143 -4581546 -8723487 -9693039 -6612331 -2735220 -1623560 -3724478 -6778963 -8539492
1135 -8539492 -8550344 -7705496 -6692660 -5230780 -2881135 -217560 1378296 1200505 152482
1126 152482 884 1724389 4471915 6064279 4873270 1524450 -1549938 -2557766 -1979444
1117 -1979444 -1451298 -1629675 -1814582 -1254040 -120882 518085 -736251 -4425157 -8943414
1108 -8943414 -11285163 -10114546 -7390857 -5846986 -5738010 -5555538 -4986566 -4957649 -5182378
1099 -5182378 -4269662 -2610802 -2599932 -4922833 -6786400 -5357540 -1373560 2251337 4139577
1090 4139577 5050080 5686585 5828682 5428493 4901839 4017424 1717390 -2270395 -6208653
1081 -6208653 -7548901 -5690721 -3326359 -4319511 -9697027 -16145563 -19158196 -17335926
1073 -17335926 -12901773 -8668067 -5844550 -4408690 -3799501 -2932544 -1034897 1099988
1065 1099988 1921890 1324210 575703 31566 -1126924 -2522405 -2271381 -34771 1803547
1056 1803547 1409127 35785 -245611 465673 914080 950109 839011 -28128 -1519928
1047 -1519928 -1418948 1690415 5333237 5687680 2429485 -1612804 -4773979 -7455842 -9345703
1038 -9345703 -9366929 -8589211 -9529690 -11709944 -11450660 -7458754 -3110578 -1163009 289549
1029 289549 3486044 5670951 2548398 -4314303 -8289428 -6250304 -2233460 -1201590
1021 -1201590 -2707712 -3179455 -1866112 -1158873 -2038449 -2568965 -1338640 239020 289560
1012 289560 -636542 -595963 845733 2288792 2583549 1829340 487690 -1162101 -2632791
1003 -2632791 -3558412 -4619978 -6836003 -9433807 -9730803 -6129655 -415278 3927658 5153909
994 5153909 4164011 2592020 1225454 249718 -178756 -315426 -1332434 -4551930 -9610369
985 -9610369 -13639869 -13343074 -8564044 -2976724 -179191 56830 105838 83201 -2030730
976 -2030730 -5799451 -7305990 -4377886 -82631 1312952 -278253 -2034193 -2998140 -4365497
967 -4365497 -6120731 -6847607 -6687582 -7400418 -9268396 -10596771 -10445851 -9244373 -6676578
958 -6676578 -2081610 2575131 3629876 1053142 -314075 2994233 8121189 9676016
950 9676016 6546689 2263619 -95169 -571314 -503732 -652648 -1335502 -2593822 -3887885
941 -3887885 -4763562 -5724029 -7308934 -8572503 -7855624 -5162095 -2563328 -1861670 -2616566
932 -2616566 -2868773 -1461315 612508 1274067 -51112 -1340993 -452305 1542908 1231124
923 1231124 -2418153 -6224291 -7093096 -6260573 -6972443 -9255845 -10015121 -8096475 -6169312
914 -6169312 -6779691 -9206015 -11623889 -13971259 -16431203 -16867576 -12933396 -6457017 -2700252
905 -2700252 -4238775 -7795246 -8645721 -6384586 -4185750 -3549366 -2743785 -650395 769833
896 769833 -597964 -3623094 -5479063 -5380682 -4682908 -4076747 -3088974 -2225022 -3160443 -6150934
886 -6150934 -9180580 -10565456 -10837665 -11126910 -11144135 -9984341 -7864177 -5815765 -4296537
877 -4296537 -3087854 -2096306 -1527917 -1668892 -2831310 -4829549 -6319076 -5771084 -3560630
868 -3560630 -1894558 -2088116 -3210776 -4115814 -5255376 -7360865 -9800739 -11697862 -13401959
859 -13401959 -15242080 -16007734 -14605222 -12366351 -11607532 -12280949 -11963182 -8969017 -3840747
850 -3840747 1783736 5853263 5980902 1512608 -4088974 -5510202 -1468900 3489419 4289717
841 4289717 799141 -3345181 -5718117 -6762444 -7278835 -6822925 -5278626 -4314744 -5826839
832 -5826839 -9288945 -11715012 -10547682 -6143875 -1164448 2072474 3165665 2941368 2163919
823 2163919 1268750 663642 616826 1030180 1684136 2505294 3375447 3971411 3929023 2769126
813 2769126 -272550 -5406439 -10906061 -13594841 -11677118 -6721664 -2299228 -1109688
805 -1109688 -3659871 -8560657 -13093916 -14407890 -11683881 -7107809 -3844638 -3156305 -3981453
796 -3981453 -4704912 -4459139 -3194891 -1521832 -369699 -155022 -444581 -683154 -632163
787 -632163 93395 1782467 3472901 3498037 1986640 1170840 2063616 2706097 1410258
778 1410258 -184976 327335 2123788 2572985 1471351 659116 136164 -1915593 -5286483
769 -5286483 -7464921 -7803300 -8645772 -11233385 -13490211 -13312536 -11455263 -9585945 -7820421
760 -7820421 -5935136 -4949601 -5466267 -5878021 -4176551 -802516 1619463 901283 -2820560
751 -2820560 -6938269 -8112452 -5585447 -2588598 -2568282 -4534858 -5063419 -4496081 -6764279
742 -6764279 -12096999 -14966661 -12098172 -7936428 -7957104 -10237255 -8908265 -3520509 854519
733 854519 1779581 1812852 2493208 1608820 -1971482 -5541710 -7004599 -8235318 -11236382
724 -11236382 -13962932 -13140245 -9325225 -6173718 -5697489 -6688285 -7157702 -6197389 -3826763
715 -3826763 -927476 721033 -88059 -2328590 -3737844 -3632218 -3666893 -5377785 -7737316
706 -7737316 -7933267 -4645325 -93969 1824257 -279163 -3579701 -4239105 -1769824 977260
697 977260 1810700 1292590 364178 -1930220 -6428834 -10794334 -11158973 -7191802 -3309991
688 -3309991 -3500014 -6394976 -7384422 -4851166 -1841266 -1165678 -1534643 -499149 751758
679 751758 -1221066 -6312432 -9934004 -8987472 -5861218 -4433766 -4448725 -2845685 569569
670 569569 2242576 -73824 -4185120 -6454109 -5998136 -4626397 -3941229 -3916126 -3701383
661 -3701383 -2621174 -512064 2083805 3952983 3951533 2004097 -732351 -2908886 -4233400
652 -4233400 -5392778 -6541937 -6517078 -4456379 -1753098 -883214 -2160035 -3322769 -2886233
643 -2886233 -2079399 -2452516 -3442286 -3886192 -4251432 -5305175 -5918079 -4555245 -2068791
634 -2068791 -644757 -613621 -646044 -511193 -1062220 -1859488 -1606324 -960601 -2080536 -4978972
624 -4978972 -7025720 -6697108 -5283771 -4215895 -3303822 -2486158 -2669259 -3700500 -4053792
615 -4053792 -3750197 -4948756 -8161870 -10627051 -10347258 -9080754 -8992324 -8920091 -6898012
606 -6898012 -4145965 -2972233 -2213586 1220729 6678153 9555309 7462516 3424954 1642610
597 1642610 2430528 2958254 1446610 -1073864 -2584027 -2325808 -1055697 342257 1840624
588 1840624 3472608 4158776 2740356 306478 -326630 1644448 3546751 2868207 654208
579 654208 -554803 -588116 -1061454 -2090908 -2332287 -1766057 -1750952 -2426252 -2587806 -2198717
569 -2198717 -2526213 -3570035 -3932144 -3758481 -5186836 -8848139 -12252956 -13021439 -11853150
560 -11853150 -10873715 -10539667 -9596403 -7045495 -3084964 995963 3242106 2553828 336126
551 336126 -741012 -81742 444356 -37262 194555 2416572 5029121 5875148 5134990
542 5134990 4110635 2985940 1894707 2337548 4845644 6732430 5255266 1980377 648894
533 648894 1321281 430294 -3182832 -6272385 -6379016 -5301539 -5374348 -5517765 -3810759
524 -3810759 -1574736 -1566248 -3444298 -4279731 -3043554 -1698303 -1935973 -3455308 -5601303
515 -5601303 -8115576 -9713486 -8390659 -4244113 -97028 1745397 1695547 952837 -603544
506 -603544 -3108077 -5104307 -5241237 -4380389 -4123301 -4341719 -4201736 -4507632 -6385136
497 -6385136 -8259556 -7208999 -3518863 -834667 -891040 -1034097 1337171 4408976 4449102
488 4449102 1025198 -2803048 -4572762 -4303032 -2822409 -643197 1362998 2205388 2184081
479 2184081 2549033 3340329 2959871 457542 -2856887 -4667587 -3816726 -1062229 1460645
470 1460645 1512439 -1330524 -4698980 -5468060 -3235142 -832781 -1006159 -3620338 -6607325
461 -6607325 -8430928 -8727911 -7601856 -5624589 -4069878 -3882918 -4390320 -3902178 -1767102
452 -1767102 687482 1406864 -383996 -3275716 -4622827 -2819812 931031 3417172 2468452
443 2468452 -934950 -3940459 -4874714 -4457199 -4242811 -4790772 -5742494 -7022420 -9061444
434 -9061444 -11688787 -13433534 -12583679 -9000410 -4490115 -1199369 107436 97930 -311872
425 -311872 -781180 -1477296 -2667128 -4299894 -5729817 -6095669 -5331721 -4547100 -4992153
416 -4992153 -6875621 -9535148 -12301200 -14555042 -15351967 -13959085 -10867493 -7657292 -5725311
407 -5725311 -5356260 -5698945 -5276005 -3128616 -178122 1142100 -464371 -3401426 -5048574
398 -5048574 -4722329 -3570780 -2362670 -1174816 -681114 -1497833 -2365361 -1410577 534869
389 534869 542071 -1729734 -2786752 -279231 3368265 4525550 3482180 3326021 5072892
380 5072892 6742358 6660595 5120272 2984466 929910 50490 1090489 2862848 3220990
371 3220990 1781510 68957 -1022619 -2077803 -3345667 -4046553 -3982201 -4044541 -4449123
362 -4449123 -4088531 -2440456 -668365 46113 7725 36230 223894 514783 1308976 2504898
352 2504898 3043369 2463409 1869158 2147183 2188861 405879 -2533632 -4068583 -2813851
343 -2813851 -12219 2189308 2812793 2131121 701973 -970954 -2238265 -2458340 -1550685
334 -1550685 -279467 213995 -594848 -2040228 -2915388 -2770746 -2311918 -2433164 -3175967
325 -3175967 -3773356 -3398524 -1735030 799620 3129462 4107261 3330220 1330110 -971050
316 -971050 -2685771 -3020311 -1696041 323118 1116386 -507078 -3659860 -6080887 -6254939
307 -6254939 -4759993 -3562936 -4011362 -5536615 -6485997 -6132984 -5244981 -4449035 -3064773
298 -3064773 -576086 1527886 1034755 -1925454 -4711340 -5441039 -4957873 -4894670 -5178658
289 -5178658 -4499455 -2314377 562300 2636089 2352582 -861701 -5226035 -7413431 -6089168
280 -6089168 -3805914 -3940007 -6506975 -8729787 -9180038 -9147764 -9704517 -9626104 -7431179
271 -7431179 -4131106 -2467456 -3730947 -6251677 -7093294 -4956327 -1489940 304001 -746610
262 -746610 -2641722 -2660984 -856948 3115 -1937950 -5384366 -7892130 -8893480 -9543874
253 -9543874 -10334345 -10432657 -9456821 -8559737 -9063598 -10684235 -11781904 -11091204 -8719190
244 -8719190 -5676337 -3000959 -1337204 -832689 -1201513 -2102438 -3450852 -4997411 -5757642
$$ [...]
##END NTUPLES=NMR SPECTRUM
##END=
