##TITLE=31Pdec_DE-136
, 24 sc
 25.3.2026
##JCAMPDX= 6.0         $$ Bruker NMR JCAMP-DX V2.0
##DATA TYPE= NMR SPECTRUM
##DATA CLASS= NTUPLES
##ORIGIN= UXNMR, Bruker Analytische Messtechnik GmbH
##OWNER= root
$$ XWIN-NMR		Version 3.5
$$ Wed Mar 25 14:20:55 2026 Russian Standard Time (UT+4h)  she@DPX200
##.OBSERVE FREQUENCY= 81.013821
##.OBSERVE NUCLEUS= ^31P
##.ACQUISITION MODE= SIMULTANEOUS
##.ACQUISITION SCHEME= undefined
##.AVERAGES= 24
##.DIGITISER RES= 17
##SPECTROMETER/DATA SYSTEM= spect
##.PULSE SEQUENCE= zgpg30
##.SOLVENT NAME= CDCl3
##.SHIFT REFERENCE= (INTERNAL, CDCl3, 0, 197.392)
##AUDIT TRAIL= $$ (NUMBER, WHEN, WHO, WHERE, WHAT)
$$ ##TITLE= Audit trail, XWIN-NMR		Version 3.5
$$ ##JCAMPDX= 5.01
$$ ##ORIGIN= Bruker BioSpin GmbH
$$ ##OWNER= she
$$ F:/spectra/data/she/nmr/P31/2/pdata/1/auditp.txt
$$ ##AUDIT TRAIL=  $$ (NUMBER, WHEN, WHO, WHERE, WHAT)
(   1,<2026-03-25 14:19:48.84 +0400>,<she>,<DPX200>,
      <created by zg, POWCHK disabled, PULCHK disabled
       configuration hash MD5:
       00 E9 B6 7A A2 85 ED C7 34 08 36 98 17 FE 4E 26
       data hash MD5: 32K
       E8 18 79 69 CB AB E3 6C 88 33 8C 55 45 82 39 76>)
(   2,<2026-03-25 14:19:57.78 +0400>,<she>,<DPX200>,
      <Start of raw data processing
       efp BC_mod = 2 LB = 1.5 FT_mod = 6 PKNL = 1 PHC0 = 1376.556 PHC1 = 93.90066 SI = 64K 
       data hash MD5: 64K
       39 B1 28 3C 77 BF 02 05 07 3C 86 C0 3F 55 C1 72>)
(   3,<2026-03-25 14:20:13.12 +0400>,<she>,<DPX200>,
      <pk PHC0 = 13.64847 PHC1 = 0 
       data hash MD5: 64K
       D8 9C C9 3C 05 C8 64 2B 14 66 2A A1 A7 8C 72 DF>)
(   4,<2026-03-25 14:20:17.43 +0400>,<she>,<DPX200>,
      <abs ABSG = 5 
       data hash MD5: 64K
       10 2B 63 E5 43 A2 40 32 F0 90 D3 AE 17 45 51 DB>)
$$ ##END=
$$ 
$$ hash MD5
$$ 48 5C A4 DA 65 4C CE 38 D6 3D 15 B5 DC FA 3B 66
##$RELAX= 
##$RELAX= 
##$RELAX= 
##$RELAX= 
##$RELAX= 
##$RELAX= 
##$RELAX= 
##$RELAX= 
$$ Bruker specific parameters
$$ --------------------------
##$DU= <F:/spectra>
##$EXPNO= 2
##$NAME= <P31>
##$PROCNO= 1
##$TYPE= <nmr>
##$USER= <she>
##$AMP= (0..31)
100 100 100 100 100 100 100 100 100 100 100 100 100 100 100 100 100 100 
100 100 100 100 100 100 100 100 100 100 100 100 100 100 
##$AQSEQ= 0
##$AQ_mod= 1
##$AUNM= <au_zg>
##$AUTOPOS= <>
##$BF1= 81.014009
##$BF2= 200.13
##$BF3= 200.13
##$BF4= 200.13
##$BF5= 200.13
##$BF6= 200.13
##$BF7= 200.13
##$BF8= 200.13
##$BYTORDA= 1
##$CFDGTYP= 0
##$CFRGTYP= 5
##$CHEMSTR= <none>
##$CNST= (0..31)
1 1 145 1 1 1 1 1 1 1 1 1 1 1 1 1 1 1 1 1 1 1 1 1 1 1 1 1 1 1 1 1 
##$CPDPRG= <waltz16>
##$CPDPRG1= <>
##$CPDPRG2= <waltz16>
##$CPDPRG3= <>
##$CPDPRG4= <mlev>
##$CPDPRG5= <mlev>
##$CPDPRG6= <mlev>
##$CPDPRG7= <mlev>
##$CPDPRG8= <mlev>
##$CPDPRGB= <>
##$CPDPRGT= <>
##$D= (0..31)
0 1 0 0 0 0 0 0 0 0.06 0 0.03 2e-05 3e-06 0 0 0.0002 0 0 0 0 0 0 0 0 0 
0 0 0 0 0 0 
##$DATE= 1774433988
##$DBL= (0..7)
120 120 120 11 120 120 24 19 
##$DBP= (0..7)
150 150 150 150 150 150 150 150 
##$DBP07= 0
##$DBPNAM0= <>
##$DBPNAM1= <>
##$DBPNAM2= <>
$$ [...]
##$SUBNAM3= <"">
##$SUBNAM4= <"">
##$SUBNAM5= <"">
##$SUBNAM6= <"">
##$SUBNAM7= <"">
##$SUBNAM8= <"">
##$SUBNAM9= <"">
##$SW= 400.765351723535
##$SWIBOX= (0..15)
0 1 3 0 0 0 0 0 0 0 0 0 0 0 0 0 
##$SW_h= 32467.5324675325
##$TD= 32768
##$TD0= 1
##$TE= 0
##$TE2= 300
##$TE3= 300
##$TEG= 300
##$TL= (0..7)
0 120 53 12 22 120 120 120 
##$TP= (0..7)
150 150 150 150 150 150 150 150 
##$TP07= 0
##$TPNAME0= <>
##$TPNAME1= <>
##$TPNAME2= <>
##$TPNAME3= <>
##$TPNAME4= <>
##$TPNAME5= <>
##$TPNAME6= <>
##$TPNAME7= <>
##$TPOAL= (0..7)
0.5 0.5 0.5 0.5 0.5 0.5 0.5 0.5 
##$TPOFFS= (0..7)
0 0 0 0 0 0 0 0 
##$TUNHIN= 0
##$TUNHOUT= 0
##$TUNXOUT= 0
##$USERA1= <user>
##$USERA2= <user>
##$USERA3= <user>
##$USERA4= <user>
##$USERA5= <user>
##$V9= 5
##$VALIST= <valist>
##$VCLIST= <CCCCCCCCCCCCCCC>
##$VD= 0
##$VDLIST= <DDDDDDDDDDDDDDD>
##$VPLIST= <PPPPPPPPPPPPPPP>
##$VTLIST= <TTTTTTTTTTTTTTT>
##$WBST= 1024
##$WBSW= 4
##$XGAIN= (0..3)
0 0 0 0 
##$XL= 0
##$YL= 0
##$YMAX_a= 24883
##$YMIN_a= -26230
##$ZGOPTNS= <>
##$ZL1= 120
##$ZL2= 120
##$ZL3= 120
##$ZL4= 120
##$ABSF1= 197.3918
##$ABSF2= -203.3724
##$ABSG= 5
##$ABSL= 3
##$ALPHA= 0
##$AQORDER= 0
##$ASSFAC= 0
##$ASSFACI= 0
##$ASSFACX= 0
##$ASSWID= 0
##$AUNMP= <proc_1d>
##$AZFE= 0.1
##$AZFW= 0.5
##$BCFW= 0
##$BC_mod= 2
##$BYTORDP= 0
##$COROFFS= 0
##$CY= -3
##$DATMOD= 1
##$DC= 0
##$DFILT= <>
##$DTYPP= 0
##$F1P= 0
##$F2P= 0
##$FCOR= 1
##$FTSIZE= 65536
##$FT_mod= 6
##$GAMMA= 0
##$GB= 0
##$INTBC= 1
##$INTSCL= 9.790993e-09
##$ISEN= 30
##$LB= 1.5
##$LEV0= 0
##$LPBIN= 0
##$MAXI= 10000
##$MC2= 0
##$MEAN= 0
##$ME_mod= 0
##$MI= 50
##$NCOEF= 0
##$NC_proc= -6
##$NLEV= 6
##$NOISF1= 182.463
##$NOISF2= 159.3651
##$NSP= 0
##$NTH_PI= 0
##$NZP= 0
##$OFFSET= 197.3918
##$PC= 4
##$PHC0= 1390.204
##$PHC1= 93.90066
##$PH_mod= 1
##$PKNL= yes
##$PPARMOD= 0
##$PSCAL= 0
##$PSIGN= 0
##$REVERSE= no
##$SF= 81.014063255964
##$SI= 65536
##$SIGF1= 159.3651
##$SIGF2= -187.1042
##$SINO= 113.3802
##$SIOLD= 16384
##$SREGLST= <1H.CDCl3>
##$SSB= 0
##$STSI= 65536
##$STSR= 0
##$SW_p= 32467.5324675325
##$SYMM= 0
##$S_DEV= 0
##$TDeff= 32768
##$TDoff= 0
##$TI= <>
##$TILT= no
##$TM1= 0
##$TM2= 0
##$TOPLEV= 0
##$USERP1= <user>
##$USERP2= <user>
##$USERP3= <user>
##$USERP4= <user>
##$USERP5= <user>
##$WDW= 1
##$XDIM= 65536
##$YMAX_p= 303379591
##$YMIN_p= -8957411
$$ End of Bruker specific parameters
$$ ---------------------------------
##NTUPLES= NMR SPECTRUM
##VAR_NAME=  FREQUENCY,     SPECTRUM/REAL,   SPECTRUM/IMAG
##SYMBOL=    X,             R,               I
##VAR_TYPE=  INDEPENDENT,   DEPENDENT,       DEPENDENT
##VAR_FORM=  AFFN,          ASDF,            ASDF
##VAR_DIM=   65536,         65536,           65536
##UNITS=     HZ,            ARBITRARY UNITS, ARBITRARY UNITS
##FACTOR=    0.49542278885378, 1,            1
##FIRST=     15991.5117654749, 0,            0
##LAST=      -16476.0207020576, 0,           0
##MIN=       -16476.0207020576, -8957411,    0
##MAX=       15991.5117654749, 303379591,    0
$$ Real data points
##PAGE= N=1
##DATA TABLE= (X++(R..R)), XYDATA
$$ [...]
46960 498691 366648 338256 377615 445479 414084 135100 -327533 -675850 -680714 -400384 -30019
46949 -30019 323684 601888 680119 505730 282446 288467 501240 614610 474224 272919
46939 272919 203816 140896 -127517 -502746 -691899 -676424 -774368 -1156021 -1527682 -1459821
46929 -1459821 -913565 -296431 -51456 -290660 -768969 -1100265 -1032161 -630387 -209478 -11635
46919 -11635 40619 202574 541350 828100 824382 553327 194755 -186375 -635697 -1054990
46909 -1054990 -1170345 -874029 -441598 -212571 -136647 123758 647158 1080694 1107048 834472
46899 834472 555798 340064 106469 -47879 118423 669595 1409981 2063924 2368768 2139210
46889 2139210 1511011 987633 902393 937470 581916 -22389 -233117 59527 183198 -290308
46879 -290308 -867021 -898967 -538812 -393286 -589981 -793332 -911909 -1139698 -1380989 -1273998
46869 -1273998 -836601 -509276 -422163 -158395 519237 1171494 1243155 799883 374588 296031
46859 296031 477037 719347 922154 1029029 999096 852600 629908 326529 -40433 -338773
46849 -338773 -391392 -146901 256935 601932 766880 804649 804697 688527 287050 -302356 -633761
46838 -633761 -400461 125617 400104 271110 61773 44049 148308 210241 200444 155135
46828 155135 152283 389977 975407 1567180 1568823 830654 -118468 -684369 -792704 -736005
46818 -736005 -728832 -785378 -772896 -424047 417933 1393411 1800404 1425890 882231 806423
46808 806423 1036157 973822 501058 39263 -157116 -248644 -360463 -365035 -223572 -154431
46798 -154431 -289480 -444149 -398109 -190077 22557 216019 433098 575905 454096 42444
46788 42444 -422636 -666872 -682023 -734304 -1007704 -1313109 -1313426 -1012583 -781457 -838650 -983747
46777 -983747 -998508 -1019283 -1239318 -1484366 -1448647 -1207224 -1096833 -1142220 -1004019 -536095
46767 -536095 -25988 231751 300241 404277 622696 918182 1249116 1485206 1392181 889380
46757 889380 222527 -265699 -470260 -532995 -599557 -670351 -646698 -457711 -179652 -45864
46747 -45864 -243837 -655168 -902051 -748736 -398447 -285082 -576437 -977655 -1073081 -797244
46737 -797244 -458257 -295045 -180121 106140 454546 543892 333455 119872 49084 -79595
46727 -79595 -362658 -495969 -212408 253746 463283 318072 -14333 -485247 -1058811 -1419500
46717 -1419500 -1301805 -1027916 -1167819 -1642944 -1731213 -1100092 -287209 103496 186146 390757
46707 390757 662905 559776 -15642 -615310 -780025 -485525 -43251 232703 236093 96340
46697 96340 38387 167572 410370 660846 873279 983449 891602 607530 290762 65920
46687 65920 -93880 -239901 -329413 -305990 -191395 -48985 36453 -68722 -435542 -897004
46677 -897004 -1144652 -1045150 -720549 -320981 82780 378804 432596 276293 66320 -143373
46667 -143373 -314573 -156962 614358 1659034 2128725 1650709 785186 219142 -70217
46658 -70217 -459172 -889806 -987576 -735994 -474764 -331044 -178899 -118305 -444602 -1056578
46648 -1056578 -1387430 -1114061 -560577 -200452 -83907 4423 83844 -25097 -350238 -657306
46638 -657306 -690458 -413853 -31483 185523 149578 81983 321626 946504 1618165 1846788
46628 1846788 1415213 558540 -247731 -687775 -804905 -793151 -672316 -341143 48250 47349
46618 47349 -552681 -1309200 -1527299 -1044691 -399766 -197597 -494486 -883697 -1058883 -1152572
46608 -1152572 -1489419 -2072754 -2459237 -2248032 -1588880 -1008955 -798049 -826996 -940764 -1155754
46598 -1155754 -1375491 -1320606 -977791 -775961 -1025291 -1467527 -1672443 -1576801 -1301298 -781324
46588 -781324 -41631 457921 330823 -42575 73559 726191 1232245 1196952 971497 964604
46578 964604 1058647 958530 690059 487523 496983 775890 1283548 1716006 1659883 1076167
46568 1076167 374487 -78927 -232338 -109633 270347 638665 616024 289972 182929 421898
46558 421898 446440 -138514 -920822 -1305972 -1310853 -1217988 -869944 8902 1026935 1387445
46548 1387445 917472 226701 -205529 -530600 -982726 -1357643 -1322662 -916511 -477899 -276278
46538 -276278 -378883 -681343 -906705 -753039 -223523 296749 429323 185604 -129734 -283052
46528 -283052 -243283 -37265 319627 696223 812908 516026 62379 -66829 278654 723726
46518 723726 865103 751845 622697 405605 -59201 -416925 -53285 916280 1547256 1291623
46508 1291623 759510 781266 1209225 1293241 883555 486037 274693 -138275 -872176 -1447626
46498 -1447626 -1514966 -1311761 -1105768 -711970 56466 864872 1213654 1073964 807291 635096
46488 635096 514809 408431 362469 364256 330406 202396 -63240 -487578 -927938 -1091149
46478 -1091149 -851196 -436458 -157279 -71498 -48428 2949 140774 447645 846208 991437
46468 991437 622656 -36934 -500480 -628530 -756476 -1149676 -1567892 -1536093 -939487 -181270
46458 -181270 258090 308883 290621 461145 734189 902306 970808 1068496 1124482 933367
46448 933367 571026 432216 707774 1082917 1153969 930666 695688 553703 398703 206641
46438 206641 75055 34992 66757 218025 435999 373203 -286321 -1306341 -2058935 -2273139
46428 -2273139 -2278255 -2382940 -2386065 -1967595 -1283269 -811779 -718808 -684748 -357302 245553
46418 245553 790636 926891 551602 -58970 -410962 -257063 110072 196293 -79555 -319785
46408 -319785 -218527 53015 154746 52187 -28287 10674 38112 -36004 -101669 -3534 284407
46397 284407 670624 1003211 1086923 799548 275726 -153288 -314521 -387310 -617590 -932183
46387 -932183 -1021240 -785990 -514712 -542197 -853456 -1115750 -1048081 -691923 -337468 -211834
46377 -211834 -231813 -94979 326547 730929 659578 41055 -679362 -1009648 -871145 -511022
46367 -511022 -135638 174481 299082 114692 -244672 -378393 -24606 602974 1002695 899220
46357 899220 512689 318030 559562 1002198 1172606 857895 321634 -12405 -7641 165461
46347 165461 378497 695436 1128305 1453133 1429324 1107590 785266 709847 916346 1263760
46337 1263760 1496528 1345489 752076 4905 -476861 -527098 -333855 -188529 -230542 -402283
46327 -402283 -527544 -444418 -183461 -8191 -156581 -548257 -866979 -909802 -720145 -430084
46317 -430084 -178133 -159993 -489654 -935809 -1035323 -588182 134544 737402 1034164 982035
46307 982035 594638 75711 -256346 -371721 -559137 -845346 -772235 -112357 564299 554339
46297 554339 -3659 -395755 -398962 -422646 -643161 -722296 -508330 -324512 -312589 -136828
46287 -136828 304305 471727 -30960 -748996 -979875 -707726 -399565 -204085 40746 232322
46277 232322 84568 -288195 -439497 -237990 31942 176301 213504 56044 -360188 -631131
46267 -631131 -215608 652283 1032377 542398 -49929 80775 646590 727807 88944 -601588
46257 -601588 -729781 -341381 213127 718299 1033241 1003797 691764 459915 590366 940489
46247 940489 1163402 1168496 1148662 1181686 1052741 590816 14461 -266069 -152474 35402
46237 35402 -17540 -288228 -577210 -793960 -930638 -933034 -805229 -713988 -774746 -845927 -754531
46226 -754531 -593572 -529220 -454121 -180937 125549 133556 -82171 -135893 -27854 -180989
46216 -180989 -615525 -698048 -89111 597079 624629 227758 209853 678786 922994 555197
46206 555197 65153 5402 219299 259639 141368 199754 441639 533342 373977 239897
46196 239897 291213 302019 39211 -374396 -675950 -803002 -765227 -394577 395741 1203996
46186 1203996 1454718 1179876 1011376 1206460 1197443 525544 -230207 -128196 721538 1160588
46176 1160588 480520 -738156 -1512168 -1600787 -1413714 -1259267 -1163134 -1142082 -1175534 -1027465
46166 -1027465 -476523 330013 1012316 1361808 1403016 1202868 862083 565438 407176 289445
46156 289445 182183 283381 677940 1058554 1097444 906449 793503 748987 562495 296676
46146 296676 206613 275542 279506 273390 541845 1029788 1280865 1067876 706290 602490 803520
46135 803520 1094764 1227404 960893 230538 -590515 -930722 -692504 -392266 -467655 -748258
46125 -748258 -814576 -593100 -335612 -219504 -226253 -274140 -255320 -50223 319925 638688
46115 638688 701692 480403 43532 -488283 -842309 -708924 -127441 434796 550552 222762
46105 222762 -290238 -795458 -1147724 -1169442 -847154 -452619 -250652 -230007 -303245 -555963
46095 -555963 -1018013 -1359963 -1175766 -534640 46456 203524 69299 -6272 135931 407708
46085 407708 669385 865706 990636 973360 670157 47168 -680272 -1237821 -1583565 -1803135
46075 -1803135 -1770628 -1281624 -594746 -383276 -868630 -1391493 -1238271 -579283 -109081 -4510
46065 -4510 164454 583145 900475 894217 849830 1027478 1210961 1104905 832119 685191
46055 685191 632418 439365 142452 46516 268830 549411 546629 158821 -445073 -965152
46045 -965152 -1130227 -846513 -245220 429426 951214 1147586 952327 517249 151107 16122
46035 16122 -20111 -95626 -46306 370670 984959 1231598 766195 -133627 -901143 -1240994
46025 -1240994 -1208707 -921825 -478162 -106302 -76303 -357462 -602846 -625867 -685238 -1068657
46015 -1068657 -1542969 -1543156 -926145 -254562 -196422 -804425 -1518738 -1774169 -1481604 -981554
46005 -981554 -653611 -584624 -571210 -413376 -138299 119299 351168 618541 814730 718919
45995 718919 316615 -161588 -579754 -1022541 -1473086 -1647116 -1368080 -892926 -599503 -493304
45985 -493304 -294414 78570 382893 385692 116678 -193805 -282413 -34773 350112 500102
45975 500102 350056 305766 677909 1153730 1206828 890152 748767 971705 1145906 961732
45965 961732 671387 625258 781387 965428 1242983 1668429 1952476 1795737 1382821 1149751
45955 1149751 1164324 1121453 903733 745787 779359 767402 465011 32937 -93472 324738
45945 324738 1077154 1673532 1743421 1328822 791959 413485 160233 -91503 -267430 -236188
45935 -236188 -141380 -311434 -811461 -1322677 -1533612 -1442050 -1195396 -865846 -529394 -357878
45925 -357878 -408737 -443801 -187762 289525 666099 818111 941548 1185606 1410922 1459471
45915 1459471 1472111 1689288 2000807 1975353 1434026 789192 621938 1012952 1496302 1656282
45905 1656282 1540705 1403429 1261487 928597 397308 -55447 -177879 5198 287718
45896 287718 476837 445094 165016 -191766 -331867 -177470 -40942 -295112 -911671 -1482455
45886 -1482455 -1669322 -1469579 -1052723 -536907 11081 517599 940987 1266476 1404855
45877 1404855 1221233 745118 233839 -75930 -194058 -273696 -382446 -471843 -483536 -388965
45867 -388965 -204692 -40183 -13762 -41527 131084 567974 997621 1202106 1348535 1676475
45857 1676475 2032445 2056981 1741177 1435114 1333306 1312711 1283556 1311700 1325658 1092792
45847 1092792 623255 247242 136785 94059 -14756 8779 275856 470127 262916 -179103
45837 -179103 -423201 -304950 59622 579752 1172858 1603941 1669232 1439003 1092284 702313
45827 702313 422815 589944 1259969 1898470 1971746 1640207 1401612 1281918 973008 603522
45817 603522 646031 1048050 1195058 902211 736249 1054344 1376637 1155650 644571 477732
45807 477732 758183 1094401 1304370 1567972 1972554 2310593 2305000 1800182 862075 -83304
45797 -83304 -425523 -2827 609523 768115 546343 481282 699249 774333 442912 -17120
45787 -17120 -247302 -266652 -278479 -316859 -326702 -399958 -660194 -972685 -1002963 -619817 -104408
45776 -104408 147223 86252 55331 337575 791290 1061458 1051037 964923 924995 831629 683008
45765 683008 731329 1113470 1536160 1584260 1233667 830066 624427 548313 445090 345276
45755 345276 439610 807881 1189286 1116602 451823 -259888 -280159 390128 905939 612196
45745 612196 -148956 -594182 -574252 -612313 -986598 -1311009 -1139711 -567419 1024 401807
45735 401807 759092 1112180 1270497 1087474 723059 497662 490624 416098 2387 -606168
45725 -606168 -1018168 -1117820 -1159076 -1315194 -1442734 -1413948 -1378266 -1490815 -1640654 -1671399
45715 -1671399 -1619979 -1490776 -1068561 -288712 433942 633639 413251 278043 462143 753246
45705 753246 865792 650504 75487 -619352 -885864 -425857 291050 502652 82880 -448243
45695 -448243 -753257 -967524 -1167582 -1161886 -960284 -901762 -1091255 -1183864 -961796 -675963
45685 -675963 -563492 -472435 -264500 -163924 -345348 -541084 -442871 -176812 14944 259404
45675 259404 758468 1244665 1255883 869699 677014 985234 1433171 1488824 1045254 429887
45665 429887 34951 19517 222903 311226 111043 -185030 -229196 79514 489233 673208
45655 673208 541089 286102 160500 187474 123232 -216606 -653041 -832248 -682902 -461835
45645 -461835 -351688 -301171 -316286 -565105 -1024430 -1336304 -1268543 -1084471 -1189856 -1590324
45635 -1590324 -1951535 -2044202 -1877889 -1520815 -1041859 -559460 -149728 229247 596236 867568
45625 867568 1044279 1269084 1507222 1404080 745323 -110678 -573991 -502193 -260014 -176567
45615 -176567 -210846 -118473 267092 874680 1350468 1289391 712444 177871 179153 560888
45605 560888 788743 657827 412377 255721 110240 -110245 -289512 -254494 42105 505055
45595 505055 929606 1092963 945148 639985 285002 -166212 -639754 -823274 -573758 -196631
45585 -196631 -11985 104191 368792 541263 230619 -394603 -739113 -577347 -224256 54086
45575 54086 290116 479901 530452 582903 854016 1097711 816468 146876 -95220 473398
45565 473398 1219542 1374637 988269 590170 363421 160429 2132 17740 75838 -37953
45555 -37953 -176865 16479 564972 1104607 1347823 1329536 1237354 1227465 1347094 1439595 1215974
45544 1215974 611723 -34885 -339555 -269282 -6651 380805 871302 1261707 1334243 1161549
45534 1161549 949706 656498 92455 -613562 -984130 -732476 -117453 349500 421812 254648
45524 254648 101371 -24456 -316702 -794182 -1102809 -914517 -442704 -218654 -323057 -260040
45514 -260040 227277 660812 503780 -15217 -214400 112949 543578 677575 504904 183220
45504 183220 -121965 -179486 136474 583922 779987 683163 534741 376414 25600 -467597
45494 -467597 -767440 -736627 -587672 -464872 -271032 -25681 25854 -143780 -180834 115685
45484 115685 431387 382137 20714 -400115 -880778 -1511098 -2052188 -2105290 -1648241 -1061064
45474 -1061064 -621644 -268497 112676 439758 566675 492835 355658 310442 438817 672045
45464 672045 794130 630863 261240 -47396 -132805 -79720 -44569 -37241 36603 153308 108895
45453 108895 -246511 -765802 -1122258 -1182918 -1114935 -1056790 -894118 -558435 -352115 -619958
45443 -619958 -1150368 -1305004 -835457 -210355 31203 -90887 -249687 -370049 -584971 -837559
45433 -837559 -906965 -756763 -556805 -423765 -399065 -562357 -836148 -786552 -50069 1034545
45423 1034545 1663508 1541979 1200233 1169039 1285575 1142431 848830 861615 1226894 1465527
45413 1465527 1204299 540635 -241477 -947694 -1383632 -1357149 -968355 -629572 -567734 -499967
45403 -499967 -38446 723935 1271692 1222990 621614 -221910 -925386 -1139213 -766373 -121903
45393 -121903 377889 728583 1269522 2033719 2511566 2298588 1712401 1428082 1631475 1876972
45383 1876972 1741630 1268657 700821 108544 -517240 -1017311 -1178725 -1061908 -1013902 -1285705
45373 -1285705 -1712772 -1851600 -1449343 -744197 -243120 -198161 -379218 -386204 -67852 433448
45363 433448 890187 1081963 825302 173168 -457444 -621106 -335320 -18685 70736 76147
45353 76147 177851 289285 250048 51137 -311408 -947530 -1782433 -2353239 -2210999 -1458191
45343 -1458191 -642396 -164139 2405 67548 151608 256987 324372 296433 243259 374075
45333 374075 779158 1226341 1388228 1219801 942613 728211 594784 541271 550395 516530
45323 516530 419534 507391 1005213 1674256 2006540 1885645 1697325 1720498 1799454 1745435
45313 1745435 1634260 1466398 944615 -43218 -1031165 -1476853 -1429701 -1279112 -1042903 -431843
45303 -431843 443011 986273 869691 433067 150315 54524 -69752 -208446 -142086 165730
45293 165730 444600 379031 -95643 -715765 -1076612 -984739 -636184 -338227 -95835 323637
45283 323637 925296 1364586 1377939 1081661 721209 377936 86806 -11295 136814 355913
45273 355913 528211 817209 1335776 1786139 1775900 1372402 981370 745852 455845 51725
45263 51725 -198455 -136381 28174 69720 71749 208304 444461 665126 895967 1159274
45253 1159274 1271809 1058203 688488 540292 718606 924992 860717 595224 420031 418042
45243 418042 340329 -10140 -369356 -208314 564744 1304888 1284486 539265 -248274 -654174
45233 -654174 -882914 -1152877 -1213504 -825170 -365836 -465660 -1157788 -1825981 -1965004 -1599303
45223 -1599303 -945621 -103756 760600 1293782 1285869 927174 524041 140229 -250571 -425234
45213 -425234 -63807 746705 1438014 1510006 999735 307322 -273840 -669340 -800236 -578562
45203 -578562 -202906 -143016 -565093 -970850 -775178 -166889 49152 -449585 -1030651 -1000366
45193 -1000366 -562229 -444394 -832028 -1202467 -1145274 -818534 -519729 -283074 -94420 -112254
45183 -112254 -395632 -675207 -678168 -518965 -518953 -737935 -894087 -702043 -156731 464754 806206
45172 806206 738129 531819 590779 928870 1098496 773815 217462 -43272 120649 329512
45162 329512 186886 -321199 -891617 -1188593 -1065114 -654918 -273260 -137408 -184012 -216130
45152 -216130 -171974 -155073 -246342 -392284 -471666 -419420 -305780 -292169 -422725 -475573 -195991
45141 -195991 293119 550907 394492 151800 151338 235443 82743 -214690 -295923 -117397
45131 -117397 54932 202838 616797 1293587 1724043 1518974 923766 471708 399477 643828
45121 643828 1125918 1693950 1980672 1715124 1121100 674710 491516 277553 -108936 -418373
45111 -418373 -455230 -426248 -599195 -839510 -790182 -420984 -108949 -156741 -455644 -684602
45101 -684602 -665993 -446781 -178668 -24527 -77584 -269797 -435732 -537463 -714508 -1013698
45091 -1013698 -1207752 -1058260 -676255 -427321 -513675 -821754 -1131644 -1270883 -1112947 -707538
45081 -707538 -439160 -744195 -1531941 -2128620 -1961860 -1125730 -162121 479584 621510 293188
45071 293188 -230243 -523085 -440031 -327738 -554965 -983455 -1191898 -1075300 -879473 -751056
45061 -751056 -639405 -595195 -754644 -994519 -989024 -687920 -381961 -207143 37040 433989
45051 433989 698680 604876 329141 91486 -256619 -932331 -1690183 -1968551 -1547841 -805643
45041 -805643 -309227 -322074 -685219 -1020524 -1040447 -755463 -390496 -111572 59319 76713
45031 76713 -149707 -513151 -675441 -448827 -45604 204851 198617 -44908 -568758 -1268478
45021 -1268478 -1697643 -1474176 -823536 -359285 -319913 -369032 -210715 -38604 -173426 -515308
45011 -515308 -646320 -397766 -69797 -43248 -327630 -601530 -635665 -524039 -453624 -411215
45001 -411215 -294435 -202843 -335489 -598323 -630844 -316902 56002 302368 631004 1143254
44991 1143254 1401654 961816 115641 -414414 -432922 -412138 -696450 -1108617 -1440342 -1790578
44981 -1790578 -2181353 -2305332 -1994780 -1605022 -1579556 -1874145 -2136236 -2243432 -2313728 -2332580
44971 -2332580 -2147073 -1794635 -1517133 -1414563 -1324267 -1102032 -854636 -819006 -1068951 -1347353
44961 -1347353 -1198291 -395028 713800 1469613 1625264 1584534 1751441 1913522 1604221
44952 1604221 876975 262393 2313 -189256 -502801 -644545 -342869 114305 231728
44943 231728 11502 -79354 213022 645564 918030 1063357 1225572 1285451 978917 323681
44933 323681 -312918 -616551 -626033 -551080 -441869 -204852 115912 278348 132671 -153658
44923 -153658 -267578 -94403 195749 377434 411530 465440 739106 1248725 1737994 1851658
44913 1851658 1492633 998757 853408 1170251 1543889 1484720 945448 316614 -66742 -254420
44903 -254420 -455270 -645378 -596872 -245278 202136 565129 861535 1063051 936551 388495
44893 388495 -205265 -358603 -110251 56202 -47425 -38656 419455 1073421 1415313 1326484
44883 1326484 1095392 948677 859532 744116 582436 372034 173166 159651 412000 689506
44873 689506 631993 209234 -207696 -250339 98270 540734 716494 443139 -155654 -776024
44863 -776024 -1260434 -1694743 -2093952 -2215583 -1917375 -1490429 -1304933 -1288873 -1147911 -948367
44853 -948367 -975037 -1087659 -838038 -298320 -103306 -428744 -597415 -124079 460895 435606
44843 435606 51361 117971 692281 989950 577993 -79306 -387434 -302415 -47253 287337
44833 287337 573932 544693 192020 -69798 52638 321473 374872 239749 127076 16989
44823 16989 -160300 -173990 200569 644441 571498 -26382 -480762 -356566 -60631 -242670
44813 -242670 -845650 -1144688 -698607 86927 500877 413082 341731 655687 1006665 760920
44803 760920 -151532 -1099215 -1464581 -1254377 -932608 -878621 -1143055 -1539067 -1772332 -1589528
44793 -1589528 -988491 -247512 347291 716378 864997 737093 355283 -68925 -384155
44784 -384155 -706494 -1126293 -1371255 -1121786 -584185 -327000 -495878 -606549 -286024 152078
44774 152078 157869 -280749 -652663 -617613 -396248 -449211 -942452 -1572604 -1854854 -1586801
44764 -1586801 -1033568 -590938 -316122 10095 369040 401832 3455 -320542 -62852 517870
44754 517870 687413 250745 -183300 -60416 405073 614599 387716 66302 -30661 52635
44744 52635 83751 -83950 -437548 -828023 -1024242 -875493 -474189 -75169 174512 355042
44734 355042 617386 991882 1364973 1561255 1443584 1047647 649496 562176 782105 965164
44724 965164 872944 712087 844947 1266493 1629962 1757291 1800819 1831142 1633606 1145238
44714 1145238 773535 907979 1312765 1437378 1231411 1164197 1421303 1615106 1465768 1253543
44704 1253543 1270652 1276161 953485 558240 538170 711268 458831 -292452 -908359 -973470
44694 -973470 -777973 -649498 -391968 182664 636393 414131 -259625 -589880 -274339 170587
44684 170587 208301 -84041 -360134 -556335 -789858 -991584 -1002418 -894204 -843807 -733693
44674 -733693 -238739 596684 1177153 980440 204067 -456447 -609842 -496785 -498782 -594626
44664 -594626 -477629 -45161 461557 762196 787245 622497 374113 120984 -132797 -476618
44654 -476618 -928202 -1254520 -1160125 -707844 -325614 -266879 -283220 -43625 296490 243799
44644 243799 -364215 -1127714 -1573779 -1641003 -1555883 -1402331 -1025947 -372737 229958 301003
44634 301003 -206385 -655959 -311852 756458 1591306 1375913 382527 -371430 -299374 258361
44624 258361 682796 805196 822578 826897 743206 603422 573740 677635 671296 276316 -500844
44613 -500844 -1292966 -1627118 -1329230 -703759 -240325 -117921 -76661 218458 807450 1439328
44603 1439328 1788277 1626803 974281 179531 -301169 -330467 -178627 -127537 -185972 -296273
44593 -296273 -543996 -924735 -1137814 -939426 -556759 -412951 -547843 -682343 -782547 -1107382
44583 -1107382 -1646183 -1965814 -1798982 -1407706 -1133809 -925263 -593584 -244008 -80691
44574 -80691 20335 339528 793355 968248 693463 256158 -19370 -119032 -154940 -91478
44564 -91478 149465 448245 544752 310057 -135237 -539980 -693893 -536983 -204548 25067
44554 25067 -93789 -570613 -1121513 -1353915 -1084064 -494986 61386 405514 587475 635842
44544 635842 465984 149400 58599 486693 1208725 1683296 1678343 1460990 1365565 1437843
44534 1437843 1563172 1671631 1684020 1494664 1186959 1067932 1282675 1552159 1506152 1129984
44524 1129984 646111 111340 -532050 -1082784 -1171510 -813940 -512050 -607836 -816273 -657487
44514 -657487 -146883 258697 300218 169010 107465 65838 -108693 -348864 -418614 -203636
44504 -203636 186430 564723 815893 925090 937968 886746 729891 410306 -6509 -341587
44494 -341587 -502787 -573244 -619360 -534997 -216226 221213 589694 904934 1268170 1527105
44484 1527105 1376424 851091 392706 277250 276577 96360 -146529 -191646 -134838 -258650
44474 -258650 -498648 -513440 -252003 -14546 94385 322703 733028 939362 652566 150165
44464 150165 -132502 -232759 -506700 -984551 -1266700 -1067994 -580765 -241433 -300919 -620321
44454 -620321 -758062 -336129 495901 1046244 771872 -53592 -618206 -515156 -137151 -84312
44444 -84312 -468014 -946047 -1213034 -1232840 -1096962 -867518 -573667 -267054 -58233 -81392
44434 -81392 -338256 -569104 -418820 178799 869834 1219368 1115109 763337 379050 16453
44424 16453 -323756 -572724 -655239 -612452 -570812 -562323 -431280 -4567 627596 1085678 1042607
44413 1042607 579101 138660 121278 534423 1012515 1158937 913552 602337 572042 794783
44403 794783 959252 937464 924942 1042310 1108051 1038733 1170266 1767915 2395507 2291237
44393 2291237 1379910 416867 2073 -88611 -375481 -904084 -1325756 -1436683 -1289089 -989004
44383 -989004 -708964 -696213 -916141 -862821 -130719 910460 1419115 1064262 354267 -36263
44373 -36263 84248 510506 1000219 1349357 1364308 997304 409942 -217108 -822538 -1336055
44363 -1336055 -1584347 -1475896 -1175925 -957609 -928621 -979474 -921062 -597978 31251 805647
44353 805647 1407726 1611163 1475813 1243837 1078280 955043 766381 466668 140881 -30791
44343 -30791 84221 418678 733851 842333 764372 628574 484437 294588 77342 -45521
44333 -45521 28953 264273 505295 589189 439185 110717 -214227 -317325 -96564 350659
44323 350659 813028 1123571 1212517 1059130 705981 335753 198013 368615 676395 957399
44313 957399 1250740 1590869 1760176 1533109 1105066 929012 1071219 1090169 719692 332404
44303 332404 449987 1054417 1707324 2143546 2367416 2308370 1847198 1205896 891746 1107471
44293 1107471 1499873 1616779 1371780 957291 556081 278956 161971 77176 -149510 -399865
44283 -399865 -288090 286256 861521 972166 787909 839346 1212206 1432383 1195527 809498
44273 809498 726312 957248 1234116 1505857 1876133 2140182 1856036 1014092 234080 -3717
44263 -3717 -33001 -493674 -1308120 -1681347 -1182963 -341147 76237 -13800 -128388 33376
44253 33376 365681 718599 1073969 1383690 1551685 1582222 1513447 1268628 834122 483507
44243 483507 474591 568101 243700 -558714 -1287654 -1469489 -1212037 -900949 -724401 -666362
44233 -666362 -682622 -686894 -575603 -406101 -330542 -257600 119873 796839 1259184 1052693
44223 1052693 323831 -415961 -838840 -901243 -642195 -166767 315340 667700 933923 1138232
44213 1138232 1189774 1135711 1228633 1510656 1609623 1240684 660839 311320 256754 329226
44203 329226 562707 1025535 1407803 1297246 813264 494638 557405 696926 645066 496836
44193 496836 421996 444567 584455 849521 1013010 771602 217507 -212279 -349284 -462548
44183 -462548 -699522 -815640 -702528 -753442 -1319948 -2093803 -2443754 -2213880 -1811007 -1571668
44173 -1571668 -1391695 -1008655 -378187 316253 851749 1067205 883227 345019 -338623
44164 -338623 -870407 -1079706 -1087669 -1153708 -1303447 -1265174 -900777 -497192 -374261 -369548 -72827
44153 -72827 513955 969163 1094997 1106475 1098072 831121 285552 -41857 247977 883898
44143 883898 1338385 1519108 1628469 1574564 1035961 57568 -867128 -1367321 -1533227 -1640062
44133 -1640062 -1797231 -1916065 -1821354 -1387692 -744448 -293079 -296852 -505206 -444063 -48785
44123 -48785 275626 231636 -27205 -181015 -89036 239267 749227 1273305 1565180 1546292
44113 1546292 1370442 1168503 936699 769375 918005 1389991 1713625 1424372 689105
44104 689105 134255 78064 249467 319655 373371 640931 1003882 1092428 813228 470641
44094 470641 299747 148787 -198316 -575612 -584274 -154447 288319 292817 -141165 -641675
44084 -641675 -895732 -896314 -837628 -872444 -961140 -928367 -701607 -469863 -484250 -686862 -711299
44073 -711299 -343939 179932 485651 518889 496290 504639 413131 181873 10467 102406 462012
44062 462012 1001492 1662525 2294469 2565804 2220826 1421290 676494 376281 457473 555590
44052 555590 424383 165115 69301 267301 540883 514794 80266 -403639 -450950 -41508
44042 -41508 258873 -74092 -844674 -1304821 -1021532 -336557 145731 264863 252803 190012
44032 190012 -84653 -541112 -842532 -811034 -693272 -729934 -689806 -140034 895715 1824066
44022 1824066 2067824 1600976 858178 248325 -146423 -445810 -682887 -744977 -580227 -302935
44012 -302935 6109 453463 1089488 1623730 1676887 1306222 972020 925811 947234 795034
44002 795034 577148 472933 406954 278153 241784 418809 526688 193625 -450957 -868754
43992 -868754 -777846 -417620 -156655 -129382 -285286 -525659 -714830 -736465 -584343 -295873
43982 -295873 122083 542718 650791 313833 -78105 6561 536496 928986 779010 245058
43972 245058 -312733 -701083 -813559 -578007 -183627 -54565 -374585 -854637 -1126641 -1125163
43962 -1125163 -936276 -575188 -145256 65927 -44352 -133569 157917 662427 889014 685172
43952 685172 387661 347276 581736 905872 1161455 1278227 1293396 1342097 1483736 1547833
43942 1547833 1314737 839866 423082 249214 235983 257199 317971 432285 503401 460825
43932 460825 409824 492739 627105 516649 -5768 -679254 -949109 -486908 427360 1145554
43922 1145554 1314024 1175014 1120504 1116621 817959 189198 -324165 -369858 -151954 -68125
43912 -68125 -76849 197710 741999 949459 372639 -584571 -1063356 -748616 -143849 159442
43902 159442 146794 168879 342480 431461 215947 -251020 -730877 -989256 -925256 -636452
43892 -636452 -335041 -130384 28871 145515 90367 -120718 -168040 188681 697536 880681
43882 880681 628966 224168 -143077 -481148 -638657 -313409 422887 1019616 1118570 1011978
43872 1011978 1153987 1486074 1574523 1232751 668903 113633 -384994 -822354 -1152545 -1358473
43862 -1358473 -1425163 -1251335 -754924 -72071 481321 661856 454282 37589 -322407 -427762
43852 -427762 -301066 -133460 -40803 4594 -36160 -309200 -742009 -920135 -572191 -27446
43842 -27446 134588 -168500 -445178 -309572 73124 318534 347639 407040 693014 1112533
43832 1112533 1399436 1398870 1222115 1102457 1099698 1039110 800480 549811 558499 875577 1308341
43821 1308341 1640542 1726120 1477699 973649 506964 284793 104515 -401057 -1151191 -1523910
43811 -1523910 -1031555 74950 1032250 1294555 912583 292894 -207873 -407326 -193006
43802 -193006 477391 1381947 1984460 1830006 1060019 345009 169963 335172 333066 68260
43792 68260 -68264 202683 667650 915633 795340 448393 39075 -370402 -711805 -840874
43782 -840874 -670369 -339222 -134164 -168646 -223544 -43702 280291 457583 502497 752158
43772 752158 1255070 1520119 1188697 666919 648307 1146028 1469974 1160873 500490 -213
43762 -213 -206187 -257333 -202264 -13050 230124 424632 602879 796963 843634 559448 102741
43751 102741 -58422 341654 979295 1215288 779741 56351 -409155 -534718 -605605 -670372
43741 -670372 -464602 -28867 98080 -348351 -800173 -584449 54240 257870 -242436 -865767
43731 -865767 -1117277 -1102156 -957512 -474079 341943 904479 760117 288750 179757 472036
43721 472036 625429 371946 -29289 -327354 -565932 -766887 -750958 -438829 -41376 217679
43711 217679 364570 511828 597703 469275 162404 -43010 135193 720905 1434974 1877586
43701 1877586 1805470 1327532 864132 833890 1268798 1744679 1800084 1423243 981311 679551
43691 679551 362333 -46044 -246982 -4464 400950 546616 488888 561025 738127 775329
43681 775329 868816 1457237 2274233 2369102 1404087 258766 -134617 3670 -161382 -778966
43671 -778966 -1227300 -1091667 -581362 -51183 345483 528822 460106 266481 94987 -93929
43661 -93929 -316440 -329276 28415 430356 430814 109398 -91983 -55960 -30671 -73074 18388
43650 18388 227380 298742 228342 267045 385694 268930 -56694 -139428 176390 477857
43640 477857 466106 387776 468568 413768 -83749 -705421 -871348 -540948 -209234 -196453
43630 -196453 -298094 -123837 448958 1144067 1501921 1335065 1027079 1154087 1717550 2066098
43620 2066098 1763349 1192354 1003873 1261659 1500768 1405492 1032166 524141 20214 -243995
43610 -243995 -133121 135525 273232 365601 650753 935303 727897 19284 -549324 -476819
43600 -476819 40144 553749 971977 1387148 1614590 1365708 789844 431645 586249 976702
43590 976702 1156923 1010104 723140 436255 102947 -339698 -801256 -1086032 -1078145 -861976
43580 -861976 -659715 -630241 -709467 -665161 -348054 94946 287719 -35531 -724725 -1288545
43570 -1288545 -1345623 -996201 -658485 -527952 -359290 89664 562428 556592 69864 -272376
43560 -272376 -27225 455389 591291 488197 767876 1485258 1851054 1307406 368581 -74339
43550 -74339 55608 94100 -262871 -565685 -411148 -86664 -128185 -584263 -1049084 -1247403
43540 -1247403 -1293139 -1421685 -1670692 -1839088 -1681161 -1164188 -558818 -204845 -177599 -282076
43530 -282076 -357652 -417582 -462236 -364817 -57454 319466 579555 699906 769601 823227 818965
43519 818965 709529 466814 104239 -284166 -585083 -789211 -962745 -1086042 -1023961 -662739
43509 -662739 3930 853157 1562682 1708850 1222651 658701 626324 958534 895494 182475
43499 182475 -533305 -652890 -459249 -557125 -875443 -823439 -269065 244892 305236 155100
43489 155100 243851 583880 776340 531561 17691 -284523 -72949 414266 644689 461509
43479 461509 298768 558673 1001373 1041745 507005 -200700 -588540 -432962 211237 1010306
43469 1010306 1439101 1232439 723373 422917 357540 207967 -743 125752 653389 1135843
43459 1135843 1279784 1303410 1430317 1515682 1467543 1579036 2034425 2435088 2274300 1664661
43449 1664661 1172504 1087113 1247895 1466152 1704501 1884999 1895808 1800059 1734254 1609214
43439 1609214 1228554 731242 598393 1102892 1958892 2604357 2676373 2186185 1432713 819499
43429 819499 585485 611086 572465 312909 -38055 -304479 -474921 -640688 -837165 -976543
43419 -976543 -871439 -371569 406117 1040797 1163814 828979 389045 73252 -116008 -159855
43409 -159855 37667 442790 879340 1263551 1606415 1759985 1477793 829364 244269 -3512
43399 -3512 -54312 -49733 167028 647907 980376 760565 225219 -30710 141503 351951
43389 351951 324514 195516 138832 120127 117364 210040 334750 299218 155782 205625 493161
43378 493161 670239 545682 378244 374356 299052 -52535 -349826 -154252 384893 744315
43368 744315 788314 832468 1023332 1145467 1065139 923556 825012 731939 738638 1037598 1491908
43357 1491908 1642461 1330604 967312 961142 1171303 1165524 783091 218187 -248256 -392724
43347 -392724 -128663 341622 626389 590278 527796 703274 911322 734763 106884 -596954
43337 -596954 -919514 -615409 245053 1258888 1920728 2073567 2006164 1958700 1763500 1212875
43327 1212875 531910 121048 -19632 -214535 -525797 -632417 -320879 233189 732439
43318 732439 1033640 1105893 980778 833686 899973 1211331 1557068 1738944 1707918 1441628
43308 1441628 891641 130885 -585565 -987995 -971935 -632663 -200586 101853 223125 249658
43298 249658 186316 -45812 -301634 -177648 477495 1253152 1668199 1744665 1748013 1617062
43288 1617062 1153019 611031 500189 791879 905628 578567 201389 138723 267748 432436
43278 432436 812707 1461566 1907823 1685631 1009606 517654 502134 722063 833319 701159
43268 701159 386443 84558 32222 312601 801266 1335758 1765406 1838854 1380729 683469
43258 683469 335322 448500 430217 -205362 -1148767 -1734962 -1738032 -1372628 -831425 -250399
43248 -250399 128808 209472 241367 366418 249000 -330426 -807667 -454952 463178 917500
43238 917500 548581 115349 288559 718728 736222 404352 290630 528832 723659 677889
43228 677889 659765 868977 1067292 953436 647329 535707 721237 873807 689409 317663
43218 317663 182911 478983 1029987 1591358 2027501 2174491 1850905 1166726 565626 368469
43208 368469 490326 755278 1164280 1600186 1649736 1156481 666048 799663 1373608 1699132
43198 1699132 1616189 1578496 1738822 1682299 1250576 946373 1154746 1493462 1367897 784544
43188 784544 192056 -182944 -422502 -564713 -571477 -519719 -488745 -352805 32944 526372
43178 526372 822066 805058 587845 300289 34194 -106816 -84311 31953 217281 548978
43168 548978 997421 1353524 1511898 1618413 1770184 1800270 1562333 1193427 867287 536146
43158 536146 180921 50866 318731 728094 950171 1074952 1334890 1541565 1296510 656622
43148 656622 79029 -257824 -571834 -926193 -1111237 -1148814 -1339568 -1624019 -1463731 -676921
43138 -676921 101615 219444 -108025 -178941 195462 574595 628452 489184 363272 232907
43128 232907 55951 -62535 -53904 -31282 -117986 -267707 -347951 -298377 -150549 14039 100173
43117 100173 107694 226250 676862 1389216 1958437 2021695 1604302 1018107 506710 102367
43107 102367 -232889 -482635 -613409 -621082 -496784 -242529 24260 93687 -84550 -241480
43097 -241480 -57197 405744 723769 639967 386712 333637 472963 491280 277652 80558
43087 80558 126315 337348 536996 723514 988633 1322293 1661372 2001886 2286037 2293913
43077 2293913 1867806 1189214 616675 273379 24311 -132638 57902 690005 1361503
43068 1361503 1510516 1059843 545639 555933 1132841 1781236 2013262 1806279 1510648 1390624
43058 1390624 1378784 1289457 1111207 966357 898726 875629 920098 1028824 1011023 675657
43048 675657 187364 -58982 17270 85038 -31716 -66212 167123 343805 136632 -136613
43038 -136613 92854 735365 1098145 867675 493362 470334 751677 1080018 1411260 1682228
43028 1682228 1567266 896925 82196 -269142 -27205 452821 835556 1039028 1122365 1215568
43018 1215568 1427110 1610352 1435536 922102 590648 748757 970051 765610 454510
43009 454510 708431 1411010 1744156 1436332 1139748 1335836 1586461 1290254 621169 200154
42999 200154 204444 311912 311301 313693 453201 711291 980702 1098649 937993 630945 522346
42988 522346 735947 1011468 1147700 1318129 1690675 2026734 2007011 1735683 1544783 1454407
42978 1454407 1215043 808473 548335 681435 1136860 1639501 1880032 1669633 1140613
42969 1140613 700543 606867 718654 813001 894895 966830 801850 301404 -186671 -316640
42959 -316640 -270814 -383906 -484874 -176905 386363 632448 427767 178322 64244 -167514
42949 -167514 -539998 -646764 -352392 -89968 -152546 -233733 -42758 112459 -196438 -820711
42939 -820711 -1249822 -1254398 -948451 -487324 -73866 13216 -179732 -76137 770910 1929129
42929 1929129 2431693 1851828 700338 -219890 -544897 -442568 -276338 -269701 -363271 -356170
42919 -356170 -203118 -65732 -38820 -26440 30681 56478 88224 322124 729762 957389
42909 957389 844774 688152 686093 529658 -18169 -515048 -384382 210962 669982 907160
42899 907160 1278613 1680264 1571905 1004643 784784 1294929 1864658 1737863 1067026 473033
42889 473033 155512 -2178 99330 541405 918677 780791 383060 348189 668195 729544
42879 729544 371835 204514 620042 1125623 1093044 711039 645731 1009490 1243709 985252
42869 985252 533070 328095 373958 408012 374827 437275 635072 792342 751563 529053
42859 529053 258244 127951 332217 878776 1437794 1590347 1287920 885726 675004 612176
42849 612176 592125 681114 859361 828298 438451 108660 355510 966424 1147257 593437
42839 593437 -57199 -67289 503334 1058356 1303077 1423137 1617111 1873116 2157553 2463771
42829 2463771 2668894 2658189 2611885 2845157 3286194 3430420 2971639 2214564 1653437 1362755
42819 1362755 1083084 769875 706665 1041380 1504004 1735495 1714555 1673246 1700909 1665264
42809 1665264 1523745 1467584 1617732 1741420 1493910 898839 360674 155135 124819 12824
42799 12824 -89115 128212 666105 1087424 1011922 586046 312165 461721 793095 883147
42789 883147 645644 413689 496901 772872 853379 632774 483664 796683 1448280 1890805
42779 1890805 1728936 1064525 309771 -163500 -188889 161347 597355 804076 733173 619313
42769 619313 632739 655753 543399 465980 740621 1333330 1775561 1680122 1185654 776290
42759 776290 776995 1146780 1658377 2096769 2309140 2249330 2035634 1848295 1710835 1468483
42749 1468483 1033636 536207 143654 -146896 -393283 -485797 -259874 177110 459326 375057
42739 375057 73428 -232898 -544965 -868683 -947333 -549083 42700 225471 -109946 -294812
42729 -294812 318696 1456238 2131865 1736793 675010 -122770 -123257 440190 946505 985403
42719 985403 635975 275711 151285 132369 -99000 -639561 -1212910 -1436876 -1176432 -610496
42709 -610496 -27918 384265 606094 723367 804897 805333 601671 160780 -341014 -610145
42699 -610145 -474310 -38676 386839 526328 340965 24494 -192775 -227321 -143401 -33627
42689 -33627 47781 71893 39664 6880 49259 201301 460942 797245 1070779 1031901 584205
42678 584205 34267 -144776 142387 524480 711071 863327 1215845 1579880 1562075 1150914
42668 1150914 716757 465576 276449 121653 225667 615414 876137 666552 241284
42659 241284 120601 376485 585467 430625 22982 -375939 -635332 -703175 -576305 -434835
42649 -434835 -517017 -681358 -372240 679484 1899243 2380687 1924055 1214435 906768
42640 906768 893820 691318 256357 60066 430414 1150359 1744051 1918670 1679180 1249253
42630 1249253 968840 1039619 1238433 1095685 522045 37470 140917 645770 954624 859972
42620 859972 691000 708726 788184 801054 912009 1270715 1708285 1997538 2185863 2398273
42610 2398273 2496491 2241783 1692831 1152629 775957 494376 292615 278761 443577 573456
42600 573456 468648 121465 -296946 -476039 -85317 876652 1880122 2320549 2218305
42591 2218305 2146487 2384410 2528246 2164346 1561724 1302217 1445603 1531401 1348120 1213892
42581 1213892 1383756 1616776 1596984 1456161 1504430 1633065 1441932 959673 771096 1207311
42571 1207311 1759307 1672754 966136 439809 652624 1269248 1582011 1382111 1059611 1022320
42561 1022320 1299531 1653890 1839097 1749861 1499732 1344225 1374504 1330885 910080 223071
42551 223071 -282712 -364568 -201588 -25394 188324 518882 833831 949237 924217 983701
42541 983701 1213110 1493748 1681106 1697705 1513076 1198248 962958 967409 1092858 1046641
42531 1046641 726398 369104 295180 564048 901710 949794 629799 288061 375230 906877
42521 906877 1389553 1437346 1292541 1437949 1779782 1638446 682208 -494975 -1002938 -633852
42511 -633852 82492 627713 935510 1141921 1289196 1394236 1538298 1734171 1876676 1925781
42501 1925781 1954549 1920827 1626745 1077972 660975 716518 1105806 1474333 1785251 2225234
42491 2225234 2669449 2696426 2215705 1667842 1426572 1370910 1287857 1337532 1742751 2260502
42481 2260502 2404167 2102945 1743150 1577254 1471218 1275472 1076241 954951 809063
42472 809063 586329 461048 594949 897152 1176579 1367839 1449806 1305865 869426 317717
42462 317717 -50766 -71860 262524 907649 1701995 2291574 2368455 2027372 1720399 1781455
42452 1781455 2074820 2160198 1762136 1053584 485991 324364 366782 211816 -188428 -404106
42442 -404106 -61612 654598 1228482 1434014 1466595 1483403 1352379 1007263 755942 906057
42432 906057 1194026 970486 65337 -819714 -824956 90518 1128972 1559348 1384534 1082434
42422 1082434 977330 1054491 1202312 1358398 1433467 1302201 946976 543223 378577 677179
42412 677179 1394031 2122859 2358641 1995399 1451268 1164878 1126618 1094525 1056940 1136412
42402 1136412 1167921 813494 116759 -458666 -627566 -555871 -445049 -240520 80570 311662
42392 311662 339906 352298 501562 682387 850954 1189361 1664034 1822864 1441496 1028429
42382 1028429 1201092 1820527 2254029 2272716 2129670 1928972 1564628 1226933 1298159 1671868
42372 1671868 1797476 1533061 1349392 1504784 1646735 1530094 1523300 1971813 2576084 2912783
42362 2912783 3142987 3608283 4034950 3804189 2893952 1945911 1406124 1136479 921421
42353 921421 835102 948024 1097929 1163702 1255353 1458851 1674777 1864417 2156195 2513887
42343 2513887 2600321 2243830 1796804 1705730 1897792 1954033 1785608 1721042 1896819 1979550
42333 1979550 1674809 1189463 928772 962500 1090546 1277362 1660198 2171071 2518801 2607710
42323 2607710 2641411 2702381 2580309 2221159 1990349 2141582 2303786 1960611 1282569 944469
42313 944469 1133462 1321706 1170910 1064860 1378393 1721332 1473670 787604 434123 734633
42303 734633 1243308 1549208 1799768 2179942 2379964 2013589 1270993 694519 437241 190931
42293 190931 -154997 -223156 305292 1147559 1675623 1593518 1159517 788753 611442 459655
42283 459655 208473 60879 408476 1303213 2129867 2075342 1064670 4311 -163142
42274 -163142 491619 1082865 1068193 804920 883257 1322484 1685203 1694548 1407743 957750
42264 957750 484816 260056 521170 1120938 1595357 1679478 1582935 1671307 2010012 2307559
42254 2307559 2230184 1721869 1058465 596421 462285 561822 882807 1544562 2398234 2875576
42244 2875576 2614077 2076927 2084238 2735384 3275293 3133757 2609225 2284450 2222076 2130615
42234 2130615 1983885 1973751 2011473 1792933 1377768 1261139 1716282 2372324 2650239 2446499
42224 2446499 2186813 2259168 2549823 2597339 2168028 1581414 1355338 1563097 1750373 1572230
42214 1572230 1274117 1313087 1673943 1894832 1735071 1465147 1391457 1395388 1167146 719188
42204 719188 397892 415427 596297 661045 613851 710956 1083093 1534840 1795789 1893729
42194 1893729 2137415 2693675 3294477 3479680 3114384 2567443 2336901 2551917 2901793
42185 2901793 3023321 2848183 2523792 2132588 1684336 1334388 1310551 1503171 1412892 770474
42175 770474 9150 -217418 132026 514919 604130 609263 750029 896886 945902 1119005
42165 1119005 1558585 1941962 1884454 1531870 1386223 1652023 2072954 2348492 2438403 2494766
42155 2494766 2702574 3129210 3573506 3688939 3423537 3160596 3223747 3463193 3583680 3613625
42145 3613625 3685855 3606773 3131399 2517295 2274061 2418563 2516261 2457576 2600931 3029783
42135 3029783 3270171 3023410 2678652 2737551 3108076 3338395 3256911 3020389 2768991 2596783
42125 2596783 2680807 3077312 3497384 3597547 3416552 3257455 3221459 3130878 2860022 2481746
42115 2481746 2103554 1786352 1627676 1726656 2034930 2371557 2590470 2652355 2598321 2568663
42105 2568663 2766268 3244504 3770562 4035386 3976578 3799623 3734602 3865094 4122409 4343139
42095 4343139 4404367 4394057 4551985 4947638 5344680 5506918 5490807 5469150 5417746 5214129
42085 5214129 4959079 4944606 5302523 5859082 6313008 6403725 5971441 5064662 3991681 3111047
42075 3111047 2579223 2397005 2572125 3028483 3464839 3587729 3466590 3410509 3511433 3571400
42065 3571400 3476360 3345013 3256734 3128165 2968146 2987561 3295787 3685759 3878770 3844408
42055 3844408 3762526 3793299 3967189 4177085 4229430 4044314 3824261 3847154 4088393 4272598
42045 4272598 4300526 4343802 4506136 4749580 5221609 6233918 7757905 9351959 10761930
42036 10761930 12127434 13411243 14285100 15000135 16683377 20154445 25174121 31707238
42028 31707238 40941550 53192856 64887232 69800548 64610193 52315942 39242360
42021 39242360 29477350 23112730 18739043 15677586 13687720 12153185 10498814 8828469
42013 8828469 7591445 6936806 6700503 6745112 7075352 7763103 8774621 9696844 9831635
42004 9831635 8971531 7915770 7656743 8108604 8241213 7483675 6346851 5563127 5291873
41995 5291873 5372097 5683702 5964023 5889458 5659544 5893066 6634002 7159008 7181145 7465754
41985 7465754 8635677 10103841 10989378 11437903 12044592 12466073 11785205 10081080 8492567
41976 8492567 7664517 7160622 6577512 6233560 6414080 6823750 7240534 7950502 9010018
41967 9010018 9726006 9475354 8578046 7794659 7332860 6899815 6428829 6161211 6143837 6153073
41957 6153073 6092411 6089309 6197606 6290760 6279280 6266641 6485081 7133059 8201591 9465894
41947 9465894 10792213 12347723 14163204 15557510 15564700 14123586 12321715 11160701 10578319
41938 10578319 10068916 9707764 9902268 10481190 10809517 10733985 10707154 10880674 10711053 9739641
41928 9739641 8312542 7179971 6629527 6321063 5859355 5270135 4894891 4952973 5281704
41919 5281704 5512560 5467205 5310831 5323599 5633911 6178084 6739118 6978917 6688291 6161890
41909 6161890 6072585 6711460 7532589 7751756 7271327 6681534 6419674 6318847 6052900 5658608
41899 5658608 5389070 5265115 5065293 4746129 4641210 5099808 5998892 6786583 7063205
41890 7063205 6971105 6895138 6946496 6970299 6928681 6940580 6983956 6931173 6894743 7119682 7465509
41879 7465509 7496360 7269646 7473475 8410093 9372210 9587434 9384356 9752335 10991307
41870 10991307 12525341 13955336 15526834 17460642 19533883 21554220 23622610 25644649
41862 25644649 27211202 28379291 30013531 32901499 37196586 43408837 53000797 66217650
41854 66217650 79158656 84930600 79370006 65263084 49844354 38400446 31267805
41847 31267805 26450780 23045913 21233967 20501962 19609331 18006619 16131403 14431804
41839 14431804 12992489 11945047 11334498 10687560 9591622 8569379 8413303 8763564 8484362
41830 8484362 7495913 6965062 7389263 7793638 7387511 6785752 6792902 7063004 6937411 6720729
41820 6720729 7054386 7694147 7963559 7900125 7957294 8037785 7825448 7683098 8205378 9164183
41810 9164183 9865251 10323943 11142199 12366511 13354014 13701001 13557379 13134032 12572396
41801 12572396 12140368 11956241 11765623 11513798 11689192 12505703 13346376 13741893 14203448
41792 14203448 15231920 16306995 16912859 17715814 19465713 21600471 23419681 25764010
41784 25764010 29802367 35064139 40805698 48460960 59821869 72726226 81388590 81896932
41776 81896932 75549616 66578968 58818167 54800898 55402532 59393960 65311220 74049563
41768 74049563 87522935 105701539 128993838 162539205 210397066 261957071 291494134
41761 291494134 279591729 233364965 179627499 139769654 117105967 105914554 102250098
41754 102250098 102470898 99561478 88337628 71697731 56767352 46457830 38605212
41747 38605212 31619703 26505664 23652153 21557122 19448799 18381057 18874998 19588388
41739 19588388 19217682 18150733 17451095 17445581 18005286 19158297 20653880 21630437 21395793
41730 21395793 20160232 18626382 17223825 16016038 15001488 14219831 13738060 13631918
41722 13631918 13815924 13943124 13744426 13424709 13423067 13794896 14120495 14048723 13714987 13633245
41712 13633245 14340730 16025405 18213341 19874461 20193757 19400870 18672328 19025917 20282720
41703 20282720 21188980 20636560 18741770 16596056 14992568 13735642 12348576 10973031
41695 10973031 10054284 9472972 8719351 7835199 7407503 7541932 7626869 7361063 7245082
41686 7245082 7650426 8142541 8341830 8862847 10604430 13380295 15945868 17253531 17128844
41677 17128844 15893712 14009722 12125272 10845731 10204046 9703017 9031138 8430228 8226335
41668 8226335 8328095 8437235 8538108 8865831 9436599 9896918 9945992 9720197 9573873 9583242
41658 9583242 9514115 9257860 8987843 8790321 8475753 7969832 7566377 7461622 7317110 6717903
41648 6717903 5868292 5338799 5235872 5161717 4976452 5019130 5449900 5918952 6145807 6389254
41638 6389254 7011454 7887683 8613640 9133522 9814009 10897880 12138520 13105144 13752090
41629 13752090 14482972 15553383 16602658 17061763 16917188 16657353 16478400 16083390 15411037
41620 15411037 14982841 15224306 15936895 16736814 17510616 18183600 18665646 19315667 20697072
41611 20697072 22496661 23574406 23597883 23695703 24960063 27403725 30938573 35835531 41248602
41602 41248602 45046657 46620716 48248082 52074036 57675592 64600334 74919988 90556002
41594 90556002 111106937 138423423 179202112 234273864 285442622 303379591 274894618
41587 274894618 217443587 161663475 123927259 100822870 84443047 73033040 67081071
41580 67081071 64162984 61549521 59265590 57606693 54841585 49706091 43619130 38447413
41572 38447413 34127112 30043778 26766357 24854654 23622568 22458088 21869527 22020303
41564 22020303 21697464 19969150 17614220 15807648 14535348 13293948 12236133 11621815
41556 11621815 11073646 10246524 9445020 8970519 8693318 8691618 9337839 10383598 11017381
41547 11017381 11152057 11536447 12363346 13042469 13558022 14595165 16063819 17120452 18034231
41538 18034231 20329021 24644880 30332860 37728763 48720345 64072522 81994540 100015863
41530 100015863 115869514 125493972 123401100 108025947 85243442 63969977 48954677
41523 48954677 39441344 33186347 29036704 26310113 24419815 23490541 23890210 25303231
41515 25303231 27373960 30657388 35938958 43705889 55177156 71496054 89451697 100152557
41507 100152557 96036324 79159016 59459215 44790439 35548621 28808133 23531995
41500 23531995 20028084 17548627 15126255 13236503 12613966 12482929 11545034 9862755
41492 9862755 8448103 7693952 7288328 7035145 6847818 6494217 6038777 5957973 6341600
41483 6341600 6706140 6981196 7756662 9093824 10104330 10288945 10327235 10959809 12078017
41474 12078017 13505410 15606121 18459138 21591159 25310749 30969097 38624862 45472237
41466 45472237 48105210 45890154 40972496 35552703 30460557 25955875 22338123 19490759
41458 19490759 16843985 14137872 11691336 9870885 8752776 8210689 7904637 7380317
41450 7380317 6598705 6081200 6111125 6196600 5833139 5331096 5237155 5360646 5128510 4584092
41440 4584092 4246900 4207722 4145521 4092009 4398652 4983645 5316632 5180153 4866373 4633594
41430 4633594 4509266 4576351 4895445 5175552 5057658 4695098 4548190 4677296 4791875 4940022
41420 4940022 5519994 6527048 7343858 7437508 6858178 5961221 5023000 4209637 3585373
41411 3585373 3094788 2787437 2957072 3706219 4510458 4688527 4263777 3900143 4000338
41402 4000338 4328573 4531506 4552982 4464430 4326758 4327714 4684471 5316663 5915155 6333792
41392 6333792 6596343 6614094 6346734 6180826 6605870 7477191 8153110 8474822 9067570 10501924
41382 10501924 12676142 15209045 17856126 20213060 21562585 21517094 20492437 19144041
41374 19144041 17645502 15927437 14297171 13273808 12946077 12980210 13212416 13798398 14769494
41365 14769494 15840699 16750367 17501708 18204104 18951965 19943165 21425853 23312708 24970831
41356 24970831 25580292 24729383 22668333 20067534 17551361 15383307 13554682 12155834
41348 12155834 11509787 11779735 12584444 13348213 14069391 15355062 17474330 19724173 21129097
41339 21129097 21553226 21618451 21596551 20995251 19427213 17325786 15390274 13718696 11997202
41330 11997202 10298669 9115216 8651572 8603660 8679771 8876808 9152780 9296493 9333103
41321 9333103 9686271 10671221 12062700 13369196 14349911 15142964 16115762 17691962 20015531
41312 20015531 22560009 24266428 24270330 22434434 19244146 15516174 12208699 10000236
41304 10000236 8771697 7818195 6761406 5893246 5458537 5124048 4530560 3911328 3679823
41295 3679823 3758252 3819330 3885196 4134230 4358425 4210547 3847950 3748447 3961160 4100030
41285 4100030 4053065 4143196 4532551 4951925 5096392 4885576 4331274 3594346 3160887 3423359
41275 3423359 3991307 3950457 3008928 1944576 1697385 2405189 3541674 4597832 5323969
41266 5323969 5619508 5553274 5371924 5266281 5228887 5249627 5466123 5973824 6644365 7273164
41256 7273164 7792846 8246273 8652891 8968651 9121393 9127051 9259391 9953264 11319159 12896000
41246 12896000 14182084 15281789 16661045 18388708 20122394 21863062 24212821 27738436
41238 27738436 32499532 38379032 45536757 54376270 65240499 77885086 90546079 99546998
41230 99546998 100962550 93640855 80437959 66008552 53507389 43555581 35640123 29488310
41222 29488310 25031392 21851331 19239281 16729120 14371254 12461175 11057654 9873132
41214 9873132 8725823 7921078 7851094 8274543 8452600 8106224 7770456 7983594 8580819
41205 8580819 9091051 9385394 9524867 9358112 8777587 8117218 7806260 7814169 7881129 8097642
41195 8097642 8762750 9805666 10850641 11800605 12918715 14384185 16173527 18307146
41187 18307146 20804851 23504706 26399591 30079420 35328630 42327841 50822322 61067454
41179 61067454 73788045 88637592 102948097 112476939 113720635 106036448 92133647
41172 92133647 76490724 62659336 51663559 42859103 35793632 30606086 27143286 25065662
41164 25065662 25015393 28176528 33722190 37840095 36818383 30829111 23483386 17842843
41156 17842843 14112315 11194489 8848215 7442005 6693156 5907225 5093131 4816223 5036341
41147 5036341 4970976 4236901 3412046 3189859 3509244 3857413 4028386 4172493 4331482 4345923
41137 4345923 4173241 3986278 3938558 4037738 4243117 4491648 4626614 4502710 4206192 4005494
41127 4005494 4037954 4196607 4358164 4536926 4752353 4967126 5290453 6007305 7144268
41118 7144268 8147063 8318872 7591853 6609686 6019374 5944255 6213352 6771777 7614528
41109 7614528 8529459 9235368 9746557 10398102 11582213 13658384 16920677 21130685 24972487
41100 24972487 26526595 24817838 20810987 16556961 13430901 11452147 10074245 9021919
41092 9021919 8238335 7590457 7054203 6931739 7520329 8718679 10268312 12243724 14962730
41083 14962730 18448958 22215207 25459081 27219440 26605669 23478271 19000711 15022041
41075 15022041 12637399 11573202 11004280 10493125 9910888 8988765 7530120 5867806 4575900
41066 4575900 3740223 2929050 1908668 990022 560238 619548 956997 1480935 2101993
41057 2101993 2487402 2290261 1631321 1075769 1017643 1264263 1369237 1226440 1112609 1218321
41047 1218321 1438638 1678463 2024645 2410071 2446353 2007374 1776484 2634884 4434345
41038 4434345 5898271 5978066 4904507 3628927 2644725 1803898 1006049 483618 397014
41029 397014 581692 803016 985334 1120846 1186244 1218123 1292964 1396985 1459180 1481013
41019 1481013 1453254 1210730 634510 -13489 -260807 -4786 351886 474857 560727 1022230
41009 1022230 1867861 2634230 2919368 2818036 2765885 3008060 3303895 3226253 2730760 2278455
40999 2278455 2311294 2756397 3196652 3376613 3317179 3080647 2764585 2676081 3104349 3821571
40989 3821571 4171929 3845936 3275763 3039252 3129343 3102495 2768500 2392802 2261422 2336003
40979 2336003 2382461 2250121 1977700 1748845 1758527 2016012 2278872 2283044 2044134 1860775
40969 1860775 2041383 2687312 3675346 4736364 5585064 6086586 6295865 6300677 6140183 5974067
40959 5974067 6142565 6799478 7605879 8157255 8716535 10081023 12523330 15258864 17334792
40950 17334792 18797945 20536190 23058683 25874117 28085139 29181823 29193939 28535928
40942 28535928 27909824 27906106 28304329 28046103 26315597 23485609 20619908 18208667 15874469
40933 15874469 13286259 10830331 9173531 8493843 8362535 8198159 7684963 6881956 6048793
40924 6048793 5350170 4783111 4422892 4473693 4847693 5034712 4853778 5032211 6360985
40915 6360985 8490720 10483481 12502256 15669067 19727632 22108880 20496638 15677802
40907 15677802 10687862 7517694 5827852 4638624 3819731 3563534 3590308 3585951 3708947
40898 3708947 4044680 4111918 3520639 2712643 2445344 2776459 3083207 2956532 2627516 2540175
40888 2540175 2838336 3301531 3591578 3544470 3287942 3026781 2749069 2323354 1837095 1536756
40878 1536756 1429432 1324278 1334828 1875687 2947684 3860355 3983510 3439463 2748852
40869 2748852 2146156 1622059 1314313 1374766 1638415 1871705 2202091 2851035 3548567 3705284
40859 3705284 3180612 2451275 1955475 1660517 1382959 1160215 1101162 1136448 1147755 1186826
40849 1186826 1365729 1625321 1791613 1822359 1841474 1921070 1988040 2056700 2438029 3455639
40839 3455639 4861629 5783555 5532843 4374821 3219110 2613259 2374891 2169188 1965852
40830 1965852 1776487 1408617 796721 242045 -6370 -123733 -325140 -402419 -75007 418218
40820 418218 577049 391222 340651 648944 1008791 1140049 1191973 1405332 1708634 1889734
40810 1889734 1958334 2108218 2420642 2772990 2998192 3030181 2906999 2686115 2376253 1974819
40800 1974819 1561589 1274656 1181683 1285841 1651496 2305790 2953636 3091036 2618257 2096281
40790 2096281 2113542 2595454 3059526 3367489 3794032 4403123 4806602 4657706 4062752 3356855
40780 3356855 2706133 2089554 1518843 1103751 914286 855073 739779 544019 501907 764397
40770 764397 1030427 865785 410802 278360 563795 558678 -110363 -655126 -166983 934456
40760 934456 1405839 958540 555780 875591 1460533 1701953 1776797 2103917 2606093 3125557
40750 3125557 3977960 5370640 6649845 6856299 5874166 4455198 3246867 2356846 1779809
40741 1779809 1630170 1821087 1958848 1757504 1326542 959298 828885 925672 1103888 1155475
40731 1155475 984252 714452 525425 442286 405863 433537 539362 606851 545834 481795
40721 481795 567926 689622 606513 353680 251448 497209 948679 1328008 1455671 1273892
40711 1273892 845875 395341 183000 263110 473008 710035 1082209 1681232 2296085 2509994
40701 2509994 2130751 1446718 955860 848853 890530 860831 908346 1247881 1658397 1649988
40691 1649988 1150196 653633 553739 665870 630744 480312 486263 659091 747639 630584
40681 630584 403495 153191 -67282 -101007 173940 573459 744218 599299 403283 419378
40671 419378 681945 1105967 1574698 1890573 1888970 1681949 1580988 1683311 1719119 1425813
40661 1425813 922940 569619 525817 586156 455807 137462 -5296 356233 1042697 1438779
40651 1438779 1171885 589072 341927 583416 869067 855974 754444 930208 1345200 1665440
40641 1665440 1763865 1808718 1891138 1862945 1620536 1307494 1080500 852308 483624 121271
40631 121271 63881 288802 414271 247332 75769 187435 363638 207537 -200691 -436003
40621 -436003 -464685 -723340 -1345823 -1832172 -1769712 -1434876 -1278065 -1176922 -722499 -27595
40611 -27595 341911 227753 136781 499621 1076912 1304320 954605 276375 -317735 -530917
40601 -530917 -294047 250422 916961 1635100 2341821 2786020 2675167 2044058 1264205 650189
40591 650189 268568 138337 292631 518721 380116 -229460 -795534 -781515 -375544 -260009
40581 -260009 -659750 -1028777 -841734 -358864 -274706 -752851 -1189331 -993077 -286783 354060
40571 354060 625719 674946 683789 641692 572787 655720 946624 1211974 1227097 1070294 940264
40560 940264 849351 710925 586733 598177 686066 714681 763056 1056508 1605183 2124385
40550 2124385 2333890 2175335 1761570 1302480 1057579 1135959 1302841 1164343 599160 -106024
40540 -106024 -542459 -483408 28376 699816 1114330 1041682 653589 311834 189653 240913
40530 240913 419778 675419 804036 616145 257624 87150 224366 499922 850125 1410156
40520 1410156 2139021 2704906 2905214 2924511 3027053 3253085 3551441 3914076 4194343 4090785
40510 4090785 3567286 3049386 2925821 3043030 2969795 2602031 2210280 1994502 1877911 1690976
40500 1690976 1327592 776609 209034 -49824 129532 438350 498189 395657 522774 902259
40490 902259 1067725 741559 258866 57967 52977 -96875 -269280 57038 945592 1688343
40480 1688343 1651583 1118397 889564 1233418 1705388 1956614 2175377 2571048 2919324 2938165
40470 2938165 2743617 2581118 2429056 2255831 2335131 2790538 3089670 2626226 1692210 1203056
40460 1203056 1439625 1738403 1566719 1224523 1181368 1326839 1324645 1266677 1489747 2009645
40450 2009645 2534774 2842362 2844796 2516892 2037917 1758917 1760533 1707553 1388599 1060580
40440 1060580 962054 891962 687161 706699 1275641 1972017 2142484 1941221 2131976 2895741
40430 2895741 3566238 3668910 3539746 3650734 3904672 3967637 3854308 3764567 3637262 3270090
40420 3270090 2706407 2163799 1703233 1273265 996463 1107692 1594885 2117629 2323330
40411 2323330 2118575 1646888 1157563 913089 1062112 1508634 1980322 2288737 2453265
40402 2453265 2517674 2375950 1948561 1450670 1219139 1238692 1139392 801462 627389 930660
40392 930660 1372933 1444335 1254198 1273715 1439436 1219280 605038 274896 531030 806161
40382 806161 612639 298881 342803 505943 326291 -57268 -271818 -467965 -947826 -1389852
40372 -1389852 -1282211 -888355 -896109 -1223457 -1086370 -282939 476208 671864 594357 631704
40362 631704 705608 733816 977069 1538560 2045845 2168599 2007772 1739001 1362129 1020765
40352 1020765 1027758 1314215 1391808 1134782 1047863 1462306 2035154 2373431 2556850 2655111
40342 2655111 2357564 1596325 974589 984594 1249242 1104668 512001 -167848 -855228 -1561099
40332 -1561099 -1904763 -1531144 -756623 -168297 166388 486110 656045 430285 151619
40323 151619 396174 1027448 1355256 1180481 951182 914621 885046 905516 1350156 2165331
40313 2165331 2694753 2535696 2032914 1699003 1628455 1666043 1694214 1610760 1458639 1630875
40303 1630875 2467431 3725754 5142404 7409414 11458079 16392372 19291720 18019832
40295 18019832 13618530 9061738 6138997 4485331 3247572 2422183 2313998 2640214
40287 2640214 2754977 2364676 1640612 860871 209284 -212129 -360328 -212306 251471
40278 251471 922064 1472378 1573350 1209988 664684 224503 11399 -2380 22602 -114197
40268 -114197 -407574 -600604 -556183 -503299 -649849 -723916 -291373 532857 1122909 1150636
40258 1150636 954090 959523 1112563 1120825 960203 835917 830032 882271 990087 1132941 1085020
40247 1085020 628723 -39405 -422090 -325737 -89003 -71798 -160095 -15641 334604 465190
40237 465190 119056 -433310 -695191 -462096 37481 402534 388652 88156 -135205 14064
40227 14064 414750 626303 413198 33564 -121098 -24889 44967 -34608 -92847 32433
40217 32433 290448 553326 753207 830010 737040 587543 631443 970083 1399689 1630364
40207 1630364 1581040 1396680 1253760 1198009 1108956 816209 335754 -32908 18830 444158
40197 444158 897863 1138254 1187056 1115181 936462 760273 756466 842328 675313 129126
40187 129126 -470689 -784134 -882161 -986616 -1025069 -790321 -403456 -245197 -445092 -737230
40177 -737230 -825691 -639426 -243151 225946 519614 464642 252371 281862 624680 889621
40167 889621 734872 281552 -133242 -393560 -579477 -670795 -552010 -272029 -54458 -667
40157 -667 47881 276246 639132 916428 945680 719717 326564 -84004 -299687 -170897
40147 -170897 194018 474490 482541 376635 415865 598352 721376 725672 730501 733674 569878
40136 569878 253060 71997 186735 396688 514338 690047 1058478 1300919 984049 239188
40126 239188 -319707 -358961 -123498 59387 174157 307305 428656 561479 824420 1080826
40116 1080826 882730 76038 -807494 -1131073 -939020 -774078 -849953 -872189 -669441 -495015
40106 -495015 -519376 -455240 -30387 438165 365607 -271286 -804362 -652642 43302 688571
40096 688571 906016 752922 444355 151109 49637 275594 679084 803231 327572 -486742
40086 -486742 -963645 -693199 20084 448154 167427 -527776 -938288 -664396 38873 608913
40076 608913 774719 695899 579843 399048 77581 -241828 -307744 -49462 402177 910579
40066 910579 1397177 1798570 2161914 2717569 3593079 4433417 4576812 3742259 2379177
40057 2379177 1230052 697678 731842 1116486 1623817 1975876 1934416 1527515 1072953 890495
40047 890495 1017466 1239382 1381365 1532960 1945115 2678951 3400402 3616303 3145258 2302717
40037 2302717 1596357 1280149 1213896 1091399 758217 329452 34238 -23334 93394 329880
40027 329880 728366 1258012 1680390 1744671 1460791 1034614 600874 192214 -109378 -232308
40017 -232308 -288655 -419251 -481577 -215552 245193 421485 203335 111833 539656 1057735
40007 1057735 913531 63943 -723472 -782124 -201264 454926 751612 614811 241707 -45303
39997 -45303 767 353144 754534 986188 1024947 952882 849804 817756 996683 1455038
39987 1455038 2063829 2525753 2619027 2496637 2648467 3339375 4105371 4145666 3328954 2428154
39977 2428154 2107053 2085942 1750050 1212254 1094317 1413760 1490964 1093947 916223 1542278
39967 1542278 2550992 3173325 3400251 3811550 4529091 4980064 4713211 3947517 3192338
39958 3192338 2694424 2416331 2280431 2224567 2147998 1976379 1774905 1736517 2024493 2567999
39948 2567999 3000788 2916466 2264087 1404002 721441 324572 178679 288705 546408 610427
39938 610427 245168 -316881 -632585 -601284 -487315 -461471 -450519 -435764 -547291 -780436
39928 -780436 -932763 -935634 -946532 -963928 -664431 128529 1054406 1591767 1679150 1676103 1817938
39917 1817938 2030546 2247554 2552451 2900789 2996358 2659803 2165837 1996521 2308583 2797164
39907 2797164 3038041 2810228 2137387 1250921 567667 461657 875568 1303621 1359745 1251265
39897 1251265 1452803 2003809 2462094 2567995 2574645 2753826 2913587 2701474 2166598 1691802
39887 1691802 1484208 1431336 1381394 1278589 1081062 829792 745347 960414 1219625 1198676
39877 1198676 1078815 1357237 2027108 2448629 2256050 1925878 2074026 2546556 2675729
39868 2675729 2232789 1640440 1310261 1234131 1281976 1485964 1846632 2136027 2119302 1858293
39858 1858293 1654572 1743003 2081669 2360767 2215147 1569105 817693 534859 925885 1650110
39848 1650110 2208730 2376439 2208341 1821197 1356357 1053890 1107395 1390951 1516062 1279464
39838 1279464 929899 834842 973255 988051 737632 511823 569247 737623 751949 785257
39828 785257 1227800 1975452 2386890 2084696 1417947 906983 569163 124812 -375259 -546817
39818 -546817 -232854 278434 616270 660878 510000 339308 317599 475823 654672 739803
39808 739803 896200 1347407 1949082 2251136 2048484 1655518 1543082 1856192 2352426 2672181
39798 2672181 2610199 2243414 1841757 1573212 1319009 887343 332263 -122283 -399123 -561154
39788 -561154 -546287 -240427 156762 211450 -140406 -381379 -35980 716567 1284997 1349574
39778 1349574 1077436 801177 729406 894312 1154363 1268693 1142878 995324 1149498 1658493
39768 1658493 2208203 2370279 1931206 1074523 292368 -5456 125993 281373 237301 176720
39758 176720 291891 420258 311824 84288 108469 484535 891913 990411 791416 590501
39748 590501 644382 932745 1175031 1105947 768491 452153 316284 241799 130513 119160
39738 119160 315844 540987 587147 563492 681701 835760 744399 440222 247828 281948
39728 281948 336132 317014 416592 729697 1033275 1116692 1046025 914396 608372 77216
39718 77216 -378349 -387758 13354 437700 627498 669783 755197 919376 1061733 1095387 1025576
39707 1025576 922425 829663 709664 535048 419793 529895 827080 1053764 1061640 1012213
39697 1012213 1132379 1408517 1671479 1843979 1891661 1639344 940410 58783 -403174 -123054
39687 -123054 547628 972051 923129 722931 724598 859868 814908 555585 493927 1054025
39677 1054025 2146646 3185305 3636819 3482452 3112680 2865733 2772688 2707975 2622969 2547301
39667 2547301 2468020 2359629 2308415 2429948 2605925 2488598 1936059 1318932 1151841 1453851
39657 1453851 1734789 1637954 1294915 937264 509654 -44351 -385075 -102414 627801 1123249
39647 1123249 998407 562488 300685 240184 19151 -580721 -1338744 -1760585 -1486565 -650120
39637 -650120 152678 420678 307105 423458 1043544 1760479 2048410 1891257 1649922 1543935
39627 1543935 1546117 1627743 1775414 1813021 1525115 1016475 707927 860382 1247693 1413551
39617 1413551 1182064 832431 791791 1199954 1783085 2145575 2144365 1919308 1599335 1128537
39607 1128537 433031 -374698 -1057573 -1433229 -1413232 -972416 -210602 598087 1123164 1160674
39597 1160674 721970 40432 -515120 -703704 -648358 -648731 -713998 -525079 18404 508205
39587 508205 552090 366280 491730 1032357 1546172 1675200 1522859 1340271 1172284 979411
39577 979411 866577 965434 1185096 1252944 1009448 609993 426683 705699 1270609 1647339
39567 1647339 1591735 1394592 1489221 1848268 2034575 1847712 1626871 1789769 2280200 2637209
39557 2637209 2503166 1939905 1319263 1015524 1196250 1864765 3049550 4799479 6865785
39548 6865785 8530431 9039608 8270252 6812181 5386601 4348484 3711586 3361788 3135428
39539 3135428 2897840 2666986 2529190 2411424 2147743 1803617 1653462 1725473 1653756 1165790
39529 1165790 471505 -45524 -305970 -466459 -571141 -548891 -418873 -229535 86567 517879
39519 517879 745911 448587 -187355 -566023 -336858 285562 857086 1085036 843603 142638
39509 142638 -728089 -1234290 -1016378 -239163 578223 1033743 1102292 1031662 1070928 1249798
39499 1249798 1370857 1254137 982320 812364 846899 932491 926216 908005 1019630 1209600
39489 1209600 1281880 1133642 794763 263342 -508055 -1388712 -1988251 -1983077 -1503609 -1018017
39479 -1018017 -771301 -519193 26816 660335 893594 676526 523978 778560 1091511
39470 1091511 923390 293669 -354272 -855217 -1397872 -1919114 -1961497 -1351367 -612857 -378306
39460 -378306 -626722 -829315 -700366 -473334 -468480 -675362 -839953 -801962 -644601 -538899
39450 -538899 -485179 -284466 160784 645842 1011930 1613533 2985601 4889476 6162222
39441 6162222 5905171 4497793 2997939 1855374 821385 -90692 -392858 -13067 345819
39432 345819 122665 -347693 -396591 96352 800183 1497072 2034322 2047036 1354824 486407
39422 486407 209115 561225 874798 746844 443746 296017 272149 322773 598169 1039600
39412 1039600 1219275 928129 535470 401965 294863 -178032 -841874 -1165031 -1027931
39403 -1027931 -778556 -601081 -346067 -20860 62501 -189345 -395730 -248002 -19780 -201976
39393 -201976 -779839 -1209455 -1113224 -727422 -553308 -747352 -1038152 -1161782 -1126520 -979027
39383 -979027 -578046 131913 775448 861249 456514 148967 204757 171502 -413540 -1290590
39373 -1290590 -1843034 -1910347 -1763120 -1469576 -863281 -106527 315707 325420 466587 1101982
39363 1101982 1768454 1696779 786051 -257735 -695518 -454839 -73168 -81848 -485887 -850078
39353 -850078 -875858 -744815 -777257 -946095 -1000742 -935155 -965147 -1082433 -1020657 -700952 -355726
39342 -355726 -174594 -188274 -501594 -1175011 -1816890 -1842342 -1308542 -922917 -960047 -791202
39332 -791202 72657 1051686 1233519 628648 14388 -198585 -239740 -268781 -115270 239840
39322 239840 535062 688847 890880 1135510 1125721 756171 267958 -195925 -776046 -1485261
39312 -1485261 -1994594 -2038176 -1760295 -1500788 -1454327 -1623007 -1867975 -1962433 -1847969 -1832126
39302 -1832126 -2206239 -2682803 -2642931 -2009177 -1395408 -1221116 -1162500 -776011 -233021 -15635
39292 -15635 -162557 -252168 575 497498 1039015 1540840 1962086 2218511 2187861 1738383
39282 1738383 857659 -164554 -845786 -947311 -677355 -349100 -4277 472374 1028275
39273 1028275 1439266 1560368 1438055 1222066 1038046 873246 565996 25197 -561246
39264 -561246 -925846 -1089511 -1248164 -1316580 -992253 -360896 27477 -80895 -243923 -19551
39254 -19551 329712 265878 -180277 -481792 -367144 -39674 263018 507413 700044 849308
39244 849308 1068517 1412050 1667527 1609513 1372970 1262689 1307578 1357524 1479841 1793117
39234 1793117 1967833 1425617 143018 -1163701 -1772166 -1527593 -671905 412813 1163020
39225 1163020 1071877 307602 -262908 -13776 722419 1165664 1069629 853835 920482 1190750
39215 1190750 1291617 967952 320015 -235771 -318723 -12460 183002 -45280 -442232 -596904
39205 -596904 -543262 -632591 -882192 -823978 -132189 835576 1340483 1059801 439353 211239
39195 211239 630384 1275485 1602764 1558657 1516292 1698723 1903285 1848494 1575977 1343163
39185 1343163 1230534 1050907 661847 234309 106876 370760 698440 717985 536299 656542
39175 656542 1254109 1799130 1698850 1134119 839045 1102448 1462555 1476878 1300346 1244202
39165 1244202 1184393 810231 217168 -155364 -83984 246592 541884 638662 522101 331265
39155 331265 286617 433545 563286 560538 661840 1135048 1871027 2564487 3113932 3500324
39145 3500324 3461406 2773322 1801514 1254385 1310532 1460080 1333133 1178823 1270543 1328372
39135 1328372 975867 450977 348703 781174 1262728 1421556 1395107 1411445 1349126 963285
39125 963285 357593 -36761 57936 455152 701073 511597 1968 -454456 -555711 -300951
39115 -300951 34458 147619 11752 -37733 370185 1143379 1684332 1527422 924873 537828
39105 537828 578427 604925 261095 -163896 -186530 149595 380121 294748 117505 72750
39095 72750 147956 286508 440943 392792 -75327 -701919 -851771 -334337 238985 212291
39085 212291 -314593 -787782 -986376 -1033263 -855035 -252681 504987 770880 368243 -155803
39075 -155803 -346398 -432511 -786466 -1226338 -1309508 -1044189 -835026 -865449 -960338 -974433
39065 -974433 -919371 -753786 -418443 -49867 187659 427156 869360 1283355 1210262 700438
39055 700438 347309 461103 706576 760336 812372 1088253 1336360 1229073 930984 807912
39045 807912 829189 711188 438605 189943 -55834 -360114 -466551 -151935 210032 66277
39035 66277 -384838 -377371 217063 593089 197074 -447138 -521874 1094 548225 790876
39025 790876 764208 457011 -131784 -688480 -862673 -764294 -734194 -733079 -454515 20783
39015 20783 228461 21112 -248413 -347706 -462181 -690804 -745244 -467457 -250438 -551000
39005 -551000 -1228444 -1721897 -1713293 -1313822 -772043 -331233 -248857 -609706 -1158077 -1574388
38995 -1574388 -1832876 -2020821 -1960528 -1432448 -729768 -496681 -876743 -1254201 -1086521 -626047
38985 -626047 -462584 -610100 -495575 213410 1201922 2043855 2833920 4032372 5743777
38976 5743777 7325175 7809451 6766783 4750132 2819127 1601818 930538 410125 63492
38967 63492 151679 539635 677302 288082 -265190 -464461 -222258 199239 592567 854414
38957 854414 827811 444047 -49300 -325354 -418572 -607170 -858668 -786686 -280965 218106
38947 218106 333826 303360 538631 886722 826108 330846 8904 250379 699225 842790
38937 842790 759642 882061 1219424 1281105 791748 115224 -179221 48586 461329 690797
38927 690797 673557 583842 555104 522210 345959 60460 -107502 -27102 138393 153753 51252
38916 51252 71783 298016 526762 514787 207856 -250147 -573216 -457794 108185 685720
38906 685720 814312 600053 540958 738868 729680 271381 -160286 1303 655387 1284038
38896 1284038 1641296 1769834 1646266 1344538 1320756 1946671 2927542 3810018 4879431
38887 4879431 6693462 8696238 9295770 7749125 5189208 3235670 2239834 1512372 653641
38878 653641 -181719 -940396 -1668878 -2001804 -1515903 -626871 -355036 -1032222 -1892869 -2145209
38868 -2145209 -1845000 -1464272 -1180351 -955414 -856234 -889466 -839829 -597420 -343469 -140868
38858 -140868 272446 918497 1208424 662264 -260006 -628404 -234254 249254 279926 49098
38848 49098 -46559 -2198 -1648 -13166 83260 232734 387878 740903 1417957 2069731 2155110
38837 2155110 1635270 1041821 780711 692539 463069 160524 52059 59556 -203761 -821746
38827 -821746 -1338312 -1299633 -818087 -396147 -321987 -450616 -515108 -427194 -233931 55756
38817 55756 485892 1008027 1361615 1177533 338410 -739983 -1368815 -1253218 -764880 -436713
38807 -436713 -386455 -434464 -544685 -779590 -960297 -830726 -562011 -637061 -1124600 -1488910
38797 -1488910 -1294321 -709150 -103875 440678 926111 1137202 978200 819279 1032318
38788 1032318 1379797 1370849 1102277 1185376 1816537 2454513 2556438 2163463 1554495 765664
38778 765664 -211098 -1063875 -1388412 -1160843 -713339 -349639 -212051 -375552 -754458 -974948
38768 -974948 -682556 -47237 309783 31595 -524532 -722479 -406533 -28489 -63536 -506369
38758 -506369 -995230 -1259714 -1315946 -1322813 -1406110 -1582811 -1695586 -1437926 -648387 356960
38748 356960 941052 777582 209899 -141937 -15291 375729 701541 794310 660248 440313
38738 440313 331695 383988 438708 432220 601995 1087786 1445327 1011223 -173728 -1236213
38728 -1236213 -1461644 -1044843 -594319 -260206 215016 805986 1102708 928655 631893
38719 631893 604668 803737 926977 861913 766680 827640 1111325 1587680 2134133 2521353
38709 2521353 2527488 2127830 1538559 1050407 826123 842657 978463 1110609 1127594 916297
38699 916297 434385 -178835 -646383 -786438 -672018 -503218 -371941 -245761 -136776 -122140
38689 -122140 -158352 -46211 279578 535679 373195 -127350 -455320 -258817 232485 517438
38679 517438 406499 70067 -388477 -1056888 -1839302 -2301090 -2135011 -1579722 -1112331 -874338
38669 -874338 -691111 -530681 -550385 -680656 -564562 -63078 487563 709285 618814 438434
38659 438434 231394 -2944 -83460 148649 465464 434138 -18221 -486487 -570105 -251155
38649 -251155 233164 654951 864386 817724 649932 558038 531650 380382 118088 85395
38639 85395 488613 995128 1069509 652468 229223 196744 417118 502180 324593 66078
38629 66078 -94404 -101253 121014 669555 1435403 2059853 2261234 2108609 1860574 1643713
38619 1643713 1439026 1277816 1221190 1166006 904116 416355 -100434 -551245 -1046535 -1574479
38609 -1574479 -1826746 -1575761 -1045688 -645801 -452294 -235910 66065 226843 111355
38600 111355 -106894 -220147 -269836 -434857 -782086 -1219365 -1566478 -1605663 -1214974 -550057
38590 -550057 30179 307620 369715 393520 445567 578970 898971 1332641 1505262 1110964
38580 1110964 339420 -301752 -555021 -578813 -573876 -520372 -357020 -170159 -46246 98903
38570 98903 370240 674930 823423 798488 773824 882676 1088971 1269325 1299233 1071505
38560 1071505 578583 10600 -361639 -461269 -454502 -477453 -456933 -300428 -117269 -86991
38550 -86991 -209864 -369597 -548395 -744902 -748891 -318743 379247 842813 878594 859515
38540 859515 1126215 1433757 1320450 810608 355936 182111 95403 -75463 -231943 -262879
38530 -262879 -212433 -99848 121974 324235 225448 -193201 -559068 -543852 -189424 310285
38520 310285 844748 1243981 1252532 916364 689708 833093 979340 679030 137705 -56251
38510 -56251 198544 408860 213548 -249987 -729354 -1135115 -1323941 -1057678 -411206 116128
38500 116128 156759 -86465 -174638 -7820 145665 44014 -291999 -628410 -667669 -262060
38490 -262060 410037 982234 1265170 1327324 1209821 842522 354453 162935 518928 1165028
38480 1165028 1657400 1835317 1763696 1443769 885643 307923 -57628 -261389 -441125 -448705
38470 -448705 -36641 620467 979445 781153 338216 73948 61168 151927 287988 450855
38460 450855 463980 102037 -599768 -1278446 -1523843 -1215520 -609314 -94233 164664 311235
38450 311235 497665 610369 427793 -34856 -528845 -884782 -1122941 -1265912 -1274979 -1218984
38440 -1218984 -1273944 -1440645 -1446659 -1079133 -499171 -79038 25690 40108 307326 881421
38430 881421 1383376 1344383 768779 225718 207397 536558 697204 628316 725235 1011434
38420 1011434 875331 -31536 -1055046 -1191269 -289796 846605 1459686 1475873 1176064
38411 1176064 739580 302215 72401 80114 18889 -375585 -902390 -1113597 -904676 -620916
38401 -620916 -538332 -496665 -211853 221591 401055 167837 -157741 -176895 150392 595002
38391 595002 990664 1274571 1357835 1222850 1040557 893327 494707 -395903 -1309528 -1369029
38381 -1369029 -454927 428030 304353 -644860 -1524911 -1937308 -2172706 -2395808 -2317666 -1773007
38371 -1773007 -1085246 -629539 -386817 -144892 121454 270628 210241 -55895 -447325 -771385
38361 -771385 -819156 -592513 -316697 -172966 -130081 -48379 172008 503841 703293 428708
38351 428708 -289872 -835589 -666981 -138306 -135616 -812030 -1283131 -876517 -124838 -9241
38341 -9241 -612945 -1149519 -1131979 -862684 -752271 -741721 -587514 -292112 -15497 150646
38331 150646 130295 -143798 -476850 -413508 217041 927247 1065468 609315 140868 45538
38321 45538 120696 110088 212795 692246 1265804 1438965 1390833 1897872 3184422 4448906
38311 4448906 4922476 4852093 4874116 4945921 4751099 4806771 6071684 8559512 11650035 15951484
38301 15951484 23089240 32441194 39440223 39182717 31650946 21832876 14548164 10569367
38293 10569367 8049104 5894764 4411952 3725058 3282981 2839604 2710403 2894185 2840491
38284 2840491 2323070 1807124 1652628 1577815 1272357 993623 1083645 1311756 1248586 1029684
38274 1029684 1147325 1576208 1714935 1285789 737768 523222 466650 227839 -12073 136827
38264 136827 492627 440668 -149440 -714285 -842742 -803951 -957737 -1104366 -840540 -243543
38254 -243543 271016 583328 877811 1104616 940445 372662 -87704 33916 646853 1270117
38244 1270117 1549074 1472642 1211624 863439 347070 -411643 -1158546 -1366741 -822668 2316
38234 2316 462422 502903 558072 768676 770893 344076 -174989 -328530 -64289 366631 750032
38223 750032 948512 863166 576785 346081 284406 230520 40359 -213825 -418029 -502836
38213 -502836 -275537 438310 1312522 1634238 1217605 781920 996116 1525653 1568755 1046449
38203 1046449 600949 535656 464599 107702 -206532 -107043 225379 378334 321153 354994
38193 354994 607302 865111 868306 585012 200884 -72104 -181185 -250779 -394363 -550181
38183 -550181 -576543 -446294 -231621 33154 318990 496762 455463 295353 216242 239577
38173 239577 233735 178005 165863 150547 -49636 -434315 -748581 -824485 -799695 -890922 -1109360
38162 -1109360 -1298209 -1314666 -1086370 -612784 -8258 528801 842884 877656 650243 285945
38152 285945 34367 91492 415137 840315 1300644 1754572 2001542 1860687 1491358 1217044
38142 1217044 1026105 593998 -142100 -800664 -1073626 -1067239 -945133 -592312 83644 802042
38132 802042 1194464 1266214 1274460 1284626 1147328 840142 559678 483109 619908 875272
38122 875272 1134010 1345281 1623029 2144673 2838057 3320770 3294677 2853974 2271288 1677547
38112 1677547 1130758 773834 660676 600583 453162 423519 768946 1354938 1832819 2143818
38102 2143818 2476985 2784090 2730424 2170350 1350076 585127 13780 -302512 -332861 -198434
38092 -198434 -83697 28186 297283 694220 1006648 1209294 1523082 2027632 2493331 2691096
38082 2691096 2645072 2570059 2839050 3952874 6068708 8471307 10039690 10499252 10758376
38073 10758376 11679382 12939920 13520417 12943229 11530547 9733799 7809624 6038796
38065 6038796 4678016 3647172 2696563 1896450 1540989 1560842 1500278 1175535 923336
38056 923336 1045792 1396779 1687095 1818360 1702750 1137072 182082 -609985 -708695 -207241
38046 -207241 361146 665271 764608 792258 770199 711478 641473 494843 174644 -280275
38036 -280275 -725773 -1076083 -1297438 -1299644 -1013402 -553712 -146232 99218 216234 231629
38026 231629 139666 -12688 -165959 -331151 -488052 -485325 -243484 25113 67321 16290
38016 16290 232576 673626 796359 283156 -438557 -692429 -383662 -24333 -20576 -254637
38006 -254637 -404717 -401433 -409544 -487352 -444418 -76724 518349 950848 930849 619265 466013
37995 466013 673401 959111 931170 556256 112025 -216990 -496408 -825736 -1158858 -1372679
37985 -1372679 -1362805 -1028777 -324486 567624 1221664 1290026 855443 372249 213605 314697
37975 314697 307921 -6355 -400938 -492277 -222345 57152 28063 -188407 -205144 100972
37965 100972 413480 395204 139508 43763 266513 490406 316045 -221607 -687502 -777554
37955 -777554 -653294 -686884 -1002157 -1375306 -1507757 -1280041 -784348 -219374 261943 663972
37945 663972 1063487 1384738 1403019 1074065 681709 477571 362810 190400 180223 614353
37935 614353 1211347 1307943 736238 60271 -194610 -102218 45001 195658 343010 318920
37925 318920 128531 74661 167802 -142189 -1139912 -2155872 -2340407 -1833108 -1449879 -1388111
37915 -1388111 -1042158 -119143 843330 1273124 1236147 1068784 895492 780257 848670 949506
37905 949506 639517 -161995 -877633 -954899 -526366 -96372 118593 233792 360902 531516
37895 531516 728964 757981 345845 -381809 -811558 -519258 197668 724371 820641 651519
37885 651519 390141 97164 -194381 -519964 -917729 -1163508 -888711 -173017 364770 360046
37875 360046 181528 257697 370710 128711 -249032 -258977 13096 5427 -427343 -826189
37865 -826189 -802953 -399877 172578 667729 742137 274122 -301855 -468387 -351791 -448344
37855 -448344 -738781 -723913 -301646 123499 475917 1159493 2126625 2568337 1985071 973434
37845 973434 445803 519565 667110 580212 359172 105107 -170388 -357809 -361512 -304055
37835 -304055 -339532 -409188 -437582 -577298 -952816 -1313185 -1252520 -700159 31242 579705
37825 579705 734052 473047 37002 -189365 -101056 -49372 -381825 -960072 -1371775 -1463036
37815 -1463036 -1377411 -1187193 -812513 -288710 166896 405049 471726 442873 284785 -44267
37805 -44267 -418680 -551691 -250428 290587 555016 228752 -394409 -732003 -596572 -315602
37795 -315602 -203365 -229145 -233011 -128696 169367 656930 995872 780366 202965 14054
37785 14054 573934 1354226 1659824 1437310 1043463 639829 245213 14734 -38342 -317978
37775 -317978 -1122712 -2051073 -2432353 -2189931 -1784202 -1446122 -1008288 -437130 4884 187135
37765 187135 289119 502576 878905 1439092 2090500 2492404 2381269 1988169 1762826 1747179
37755 1747179 1633367 1386249 1328328 1564963 1777873 1700801 1427074 1139574 870041 635613
37745 635613 535972 624393 874806 1243181 1544876 1415470 730888 -68754 -464862 -524074
37735 -524074 -630049 -737241 -489702 22739 326052 389283 642524 1042020 910614 21039
37725 21039 -888232 -1116513 -903176 -835773 -902619 -716792 -288854 13257 41389 -71162
37715 -71162 -226576 -351150 -283864 -32105 89130 -104957 -356130 -389408 -310201 -227461
37705 -227461 98537 735210 1094708 618970 -291322 -712520 -458471 -250578 -638813 -1381589
37695 -1381589 -1988046 -2300329 -2355330 -2147671 -1763708 -1405725 -1106070 -722771 -347379 -369674
37685 -369674 -931526 -1591845 -1765116 -1325526 -623170 -75832 102848 -66123 -372174 -551437
37675 -551437 -516074 -442569 -574628 -945629 -1317730 -1410782 -1221222 -1070327 -1214838 -1442839
37665 -1442839 -1285485 -670012 -60503 191229 295117 566141 859542 864057 702644 744140
37655 744140 945462 899062 518102 180707 132663 207718 255887 403591 685193 793887
37645 793887 474201 -80381 -460413 -503581 -342352 -129708 117959 473847 970593 1461141
37635 1461141 1655094 1445752 1140230 1141453 1435900 1639910 1512810 1139291 647716 111750
37625 111750 -247267 -156498 300025 708665 860811 918573 969272 834519 475341 146537
37615 146537 -79871 -501584 -1189120 -1631859 -1393389 -774258 -368138 -247857 -92409 114919
37605 114919 101567 -81195 -52207 250775 443995 340899 243154 383961 495852 230906
37595 230906 -281146 -623889 -672123 -658392 -722845 -691029 -373439 93173 336945 149152
37585 149152 -292476 -626113 -689194 -636138 -679844 -815293 -869999 -769426 -650691 -687196
37575 -687196 -822938 -717002 -57073 967460 1609369 1229587 41003 -1067804 -1511282
37566 -1511282 -1497507 -1416263 -1164583 -462872 469242 1086271 1252022 1278112 1255680 927906
37556 927906 360768 157747 656854 1336587 1447908 961928 460787 281116 229392 74894
37546 74894 -126788 -253215 -293030 -215666 31383 301105 319202 110471 76474 465001
37536 465001 991987 1201394 1018092 728173 573020 605840 827750 1201042 1579117 1831510
37526 1831510 1964567 1927441 1466037 506918 -425633 -638002 -174713 140457 -259150 -1000633
37516 -1000633 -1372073 -1244139 -1042265 -1061698 -1214984 -1328215 -1310945 -1079720 -632323 -189053
37506 -189053 -9435 -92811 -264239 -462474 -696195 -831769 -738546 -567680 -556128 -614334
37496 -614334 -461555 -118585 134138 265032 494257 733392 520957 -300767 -1274514 -1905439
37486 -1905439 -2147750 -2089068 -1598471 -667766 229185 558577 353356 95088 113770 372363
37476 372363 678517 829270 678178 299186 -38382 -218457 -396256 -620463 -656894 -426018
37466 -426018 -255560 -364405 -461184 -281766 -164357 -537838 -1124247 -1295163 -1047797 -940586
37456 -940586 -1125663 -1154830 -803299 -409273 -255926 -247498 -365329 -786593 -1293205 -1234622
37446 -1234622 -485524 149170 -10643 -552707 -636314 -229246 -9167 -243149 -462537 -269993
37436 -269993 109194 237422 21674 -318109 -563936 -616721 -463801 -157114 239294 696526
37426 696526 1150966 1440418 1427863 1164731 847840 654108 652890 758799 707330 255678
37416 255678 -463319 -963068 -937349 -593498 -274973 17253 432594 789392 698926 153824
37406 153824 -379092 -536829 -437987 -368806 -350738 -217022 17739 74454 -282519 -939505
37396 -939505 -1498436 -1678823 -1615822 -1650692 -1835564 -1845982 -1476944 -1004653 -849361 -1036245
37386 -1036245 -1240085 -1265623 -1214036 -1202950 -1169674 -987460 -626677 -209188 4701 -191230
37376 -191230 -618107 -766079 -434880 -115495 -358392 -928543 -1090957 -679855 -295079 -337676
37366 -337676 -479820 -393344 -421285 -1001685 -1809298 -2088983 -1685901 -1163182 -914111 -722787
37356 -722787 -361472 -129195 -430512 -1067431 -1359715 -980760 -385398 -257398 -681338 -1090448
37346 -1090448 -1037112 -744948 -694145 -861944 -761867 -233708 234470 170167 -240531 -476052
37336 -476052 -403269 -322925 -429346 -588807 -625880 -537814 -435718 -500740 -916382 -1570693
37326 -1570693 -1941687 -1658182 -1111746 -1053607 -1560926 -1926453 -1722743 -1407599 -1526166 -1817596
37316 -1817596 -1651375 -1024657 -509053 -345585 -212139 90531 315542 309535 365107 717945
37306 717945 1046389 844290 116245 -608482 -871157 -672347 -344790 -221379 -363275 -488566
37296 -488566 -276761 147649 228781 -331511 -1105624 -1448616 -1297201 -1080671 -957230 -655151
37286 -655151 -139897 106279 -230457 -740970 -834366 -567050 -466177 -659408 -690769 -259918
37276 -259918 301683 493551 276324 1312 -85120 -22062 63715 107904 94255 42469 -16338
37265 -16338 -144905 -490125 -1030846 -1424614 -1298770 -682125 -2761 317025 131350 -469817
37255 -469817 -1217440 -1687129 -1566200 -1020068 -572217 -496408 -555487 -487984 -452182 -672746
37245 -672746 -880412 -575942 174561 678598 496273 -1914 -187421 25573 236375 190915
37235 190915 -8904 -227320 -446779 -572652 -421883 -34750 249282 201179 25557 85328
37225 85328 390793 562963 323140 -131125 -340250 -127560 191817 215042 -20318 -81652
37215 -81652 266501 721905 839067 599616 361965 333353 365344 277929 123019 42556
37205 42556 64317 129889 169391 91761 -126194 -292946 -153689 237786 527777 542882 506243
37194 506243 633679 803118 847266 879229 994843 899190 278290 -567742 -941127 -633588
37184 -633588 -182038 -124922 -361268 -424576 -112350 365594 688047 710451 578423 626764
37174 626764 995839 1310074 998713 46570 -849445 -1049251 -643124 -152944 158198 350246
37164 350246 392140 135313 -293844 -458531 -119576 430022 664402 339191 -350558 -994067
37154 -994067 -1273648 -1159675 -904660 -833462 -1097366 -1592079 -2040746 -2149394 -1823356 -1327660
37144 -1327660 -1096779 -1229811 -1288493 -793848 158862 999198 1327153 1201558 826895 293660
37134 293660 -276324 -633466 -651569 -497229 -383774 -307745 -180008 -61406 -80509 -221963
37124 -221963 -364511 -440585 -412178 -199605 192140 577142 808561 1000021 1310797 1597641
37114 1597641 1558142 1206807 925557 986677 1271545 1526482 1635317 1528197 1098944 426877
37104 426877 -122961 -277405 -221400 -360850 -809018 -1336908 -1758706 -2093711 -2341941 -2362782
37094 -2362782 -2067428 -1561485 -1029406 -617365 -449703 -560065 -733365 -622155 -157365
37085 -157365 307979 401077 143822 -165312 -334981 -370083 -305660 -177625 -97693 -135983
37075 -135983 -148800 65622 426387 579743 294746 -296732 -863085 -1108386 -856549 -154324
37065 -154324 616553 956626 735473 307129 17287 -201106 -544583 -866625 -842163 -548618
37055 -548618 -487456 -880886 -1247006 -958352 -99231 542711 389247 -266390 -670501 -523505
37045 -523505 -221861 -204830 -376890 -371350 -157034 -40536 -122460 -127338 114726 338035 218501
37034 218501 -136633 -342574 -255939 -80452 -18501 -55955 -63896 102169 577146 1325052
37024 1325052 1987805 2117619 1617358 795060 -7146 -626572 -938782 -814364 -340282
37015 -340282 158071 466572 661402 823823 832123 638928 511091 692951 985603 991233
37005 991233 697543 476040 501974 525826 322783 69757 92603 439329 890056 1240910
36995 1240910 1383971 1218379 716428 66616 -445340 -746393 -1021851 -1378219 -1587496
36986 -1587496 -1318297 -599778 94840 304515 35724 -339757 -575161 -761938 -1038890
36977 -1038890 -1304508 -1365540 -1215317 -952240 -527295 138495 788161 910620 349619 -403303
36967 -403303 -743149 -627185 -484850 -566264 -675902 -561517 -287681 -101658 -114626 -264618
36957 -264618 -475664 -694981 -833143 -822521 -734456 -719055 -803993 -847155 -735135 -562553
36947 -562553 -550241 -805746 -1205324 -1498122 -1496666 -1197352 -788273 -553592 -690740 -1139315
36937 -1139315 -1595981 -1754967 -1549191 -1141410 -722983 -395789 -217163 -213592 -286184 -220582
36927 -220582 91407 497320 755468 808895 771438 694852 522618 287235 176897 319409
36917 319409 605165 790679 687689 222970 -525487 -1249822 -1534191 -1250155 -764304 -576055
36907 -576055 -778124 -1030420 -1035075 -849036 -703289 -686163 -681157 -514536 -121127 343053
36897 343053 540754 234724 -427831 -1017364 -1230617 -1086301 -739063 -312257 38544 153707
36887 153707 120900 295641 870487 1574851 1994379 2019641 1747831 1146532 197506 -718235
36877 -718235 -1034387 -680430 -170157 114437 349544 780514 1193139 1228088 954640 704141
36867 704141 475178 -29939 -769838 -1207840 -950194 -228527 436795 801318 911130 768811
36857 768811 292986 -432465 -1116100 -1522902 -1660627 -1680523 -1689838 -1690996 -1641911 -1542458 -1461732
36846 -1461732 -1448317 -1409744 -1169251 -700771 -223929 17246 -9445 -199155 -503651 -880316
36836 -880316 -1133962 -1052571 -713334 -432059 -363443 -375984 -388228 -544844 -879379 -1070326
36826 -1070326 -838466 -426748 -336546 -649150 -960718 -993475 -898417 -855920 -746029 -429918
36816 -429918 -71970 81332 38561 -72361 -287400 -674027 -1078307 -1314721 -1475385 -1710548
36806 -1710548 -1827115 -1537437 -1065639 -1005696 -1472842 -1874736 -1730011 -1264211 -902845 -611614
36796 -611614 -170887 243616 300004 133488 156924 317541 129400 -487070 -967359 -910157
36786 -910157 -629097 -595122 -736521 -680451 -396774 -170789 -99825 -34668 34052 -101069
36776 -101069 -527077 -1057605 -1427936 -1442930 -1001639 -247245 351727 384847 -15343 -359816
36766 -359816 -476048 -639337 -977336 -1181166 -1036828 -865046 -1079319 -1552240 -1794226 -1611669
36756 -1611669 -1230407 -872576 -585893 -453340 -594480 -910376 -1139438 -1218293 -1289862 -1306182
36746 -1306182 -964881 -166764 766919 1475701 1860901 1865921 1340318 420162 -282207 -283583
36736 -283583 161070 464074 578345 982937 1796839 2400119 2142870 1121813 35301
36727 35301 -544187 -583872 -429788 -407905 -545164 -618499 -487586 -293397 -210178 -142369 71496
36716 71496 255612 76705 -358658 -503212 -103884 441418 659721 570405 410935 149469
36706 149469 -342813 -872941 -1105743 -1055321 -1033992 -1178893 -1357975 -1495453 -1664271 -1853959
36696 -1853959 -1922759 -1800098 -1533011 -1166760 -774499 -520974 -475920 -474305 -403378 -466634
36686 -466634 -837046 -1206896 -1101311 -551155 -15662 296760 537175 675675 430262 -159053
36676 -159053 -632358 -758176 -775285 -823265 -694773 -388962 -297614 -477125 -342348 411662
36666 411662 1123935 1016075 289051 -292703 -537335 -789353 -1035388 -917355 -577783 -639543
$$ [...]
##END NTUPLES=NMR SPECTRUM
##END=
