##TITLE=31Pdec_DE-135rm__1d_b
, 24 sc
 20.3.2026
##JCAMPDX= 6.0         $$ Bruker NMR JCAMP-DX V2.0
##DATA TYPE= NMR SPECTRUM
##DATA CLASS= NTUPLES
##ORIGIN= UXNMR, Bruker Analytische Messtechnik GmbH
##OWNER= root
$$ XWIN-NMR		Version 3.5
$$ Fri Mar 20 14:16:24 2026 Russian Standard Time (UT+4h)  she@DPX200
##.OBSERVE FREQUENCY= 81.013821
##.OBSERVE NUCLEUS= ^31P
##.ACQUISITION MODE= SIMULTANEOUS
##.ACQUISITION SCHEME= undefined
##.AVERAGES= 24
##.DIGITISER RES= 17
##SPECTROMETER/DATA SYSTEM= spect
##.PULSE SEQUENCE= zgpg30
##.SOLVENT NAME= CDCl3
##.SHIFT REFERENCE= (INTERNAL, CDCl3, 0, 197.392)
##AUDIT TRAIL= $$ (NUMBER, WHEN, WHO, WHERE, WHAT)
$$ ##TITLE= Audit trail, XWIN-NMR		Version 3.5
$$ ##JCAMPDX= 5.01
$$ ##ORIGIN= Bruker BioSpin GmbH
$$ ##OWNER= she
$$ F:/spectra/data/she/nmr/P31/2/pdata/1/auditp.txt
$$ ##AUDIT TRAIL=  $$ (NUMBER, WHEN, WHO, WHERE, WHAT)
(   1,<2026-03-20 14:15:03.68 +0400>,<she>,<DPX200>,
      <created by zg, POWCHK disabled, PULCHK disabled
       configuration hash MD5:
       00 E9 B6 7A A2 85 ED C7 34 08 36 98 17 FE 4E 26
       data hash MD5: 32K
       7C DA 3D 4D 50 09 72 C0 A7 36 B3 47 34 5D 85 F7>)
(   2,<2026-03-20 14:15:07.48 +0400>,<she>,<DPX200>,
      <Start of raw data processing
       efp BC_mod = 2 LB = 1.5 FT_mod = 6 PKNL = 1 PHC0 = 1389.29 PHC1 = 65.90066 SI = 64K 
       data hash MD5: 64K
       24 1F 6D C0 7F 4C 48 6F 3E 52 58 5E 07 77 66 2F>)
(   3,<2026-03-20 14:15:41.39 +0400>,<she>,<DPX200>,
      <pk PHC0 = -7.770239 PHC1 = 18 
       data hash MD5: 64K
       76 0F 55 F4 22 C9 89 9D 84 27 95 62 B1 24 78 B1>)
$$ ##END=
$$ 
$$ hash MD5
$$ 92 10 6B 2B 58 73 A9 D1 C2 92 78 63 41 92 44 C5
##$RELAX= 
##$RELAX= 
##$RELAX= 
##$RELAX= 
##$RELAX= 
##$RELAX= 
##$RELAX= 
##$RELAX= 
$$ Bruker specific parameters
$$ --------------------------
##$DU= <F:/spectra>
##$EXPNO= 2
##$NAME= <P31>
##$PROCNO= 1
##$TYPE= <nmr>
##$USER= <she>
##$AMP= (0..31)
100 100 100 100 100 100 100 100 100 100 100 100 100 100 100 100 100 100 
100 100 100 100 100 100 100 100 100 100 100 100 100 100 
##$AQSEQ= 0
##$AQ_mod= 1
##$AUNM= <au_zg>
##$AUTOPOS= <>
##$BF1= 81.014009
##$BF2= 200.13
##$BF3= 200.13
##$BF4= 200.13
##$BF5= 200.13
##$BF6= 200.13
##$BF7= 200.13
##$BF8= 200.13
##$BYTORDA= 1
##$CFDGTYP= 0
##$CFRGTYP= 5
##$CHEMSTR= <none>
##$CNST= (0..31)
1 1 145 1 1 1 1 1 1 1 1 1 1 1 1 1 1 1 1 1 1 1 1 1 1 1 1 1 1 1 1 1 
##$CPDPRG= <waltz16>
##$CPDPRG1= <>
##$CPDPRG2= <waltz16>
##$CPDPRG3= <>
##$CPDPRG4= <mlev>
##$CPDPRG5= <mlev>
##$CPDPRG6= <mlev>
##$CPDPRG7= <mlev>
##$CPDPRG8= <mlev>
##$CPDPRGB= <>
##$CPDPRGT= <>
##$D= (0..31)
0 1 0 0 0 0 0 0 0 0.06 0 0.03 2e-05 3e-06 0 0 0.0002 0 0 0 0 0 0 0 0 0 
0 0 0 0 0 0 
##$DATE= 1774001703
##$DBL= (0..7)
120 120 120 11 120 120 24 19 
##$DBP= (0..7)
150 150 150 150 150 150 150 150 
##$DBP07= 0
##$DBPNAM0= <>
##$DBPNAM1= <>
##$DBPNAM2= <>
##$DBPNAM3= <>
##$DBPNAM4= <>
##$DBPNAM5= <>
##$DBPNAM6= <>
##$DBPNAM7= <>
##$DBPOAL= (0..7)
0.5 0.5 0.5 0.5 0.5 0.5 0.5 0.5 
##$DBPOFFS= (0..7)
$$ [...]
##$SUBNAM2= <"">
##$SUBNAM3= <"">
##$SUBNAM4= <"">
##$SUBNAM5= <"">
##$SUBNAM6= <"">
##$SUBNAM7= <"">
##$SUBNAM8= <"">
##$SUBNAM9= <"">
##$SW= 400.765351723535
##$SWIBOX= (0..15)
0 1 3 0 0 0 0 0 0 0 0 0 0 0 0 0 
##$SW_h= 32467.5324675325
##$TD= 32768
##$TD0= 1
##$TE= 0
##$TE2= 300
##$TE3= 300
##$TEG= 300
##$TL= (0..7)
0 120 53 12 22 120 120 120 
##$TP= (0..7)
150 150 150 150 150 150 150 150 
##$TP07= 0
##$TPNAME0= <>
##$TPNAME1= <>
##$TPNAME2= <>
##$TPNAME3= <>
##$TPNAME4= <>
##$TPNAME5= <>
##$TPNAME6= <>
##$TPNAME7= <>
##$TPOAL= (0..7)
0.5 0.5 0.5 0.5 0.5 0.5 0.5 0.5 
##$TPOFFS= (0..7)
0 0 0 0 0 0 0 0 
##$TUNHIN= 0
##$TUNHOUT= 0
##$TUNXOUT= 0
##$USERA1= <user>
##$USERA2= <user>
##$USERA3= <user>
##$USERA4= <user>
##$USERA5= <user>
##$V9= 5
##$VALIST= <valist>
##$VCLIST= <CCCCCCCCCCCCCCC>
##$VD= 0
##$VDLIST= <DDDDDDDDDDDDDDD>
##$VPLIST= <PPPPPPPPPPPPPPP>
##$VTLIST= <TTTTTTTTTTTTTTT>
##$WBST= 1024
##$WBSW= 4
##$XGAIN= (0..3)
0 0 0 0 
##$XL= 0
##$YL= 0
##$YMAX_a= 23544
##$YMIN_a= -31582
##$ZGOPTNS= <>
##$ZL1= 120
##$ZL2= 120
##$ZL3= 120
##$ZL4= 120
##$ABSF1= 0
##$ABSF2= 0
##$ABSG= 0
##$ABSL= 0
##$ALPHA= 0
##$AQORDER= 0
##$ASSFAC= 0
##$ASSFACI= 0
##$ASSFACX= 0
##$ASSWID= 0
##$AUNMP= <proc_1d>
##$AZFE= 0.1
##$AZFW= 0.5
##$BCFW= 0
##$BC_mod= 2
##$BYTORDP= 0
##$COROFFS= 0
##$CY= -3
##$DATMOD= 1
##$DC= 0
##$DFILT= <>
##$DTYPP= 0
##$F1P= 0
##$F2P= 0
##$FCOR= 1
##$FTSIZE= 65536
##$FT_mod= 6
##$GAMMA= 0
##$GB= 0
##$INTBC= 1
##$INTSCL= 9.790993e-09
##$ISEN= 30
##$LB= 1.5
##$LEV0= 0
##$LPBIN= 0
##$MAXI= 10000
##$MC2= 0
##$MEAN= 0
##$ME_mod= 0
##$MI= 50
##$NCOEF= 0
##$NC_proc= -9
##$NLEV= 6
##$NOISF1= 182.463
##$NOISF2= 159.3651
##$NSP= 0
##$NTH_PI= 0
##$NZP= 0
##$OFFSET= 197.3918
##$PC= 4
##$PHC0= 1381.52
##$PHC1= 83.90066
##$PH_mod= 1
##$PKNL= yes
##$PPARMOD= 0
##$PSCAL= 0
##$PSIGN= 0
##$REVERSE= no
##$SF= 81.014063255964
##$SI= 65536
##$SIGF1= 159.3651
##$SIGF2= -187.1042
##$SINO= 113.3802
##$SIOLD= 16384
##$SREGLST= <1H.CDCl3>
##$SSB= 0
##$STSI= 65536
##$STSR= 0
##$SW_p= 32467.5324675325
##$SYMM= 0
##$S_DEV= 0
##$TDeff= 32768
##$TDoff= 0
##$TI= <>
##$TILT= no
##$TM1= 0
##$TM2= 0
##$TOPLEV= 0
##$USERP1= <user>
##$USERP2= <user>
##$USERP3= <user>
##$USERP4= <user>
##$USERP5= <user>
##$WDW= 1
##$XDIM= 65536
##$YMAX_p= 536514829
##$YMIN_p= -153601752
$$ End of Bruker specific parameters
$$ ---------------------------------
##NTUPLES= NMR SPECTRUM
##VAR_NAME=  FREQUENCY,     SPECTRUM/REAL,   SPECTRUM/IMAG
##SYMBOL=    X,             R,               I
##VAR_TYPE=  INDEPENDENT,   DEPENDENT,       DEPENDENT
##VAR_FORM=  AFFN,          ASDF,            ASDF
##VAR_DIM=   65536,         65536,           65536
##UNITS=     HZ,            ARBITRARY UNITS, ARBITRARY UNITS
##FACTOR=    0.49542278885378, 1,            1
##FIRST=     15991.5117654749, 0,            0
##LAST=      -16476.0207020576, 0,           0
##MIN=       -16476.0207020576, -153601752,  0
##MAX=       15991.5117654749, 536514829,    0
$$ Real data points
##PAGE= N=1
##DATA TABLE= (X++(R..R)), XYDATA
$$ [...]
$$ plain form
44420 25946840 27736437 27657860 24941620 22284472 22150558 23044694 22330993 20905712 21857895
44411 21857895 25501293 28857065 29896343 29819685 30992662 34398842 39110841 43043457
44403 43043457 44978445 47429203 56417634 75868467 102187272 126206449 140369628
44396 140369628 142487775 133505323 114982890 89970116 64102380 43618267 31947302
44389 31947302 28085605 27758075 26655755 23722417 21279937 21316172 22360233 21058630
44381 21058630 15992614 8637472 1546980 -2792754 -2542589 1666951 6228950 8316800
44373 8316800 9395711 12173858 14925907 12879112 5643185 -893085 -1673029 1955708
44365 1955708 5606979 7479589 8227828 8224837 8037333 9517686 13396075 17332299 18990723
$$ packed form
44420B5946840J789597p8577k716240k657148j33914Q94136p13701j425281R52183
44411B1857895L643398L355772J039278p6658J172977L406180M711999L932616
44403D3043457J934988K450758Q988431J9450833K6318805K4019177J4163179
44396A40369628K118147q982452j8522433k5012774k5867736k0484113j1670965
44389C1947302l861697l27530j102320k933338k442480L6235J044061j301603
44381B1058630n066016p355142p090492m339734K50165M209540M561999K087850
44373H316800J078911K778147K752049k046795p235927o536270p79944L628737
44365A955708L651271J872610P48239k991j87504J480353L878389L936224J658424
$$ plain form
44356 18990723 19343632 20171582 20281330 17798191 14676546 14641407 17202540 18097585 15940718
44347 15940718 14087893 14855066 16114442 15607388 14830899 15744608 16628313 14869356 12112397
44338 12112397 12775565 17792813 23124973 25048040 24417280 24656510 27311979 31050165
44330 31050165 34354509 37977484 44453383 55465244 69916465 84674532 96871776
44323 96871776 104953880 107937109 105141464 97226697 86257580 73860402 60386110 46868450
44315 46868450 36410499 31671531 31515189 32145383 31592334 31227215 32520182 34329402
44307 34329402 34653737 33742208 33773347 35739769 37988321 38182588 36000286 33408637 32468646
44298 32468646 33248530 34015955 33201947 30810658 28129459 26809568 28236726 32588279
$$ packed form
44356A8990723L52909Q27950J09748k483139l121645l5139K561133Q95045k156867
44347A5940718j852825P67173J259376n07054p76489R13709Q83705j758957k756959
44338A2112397O63168N017248N332160J923067o30760K39230K655469L738186
44330C1050165L304344L622975O475899J1011861J4451221J4758067J2197244
44323I6871776Q082104K983229k795645p914767j0969117j2397178j3474292j3517660
44315D6868450j0457951m738968j56342O30194n53049l65119J292967J809220
44307C4329402L24335r11529L1139J966422K248552J94267k182302k591649r39991
44298C2468646P79884P67425q14008k391289k681199j319891J427158M351553
$$ plain form
44290 32588279 37829819 40874853 41076018 41712673 46437853 54981056 64338827 73494357
44282 73494357 83832847 94308762 99633265 95686028 84753938 72843873 63070570
44275 63070570 54309596 45446762 37677085 32105373 27726489 23086144 18392357 14863277
44267 14863277 13026727 12559431 13073387 14391447 16446986 18983587 20822531 20050621
44259 20050621 16438288 13265986 14406336 19086093 21998505 19918372 15934115 15112711
44251 15112711 17857996 20225551 19610591 17070900 14453577 12541543 12630605 16697026
44243 16697026 24116734 30424332 31705224 29161621 27296943 28370275 30883997 33265107
44235 33265107 36425033 41806781 49179907 58340431 71600359 91631373 116175817 136959882
$$ packed form
44290C2588279N241540L045034K01165O36655M725180Q543203R357771R155530
44282G3494357J0338490J0475915N324503l947237j0932090j1910065r773303
44275F3070570q760974q862834p769677n571712m378884m640345m693787l529080
44267A4863277j836550m67296N13956J318060K055539K536601J838944p71910
44259B0050621l612333l172302J140350M679757K912412k080133l984257q21404
44251A5112711K745285K367555o14960k539691k617323j912034Q9062M066421
44243A6697026P419708O307598J280892k543603j864678J073332K513722K381110
44235C3265107L159926N381748P373126R160524J3259928K0031014K4544444K0784065
$$ plain form
44227 136959882 145512838 139628545 123595943 103495699 83786724 67211754 55026879
44220 55026879 46404008 39349683 33179940 28871955 26459039 23911362 19875005 16000448
44212 16000448 14904382 16849032 19936188 22518168 23774939 23039828 20611822 18401511
44204 18401511 17610816 16514905 12919700 8138797 5746922 6758775 9089430 11602238
44196 11602238 15051818 18551547 19132838 16277711 13205523 11923113 10897039 9859568
44188 9859568 12324754 19401588 25211213 23918034 18601432 17127756 20924459 24482981
44180 24482981 25388315 27334237 31694990 33449703 29220888 23554518 22436560 24822131
44172 24822131 25582466 23572045 21542445 20464689 19410154 19591749 22922533 27014920
$$ packed form
44227A36959882Q552956n884293j6032602k0100244j9708975j6574970j2184875
44220E5026879q622871p054325o169743m307985k412916k547677m036357l874557
44212A6000448j096066J944650L087156K581980J256771p35111k428006k210311
44204A8401511p90695j095911l595205m780903k391875J011853K330655K512808
44196A1602238L449580L499729N81291k855127l072188j282410j026074j037471
44188I859568K465186P076834N809625j293179n316602j473676L796703L558522
44180B4482981R05334J945922M360753J754713m228815n666370j117958K385571
44172B4822131P60335k010421k029600j077756j054535J81595L330784M092387
$$ plain form
44164 27014920 27101682 23460633 21795954 24879409 28489387 27768736 23589514 19971698
44156 19971698 18554632 18680926 20311287 23423020 26070032 26175734 24505588 23526499
44148 23526499 24173058 25877852 28774717 33388137 38666578 42615261 44658449 45543206
44140 45543206 45437954 44139788 42655689 42380301 43040090 43692749 45420814 50397927 58193709
44131 58193709 65777369 71808433 78356150 87588952 99498366 114223702 133948300 160425134
44123 160425134 192658158 229221014 270974280 318412410 366665427 405383629 423929284
44116 423929284 416356534 383464869 332871026 276540836 225095776 182932971 149144516
44109 149144516 122248670 102207410 88476213 78926076 71753453 66910548 64831312
$$ packed form
44164B7014920Q6762l641049j664679L083455L609978p20651m179222l617816
44156A9971698j417066J26294J630361L111733K647012J05702j670146r79089
44148B3526499O46559J704794K896865M613420N278441L948683K043188Q84757
44140D5543206j05252j298166j484099k75388O59789O52659J728065M977113P795782
44131E8193709P583660O031064O547717R232802J1909414J4725336J9724598K6476834
44123A60425134L2233024L6562856M1753266M7438130M8253017L8718202J8545655
44116D23929284p572750l2891665n0593843n6330190n1445060m2162805l3788455
44109A49144516k6895846k0041260j3731197r550137p172623m842905k079236
$$ plain form
44102 64831312 64888633 65678764 65847714 64389584 61385229 58898729 59920799 65617786 74106739
44093 74106739 82098493 87341424 90227124 94410783 105111341 124320614 147261049 165610633
44085 165610633 174673668 175327061 168953336 154335979 131885743 107881995 90615213
44078 90615213 82950916 81314184 81267157 81385380 82212368 84696214 90325272 100021621 111421584
44069 111421584 119096119 119201370 113149194 105495316 98688101 90921223 79123152 63354784
44061 63354784 47734975 36803876 31275850 28127448 24728315 21360198 19087513 17243990
44053 17243990 15056276 14271737 17189830 22308376 24886758 22616412 18355629 16044281
44045 16044281 15784697 14420310 9733445 2770415 -3142815 -4772769 -1291233 4817173
$$ packed form
44102F4831312N7321P90131J68950j458130l004355k486500J022070N696987Q488953
44093G4106739P991754N242931K885700M183659J0700558J9209273K2940435J8349584
44085A65610633R063035O53393o373725j4617357k2450236k4003748j7266782
44078I0615213p664297j636732m7027J18223Q26988K483846N629058R696349J1399963
44069A11421584P674535J05251o052176p653878o807215p766878j1798071j5768368
44061F3354784j5619809j0931099n528026l148402l399133l368117k272685j843523
44053A7243990k187714p84539K918093N118546K578382k270346m260783k311348
44045A6044281k59584j364387m686865o963030n913230j629954L481536O108406
$$ plain form
44037 4817173 9764869 11919785 12602330 13465776 14604473 15686734 17106168 18874406
44029 18874406 19843487 19228734 17570997 15085914 10736356 4584493 -453567 -1289718
44021 -1289718 1858843 6504944 11221209 15661080 18290429 17067720 12404452 6948768
44013 6948768 2229648 -2112922 -5526745 -5739510 -1887499 3658211 7896481 10092151
44005 10092151 11155631 11864327 12794908 14275699 15042587 12612809 6718217 1000810
43997 1000810 -665998 1397157 3842178 5076092 6635689 9943621 13843275 15982049
43989 15982049 15386358 13263375 12115889 14007014 18629037 23139856 24974272 24577589
43981 24577589 24033809 23393415 20542199 15185443 10615369 9833698 11339176 10867293 7005912
$$ packed form
44037D817173M947696K154916O82545Q63446J138697J082261J419434J768238
44029A8874406R69081o14753j657737k485083m349558o151863n038060q36151
44021a289718L148561M646101M716265M439871K629349j222709m663268n455684
44013F948768m719120m342570l413823k12765L852011N545710M238270K195670
44005A0092151J063480P08696R30581J480791P66888k429778n894592n717407
43997A000810j666808K063155K445021J233914J559597L307932L899654K138774
43989A5982049n95691k122983j147486J891125M622023M510819J834416l96683
43981B4577589n43780o40394k851216n356756m570074p81671J505478m71883l861381
$$ plain form
43972 7005912 3324649 4429622 10781349 17999168 21212470 19985022 18643077 21217156
43964 21217156 26402301 28888519 26030975 21482372 20849966 25051152 29925623 31693614
43956 31693614 30444155 28221961 26225910 24995019 25414046 27856140 31333648 34866530
43948 34866530 38920030 44320326 50687188 57457841 65701883 76969301 90429678 102956841
43940 102956841 112302060 118520723 121830397 120912218 114579059 104011927 92100228 81169494
43932 81169494 72130768 64920796 58674728 52309357 46293349 43194862 44914479 49790388
43924 49790388 54241919 57196812 60810447 66298594 71340876 73197598 72729952 73005318
43916 73005318 74526413 74378937 70836849 67015676 68436353 77471945 91428009 106273679
$$ packed form
43972G005912l681263J104973O351727P217819L213302j227448j341945K574079
43964B1217156N185145K486218k857544m548603o32406M201186M874471J767991
43956C1693614j249459k222194j996051j230891M19027K442094L477508L532882
43948C4866530M053500N400296O366862O770653Q244042J1267418J3460377J2527163
43940A02956841R345219O218663L309674r18179o333159j0567132j1911699j0930734
43932H1169494r038726p209972o246068o365371o016008l098487J719617M875909
43924D9790388M451531K954893L613635N488147N042282J856722m67646K75366
43916G3005318J521095j47476l542088l821173J420677R035592J3956064J4845670
$$ plain form
43908 106273679 121367977 139681534 163559872 191576022 220647127 250202859 281407282
43901 281407282 311023606 328662638 323759045 295678196 254746164 212928927 175596162
43894 175596162 142681381 114420436 92957112 79492650 72521143 68990912 66015596
43887 66015596 62115215 58108043 55951872 55408853 53296478 48026589 43138787 43098410
43879 43098410 46741524 48991699 48693713 49693745 53185169 54838350 52956170 54335716
43871 54335716 66217894 84997041 98940255 101342215 95476229 86588745 75176006
43864 75176006 60498111 45802815 36000020 32216976 31563232 31021522 29504531 27236766
43856 27236766 24979027 23286027 21664928 19436875 17623774 17919520 19212236 17897717
$$ packed form
43908A06273679J5094298J8313557K3878338K8016150K9071105K9555732L1204423
43901B81407282K9616324J7639032m903593k8080849m0932032m1817237l7332765
43894A75596162l2914781k8260945k1463324j3464462o971507l530231k975316
43887F6015596l900381m007172k156171n43019k112375n269889m887802m0377
43879D3098410L643114K250175k97986J000032L491424J653181j882180J379546
43871E4335716J1882178J8779147J3943214K401960n865986q887484j1412739
43864G5176006j4677895j4695296r802795l783044o53744n41710j516991k267765
43856B7236766k257739j693000j621099k228053j813101K95746J292716j314519
$$ plain form
43848 17897717 13118148 8875889 8687993 10648301 10569551 7840510 4944714 3071376
43840 3071376 2092073 3671654 9930112 18906216 25348422 26807923 25670845 24579670
43832 24579670 23431381 21907235 21055214 20323616 16588610 9078220 2492266 1734330
43824 1734330 5357725 7852019 7315796 6980821 9213574 11857151 11777695 9144124 6374400
43815 6374400 4837810 4621899 6257216 10365077 15825754 20206636 22428102 23635443
43807 23635443 24809350 24791982 21993413 17442325 14425426 14652923 16075066 15435670 12157440
43798 12157440 8633128 7313521 8814404 12448148 16833258 19712052 19040951 15548450
43790 15548450 13216662 15725051 22444925 28881905 31382181 31046890 32610265 39120410
$$ packed form
43848A7897717m779569m242259j87896J960308p8750k729041k895796j873338
43840C071376r79303J579581O258458Q976104O442206J459501j137078j091175
43832B4579670j148289j524146q52021p31598l735006p510390o585954p57936
43824A734330L623395K494294n36223l34975K232753K643577p9456k633571k769724
43815F374400j536590k15911J635317M107861N460677M380882K221466J207341
43807B3635443J173907j7368k798569m551088l016899K27497J422143o39396l278230
43798A2157440l524312j319607J500883L633744M385110K878794o71101l492501
43790A5548450k331788K508389O719874O436980K500276l35291J563375O510145
$$ plain form
43782 39120410 47802001 52147957 48901456 41957456 37717678 37342668 36200720 31079132
43774 31079132 24569451 20548886 18356226 14749097 9904524 7463442 8715082 10465860
43766 10465860 9778714 7809470 7143188 7564330 6707243 3670721 -13104 -2331480 -2173916
43757 -2173916 461260 3979154 5513998 3585847 251614 -1047121 375976 2231325
43749 2231325 3047342 3861925 5468937 6347652 4978126 2579947 1600392 2446126 3534359
43740 3534359 3868835 3768117 3640383 3934979 5786533 9516549 12747643 12454840 9063190
43731 9063190 6065380 5344633 5815285 7328290 12126564 20196619 26558213 26708093 22669771
43722 22669771 19988915 20189478 20115102 17916436 15452188 14558446 14891910 16314233 19749045
$$ packed form
43782C9120410Q681591M345956l246501o944000m239778l75010j141948n121588
43774C1079132o509681m020565k192660l607129m844573k441082J251640J750778
43766A0465860o87146j969244o66282M21142q57087l036522l683825k318376J57564
43757b173916K635176L517894J534844j928151l334233j298735J423097J855349
43749B231325Q16017Q14583J607012Q78715j369526k398179r79555Q45734J088233
43740C534359L34476j00718j27734K94596J851554L730016L231094k92803l391650
43731I063190k997810p20747M70652J513005M798274Q070055O361594J49880m038322
43722B2669771k680856K00563p4376k198666k464248q93742L33464J422323L434812
$$ plain form
43713 19749045 24240021 26422922 24975989 23267863 25659933 32805897 41793017 49006794
43705 49006794 51837691 50022111 47010515 48028105 55104877 65532237 75885971 84808195
43697 84808195 90704322 90599442 84263873 76328341 70543450 64333191 53250885 39103706
43689 39103706 28902902 26244643 28130237 30496156 32739707 35819981 39313599 41706451
43681 41706451 41361774 36820201 28626958 20836383 17520130 17387428 15274102 9779051
43673 9779051 5826639 8100095 15129059 21727396 24419416 22583937 17271511 11504559
43665 11504559 9351457 11920717 15963594 18580838 21039730 25282068 29168977 29106868
43657 29106868 25972327 24158951 25007629 25253805 22630303 19296675 18191351 18962207
$$ packed form
43713A9749045M490976K182901j446933j708126K392070P145964Q987120P213777
43705D9006794K830897j815580l011596J017590P076772J0427360J0353734Q922224
43697H4808195N896127j04880o335569p935532n784891o210259j1082306j4147179
43689C9103706j0200804k658259J885594K365919K243551L080274L493618K392852
43681D1706451l44677m541573q193243p790575l316253j32702k113326n495051
43673I779051l952412K273456P028964O598337K692020j835479n312426n766952
43665A1504559k153102K569260M042877K617244K458892M242338L886909o2109
43657B9106868l134541j813376Q48678K46176k623502l333628j105324P70856
$$ plain form
43649 18962207 19576291 19804904 20736997 22081245 22350300 21433257 21007960 22081273 23607760
43640 23607760 24263307 24583797 26342580 30297384 35756857 42543854 52285981 66944265
43632 66944265 86411377 107831340 126404237 136369937 132998162 116158057 92041413
43625 92041413 69368529 53009426 42017463 33396465 25804272 19435921 14716964 12343434
43617 12343434 12929826 15380697 16898128 15609051 12109389 8065432 5089357 5336019
43609 5336019 10371068 17967199 22778318 22407574 20369306 20503181 21102479 18254066 13011255
43600 13011255 10616077 13083006 16950545 18830113 19187095 19527495 19420586 18122170
43592 18122170 16552115 15901244 16078373 16586422 17011212 15966588 12095377 7210272 5670084
$$ packed form
43649A8962207O14084K28613R32093J344248K69055r17043m25297J073313J526487
43640B3607760O55547L20490J758783L954804N459473O786997R742127J4658284
43632F6944265J9467112K1419963J8572897R965700l371775j6840105k4116644
43625I2041413k2672884j6359103j0991963q620998p592193o368351m718957k373530
43617A2343434N86392K450871J517431j289077l499662m043957k976075K46662
43609E336019N035049P596131M811119l70744k038268J33875N99298k848413n242811
43600A3011255k395178K466929L867539J879568L56982L40400j06909j298416
43592A8122170j570055o50871J77129N08049M24790j044624l871211m885105j540188
$$ plain form
43583 5670084 8881508 12935271 13849007 12836129 13674714 16733626 18980778 19173427 19711098
43574 19711098 22848911 27426346 30226827 29270285 25332927 21264124 20023316 22437574
43566 22437574 26608128 29990098 31854723 33286853 35519068 39236937 44853657 52135341
43558 52135341 59790800 66608466 72906996 79913585 87928854 96013549 103036882 107821517
43550 107821517 108658441 104352545 96070521 86940163 79483152 74432156 72162838 73772002
43542 73772002 79705082 87916087 94248370 94818971 88386963 77169293 65405348 56308879
43534 56308879 50058613 45046044 40641995 37630366 36105917 34677174 32545818 31021514
43526 31021514 31685192 33826156 35103400 34513421 33468288 33826654 35848884 38388475
$$ packed form
43583E670084L211424M053763R13736j012878Q38585L058912K247152J92649N37671
43574A9711098L137813M577435K800481r56542l937358m068803j240808K414258
43566B2437574M170554L381970J864625J432130K232215L717869N616720P281684
43558E2135341P655459O817666O298530P006589Q015269Q084695P023333M784635
43550A07821517Q36924m305896q282024r130358p457011n050996k269318J609164
43542G3772002N933080Q211005O332283N70601o432008j1217670j1763945r096469
43534E6308879o250266n012569m404049l011629j524449j428743k131356j524304
43526C1021514O63678K140964J277244n89979j045133L58366K022230K539591
$$ plain form
43518 38388475 40317967 41308885 41671971 41842255 41800587 40840207 38238450 34311631 30335019
43509 30335019 27089788 23981781 20183768 16278348 13913055 13873598 15408758 17606035
43501 17606035 20267864 22745609 23135112 20214410 15769858 13319401 14367924 17437423
43493 17437423 21032412 25542963 31082023 35379990 36050970 34038159 32470964 32386997
43485 32386997 31970195 30212865 28653579 28290544 27178410 23363552 18915424 18494982
43477 18494982 23958194 32171120 38360011 40286838 39085901 37495324 37773026 40278658
43469 40278658 43545142 46265255 49033089 53132393 57988714 61676910 64328556 69085217
43461 69085217 78634585 92506808 109211365 129382043 154444887 182554331 207639637
$$ packed form
43518C8388475J929492R90918L63086J70284m1668r60380k601757l926819l976612
43509C0335019l245231l108007l798013l905420k365293l9457J535160K197277
43501A7606035K661829K477745L89503k920702m444552k450457J048523L069499
43493A7437423L594989M510551N539060M297967O70980k012811j567195q3967
43485C2386997m16802j757330j559286l63035j112134l814858m448128m20442
43477A8494982N463212Q212926O188891J926827j200937j590577K77702K505632
43469D0278658L266484K720113K767834M099304M856321L688196K651646M756661
43461F9085217R549368J3872223J6704557K0170678K5062844K8109444K5085306
$$ plain form
43454 207639637 222502181 222185347 205976416 178725958 149627148 126459549 109890152
43447 109890152 95194435 79842498 66790270 59390941 56164435 53073516 48887984
43440 48887984 45274464 42761112 40062390 37543719 38219215 43941806 52543522 60285676
43432 60285676 66097189 72244262 81743053 96309809 115837887 137565801 155097849
43425 155097849 160273390 148711158 124326923 97054665 74889753 58699437 45513250
43418 45513250 35181578 30998630 33980236 39919323 43752788 44466207 43689732 41711954
43410 41711954 37959214 34183268 33551795 36215999 38536012 37512652 33916608 30290620
43402 30290620 27853636 26541082 26609102 28754175 33079498 38505159 42841658 43716667
$$ packed form
43454B07639637J4862544l16834j6208931k7250458k9098810k3167599j6569397
43447A09890152j4695717j5351937j3052228p399329l226506l090919m185532
43440D8887984l613520k513352k698722k518671O75496N722591Q601716P742154
43432F0285676N811513O147073R498791J4566756J9528078K1727914J7532048
43425A55097849N175541j1562232k4384235k7272258k2164912j6190316j3186187
43418D5513250j0331672m182948K981606N939087L833465P13419p76475j977778
43410D1711954l752740l775946o31473K664204K320013j023360l596044l625988
43402C0290620k436984j312554O8020K145073M325323N425661M336499Q75009
$$ plain form
43394 43716667 40597570 35931893 33041795 32697149 32799847 31275386 27908746 23581696
43386 23581696 19546390 17571140 18871956 22435186 26007482 28891902 31878137 34401597
43378 34401597 34334183 31208664 27124722 23670200 20641137 18717227 20044761 24269273
43370 24269273 27244322 26388196 24513112 25228086 27252503 27266568 26265571 28182698 32972866
43361 32972866 36022785 34911829 32322761 31013910 29886177 27055167 23673776 22229194
43353 22229194 23029282 24413305 24947581 23902474 21208846 18507391 18609056 22195438
43345 22195438 26555160 29383867 32160336 37221155 42717996 43904992 39731781 34990141
43337 34990141 34268243 35983985 34944967 29974957 26100406 28199886 34510643 38537774
$$ packed form
43394D3716667l119097m665677k890098l44646J02698j524461l366640m327050
43386B3581696m035306j975250J300816L563230L572296K884420K986235K523460
43378C4401597o7414l125519m083942l454522l029063j923910J327534M224512
43370B4269273K975049q56126j875084P14974K024417J4065j000997J917127M790168
43361C2972866L049919j110956k589068j308851j127733k831010l381391j444582
43353B2229194Q00088J384023N34276j045107k693628k701455J01665L586382
43345B2195438M359722K828707K776469N060819N496841J186996m173211m741640
43337C4990141p21898J715742j039018m970010l874551K099480O310757M027131
$$ plain form
43329 38537774 36833808 32707691 31699759 35282027 40508213 44711663 48420320 53506826
43321 53506826 60195922 66940810 72575993 77521718 82621902 87320523 89713520 88621755
43313 88621755 84885947 79900402 73665095 65735931 57579557 51794306 48724257 46148536
43305 46148536 43023440 40914463 40399767 39012904 35196673 31662073 31441260 32533813
43297 32533813 30440764 24944723 20213687 18544984 18258750 18037344 18914204 20787718
43289 20787718 21168215 19434493 18817611 21714261 25887444 27831169 27445360 26758314 26136496
43280 26136496 24592941 22370557 20636753 19741683 19882253 22035042 25865344 28153790
43272 28153790 26153021 21697188 19228797 20170609 21825479 21641860 20011529 18635130
$$ packed form
43329C8537774j703966m126117j007932L582268N226186M203450L708657N086506
43321E3506826O689096O744888N635183M945725N100184M698621K392997j091765
43313H8621755l735808m985545o235307p929164q156374n785251l070049k575721
43305D6148536l125096k108977n14696j386863l816231l534600k20813J092553
43297C2533813k093049n496041m731036j668703k86234k21406Q76860J873514
43289B0787718L80497j733722o16882K896650M173183J943725l85809o87046o21818
43280B6136496j543555k222384j733804q95070J40570K152789L830302K288446
43272B8153790k000769m455833k468391R41812J654870j83619j630331j376399
$$ plain form
43264 18635130 18431005 19642133 22176651 25163425 27504707 29307046 31622982 34626691
43256 34626691 37396215 39799230 43125372 47986995 52491803 53502207 49607776 42455345
43248 42455345 35233658 30128999 27332435 26133556 26027646 26218145 25132525 22010363
43240 22010363 18535888 17073118 17376443 17063928 15424431 14341180 14994538 16404382
43232 16404382 18161382 21515542 26128203 28957171 28867042 29445068 34157179 41337048
43224 41337048 47687401 54481289 65739823 81501246 97610685 111751408 124863330
43217 124863330 136036607 140632612 135331512 122000715 105236951 88748189 74989226
43210 74989226 65168945 57952624 50453500 41793564 33761952 27475915 22023645 17049763
$$ packed form
43264A8635130k04125J211128K534518K986774K341282J802339K315936L003709
43256C4626691K769524K403015L326142M861623M504808J010404l894431p152431
43248D2455345p221687n104659k796564j198879j05910J90499j085620l122162
43240B2010363l474475j462770L03325l12515j639497j083251O53358J409844
43232A6404382J757000L354160M612661K828968r0129N78026M712111P179869
43224D1337048O350353O793888J1258534J5761423J6109439J4140723J3111922
43217A24863330J1173277M596005n301100j3330797j6763764j6488762j3758963
43210G4989226r820281p216321p499124q659936q031612o286037n452270m973882
$$ plain form
43202 17049763 13633103 11515880 8600160 4708260 2807621 4665417 8135781 10712814
43194 10712814 12836867 15329148 16516692 15015747 13024328 13422627 15234039 15295293
43186 15295293 13235567 11579113 11766831 13132528 15099836 17273260 17829654 15139107
43178 15139107 11152729 10104759 13145148 16781971 17431823 15249240 12513717 10361833
43170 10361833 8602758 7375062 7327431 8478551 9848732 10302449 9580359 8590869 8575592
43161 8575592 9853818 11666661 13223600 14245074 14637611 14885090 16643387 20862668
43153 20862668 24890909 24238006 18708924 13854341 13785742 15290101 12715437 6595181
43145 6595181 2807873 4043177 6995935 8359717 8864118 9953839 10681941 10250327 10528972
$$ packed form
43202A7049763l416660k117223k915720l891900j900639J857796L470364K577033
43194A0712814K124053K492281J187544j500945j991419L98299J811412O1254
43186A5295293k059726j656454J87718J365697J967308K173424N56394k690547
43178A5139107l986378j047970L040389L636823O49852k182583k735523k151884
43170A0361833j759075j227696m7631J151120J370181M53717p22090r89490j5277
43161H575592J278226J812843J556939J021474L92537K47479J758297M219281
43153B0862668M028241o52903n529082m854583o8599J504359k574664o120256
43145F595181l787308J235304K952758J363782N04401J089721P28102m31614K78645
$$ plain form
43136 10528972 13559976 18573646 23156430 25363553 23611107 17392793 9856044 6646910
43128 6646910 9696095 14598799 16528140 15987128 15808280 15574229 13442460 11423689 13532263
43119 13532263 19107517 22975726 22778787 21454914 21293349 20409947 17729071 17159762 22550115
43110 22550115 30808838 34560362 31188283 25521129 23075984 23789030 23854067 21521019
43102 21521019 18851605 18382764 19995518 21695291 22519156 23598521 26341946 30499167
43094 30499167 34572290 37342421 37984188 35433449 29543809 22970740 19710428 20600805
43086 20600805 22002192 20563798 17822519 17849639 21328618 24840601 26032466 26440050
43078 26440050 28009076 29530030 28869678 27099301 27513233 30823925 33900174 33885963 31589865
$$ packed form
43136A0528972L031004N013670M582784K207123j752446o218314p536749l209134
43128F646910L049185M902704J929341n41012j78848k34051k131769k018771K108574
43119A3532263N575254L868209j96939j323873j61565q83402k680876n69309N390353
43110B2550115Q258723L751524l372079n667154k445145P13046O5037k333048
43102B1521019k669414m68841J612754J699773Q23865J079365K743425M157221
43094C0499167M073123K770131O41767k550739n889640o573069l260312Q90377
43086B0600805J401387j438394k741279K7120L478979L511983J191865M07584
43078B6440050J569026J520954o60352j770377M13932L310692L076249j4211k296098
$$ plain form
43069 31589865 29743763 29422251 29624182 29477383 29235931 29322026 29761428 30648557 31937128
43060 31937128 32524270 30897580 27466187 25104270 26129334 29400939 31781677 32045508
43052 32045508 31653603 31680362 31091801 29034031 26921321 26383223 26270098 23925435 19120218
43043 19120218 14627804 12795133 13592488 16396119 21245288 26980161 30248603 28682973
43035 28682973 24179822 20949925 20683774 21493793 21443717 21059912 21773351 23494125 24816421
43026 24816421 24887856 24224743 23901979 24357035 25005193 25098109 24880277 25176699 25547286 24093204
43016 24093204 20208050 16363483 15398355 16843478 18091736 18662779 20578461 24435346
43008 24435346 28205097 30841200 33894640 37721948 39088974 35457793 29549837 26278658
$$ packed form
43069C1589865j846102l21512K01931j46799k41452Q6095M39402Q87129J288571
43060C1937128N87142j626690l431393k361917J025064L271605K380738K63831
43052C2045508l91905K6759n88561k057770k112710n38098j13125k344663m805217
43043A9120218m492414j832671P97355K803631M849169N734873L268442j565630
43035B8682973m503151l229897k66151Q10019n0076l83805P13439J720774J322296
43026B4816421P1435o63113l22764M55056O48158R2916k17832K96422L70587j454082
43016B4093204l885154l844567r65128J445123J248258N71043J915682L856885
43008B4435346L769751K636103L053440L827308J367026l631181n907956l271179
$$ plain form
43000 26278658 26420114 26872339 26531141 27869252 32027414 36053023 36834990 35059779 33091157
42991 33091157 31026422 27516386 23337335 21300009 22554875 25195183 27087713 28327357
42983 28327357 29888767 31207230 30745730 28591028 26772055 26415002 25978940 23702873
42975 23702873 20948179 20914253 23724028 25125750 21674636 15537623 11903394 12603632
42967 12603632 14943201 16446698 17491254 18399662 17260915 13112451 9165242 9726566
42959 9726566 14593681 19255990 20541867 19357726 17375939 13982062 8498155 3591702
42951 3591702 3693227 9956212 18503239 24114528 24695641 21978803 18980601 17409345
42943 17409345 16915805 16190212 14812802 13985531 15082305 17788857 20607425 23038772
$$ packed form
43000B6278658J41456M52225l41198J338111M158162M025609P81967j775211j968622
42991C3091157k064735l510036m179051k037326J254866K640308J892530J239644
42983B8327357J561410J318463m61500k154702j818973l57053m36062k276067
42975B3702873k754694l3926K809775J401722l451114o137013l634229P00238
42967A2603632K339569J503497J044556R08408j138747m148464l947209N61324
42959I726566M867115M662309J285877j184141j981787l393877n483907m906453
42951C591702J01525O262985Q547027N611289N81113k716838k998202j571256
42943A7409345m93540p25593j377410q27271J096774K706552K818568K431347
$$ plain form
42935 23038772 25750798 28212312 28165485 24966003 21767309 21903887 23901392 23007356 17912722
42926 17912722 13086300 13279577 18041421 23174809 25550525 24594809 20947319 16388453
42918 16388453 14197228 16771771 22721057 28250566 31505917 33777851 36338396 37991378
42910 37991378 36391883 30567925 21827737 13333116 8869299 10540681 16987473 24575965
42902 24575965 30476125 33995469 35577450 35973838 36062835 35828522 33771638 29153025 24450960
42893 24450960 23097253 24626194 24917333 22080662 19144925 19281916 21127361 21350863
42885 21350863 19897320 19779628 22643006 27071461 30711115 31834632 29336474 23617908
42877 23617908 17617838 15038857 17163821 22510742 29119264 35531097 40088588 41664065
$$ packed form
42935B3038772K712026K461514m6827l199482l198694J36578J997505q94036n094634
42926A7912722m826422J93277M761844N133388K375716r55716l647490m558866
42918A6388453k191225K574543N949286N529509L255351K271934K560545J652982
42910C7991378j599495n823958q740188q494621m463817J671382O446792P588492
42902B4575965N900160L519344J581981L96388Q8997k34313k056884m618613m702065
42893B4450960j353707J528941K91139k836671k935737J36991J845445K23502
42885B1350863j453543j17692K863378M428455L639654J123517k498158n718566
42877B3617908o000070k578981K124964N346921O608522O411833M557491J575477
$$ plain form
42869 41664065 41439763 41891928 43255173 42720651 38213981 31776523 28007380 29527655
42861 29527655 34519022 38476003 38346506 35364241 33615259 35453242 39122329 41625742
42853 41625742 42416133 42313537 40273137 34767843 28320493 26599655 31302744 37239680
42845 37239680 38965316 37543284 37553683 39687110 40624686 39417540 39228772 41689190 43506186
42836 43506186 41017195 35489459 31215287 29839029 29193021 27175927 24455576 23086932
42828 23086932 24030982 26558215 29271954 31335053 32908214 34265099 34588200 32672314
42820 32672314 29277549 27427980 29171430 33039869 35987385 36730805 35633181 32753555
42812 32753555 28611106 25948697 27377554 31137533 32489510 30002293 27129144 26477142
$$ packed form
42869D1664065k24302M52165J363245n34522m506670o437458l769143J520275
42861B9527655M991367L956981j29497k982265j748982J837983L669087K503413
42853D1625742P90391j02596k040400n505294o447350j720838M703089N936936
42845C7239680J725636j422032J0399K133427R37576j207146j88768K460418J816996
42836D3506186k488991n527736m274172j376258o46008k017094k720351j368644
42828B3086932R44050K527233K713739K063099J573161J356885L23101j915886
42820C2672314l394765j849569J743450L868439K947516P43420j097624k879626
42812C2753555m142449k662409J428857L759979J351977k487217k873149o52002
$$ plain form
42804 26477142 26342158 25091096 25072093 28504202 32510787 32851747 30699141 30609384 32602313
42795 32602313 31838891 26878395 22848703 24086484 27941647 29040487 26553822 23790310
42787 23790310 22762018 22795575 23482998 25578194 28821000 31316220 31699904 30640938 29928094
42778 29928094 30769808 32773729 34052018 32825205 29328518 25403360 22115009 19240696
42770 19240696 17432626 18654043 23118254 27791443 29859283 30099195 30660825 30918727
42762 30918727 28322841 22898866 18207586 17328254 19587092 21695588 21000912 17525670
42754 17525670 13803442 12716009 14766280 17678927 19088045 18843699 18157776 17744079
42746 17744079 17780248 18397020 18954688 18088656 15784764 14045019 14064813 14318910 13171668
$$ packed form
42804B6477142j34984j251062j9003L432109M006585L40960k152606q9757J992929
42795C2602313p63422m960496m029692J237781L855163J098840k486665k763512
42787B3790310j028292L3557O87423K095196L242806K495220L83684j058966p12844
42778B9928094Q41714K003921J278289j226813l496687l925158l288351k874313
42770A9240696j808070J221417M464211M673189K067840K39912N61630K57902
42762C0918727k595886n423975m691280q79332K258838K108496o94676l475242
42754A7525670l722228j087433K050271K912647J409118k44346o85923m13697
42746A7744079L6169O16772N57668q66032k303892j739745J9794K54097j147242
$$ plain form
42737 13171668 11683025 11660375 12526893 12616256 12119942 11991404 11289564 8810370 6405261
42728 6405261 7252298 11180136 14811561 16088445 15784460 15062450 14663764 16011198 19751715
42719 19751715 23560770 24731719 24325589 25057246 26037392 24367027 21374856 21508132 24554815
42710 24554815 25162124 21658885 19086398 20853483 23512408 23380923 22442719 23126154 22779157
42701 22779157 19045431 16046640 18613219 23831819 25239011 22883744 21983199 23176008
42693 23176008 21853743 17152080 14081200 15219230 16899350 16050944 15111374 17013585
42685 17013585 19909703 20380870 18547429 16790274 15949498 15561409 15735094 16335087 16102145
42676 16102145 14697880 13986828 15504963 18340324 21134181 24222486 27797688 29727762
$$ packed form
42737A3171668j488643k2650Q66518Q9363m96314j28538p01840k479194k405109
42728F405261Q47037L927838L631425J276884l03985p22010l98686J347434L740517
42719A9751715L809055J170949m06130P31657R80146j670365k992171J33276L046683
42710B4554815O07309l503239k572487J767085K658925j31485r38204O83435l46997
42701B2779157l733726k998791K566579N218600J407192k355267r00545J192809
42693B3176008j322265m701663l070880J138030J680120q48406r39570J902211
42685A7013585K896118M71167j833441j757155q40776l88089J73685N99993k32942
42676A6102145j404265p11052J518135K835361K793857L088305L575202J930074
$$ plain form
42668 29727762 27705937 22779194 18754265 18400062 21349513 25073560 26934914 26022843
42660 26022843 23832400 22565347 22546806 22397899 21647528 21233905 21201699 20436330 19509782
42651 19509782 20910142 24774798 27225222 25492536 22360218 22329258 25032151 26141989
42643 26141989 24160777 22509634 24303312 28140321 30338532 29228094 25976405 22689872
42635 22689872 20890225 20906711 21882598 22871077 24007249 25672583 26692504 25086145 21121524
42626 21121524 17925132 17985422 20389857 22769771 24690883 27273658 30170246 31162225
42618 31162225 29077704 25333129 21931464 19519491 18381470 19670671 23761915 28342295
42610 28342295 30479450 30490054 31389040 33977808 35020961 31863189 26740130 24098505
$$ packed form
42668B9727762k021825m926743m024929l54203K949451L724047J861354r12071
42660B6022843k190443j267053j8541j48907p50371m13623l2206p65369r26548
42651A9509782J400360L864656K450424j732686l132318l0960K702893J109838
42643B6141989j981212j651143J793678L837009K198211j110438l251689l286533
42635B2689872j799647J6486R75887R88479J136172J665334J019921j606359l964621
42626B1121524l196392O0290K404435K379914J921112K582775K896588R91979
42618C1162225k084521l744575l401665k411973j138021J289201M091244M580380
42610B8342295K137155J0604Q98986K588768J043153l157772n123059k641625
$$ plain form
42602 24098505 24920149 26434897 26808854 26920200 27069909 25242392 20606353 16539746 17413321
42593 17413321 22886359 27564917 26653539 20713235 14579080 12554461 15042639 19168411
42585 19168411 22028327 23277788 24647209 27088731 28956761 27698289 23363424 19508520
42577 19508520 19571090 22477065 23297589 19254043 13905909 13419401 19002659 25415445 27467658
42568 27467658 25420285 22662247 20807630 19617397 19545158 20899623 21727204 20217494
42560 20217494 18570129 20485187 24886172 26654780 24595843 23910210 28239537 33430155
42552 33430155 33055473 27343879 22316708 21521108 22850693 23244009 22677746 22746421 24141657
42543 24141657 26638297 29665648 32046024 32715631 32458593 33629195 37322305 41633644
$$ packed form
42602B4098505Q21644J514748L73957J11346J49709j827517m636039m066607Q73575
42593A7413321N473038M678558r11378n940304o134155k024619K488178M125772
42585A9168411K859916J249461J369421K441522J868030j258472m334865l854904
42577A9508520O2570K905975Q20524m043546n348134m86508N583258O412786K052213
42568B7467658k047373k758038j854617j190233p2239J354465Q27581j509710
42560B0217494j647365J915058M400985J768608k058937o85633M329327N190618
42552C3430155l74682n711594n027171p95600J329585L93316n66263O8675J395236
42543B4141657K496640L027351K380376O69607k57038J170602L693110M311339
$$ plain form
42535 41633644 43379452 41158227 36530994 32585815 31382317 32483489 33970986 34720959
42527 34720959 35010562 35026367 34204716 32596090 31389807 31086367 30523563 28900094 27320537
42518 27320537 26812556 26276507 24484230 23072062 25158348 31288839 38672657 44148528
42510 44148528 46235953 44906902 41502129 38636619 38062068 38592798 37963017 36482329
42502 36482329 36722438 39659992 43403019 45909007 46680812 45465078 41773158 36580535
42494 36580535 32391271 30590786 30403421 31027725 32655751 34548173 34616748 32606694 31607078
42485 31607078 34195696 38474310 40278922 38650294 36912018 38359158 42678496 47025978
42477 47025978 49250693 49174127 47357183 43879079 39077174 34997858 34540872 38261997
$$ packed form
42535D1633644J745808k221225m627233l945179j203498J101172J487497P49973
42527C4720959K89603J5805q21651j608626j206283l03440n62804j623469j579557
42518B7320537n07981n36049j792277j412168K086286O130491P383818N475871
42510D4148528K087425j329051l404773k865510n74551N30730o29781j480688
42502C6482329K40109K937554L743027K505988P71805j215734l691920n192623
42494C6580535m189264j800485j87365O24304J628026J892422O8575k010054r99616
42485C1607078K588618M278614J804612j628628j738276J447140M319338M347482
42477D7025978K224715p6566j816944l478104m801905m079316m56986L721125
$$ plain form
42469 38261997 43164586 46070754 47316089 49400398 52893609 56136814 58591212 61495732
42461 61495732 64776409 66303869 65330881 63922806 63466194 62324376 58901224 54796492
42453 54796492 52657459 52632169 53120198 53421037 53427017 52357052 50441884 50591448 55498834
42444 55498834 63689289 70922735 74956374 76628084 77076110 76748267 76914722 79439050
42436 79439050 84938447 93352036 105746207 122418178 139069302 148255411 145931320 134356783
42428 134356783 118056811 99914995 82320438 68536906 59833329 53029771 43946007
42421 43946007 32897027 24686642 23265026 27844594 34134148 38161605 38854697 37819266
42413 37819266 37044834 36984430 37125840 37780063 39843623 42699198 43994086 42238003 38498467
$$ packed form
42469C8261997M902589K906168J245335K084309L493211L243205K454398K904520
42461F1495732L280677J527460r72988j408075m56612j141818l423152m104732
42453E4796492k139033k5290M88029L00839N980j069965j915168J49564M907386
42444E5498834Q190455P233446M033639J671710M48026l27843J66455K524328
42436G9439050N499397Q413589J2394171J6671971J6651124R186109k324091j1574537
42428A34356783j6299972j8141816j7594557j3783532q703577o803558r083764
42421D3946007j1048980q210385j421616M579568O289554M027457O93092j035431
42413C7819266p74432o0404J41410O54223K063560K855575J294888j756083l739536
$$ plain form
42404 38498467 35071894 33679283 35107252 38736667 41828763 41400692 37930609 35300784
42396 35300784 36041938 38930193 42437472 47187015 52327869 53004012 46301239 37946741
42388 37946741 37353292 45579310 53392274 53040052 47461608 44977746 48409007 53309314
42380 53309314 55018371 53413663 50908017 48971308 47515123 45874690 43470015 40359894
42372 40359894 37698801 37248286 40053202 45290601 50074507 50988791 47236271 42378638
42364 42378638 41283984 44639008 47971193 46994598 42475434 38777524 39081948 43284108
42356 43284108 49090861 53564153 54738382 53316768 51969324 52088555 52844490 54283921
42348 54283921 58408722 64852780 68578334 65781813 59930281 57354705 58421965 58529850
$$ packed form
42404C8498467l426573j392611J427969L629415L092096m28071l470083k629825
42396C5300784P41154K888255L507279M749543N140854O76143o702773q354498
42388C7946741n93449Q226018P812964l52222n578444k483862L431261M900307
42380E3309314J709057j604708k505646j936709j456185j640433k404675l110121
42372D0359894k661093m50515K804916N237399M783906R14284l752520m857633
42364D2378638j094654L355024L332185r76595m519164l697910L04424M202160
42356D3284108N806753M473292J174229j421614j347444J19231P55935J439431
42348E4283921M124801O444058L725554k796521n851532k575576J067260J07885
$$ plain form
42340 58529850 57108688 58917248 64955010 68699131 65106690 58442113 56644225 61220905
42332 61220905 67003742 69338192 67332585 62062969 55791720 51568787 49839753 46879462
42324 46879462 40307663 34418954 35511906 43085420 50612715 54580642 57528859 61774063
42316 61774063 65612936 67495783 69225558 72508081 76072737 78736592 82028316 87162129
42308 87162129 92504464 97201786 105017807 121135091 145907484 173548928 195545609
42301 195545609 204150558 195643147 173641766 147919338 126914286 111750297 99023403
42294 99023403 87397029 78721050 74410828 74310961 78535014 87199609 98442596 109365215
42286 109365215 118582619 125125789 125574551 116299600 99386757 82775713 72642162 67949168
$$ packed form
42340E8529850j421162J808560O037762L744121l592441o664577j797888M576680
42332F1220905N782837K334450k005607n269616o271249m222933j729034k960291
42324D6879462o571799n888709J092952P573514P527295L967927K948217M245204
42316F1774063L838873J882847J729775L282523L564656K663855L291724N133813
42308H7162129N342335M697322P816021J6117284K4772393K7641444K1996681
42301A95545609Q604949q507411k2001381k5722428k1005052j5163989j2726894
42294I9023403j1626374q675979m310222r9867M224053Q664595J1242987J0922619
42286A09365215R217404O543170M48762r274951j6912843j6611044j0133551m692994
$$ plain form
42278 67949168 63996529 58855141 54049561 50727245 48100728 45474208 43644973 43695894
42270 43695894 45411575 47328577 47939322 46757425 44498642 42278090 40574975 39051481
42262 39051481 37250009 35153218 33116816 31556868 30613779 29855469 28493575 26134279
42254 26134279 23037949 19560946 16074864 13730391 14158719 17513722 21822382 25442356
42246 25442356 29104977 33886279 38140731 38930194 36504077 34879681 37030421 41313791
42238 41313791 43922757 43639821 42757454 43779107 46322697 47476682 45019017 40197855
42230 40197855 36764281 36712574 37850132 36906008 34238753 33196141 34835170 36107045
42222 36107045 34604407 32690706 34512525 40236059 45967632 49082076 50886845 53246054
$$ packed form
42278F7949168l952639n141388m805580l322316k626517k626520j829235N0921
42270D3695894J715681J917002O10745j181897k258783k220552j703115j523494
42262C9051481j801472k096791k036402j559948r43089p58310j361894k359296
42254B6134279l096330l477003l486082k344473M28328L355003M308660L619974
42246B5442356L662621M781302M254452P89463k426117j624396K150740M283370
42238D1313791K608966k82936q82367J021653K543590J153985k457665m821162
42230D0197855l433574n1707J137558r44124k667255j042612J639029J271875
42222C6107045j502638j913701J821819N723534N731573L114444J804769K359209
$$ plain form
42214 53246054 55041651 54101740 51483362 51193444 55156970 60490387 63128426 62807871
42206 62807871 62667004 64887918 69293622 76128598 86980184 101321315 114592575 122199712
42198 122199712 124108090 123220294 120353540 113492711 101577449 86489035 71232759 58242719
42190 58242719 49358185 45118851 43735335 42738678 41905093 42702478 44956891 46486963
42182 46486963 46334306 45848169 45950122 45780237 44867174 44196983 44132945 43699656 43024291
42173 43024291 43834840 45972360 46051028 41791804 35613641 31623599 30789254 31417964 32736968
42164 32736968 35139928 37753237 38575273 37176153 35463310 35551274 37769549 40528770
42156 40528770 41781314 41468415 42459033 47093850 52616917 53152994 47457619 41130082
$$ packed form
42214E3246054J795597r39911k618378k89918L963526N333417K638039l20555
42206F2807871j40867K220914M405704O834976J0851586J4341131J3271260P607137
42198A22199712J908378q87796k866754o860829j1915262j5088414j5256276j2990040
42190E8242719q884534m239334j383516r96657q33585P97385K254413J530072
42182D6486963j52657m86137J01953j69885r13063o70191o4038m33289o75365
42173D3024291Q10549K137520P8668m259224o178163l990042q34345O28710J319004
42164C2736968K402960K613309Q22036j399120j712843Q7964K218275K759221
42156D0528770J252544l12899R90618M634817N523067N36077n695375o327537
$$ plain form
42148 41130082 38798920 37929871 34215420 29704708 30039731 35226833 39094644 38131564
42140 38131564 35650635 36054988 39432889 43441004 46658453 48012368 45999158 40810675
42132 40810675 35362410 32797088 34500373 40636522 49674381 56831058 56750952 49632301
42124 49632301 41735360 37971551 36969496 35458966 34019639 35171277 38487270 41647669
42116 41647669 44845883 50120324 56740570 60862169 60256831 56831997 53932030 52985800
42108 52985800 53066554 52250570 49416169 45919481 44910998 47525702 50715133 50949322 49154348
42099 49154348 49133548 51392369 51914981 47974370 42127052 38662554 38360187 38893748 38768295
42090 38768295 38422457 38355408 38660917 40216034 43973062 48666355 51368560 51297107 51216204
$$ packed form
42148D1130082k331162q69049l714451m510712L35023N187102L867811r63080
42140C8131564k480929M04353L377901M008115L217449J353915k013210n188483
42132D0810675n448265k565322J703285O136149R037859P156677q0106p118651
42124D9632301p896941l763809j002055j510530j439327J151638L315993L160399
42116D1647669L198214N274441O620246M121599o05338l424834k899967r46230
42108E2985800Q0754q15984k834401l496688j008483K614704L189431K34189j794974
42099D9154348k0800K258821N22612l940611n847318l464498l02367N33561j25453
42090C8768295l45838o7049L05509J555117L757028M693293K702205p1453q0903
$$ plain form
42081 51216204 53559403 56698555 57247071 55196455 54023301 55529373 57414039 57206454
42073 57206454 56103657 56765178 59097563 60848129 61333533 61875254 63096092 64504509
42065 64504509 66481474 69822898 73359484 75211016 76711279 81370608 88770123 93486243
42057 93486243 92545784 90414098 93074256 99838165 105260162 107565331 110486038 116857771
42049 116857771 124771477 131333053 137009078 144397938 154477338 165414588 174121924 178694200
42041 178694200 180619092 184476753 193523658 205337803 213876856 216313908 215711192 216243076
42033 216243076 218204136 219279404 218714057 217907260 217731632 217368108 215851762 213513942
42025 213513942 211782692 212338288 216475238 224688619 236705108 251966089 269899111 289810648
$$ packed form
42081E1216204K343199L139152N48516k050616j173154J506072J884666k07585
42073E7206454j102797O61521K332385J750566M85404N41721J220838J408417
42065F4504509J976965L341424L536586J851532J500263M659329P399515M716120
42057I3486243r40459k131686K660158O763909N421997K305169K920707O371733
42049A16857771P913706O561576N676025P388860J0079400J0937250Q707336M572276
42041A78694200J924892L857661R046905J1814145Q539053K437052o02716N31884
42033B16243076J961060J075268n65347q06797j75628l63524j516346k337820
42025B13513942j731250N55596M136950Q213381J2016489J5260981J7933022J9911537
$$ plain form
42017 289810648 311011486 333119013 355891516 378994762 402412954 426470095 450345833
42010 450345833 471041553 485345764 492696077 494406120 490060021 476948991 454051776
42003 454051776 424670049 393645832 363238022 333049867 302716086 272965984 244848367
41996 244848367 219502137 198103077 180596905 165161300 150574720 138513486 131414499
41989 131414499 128159358 124245280 117081435 109166479 104521134 103219635 101286883 95660415
41981 95660415 87590470 80762604 77212346 75783346 73955476 70398742 65917691 62525422
41973 62525422 61652890 62829146 63957633 63099837 60061214 56213084 53125968 51715921
41965 51715921 52131630 53469947 53833870 52026986 49474730 49097911 51640553 54445858
$$ packed form
42017B89810648K1200838K2107527K2772503K3103246K3418192K4057141K3875738
42010D50345833K0695720J4304211P350313J710043m346099j3111030k2897215
42003D54051776k9381727l1024217l0407810l0188155l0333781k9750102k8117617
41996B44848367k5346230k1399060j7506172j5435605j4586580j2061234p098987
41989A31414499l255141l914078p163845p914956m645345j301499j932752n626468
41981I5660415q069945o827866l550258j429000j827870l556734m481051l392269
41973F2525422q72532J176256J128487q57796l038623l848130l087116j410047
41965E1715921M15709J338317L63923j806884k552256l76819K542642K805305
$$ plain form
41957 54445858 54767950 52902492 50783498 48993406 47181221 46376267 48262806 52195156
41949 52195156 55225762 55582527 54456195 54082498 55619441 58903521 62401319 63383015
41941 63383015 60519040 56790623 57247167 62763421 68428656 69643926 67509362 66068666
41933 66068666 66186872 65059074 61094612 56658110 55556844 59167390 65234656 69817867
41925 69817867 70758124 69740614 70252131 73198249 75925006 76253745 75635203 76832565 80094241
41916 80094241 83593922 86577391 90027339 94734043 100295103 105597331 109344118 111226616
41908 111226616 113578785 120075398 131183828 142922870 152271247 161546937 174411227
41901 174411227 189683950 203230714 214710113 227869800 244555834 263142089 283077302
$$ packed form
41957E4445858L22092j865458k118994j790092j812185q04954J886539L932350
41949E2195156L030606L56765j126332l73697J536943L284080L497798R81696
41941F3383015k863975l728417M56544N516254N665235J215270k134564j440696
41933F6068666J18206j127798l964462m436502j101266L610546O067266M583211
41925F9817867R40257j017510N11517K946118K726757L28739o18542J197362L261676
41916H0094241L499681K983469L449948M706704N561060N302228L746787J882498
41908A11226616K352169O496613J1108430J1739042R348377R275690J2864290
41901A74411227J5272723J3546764J1479399J3159687J6686034J8586255J9935213
$$ plain form
41894 283077302 305764643 329416368 347954210 357736557 361568326 363319426 362307421
41887 362307421 356475863 347868685 340549217 335074693 329562938 325343809 327039981 336457242
41879 336457242 349681607 360961222 366740926 365190191 354873332 336229365 313031103
41872 313031103 289975786 268322050 244842122 215809001 181951371 148849767 122140903
41865 122140903 103182312 90250478 82531088 80288794 81413894 81285391 77524367 72243100
41857 72243100 67929713 63929795 59460133 57228143 60028895 65128744 66368537 61962108
41849 61962108 56565248 54923428 56664592 58527573 58959928 58818313 59440125 61632362
41841 61632362 65265914 68727093 70170900 70555110 74031655 83571299 96858159 108164733
$$ packed form
41894B83077302K2687341K3651725J8537842R782347L831769J751100j012005
41887C62307421n831558q607178p319468n474524n511755m219129J696172R417261
41879C36457242J3224365J1279615N779704j550735j0316859j8643967k3198262
41872C13031103k3055317k1653736k3479928k9033121l3857630l3101604k6708864
41865A22140903j8958591j2931834p719390k242294J125100j28503l761024n281267
41857G2243100m313387l999918m469662k231990K800752N099849J239793m406429
41849F1962108n396860j641820J741164J862981M32355j41615O21812K192237
41841F1632362L633552L461179J443807L84210L476545R539644J3286860J1306574
$$ plain form
41833 108164733 114140209 116230254 117029447 115830245 109527400 97731812 84780007 75040426
41825 75040426 67648045 58666828 48103395 41077094 40650651 43057137 42895932 40268030
41817 40268030 38973609 39590915 38946516 35903591 33221122 33236023 35476554 38944497 42867428
41808 42867428 44711514 41983137 37338464 37174825 42820083 47706680 46524800 42722983
41800 42722983 42389528 44482905 43195069 38062861 35116091 37660573 41704935 42387802
41792 42387802 40573102 40593166 44388842 50164898 54816456 55916626 53073225 48888304
41784 48888304 47060184 48269703 49525802 48717611 47826781 49899085 54684555 59732290
41776 59732290 64714308 71868662 82082743 92762786 100208869 102574792 99957457 93205696
$$ packed form
41833A08164733N975476K090045P99193j199202o302845j1795588j2951805r739581
41825G5040426p392381q981217j0563433p026301m26443K406486j61205k627902
41817D0268030j294421O17306o44399l042925k682469J4901K240531L467943L922931
41808D2867428J844086k728377m644673j63639N645258M886597j181880l801817
41800D2722983l33455K093377j287836n132208k946770K544482M044362O82867
41792D2387802j814700K0064L795676N776056M651558J100170k843401m184921
41784D8888304j828120J209519J256099q08191q90830K072304M785470N047735
41776E9732290M982018P154354J0214081J0680043P446083K365923k617335o751761
$$ plain form
41768 93205696 83987304 75240774 69921543 68769549 69904518 71135766 72543378 76478164
41760 76478164 85177489 98929443 116645664 137251588 159348823 179649922 193186518
41753 193186518 196184935 188649934 173813830 155549991 136886700 120343760 108083554
41746 108083554 100869812 97475373 95974467 95539784 96450701 98639478 101290188 104261542
41738 104261542 109039273 117403567 129417079 143395825 157648252 171557279 185173598
41731 185173598 198706815 212561838 226896482 240482440 250446335 253796071 249347033
41724 249347033 238218722 222771049 205183222 186797039 168496859 151294550 136014432
41717 136014432 122588966 110782342 101956840 98617393 101047892 105851384 109711022 113471900
$$ packed form
41768I3205696r218392q746530n319231j151994J134969J231248J407612L934786
41760G6478164Q699325J3751954J7716221K0605924K2097235K0301099J3536596
41753A93186518K998417p535001j4836104j8263839j8663291j6542940j2260206
41746A08083554p213742l394439j500906m34683R10917K188777K650710K971354
41738A04261542M777731Q364294J2013512J3978746J4252427J3909027J3616319
41731A85173598J3533217J3855023J4334644J3585958R963895L349736m449038
41724B49347033j1128311j5447673j7587827j8386183j8300180j7202309j5280118
41717A36014432j3425466j1806624q825502l339447K430499M803492L859638L760878
$$ plain form
41709 113471900 120124746 129672111 139156657 147579641 157142842 168887363 180911033 192582629
41701 192582629 206679603 224295935 240447683 248267088 245815866 235681630 219824954
41694 219824954 198749242 174674417 151401933 130937954 113286808 99117514 89211649
41687 89211649 81608171 73217669 64656746 59696416 59243076 59839451 59341741 59872787 62909743
41678 62909743 65379845 64060712 61082360 61216146 65252655 69704168 72344171 74634095
41670 74634095 78526535 83709666 88857855 93747398 99196761 105907752 114009847 123387420
41662 123387420 134392574 148347720 166699927 189207687 213828254 239224685 266433802
41655 266433802 296459866 326088109 347180044 351058078 334351098 301416036 261346697
$$ packed form
41709A13471900O652846R547365R484546Q422984R563201J1744521J2023670J1671596
41701A92582629J4096974J7616332J6151748P819405k451222j0134236j5856676
41694B19824954k1075712k4074825k3272484k0463979j7651146j4169294r905865
41687H9211649p603478q390502q560923m960330m53340N96375m97710N31046L036956
41678F2909743K470102j319133k978352J33786M036509M451513K640003K289924
41670G4634095L892440N183131N148189M889543N449363O710991Q102095R377573
41662A23387420J1005154J3955146J8352207K2507760K4620567K5396431K7209117
41655B66433802L0026064K9628243K1091935L878034j6706980l2935062m0069339
$$ plain form
41648 261346697 222160981 187475681 158116643 134938084 118331240 106357590 96421359
41641 96421359 88870893 86070133 87274052 87419509 82523483 73932197 65651745 59672804
41633 59672804 55640531 52949578 51002906 49022658 47510792 48345711 51795890 55368744
41625 55368744 57484496 60198215 66167543 75160306 85886315 98502406 111912615 121157480
41617 121157480 122033665 117026637 112372265 110302172 108775340 108051812 112010404 122216446
41609 122216446 135621766 149477038 163950661 178127891 187918467 190635739 188111982
41602 188111982 182648134 173343477 159729093 146182162 138734830 138764554 142955467 148390144
41594 148390144 154524718 160479615 163198109 159102277 146741973 128213457 108672036
$$ packed form
41648B61346697l9185716l4685300k9359038k3178559j6606844j1973650r936231
41641I6421359p550466k800760J203919J45457m896026q591286q280452n978941
41633E9672804m032273k690953j946672j980248j511866Q34919L450179L572854
41625E5368744K115752K713719N969328Q992763J0726009J2616091J3410209R244865
41617A21157480Q76185n007028m654372k070093j526832p23528L958592J0206042
41609A22216446J3405320J3855272J4473623J4177230R790576K717272k523757
41602A88111982n463848r304657j3614384j3546931p447332K9724M190913N434677
41594A48390144O134574N954897K718494m095832j2360304j8528516j9541421
$$ plain form
41587 108672036 93352303 83884115 78224190 74501166 72987218 73336818 72530391 68115300
41579 68115300 62047615 58740882 59939011 63483974 66421347 67390994 66592090 65292247
41571 65292247 64952705 65312646 64096169 60280846 56685192 57100017 61333359 65340958
41563 65340958 66233468 65187916 65280634 68242869 73718296 80261048 86519638 92177828
41555 92177828 97772574 103170192 106991438 108348950 108060863 107000691 104647823 100950633
41547 100950633 98056877 97715963 98190278 96778085 94630594 95529046 99946434 104119907
41539 104119907 105742503 106724288 108796722 110327891 110337887 112449128 120894062 134270158
41531 134270158 147083732 156541732 163790681 168608135 167592275 159626698 149476776 142481525
$$ packed form
41587A08672036j5319733r468188n659925l723024j513948L49600q06427m415091
41579F8115300o067685l306733J198129L544963K937373R69647p98904j299843
41571F5292247l39542L59941j216477l815323l595654M14825M233342M007599
41563F5340958Q92510j045552R2718K962235N475427O542752O258590N658190
41555I2177828N594746N397618L821246J357512k88087j060172k352868l697190
41547A00950633k893756l40914M74315j412193k147491Q98452M417388M173473
41539A04119907J622596R81785K072434J531169R996K111241Q444934J3376096
41531A34270158J2813574R458000P248949M817454j015860p965577j0149922o995251
$$ plain form
41523 142481525 137454127 128524202 113707718 98152009 87891164 83267980 80416185
41516 80416185 76985695 73661068 71317225 69930702 70192954 73045056 76905401 78341683
41508 78341683 76900654 76508634 79961352 84380725 84899561 81173375 77191055 75717235
41500 75717235 76100460 76939395 77472499 76293698 72206462 67191087 65314550 67204027
41492 67204027 68244180 64111460 56155204 49546710 47676319 49975952 53775914 56514273
41484 56514273 57133264 56893567 58171903 61510986 64954390 67264922 70307699 76715443
41476 76715443 86353995 96724865 105969308 113897335 120767677 126553460 130947611 133085260
41468 133085260 132123239 129031651 126393209 125008413 122293660 116029968 108150206 102132397
$$ packed form
41523A42481525n027398q929925j4816484j5555709j0260845m623184k851795
41516H0416185l430490l324627k343843j386523K62252K852102L860345J436282
41508G8341683j441029l92020L452718M419373N18836l726186l982320j473820
41500G5717235L83225Q38935N33104j178801m087236n015375j876537J889477
41492F7204027J040153m132720p956256o608494j870391K299633L799962K738359
41484E6514273O18991k39697J278336L339083L443404K310532L042777O407744
41476G6715443R638552J0370870R244443P928027O870342N785783M394151K137649
41468A33085260r62021l091588k638442j384796k714753o263692p879762o017809
$$ plain form
41460 102132397 97720501 91411044 81893315 71830113 63903370 58103359 53769429 51514458
41452 51514458 51711062 53173050 54643966 55808467 55881034 53435470 49120288 46410868
41444 46410868 47623979 50681174 51767506 49939682 47259049 45665132 45773899 47568926
41436 47568926 49926930 50350362 47667084 44409244 44034770 46398457 48872255 51514529
41428 51514529 57342330 66698946 75209326 79491348 81915977 86920137 94788698 102339800
41420 102339800 108554042 116063899 126925713 139532434 150392423 157395100 161074376
41413 161074376 164009489 169000359 176543775 184240727 189769751 193512859 196294179 195535414
41405 195535414 186929717 170367657 151248016 134889828 122244951 112124301 104358306
$$ packed form
41460A02132397m411896o309457r517729j0063202p926743n800011m333930k254971
41452E1514458J96604J461988J470916J164501P2567k445564m315182k709420
41444D6410868J213111L057195J086332j827824k680633j593917J08767J795027
41436D7568926K358004M23432k683278l257840l74474K363687K473798K642274
41428E1514529N827801R356616Q510380M282022K424629N004160P868561P551102
41420A02339800O214242P509857J0861814J2606721J0859989P002677L679276
41413A61074376K935113M990870P543416P696952N529024L743108K781320p58765
41405A95535414q605697j6562060j9119641j6358188j2644877j0120650p765995
$$ plain form
41398 104358306 98417473 91736293 82915819 75189732 73225236 76906725 81480155 84129331
41390 84129331 87521787 95679744 108140745 119390757 123291971 117771862 106143052 94165987
41382 94165987 85223712 78367812 71166708 63150467 55452929 48808001 44041537 43152816
41374 43152816 46989886 52496349 55302519 54795092 53560409 52218710 48875817 44178711
41366 44178711 42245818 44560393 47103540 46528385 45772129 50067281 60052883 72279617
41358 72279617 83784341 91905924 92047541 81509768 65447740 53851933 51405612 54036192
41350 54036192 56124686 56827889 57652319 57971237 56201224 53181542 51424370 51970254 53892081
41341 53892081 56103618 58317132 60985967 65127846 71253422 78097758 83885805 89217818
$$ packed form
41398A04358306n940833o681180q820474p726087j964496L681489M573430K649176
41390H4129331L392456Q157957J2461001J1250012L901214n520109j1628810j1977065
41382I4165987q942275o855900p201104q016241p697538o644928m766464q88721
41374D3152816L837070N506463K806170n07427j234683j341699l342893m697106
41366D4178711j932893K314575K543147n75155p56256M295152R985602J2226734
41358G2279617J1504724Q121583J41617j0537773j6062028j1595807k446321K630580
41350E4036192K088494P03203Q24430L18918j770013l019682j757172N45884J921827
41341E3892081K211537K213514K668835M141879O125576O844336N788047N332013
$$ plain form
41333 89217818 96979896 109364668 127507397 153895893 190389637 231216497 261924275
41326 261924275 269865100 254517093 224875206 189524459 153477640 121886927 99709304
41319 99709304 86567753 77134625 68347841 62093919 59320008 56355034 50110413 43049202
41311 43049202 39259189 38431940 37600799 36561145 37193588 38672000 37841637 34325499 31404366
41302 31404366 31244221 32349258 32350842 30575191 27341558 23460623 21022013 21889831 24654787
41293 24654787 25887126 25204968 25857528 29010659 31180739 29785729 27761737 29046922
41285 29046922 32066235 32057672 28452075 25323636 24740974 24232039 21930103 20328173 22703748
41276 22703748 28229181 32818398 33580349 31053759 28142743 27885046 31206568 35975931
$$ packed form
41333H9217818P762078J2384772J8142729K6388496L6493744M0826860L0707778
41326B61924275P940825j5348007k9641887l5350747l6046819l1590713k2177623
41319I9709304j3141551r433128q786784o253922k773911k964974o244621p061211
41311D3049202l790013q27249q31141j039654O32443J478412q30363l516138k921133
41302C1404366j60145J105037J584j775651l233633l880935k438610Q67818K764956
41293B4654787J232339o82158O52560L153131K170080j395010k023992J285185
41285B9046922L019313q563l605597l128439n82662n08935k301936j601930K375575
41276B2703748N525433M589217P61951k526590k911016k57697L321522M769363
$$ plain form
41268 35975931 39130256 40165493 41380144 44396318 48059193 50457212 51488762 52635558
41260 52635558 55666261 62308781 73415363 87129360 99287631 107144044 111891378 116607334
41252 116607334 122871778 130355514 138344945 146326304 154130024 162794334 174632795 191965349
41244 191965349 216923369 251934745 296369581 340375371 365813719 358717480 321360681
41237 321360681 269658267 219355396 177195152 143705186 119064315 104018302 97871014
41230 97871014 97956413 100434402 101356351 98570145 93046424 87042526 81176521 75033462
41222 75033462 69899559 67830484 67821847 66283243 62430784 60012785 61842551 65394591
41214 65394591 66204776 63510436 60034775 57953530 57777361 59838671 63800361 67248123
$$ packed form
41268C5975931L154325J035237J214651L016174L662875K398019J031550J146796
41260E2635558L030703O642520J1106582J3713997J2158271P856413M747334M715956
41252A16607334O264444P483736P989431P981359P803720Q664310J1838461J7332554
41244A91965349K4958020L5011376M4434836M4005790K5438348p096239l7356799
41237C21360681n1702414n0302871m2160244l3489966k4640871j5046013o147288
41230I7871014Q5399K477989R21949k786206n523721o003898n866005o143059
41222G5033462n133903k069075q637j538604l852459k417999J829766L552040
41214F5394591Q10185k694340l475661k081245j76169K061310L961690L447762
$$ plain form
41206 67248123 67781841 66758987 68405129 74406963 81332655 84440937 82593782 78242036
41198 78242036 73715729 69238950 64415491 59868650 56300546 52901591 48469718 44079057
41190 44079057 42539531 44221104 45494149 43267462 39290685 37194733 36738544 34803733
41182 34803733 31471404 30431084 32586373 34125506 33058146 32952053 36634572 40195911
41174 40195911 38107643 31797264 27919147 29166752 31638538 31130162 27723060 23914254
41166 23914254 22151147 24632504 31641657 39156561 41625409 38300018 33926604 32502296
41158 32502296 33581639 35344334 37342130 38841474 38586468 38406691 43025002 53158014
41150 53158014 62318943 64340407 61412040 60562496 64352785 69640440 74019081 78055246
$$ packed form
41206F7248123N33718j022854J646142O001834O925692L108282j847155m351746
41198G8242036m526307m476779m823459m546841l568104l398955m431873m390661
41190D4079057j539526J681573J273045k226687l976777k095952m56189j934811
41182C4803733l332329j040320K155289J539133j067360j06093L682519L561339
41174D0195911k088268o310379l878117J247605K471786n08376l407102l808806
41166B3914254j763107K481357P009153P514904K468848l325391m373414j424308
41158C2502296J079343J762695J997796J499344k55006j79777M618311J0133012
41150E3158014R160929K021464k928367q49544L790289N287655M378641M036165
$$ plain form
41142 78055246 81003321 79584688 73079279 66049433 63583109 65946751 69716379 72325711
41134 72325711 73728078 75087710 77829481 83414128 92660536 105383374 121111909 139553646
41126 139553646 159978716 180697363 198981753 210508217 209632937 193033757 164345814
41119 164345814 133312185 108628738 92318247 81423504 72834011 64762887 55936774
41112 55936774 46683649 39974542 38116992 38500564 35960810 30102969 26849537 30650674
41104 30650674 37888361 41180953 38850225 36556674 39519850 46617172 53792595 60674088
41096 60674088 70883828 86461971 104516392 119675333 127823576 126952022 117088623 101953090
41088 101953090 89345616 86367445 93347440 104857957 117680416 134737374 158439151
$$ packed form
41142G8055246K948075j418633o505409p029846k466324K363642L769628K609332
41134G2325711J402367J359632K741771N584647R246408J2722838J5728535J8441737
41126A39553646K0425070K0718647J8284390J1526464q75280j6599180k8687943
41119A64345814l1033629k4683447j6310491j0894743q589493q071124q826113
41112E5936774r253125o709107j857550L83572k539754n857841l253432L801137
41104C0650674P237687L292592k330728k293551K963176P097322P175423O881493
41096F0674088J0209740J5578143J8054421J5158941Q148243q71554r863399j5135533
41088A01953090j2607474k978171O979995J1510517J2822459J7056958K3701777
$$ plain form
41081 158439151 182542389 195316947 191200710 175542525 156750922 137798611 118085362
41074 118085362 99837280 87440075 81179731 76305280 69302109 61805908 57130787 55833550
41066 55833550 56319041 57367893 58095823 57347183 55246065 53849075 54138431 53722481 50026580
41057 50026580 44970562 43802547 49252762 58944866 68618714 75786849 80034146 82251689
41049 82251689 84899476 91350509 103367455 119988026 140028782 164844720 196826447
41042 196826447 234559971 270184094 292614506 294473490 276773816 247274096 214538740
41035 214538740 183795056 157581160 137852970 125593573 119363946 116338133 114819378
41028 114819378 114463854 114496221 113556054 111354350 108783504 106252354 103558284 101376654
$$ packed form
41081A58439151K4103238J2774558m116237j5658185j8791603j8952311j9713249
41074A18085362j8248082j2397205o260344m874451p003171p496201m675121j297237
41066E5833550M85491J048852P27930p48640k101118j396990K89356m15950l695901
41057E0026580n056018j168015N450215R692104R673848P168135M247297K217543
41049H2251689K647787O451033J2016946J6620571K0040756K4815938L1981727
41042A96826447L7733524L5624123K2430412J858984j7699674k9499720l2735356
41035B14538740l0743684k6213896j9728190j2259397o229627l025813j518755
41028A14819378l55524L2367r40167k201704k570846k531150k694070k181630
$$ plain form
41020 101376654 100716880 100442326 97584514 91071914 83105060 75781547 68620384 61024335
41012 61024335 54896330 52278221 51847065 50447914 47235646 43541682 39061598 31346064
41004 31346064 20021419 9224705 4240150 6567401 13125030 19549194 23581704 25775013
40996 25775013 27609186 29142216 28846774 26011913 22544276 21323212 23000611 25482299
40988 25482299 26569708 26126570 25472920 25546605 26162738 26761769 27566900 29730754 33805494
40979 33805494 38149941 40015478 38745483 36687676 36126751 36747304 37380046 38564203
40971 38564203 41224835 44102429 45256018 45460551 47099924 49829737 50648090 48870540
40963 48870540 47645268 49030152 50628197 49399378 46407139 44943362 45410579 44997358
$$ packed form
41020A01376654o59774k74554k857812o512600p966854p323513p161163p596049
41012F1024335o128005k618109m31156j399151l212268l693964m480084p715534
41004C1346064j1324645j0796714m984555K327251O557629O424164M032510K193309
40996B5775013J834173J533030k95442k834861l467637j221064J677399K481688
40988B5482299J087409m43138o53650P3685O16133N99031Q05131K163854M074740
40979C3805494M344447J865537j269995k057807n60925O20553O32742J184157
40971C8564203K660632K877594J153589K04533J639373K729813Q18353j777550
40963D8870540j225272J384884J598045j228819k992239j463777M67217m13221
$$ plain form
40955 44997358 41931403 37565418 34173370 32566697 32156818 32006808 31558814 31216429 32183877
40946 32183877 34963801 38173064 39470184 37392115 32015338 24797609 18539606 16369649
40938 16369649 19320913 25254827 31039844 35264289 38250974 40561703 42517406 44113866
40930 44113866 44414850 42362608 39182647 37899042 38638368 36790555 28900914 18612762
40922 18612762 12959387 13764740 16837850 19099588 21545077 24514318 25360944 23176874
40914 23176874 21311883 21931986 21799204 17387769 11297427 9089220 11557827 14747670
40906 14747670 16689043 19308946 23379426 26092148 25253324 22574323 20863810 20319727
40898 20319727 19489019 18112588 17067843 16556137 16079665 15786155 16573572 18846073 21698665
$$ packed form
40955D4997358l065955m365985l392048j606673m09879j50010m47994l42385R67448
40946C2183877K779924L209263J297120k078069n376777p217729o258003k169957
40938A6369649K951264N933914N785017M224445K986685K310729J955703J596460
40930D4113866L00984k052242l179961j283605P39326j847813p889641j0288152
40922A8612762n653375Q05353L073110K261738K445489K969241Q46626k184070
40914B3176874j864991O20103j32782m411435o090342k208207K468607L189843
40906A4747670J941373K619903M070480K712722q38824k679001j710513n44083
40898B0319727q30708j376431j044745n11706m76472k93510P87417K272501K852592
$$ plain form
40889 21698665 23320408 22296097 18975351 15400001 13296527 12504948 12160826 12715569
40881 12715569 15316945 19574486 23711361 26924303 29729426 31688543 30850542 26456331
40873 26456331 20707992 16715242 15579686 16172797 16760206 16155281 14226478 11979650
40865 11979650 10544396 9942667 9689828 10243732 12189234 14109812 13588087 10968657 9846171
40856 9846171 12633459 17602398 21587178 23655784 24577162 24603084 23799105 23148055 23329723
40847 23329723 23441378 22537527 21251648 20383749 19321344 17490231 15733645 14466892
40839 14466892 12458433 9747104 9560638 14093076 20054090 22117115 19691456 16447141
40831 16447141 14043471 10850882 6904325 5389107 7900302 12017946 15005854 16557936
$$ packed form
40889B1698665J621743j024311l320746l575350k103474p91579l44122N54743
40881A2715569K601376M257541M136875L212942K805123J959117q38001m394211
40873B6456331n748339l992750j135556N93111N87409o04925j928803k246828
40865A1979650j435254o01729k52839N53904J945502J920578n21725k619430j122486
40856I846171K787288M968939L984780K068606R21378K5922q03979o51050J81668
40847B3329723J11655r03851j285879q67899j062405j831113j756586j266753
40839A4466892k008459k711329j86466M532438N961014K063025k425659l244315
40831A6447141k403670l192589l946557j515218K511195M117644K987908J552082
$$ plain form
40823 16557936 16629955 14244973 10441919 9119529 12385934 17303056 19243109 16463345
40815 16463345 10055946 2185459 -3824604 -4694530 -1055307 2265255 2194545 1235275 2939337
40806 2939337 6332600 7978085 7175649 5585406 3710241 1558481 1142623 4161293
40798 4161293 8182328 9235061 7687073 7575460 10315154 13050433 13476011 12477060 11429469
40789 11429469 10504733 10432283 12398225 15058660 14976057 11487938 8223242 8262620 10480289
40780 10480289 12249606 13138379 13975861 14415224 13527287 11462180 9062897 7043804 6345879
40771 6345879 7641770 9855769 11229634 12348894 15282234 18813542 18245982 12359411
40763 12359411 7204157 9240968 16681898 21522880 19250237 12912421 7849033 5949295
$$ packed form
40823A6557936P2019k384982l803054j322390L266405M917122J940053k779764
40815A6463345o407399p870487o010063q69926L639223L320562p0710r59270J704062
40806B939337L393263J645485q02436j590243j875165k151760m15858L018670
40798D161293M021035J052733j547988j11613K739694K735279M25578r98951j047591
40789A1429469r24736p2450J965942K660435q2603l488119l264696L9378K217669
40780A0480289J769317Q88773Q37482M39363q87937k065107k399283k019093o97925
40771F345879J295891K213999J373865J119260K933340L531308n67560n886571
40763A2359411n155254K036811P440930M840982k272643o337816n063388j899738
$$ plain form
40755 5949295 5891093 6186064 6345916 6410519 6646196 7374695 8680247 10454065 12603210
40746 12603210 15061549 18016788 22014826 26714019 29539566 27536999 21408764 15746754
40738 15746754 13979419 15063475 16697572 19301529 24042237 28860652 30163600 27931298
40730 27931298 25873910 26502748 28872813 31219908 32808986 32650752 29405338 23952113
40722 23952113 19922043 20181961 24015832 28560275 31706559 32977686 32947690 32572741 32199308
40713 32199308 31090328 28974885 27544336 28387623 29610705 27159326 20242688 13070598
40705 13070598 10073915 11362684 13872140 14794035 12680393 7731147 3138846 4082102
40697 4082102 12609139 24484402 33349485 37092860 37977637 37823605 36438351 34689979
$$ packed form
40755E949295n8202K94971J59852O4603K35677P28499J305552J773818K149145
40746A2603210K458339K955239L998038M699193K825547k002567o128235n662010
40738A5746754j767335J084056J634097K603957M740708M818415J302948k232302
40730B7931298k057388O28838K370065K347095J589078j58234l245414n453225
40722B3952113m030070K59918L833871M544443L146284J271127k9996l74949l73433
40713C2199308j108980k115443j430549Q43287J223082k451379o916638p172090
40705A3070598k996683J288769K509456R21895k113642m949246m592301R43256
40697D082102Q527037J1875263Q865083L743375Q84777j54032j385254j748372
$$ plain form
40689 34689979 35361007 39107123 41944943 39294899 31710367 24379895 20886850 19432915
40681 19432915 16196027 10861730 6749031 5774229 5806599 4210903 1920195 1690248 3615985
40672 3615985 5401622 6700544 9696668 14624769 18261275 18780056 18919710 21401183
40664 21401183 23806254 22017712 17374535 15780179 19316030 22919295 21111830 14848817
40656 14848817 9272710 6870385 5798929 4127436 2825991 3842478 6887874 9374613
40648 9374613 9356022 7991206 8773872 14047894 22320184 29438801 32505869 32147134 30874058
40639 30874058 30078247 29290859 27824363 26103029 25182127 25536616 26624577 27309052 26427106
40630 26427106 23348139 18733564 14856712 14247086 17122751 20566995 21363238 19638178
$$ packed form
40689C4689979O71028L746116K837820k650044p584532p330472l493045j453935
40681A9432915l236888n334297m112699r74802L2370j595696k290708k29947J925737
40672C615985J785637J298922K996124M928101L636506N18781J39654K481473
40664B1401183K405071j788542m643177j594356L535851L603265j807465o263013
40656A4848817n576107k402325j071456j671493j301445J016487L045396K486739
40648I374613j8591j364816P82666N274022Q272290P118617L067068l58735j273076
40639C0874058p95811p87388j466496j721334r20902L54489J087961O84475q81946
40630B6427106l078967m614575l876852o09626K875665L444244P96243j725060
$$ plain form
40622 19638178 18493562 19769371 21649511 21416900 19313469 18116839 19518061 22557860
40614 22557860 25529345 27849267 29628475 30582440 30164416 28443656 26566387 26380789
40606 26380789 29079183 33555330 36636729 36078679 33285061 32151144 35253339 41931466
40598 41931466 49719888 56424467 60914123 63263582 64462263 65160679 64929154 63885967
40590 63885967 64460550 69430919 78074772 86560579 92880750 99090875 107384936 116218644
40582 116218644 122335441 124812231 124562238 121147021 113318625 102689746 93805447 89401577
40574 89401577 87598276 85078282 81408361 78401343 76038163 71283635 61787999 49653333
40566 49653333 40152076 36542066 37058966 37571945 36282774 34507272 33389601 32063554
$$ packed form
40622A9638178j144616J275809J880140k32611k103431j196630J401222L039799
40614B2557860K971485K319922J779208R53965m18024j720760j877269j85598
40606B6380789K698394M476147L081399n58050k793618j133917L102195O678127
40598D1931466P788422O704579M489656K349459J198681O98416k31525j043187
40590F3885967N74583M970369Q643853Q485807O320171O210125Q294061Q833708
40582A16218644O116797K476790k49993l415217p828396j0628879q884299m403870
40574H9401577j803301k519994l669921l007018k363180m754528r495636j2134666
40566D9653333r501257l610010N16900N12979j289171j775502j117671j326047
$$ plain form
40558 32063554 29811775 27984027 27910548 28078389 25644371 20569885 16160780 14893140
40550 14893140 15229715 13669281 9326505 5520806 6625443 13457641 21901366 26330512
40542 26330512 24363347 17915249 10151489 3018883 -1981255 -2939399 566442 5912430
40534 5912430 9805556 11587900 12461756 12429820 10494810 7509520 6062743 7061123 8657272
40525 8657272 9101028 8588428 7789239 6744066 5974961 6562745 8216207 9259346 9328658
40516 9328658 9837661 10858909 10231063 7292406 4790855 4953457 6192440 6360685 6907788
40507 6907788 10367303 15370017 18044550 17691666 17251431 18053366 17698752 14027389 8304408
40498 8304408 3354541 722586 526121 2086413 3935071 5071444 6735854 10818464
$$ packed form
40558C2063554k251779j827748p3479J67841k434018n074486m409105j267640
40550A4893140L36575j560434m342776l805699J104637O832198Q443725M429146
40542B6330512j967165o448098p763760p132606n000138r58144L505841N345988
40534E912430L893126J782344Q73856l1936j935010k985290j446777R98380J596149
40525H657272M43756n12600p99189j045173p69105N87784J653462J043139O9312
40516I328658N09003J021248o27846k938657k501551J62602J238983J68245N47103
40507F907788L459515N002714K674533l52884m40235Q01935l54614l671363n722981
40498H304408m949867k631955j96465J560292J848658J136373J664410M082610
$$ plain form
40490 10818464 15951968 17789535 14566702 10199251 9977503 14567457 19859268 21564964
40482 21564964 18485200 12376466 6404424 3350833 3945131 6717702 9638625 11372536
40474 11372536 11121821 8765115 5666920 3845765 3535489 2935634 1152881 -194833
40466 -194833 595155 2812545 4651960 5742042 6868290 8223828 9407119 10304675 10703055
40457 10703055 9994141 8552351 8271021 10155402 12368596 12377900 10249610 8115605 7118175
40448 7118175 6713201 6444159 6515597 6865062 7342313 8581895 11119237 13834561 14733948
40439 14733948 13073061 9485864 4656481 -502570 -3942756 -3792149 -671997 2693609
40431 2693609 4019702 2611969 -904327 -4201647 -3838506 1064711 6332933 6794011
$$ packed form
40490A0818464N133504J837567l222833m367451k21748M589954N291811J705696
40482B1564964l079764o108734n972042l053591N94298K772571K920923J733911
40474A1372536k50715k356706l098195j821155l10276n99855j782753j347714
40466a94833P89988K217390J839415J090082J126248J355538J183291Q97556L98380
40457A0703055p08914j441790k81330J884381K213194R304k128290k134005r97430
40448G118175m04974k69042P1438L49465M77251J239582K537342K715324Q99387
40439A4733948j660887l587197m829383n159051l440186J50607L120152L365606
40431B693609J326093j407733l516296l297320L63141M903217N268222M61078
$$ plain form
40423 6794011 2645618 -1074880 -1168778 940323 3254370 5956637 8747008 9378237 7458130
40414 7458130 6687636 10163472 15436660 17347445 14556991 10467869 8462759 8821184
40406 8821184 9971000 10492543 9807436 8466266 7746824 8070664 8560603 9079214 11194266
40397 11194266 15404654 18925166 18706706 15680407 13239299 12084561 9776110 5630104
40389 5630104 2716630 3575169 6570911 8537352 9233049 10829035 13898516 16361292
40381 16361292 16569929 15528180 15194726 15769739 15823892 14643451 13231213 12792304 13200805
40372 13200805 13517785 13281380 12598095 11773145 11889980 14805990 20672595 25833544 25655295
40363 25655295 20140276 14628662 13884229 17414860 21820361 25438442 28487172 30506576
$$ packed form
40423F794011m148393l720498r3898K109101K314047K702267K790371O31229j920107
40414G458130p70494L475836N273188J910785k790454m089122k005110L58425
40406H821184J149816N21543o85107j341170p19442L23840M89939N18611K115052
40397A1194266M210388L520512k18460l026299k441108j154738k308451m146006
40389E630104k913474Q58539K995742J966441O95697J595986L069481K462776
40381A6361292K08637j041749l33454N75013N4153j180441j412238m38909M08501
40372A3200805L16980k36405o83285q24950J16835K916010N866605N160949j78249
40363B5655295n515019n511614p44433L530631M405501L618081L048730K019404
$$ plain form
40355 30506576 30699984 30117332 30682384 32099064 32154297 30299393 28698046 29239721 31478862
40346 31478862 34164970 37062940 40478869 44437019 49052679 54381168 59228885 61632792
40338 61632792 61680712 62697067 68081225 77268966 86022135 90840825 92239965 93233491
40330 93233491 95217339 96558862 95720376 94402210 95564681 98590084 99094784 94651864
40322 94651864 88186576 83626461 80365647 75032046 67296929 60343454 56012718 53076928
40314 53076928 50571491 49238171 48624729 46059504 40273562 33512501 28281860 24209624
40306 24209624 19959943 16170363 14313202 14200184 14742780 15952388 18138190 20162646
40298 20162646 20613038 20089326 20446562 22158369 24038939 25233653 26033285 26988894 28470707
$$ packed form
40355C0506576J93408n82652N65052J416680N5233j854904j601347N41675K239141
40346C1478862K686108K897970L415929L958150M615660N328489M847717K403907
40338F1632792M7920J016355N384158R187741Q753169M818690J399140R93526
40330I3233491J983848J341523q38486j318166J162471L025403N04700m442920
40322I4651864o465288m560115l260814n333601p735117o953475m330736k935790
40314E3076928k505437j333320o13442k565225n785942o761061n230641m072236
40306B4209624m249681l789580j857161j13018N42596J209608K185802K024456
40298B0162646M50392n23712L57236J711807J880570J194714P99632R55609J481813
$$ plain form
40289 28470707 30798447 33692944 35977728 36901439 37376081 38897705 41622649 44424931
40281 44424931 46459296 47894688 49551530 52295609 55944465 58379472 57276916 53678794
40273 53678794 52052920 55134348 60326055 63409730 64408298 66846458 71832707 76106679
40265 76106679 76371857 72770499 67181797 60662269 54145765 49647833 48481725 48932363
40257 48932363 47539445 42846681 36912479 32981429 32258525 33021724 32371296 28659470
40249 28659470 22697061 17212048 15081789 17186527 21327083 23963128 24065848 24584544
40241 24584544 28550661 34375704 37495664 36716075 35756798 37374011 39362225 38790623
40233 38790623 37059940 37054273 37467560 34466945 28102602 22522611 19790588 17954885 16015837
$$ packed form
40289B8470707K327740K894497K284784R23711M74642J521624K724944K802282
40281D4424931K034365J435392J656842K744079L648856K435007j102556l598122
40273E3678794j625874L081428N191707L083675R98568K438160M986249M273972
40265G6106679K65178l601358n588702o519528o516504m497932j166108M50638
40257D8932363j392918m692764n934202l931050p22904P63199o50428l711826
40249B8659470n962409n485013k130259K104738M140556K636045J02720N18696
40241B4584544L966117N825043L119960p79589r59277J617213J988214n71602
40233C8790623j730683n667M13287l000615o364343n579991k732023j835703j939048
$$ plain form
40224 16015837 16212654 19325266 21622803 19519543 14678221 11521213 11482631 12458136 12516213
40215 12516213 11409154 9310741 6651872 4857054 5151917 6846090 8393220 9577627
40207 9577627 10889447 11391552 9458996 5611005 2492731 1617873 1912205 2104208 2908322
40198 2908322 5730500 10232301 14363759 16463107 16545263 15702154 14863585 14223621 13561782
40189 13561782 12976956 13287360 15538102 19834873 24578502 27238361 26552453 24111763
40181 24111763 23032221 24497226 26282019 25578845 22657508 20366027 20250248 20800314
40173 20800314 19819441 16939190 13114607 9089689 5433890 3021951 2287088 2655908
40165 2655908 3642633 5741647 9148218 12248878 12809188 10730702 8626963 9228071 12496468
$$ packed form
40224A6015837J96817L112612K297537k103260m841322l157008l8582R75505N8077
40215A2516213j107059k098413k658869j794818K94863J694173J547130J184407
40207I577627J311820N02105j932556l847991l118274q74858K94332J92003Q04114
40198B908322K822178M501801M131458K099348Q2156q43109q38569o39964o61839
40189A3561782n84826L10404K250742M296771M743629K659859o85908k440690
40181B4111763j079542J465005J784793p03174k921337k291481j15779N50066
40173B0800314r80873k880251l824583m024918l655799k411939p34863L68820
40165B655908R86725K099014L406571L100660N60310k078486k103739O01108L268397
$$ plain form
40156 12496468 15555759 15670053 13378687 12038372 13530954 15293103 13386108 8236810
40148 8236810 4867746 6613534 10943001 13131098 12169618 10875357 11454610 13481593
40140 13481593 15831926 18297109 20975832 23603145 25781313 26940187 26300019 23898050
40132 23898050 21214974 19593425 18525172 16835227 15007592 14690855 16224487 18414452
40124 18414452 20634809 23285112 26008963 27370685 26891249 25830784 25322089 25196161
40116 25196161 25347787 26716156 29762739 33127640 35119317 35832130 36486308 37067967 36092181
40107 36092181 33069632 30108931 30012557 32896654 35664626 35414510 32782528 31031981
40099 31031981 32222456 35505097 39018503 41740373 43073183 42507700 40689283 39078079
$$ packed form
40156A2496468L059291J14294k291366j340315J492582J762149j906995n149298
40148H236810l369064J745788M329467K188097r61480j294261N79253K026983
40140A3481593K350333K465183K678723K627313K178168J158874o40168k401969
40132B3898050k683076j621549j068253j689945j827635l16737J533632K189965
40124A8414452K220357K650303K723851J361722m79436j060465n08695j25928
40116B5196161J51626J368369L046583L364901J991677P12813O54178N81659r75786
40107C6092181l022549k960701r6374K884097K767972k50116k631982j750547
40099C1031981J190475L282641L513406K721870J332810n65483j818417j611204
$$ plain form
40091 39078079 37431031 33680896 27954077 24291595 25562176 28579159 27941261 23679136
40083 23679136 20977231 22401728 24682744 24215263 21879449 20640318 21593896 24428984
40075 24428984 28951804 33767743 35820141 33864843 30706703 29624809 30116772 29520511
40067 29520511 27395288 25727015 25833332 27545415 30600870 34312579 36433778 34954695
40059 34954695 30990089 27738506 26618411 26390470 25925577 25672721 26280183 27870375 30964984
40050 30964984 36030380 41558873 44640454 44353471 42848916 42039131 40909964 37635334
40042 37635334 33063530 30077781 29824381 30474510 30249103 30199521 32624321 37182702 40237359
40033 40237359 38887359 34631688 31604922 31552663 32293432 31414257 29514594 28565252 28570153
$$ packed form
40091C9078079j647048l750135n726819l662482J270581L016983o37898m262125
40083B3679136k701905J424497K281016m67481k335814j239131R53578K835088
40075B4428984M522820M815939K052398j955298l158140j081894M91963n96261
40067B9520511k125223j668273J06317J712083L055455L711709K121199j479083
40059C4954695l964606l251583j120095k27941m64893k52856O07462J590192L094609
40050C0964984N065396N528493L081581k86983j504555q09785j129167l274630
40042C7635334m571804k985749k53400O50129k25407m9582K424800M558381L054657
40033D0237359j350000m255671l026766n2259P40769q79175j899663r49342M901
$$ plain form
40024 28570153 27686821 25026171 21741267 19610673 19776162 22472052 26630078 29958391
40016 29958391 30718752 29409810 27773465 26656117 26197056 27518353 32007980 38415361
40008 38415361 42527124 41047117 35096776 29012509 26061254 25859724 25641769 23437520
40000 23437520 19804362 16590693 14596229 13250827 12365661 12721819 14341927 15667176
39992 15667176 15601674 15090486 15224218 14984931 12751763 9196046 6616158 5838220 5711099
39983 5711099 5346436 5005580 5115916 6200371 9102907 13073432 14463238 10409185 3664211
39974 3664211 376216 2483869 5617842 5557938 3370116 2427250 3576187 5801063 9124886
39965 9124886 13791248 17994867 19122410 16551582 11534657 5556170 484275 -1322769
$$ packed form
40024B8570153q83332k660650l284904k130594J65489K695890M158026L328313
40016B9958391P60361j308942j636345j117348m59061J321297M489627O407381
40008C8415361M111763j480007n950341o084267k951255k01530k17955k204249
40000B3437520l633158l213669j994464j345402q85166L56158J620108J325249
39992A5667176o5502n11188J33732k39287k233168l555717k579888p77938j27121
39983E711099l64663l40856J10336J084455K902536L970525J389806m054053o744974
39974C664211l287995K107653L133973n9904k187822r42866J148937K224876L323823
39965I124886M666362M203619J127543k570828n016925n978487n071895j807044
$$ plain form
39957 -1322769 642343 3779712 5539260 6518634 8329672 10194929 10682735 11374194 14980273
39948 14980273 20259974 22762714 21120022 18944245 19367804 21101568 21655117 21401031
39940 21401031 21945966 22778657 22487605 21930006 23176579 25859521 27436492 27199668 27333012
39931 27333012 29240685 31362425 32240127 33731205 38746426 46809835 54526261 60208888
39923 60208888 65118162 69476749 70500815 66606722 61137277 58732821 59249407 58546174
39915 58546174 54667066 49750473 45889747 43004628 41737962 44548039 51763835 59468192
39907 59468192 63575010 63671510 60931996 55101719 46287816 37285540 30905023 26632037
39899 26632037 22662528 19292817 17307438 15178731 11581348 8887188 10015221 13185907
$$ packed form
39957a322769J965112L137369J759548R79374J811038J865257M87806O91459L606079
39948A4980273N279701K502740j642692k175777M23559J733764N53549k54086
39940B1401031N44935Q32691k91052n57599J246573K682942J576971k36824J33344
39931B7333012J907673K121740Q77702J491078N015221Q063409P716426N682627
39923F0208888M909274M358587J024066l894093n469445k404456N16586p03233
39915E8546174l879108m916593l860726k885119j266666K810077P215796P704357
39907E9468192M106818R6500k739514n830277q813903r002276o380517m272986
39899B6632037l969509l369711j985379k128707l597383k694160J128033L170686
$$ plain form
39891 13185907 14242140 13123556 13143384 14372985 13180419 8903457 5732780 6551909
39883 6551909 9508816 12175764 14532976 16063528 14566043 10280733 6976538 6464918
39875 6464918 6289944 5495759 7845301 15416204 23384107 26067495 24803667 24644721 25856198
39866 25856198 24205226 18114045 10329852 3490082 -1177122 -1702830 3047735 9986849
39858 9986849 14590238 16733282 19275083 21632937 20357483 16150748 14137001 15766280
39850 15766280 16376319 13117164 9624494 9514911 10459375 9088749 7424741 9163015
39842 9163015 12671007 13438201 11829604 12708264 17722746 23271547 26755855 29870251
39834 29870251 33777372 35170183 30402617 21447974 14686460 14259381 18500764 22663710
$$ packed form
39891A3185907J056233j118584J9828J229601j192566m276962l170677Q19129
39883F551909K956907K666948K357212J530552j497485m285310l304195n11620
39875F464918j74974p94185K349542P570903P967903K683388j263828j58946J211477
39866B5856198j650972o091181p784193o839770m667204n25708M750565O939114
39858I986849M603389K143044K541801K357854j275454m206735k013747J629279
39850A5766280O10039l259155l492670j09583R44464j370626j664008J738274
39842I163015L507992P67194j608597Q78660N014482N548801L484308L114396
39834B9870251L907121J392811m767566q954643o761514m27079M241383M162946
$$ plain form
39826 22663710 23700658 22265290 21004148 21374540 22179626 21354636 18837196 16719620
39818 16719620 16405314 16868301 16659077 16636568 19014939 23719159 27411302 27119613 23812721
39809 23812721 21081488 20753580 21250207 20319283 17925000 15794311 15188036 15951333 17040987
39800 17040987 17289870 16332641 15367267 16154812 18644666 20709543 21084047 21145784 22403730
39791 22403730 23758353 23454287 22658900 24296816 28562942 32342578 33353152 32180490
39783 32180490 29608407 24899993 18434188 13754511 14512259 20099225 26004150 28295413
39775 28295413 26971157 25322071 26370129 29331236 29799782 24837311 17710579 15279619
39767 15279619 19950038 26518925 28396369 25004081 21328996 21805984 26561940 32501612
$$ packed form
39826B2663710J036948j435368j261142L70392Q05086q24990k517440k117576
39818A6719620l14306M62987k09224k2509K378371M704220L692143k91689l306892
39809B3812721k731233l27908M96627r30924k394283k130689o06275P63297J089654
39800A7040987K48883r57229r65374P87545K489854K064877L74504O1737J257946
39791B2403730J354623l04066p95387J637916M266126L779636J010574j172662
39783C2180490k572083m708414o465805m679677P57748N586966N904925K291263
39775B8295413j324256j649086J048058K961107M68546m962471p126732k430960
39767A5279619M670419O568887J877444l392288l675085M76988M755956N939672
$$ plain form
39759 32501612 36187937 36311503 34646975 33867219 33785138 31484072 26251440 22039875 22851432
39750 22851432 27495074 31341973 31718660 29113212 24914202 21242468 21477985 26764506
39742 26764506 32393639 31859142 25000428 18349721 16652080 17936196 18348274 17802982
39734 17802982 18158715 18949460 18377073 16776364 15896981 15712971 14801664 13419605 13586124
39725 13586124 16038688 19223623 21539840 22704044 22494268 20060920 15650755 11791190
39717 11791190 11177322 13513440 15638879 15172686 13132599 12097527 12475540 12284960 10866516
39708 10866516 10707123 13938309 18516642 20399292 19009983 17750249 18652580 19304253
39700 19304253 16558947 11204232 6944259 6021172 7818101 10940776 14479023 17295498
$$ packed form
39759C2501612L686325J23566j664528p79756q2081k301066n232632m211565Q11557
39750B2851432M643642L846899L76687k605448m199010l671734K35517N286521
39742B6764506N629133n34497o858714o650707j697641J284116M12078n45292
39734A7802982L55733P90745n72387j600709q79383j84010r11307j382059J66519
39725A3586124K452564L184935K316217J164204k09776k433348m410165l859565
39717A1791190o13868K336118K125439m66193k040087j035072L78013j90580j418444
39708A0866516j59393L231186M578333J882650j389309j259734R02331O51673
39700A9304253k745306n354715m259973r23087J796929L122675L538247K816475
$$ plain form
39692 17295498 18180293 17611148 18103540 21534754 26400219 28861101 27010681 23379638
39684 23379638 22203825 24505621 27349494 28134134 27484120 26672747 24629824 20307476
39676 20307476 16307220 16238683 18879495 19152778 15508264 12004790 11531219 11512594 9293492
39667 9293492 7579760 10005979 14182536 14524351 10741600 8136451 9399175 11193088
39659 11193088 10061917 7154877 4935844 3027410 322716 -1450568 331926 4931628
39651 4931628 8747800 9565024 8168595 6201370 4576187 4109166 5805609 9604358
39643 9604358 13625812 15411848 14026361 11063004 9510149 10986037 13862389 14914382
39635 14914382 13252388 11568754 12519130 14846943 14849867 11591001 8715212 9997767 14290794
$$ packed form
39692A7295498Q84795n69145M92392L431214M865465K460882j850420l631043
39684B3379638j175813K301796K843873P84640o50014q11373k042923m322348
39676B0307476m000256o8537K640812K73283l644514l503474m73571j8625k219102
39667I293492j713732K426219M176557L41815l782751k605149J262724J793913
39659A1193088j131171k907040k219033j908434k704694j773284J782494M599702
39651D931628L816172Q17224j396429j967225j625183m67021J696443L798749
39643I604358M021454J786036j385487k963357j552855J475888K876352J051993
39635A4914382j661994j683634R50376K327813K924l258866k875789J282555M293027
$$ plain form
39626 14290794 16681344 14623590 11097989 10575343 13146976 14730390 12877017 9902118
39618 9902118 9145067 10256972 10423125 9082492 8671968 10618229 13017948 13161142 10675185
39609 10675185 7245861 4533624 3271147 3333980 3785808 3662411 3417901 4798620 8648322
39600 8648322 13569438 17213367 18104753 16036159 12023920 8392376 7359090 8581262
39592 8581262 9412160 8424459 7013059 6370602 5016064 1509606 -2128122 -2651311 -281003
$$ packed form
39626A4290794K390550k057754l525601n22646K571633J583414j853373k974899
39618I902118p57051J111905J66153j340633m10524J946261K399719J43194k485957
39609A0675185l429324k712237j262477O2833M51828j23397k44510J380719L849702
39600H648322M921116L643929Q91386k068594m012239l631544j033286J222172
39592H581262Q30898r87701j411400o42457j354538l506458l637728n23189K370308
$$ [...]
##END NTUPLES=NMR SPECTRUM
##END=
