##TITLE=31Pdec_DE-135rm__1d
, 24 sc
 20.3.2026
##JCAMPDX= 6.0         $$ Bruker NMR JCAMP-DX V2.0
##DATA TYPE= NMR SPECTRUM
##DATA CLASS= NTUPLES
##ORIGIN= UXNMR, Bruker Analytische Messtechnik GmbH
##OWNER= root
$$ XWIN-NMR		Version 3.5
$$ Fri Mar 20 13:29:36 2026 Russian Standard Time (UT+4h)  she@DPX200
##.OBSERVE FREQUENCY= 81.013821
##.OBSERVE NUCLEUS= ^31P
##.ACQUISITION MODE= SIMULTANEOUS
##.ACQUISITION SCHEME= undefined
##.AVERAGES= 24
##.DIGITISER RES= 17
##SPECTROMETER/DATA SYSTEM= spect
##.PULSE SEQUENCE= zgpg30
##.SOLVENT NAME= CDCl3
##.SHIFT REFERENCE= (INTERNAL, CDCl3, 0, 197.392)
##AUDIT TRAIL= $$ (NUMBER, WHEN, WHO, WHERE, WHAT)
$$ ##TITLE= Audit trail, XWIN-NMR		Version 3.5
$$ ##JCAMPDX= 5.01
$$ ##ORIGIN= Bruker BioSpin GmbH
$$ ##OWNER= she
$$ F:/spectra/data/she/nmr/P31/2/pdata/1/auditp.txt
$$ ##AUDIT TRAIL=  $$ (NUMBER, WHEN, WHO, WHERE, WHAT)
(   1,<2026-03-20 13:28:16.70 +0400>,<she>,<DPX200>,
      <created by zg, POWCHK disabled, PULCHK disabled
       configuration hash MD5:
       00 E9 B6 7A A2 85 ED C7 34 08 36 98 17 FE 4E 26
       data hash MD5: 32K
       42 69 EE 6C C7 41 0C B8 51 96 4E 88 68 29 75 B1>)
(   2,<2026-03-20 13:28:33.73 +0400>,<she>,<DPX200>,
      <Start of raw data processing
       efp BC_mod = 2 LB = 1.5 FT_mod = 6 PKNL = 1 PHC0 = 1393.69 PHC1 = 58.10066 SI = 64K 
       data hash MD5: 64K
       2C F2 8A A2 84 85 59 E3 70 4E 87 B8 88 A0 F3 9C>)
(   3,<2026-03-20 13:29:00.21 +0400>,<she>,<DPX200>,
      <pk PHC0 = -4.399862 PHC1 = 7.799999 
       data hash MD5: 64K
       24 70 07 E3 7E 62 A3 D5 4F 92 7C 44 CC EE 29 FE>)
(   4,<2026-03-20 13:29:07.14 +0400>,<she>,<DPX200>,
      <abs ABSG = 5 
       data hash MD5: 64K
       82 E7 DC 5A ED 59 0E 5C C6 E7 C5 95 C4 92 2A EF>)
$$ ##END=
$$ 
$$ hash MD5
$$ 6A BC A1 2D 5B 02 E0 95 A5 9F BA 33 0A 7F 53 42
##$RELAX= 
##$RELAX= 
##$RELAX= 
##$RELAX= 
##$RELAX= 
##$RELAX= 
##$RELAX= 
##$RELAX= 
$$ Bruker specific parameters
$$ --------------------------
##$DU= <F:/spectra>
##$EXPNO= 2
##$NAME= <P31>
##$PROCNO= 1
##$TYPE= <nmr>
##$USER= <she>
##$AMP= (0..31)
100 100 100 100 100 100 100 100 100 100 100 100 100 100 100 100 100 100 
100 100 100 100 100 100 100 100 100 100 100 100 100 100 
##$AQSEQ= 0
##$AQ_mod= 1
##$AUNM= <au_zg>
##$AUTOPOS= <>
##$BF1= 81.014009
##$BF2= 200.13
##$BF3= 200.13
##$BF4= 200.13
##$BF5= 200.13
##$BF6= 200.13
##$BF7= 200.13
##$BF8= 200.13
##$BYTORDA= 1
##$CFDGTYP= 0
##$CFRGTYP= 5
##$CHEMSTR= <none>
##$CNST= (0..31)
1 1 145 1 1 1 1 1 1 1 1 1 1 1 1 1 1 1 1 1 1 1 1 1 1 1 1 1 1 1 1 1 
##$CPDPRG= <waltz16>
##$CPDPRG1= <>
##$CPDPRG2= <waltz16>
##$CPDPRG3= <>
##$CPDPRG4= <mlev>
##$CPDPRG5= <mlev>
##$CPDPRG6= <mlev>
##$CPDPRG7= <mlev>
##$CPDPRG8= <mlev>
##$CPDPRGB= <>
##$CPDPRGT= <>
##$D= (0..31)
0 1 0 0 0 0 0 0 0 0.06 0 0.03 2e-05 3e-06 0 0 0.0002 0 0 0 0 0 0 0 0 0 
0 0 0 0 0 0 
##$DATE= 1773998896
##$DBL= (0..7)
120 120 120 11 120 120 24 19 
##$DBP= (0..7)
150 150 150 150 150 150 150 150 
##$DBP07= 0
##$DBPNAM0= <>
##$DBPNAM1= <>
$$ [...]
##$SUBNAM3= <"">
##$SUBNAM4= <"">
##$SUBNAM5= <"">
##$SUBNAM6= <"">
##$SUBNAM7= <"">
##$SUBNAM8= <"">
##$SUBNAM9= <"">
##$SW= 400.765351723535
##$SWIBOX= (0..15)
0 1 3 0 0 0 0 0 0 0 0 0 0 0 0 0 
##$SW_h= 32467.5324675325
##$TD= 32768
##$TD0= 1
##$TE= 0
##$TE2= 300
##$TE3= 300
##$TEG= 300
##$TL= (0..7)
0 120 53 12 22 120 120 120 
##$TP= (0..7)
150 150 150 150 150 150 150 150 
##$TP07= 0
##$TPNAME0= <>
##$TPNAME1= <>
##$TPNAME2= <>
##$TPNAME3= <>
##$TPNAME4= <>
##$TPNAME5= <>
##$TPNAME6= <>
##$TPNAME7= <>
##$TPOAL= (0..7)
0.5 0.5 0.5 0.5 0.5 0.5 0.5 0.5 
##$TPOFFS= (0..7)
0 0 0 0 0 0 0 0 
##$TUNHIN= 0
##$TUNHOUT= 0
##$TUNXOUT= 0
##$USERA1= <user>
##$USERA2= <user>
##$USERA3= <user>
##$USERA4= <user>
##$USERA5= <user>
##$V9= 5
##$VALIST= <valist>
##$VCLIST= <CCCCCCCCCCCCCCC>
##$VD= 0
##$VDLIST= <DDDDDDDDDDDDDDD>
##$VPLIST= <PPPPPPPPPPPPPPP>
##$VTLIST= <TTTTTTTTTTTTTTT>
##$WBST= 1024
##$WBSW= 4
##$XGAIN= (0..3)
0 0 0 0 
##$XL= 0
##$YL= 0
##$YMAX_a= 20732
##$YMIN_a= -29899
##$ZGOPTNS= <>
##$ZL1= 120
##$ZL2= 120
##$ZL3= 120
##$ZL4= 120
##$ABSF1= 197.3918
##$ABSF2= -203.3724
##$ABSG= 5
##$ABSL= 3
##$ALPHA= 0
##$AQORDER= 0
##$ASSFAC= 0
##$ASSFACI= 0
##$ASSFACX= 0
##$ASSWID= 0
##$AUNMP= <proc_1d>
##$AZFE= 0.1
##$AZFW= 0.5
##$BCFW= 0
##$BC_mod= 2
##$BYTORDP= 0
##$COROFFS= 0
##$CY= -3
##$DATMOD= 1
##$DC= 0
##$DFILT= <>
##$DTYPP= 0
##$F1P= 0
##$F2P= 0
##$FCOR= 1
##$FTSIZE= 65536
##$FT_mod= 6
##$GAMMA= 0
##$GB= 0
##$INTBC= 1
##$INTSCL= 9.790993e-09
##$ISEN= 30
##$LB= 1.5
##$LEV0= 0
##$LPBIN= 0
##$MAXI= 10000
##$MC2= 0
##$MEAN= 0
##$ME_mod= 0
##$MI= 50
##$NCOEF= 0
##$NC_proc= -7
##$NLEV= 6
##$NOISF1= 182.463
##$NOISF2= 159.3651
##$NSP= 0
##$NTH_PI= 0
##$NZP= 0
##$OFFSET= 197.3918
##$PC= 4
##$PHC0= 1389.29
##$PHC1= 65.90066
##$PH_mod= 1
##$PKNL= yes
##$PPARMOD= 0
##$PSCAL= 0
##$PSIGN= 0
##$REVERSE= no
##$SF= 81.014063255964
##$SI= 65536
##$SIGF1= 159.3651
##$SIGF2= -187.1042
##$SINO= 113.3802
##$SIOLD= 16384
##$SREGLST= <1H.CDCl3>
##$SSB= 0
##$STSI= 65536
##$STSR= 0
##$SW_p= 32467.5324675325
##$SYMM= 0
##$S_DEV= 0
##$TDeff= 32768
##$TDoff= 0
##$TI= <>
##$TILT= no
##$TM1= 0
##$TM2= 0
##$TOPLEV= 0
##$USERP1= <user>
##$USERP2= <user>
##$USERP3= <user>
##$USERP4= <user>
##$USERP5= <user>
##$WDW= 1
##$XDIM= 65536
##$YMAX_p= 399681206
##$YMIN_p= -33544121
$$ End of Bruker specific parameters
$$ ---------------------------------
##NTUPLES= NMR SPECTRUM
##VAR_NAME=  FREQUENCY,     SPECTRUM/REAL,   SPECTRUM/IMAG
##SYMBOL=    X,             R,               I
##VAR_TYPE=  INDEPENDENT,   DEPENDENT,       DEPENDENT
##VAR_FORM=  AFFN,          ASDF,            ASDF
##VAR_DIM=   65536,         65536,           65536
##UNITS=     HZ,            ARBITRARY UNITS, ARBITRARY UNITS
##FACTOR=    0.49542278885378, 1,            1
##FIRST=     15991.5117654749, 0,            0
##LAST=      -16476.0207020576, 0,           0
##MIN=       -16476.0207020576, -33544121,   0
##MAX=       15991.5117654749, 399681206,    0
$$ Real data points
##PAGE= N=1
##DATA TABLE= (X++(R..R)), XYDATA
65535 -494512 -137378 540017 1442280 1722383 1068254 283086 63605 20422 -402458 -805374
65525 -805374 -541260 34188 49919 -501061 -893696 -938892 -1045026 -1105041 -452697 902625
65515 902625 1997313 2169587 1769655 1356489 1021214 838286 1146394 1880369 2308057
65506 2308057 1970200 1348313 1124648 1275771 1353253 1183895 835920 353553 -13964 206648
65496 206648 986817 1501551 1143632 438136 298924 701765 849412 496917 305557 759399
65486 759399 1388678 1385289 618475 -257979 -556317 -246479 42199 -326168 -1295829 -2123605
65476 -2123605 -2128471 -1323086 -249125 601883 1050325 1120993 923746 570122 66597 -613291
65466 -613291 -1272408 -1504906 -1125126 -422458 149686 383979 335677 172578 140593 413304
65456 413304 803685 890616 610719 413546 588780 770797 455383 -255448 -812011 -939212
65446 -939212 -828091 -734116 -733922 -810755 -910183 -989204 -1183244 -1706103 -2358227 -2455350 -1633187
65435 -1633187 -455000 240265 363670 419421 525452 282557 -369409 -864106 -810296 -541732
65425 -541732 -572248 -921858 -1292260 -1569173 -1819717 -2033400 -2161435 -2227523 -2159934 -1723994
65415 -1723994 -898723 -148997 -23629 -579419 -1437588 -2256615 -2842916 -2938595 -2346258 -1312695
65405 -1312695 -403567 121678 461957 671184 354658 -668197 -1751830 -2019035 -1441773
65396 -1441773 -807888 -661549 -852509 -1173531 -1733232 -2399427 -2561673 -2000320 -1464932
65387 -1464932 -1707323 -2321311 -2322512 -1650815 -1233060 -1572543 -2119568 -2195097 -1783621 -1176470
65377 -1176470 -527324 -54360 -28907 -228257 -28493 594365 811702 156332 -637437 -580159
65367 -580159 321749 1348642 2058777 2312171 1844815 728010 -71384 413414 1736668
65358 1736668 2413781 1807426 853033 709903 1403578 2125903 2301246 1931962 1245408
65349 1245408 419201 -427587 -1161072 -1549867 -1350226 -652666 -4434 112468 -173426
65340 -173426 -407339 -488060 -652239 -899342 -949263 -787656 -751320 -953176 -1044530 -708298
65330 -708298 -73705 472154 630492 327570 -216914 -584445 -618984 -707431 -1242116 -1943181
65320 -1943181 -2192897 -1919627 -1553666 -1174880 -445641 511341 975999 699954 394995
65311 394995 674563 1098953 860546 -1209 -679917 -647503 -81483 582345 1020767 1013642
65301 1013642 493147 -341224 -1152352 -1655297 -1602112 -872637 180389 793780 579515
65292 579515 26948 -171316 -83757 -336472 -1046393 -1533989 -1252461 -568024 -327724 -864375
65282 -864375 -1682462 -2047946 -1692973 -927876 -200541 323486 726432 1024503 1074807 799573
65272 799573 317364 -225240 -790375 -1306715 -1550504 -1365511 -949984 -728150 -856653 -939103
65262 -939103 -368304 944929 2230803 2463105 1430705 38046 -652924 -522330 -286648
65253 -286648 -468414 -871812 -1057433 -920294 -680314 -608442 -874053 -1400510 -1790385 -1652944
65243 -1652944 -1060344 -416393 101089 567679 775894 247322 -950884 -1888610 -1697354
65234 -1697354 -540709 677333 1314889 1367255 1112092 830012 777606 1045562 1427609
65225 1427609 1664269 1772167 1926070 2095416 2035098 1611548 949915 268649 -293846 -701337
65215 -701337 -967447 -1084475 -1000885 -723671 -388833 -97271 248156 750233 1258985 1571523
65205 1571523 1769196 1977784 1905649 1158253 19529 -699146 -738065 -685683 -944632 -1070605
65195 -1070605 -581922 153351 404608 30601 -600536 -1263102 -1859095 -2053422 -1551480
65186 -1551480 -609408 210317 641355 692643 326327 -339643 -780464 -603068 -174934 -180955
65176 -180955 -708665 -1295207 -1705105 -2082140 -2447006 -2615462 -2537786 -2202423 -1346390 143964
65166 143964 1657111 2338646 2146886 1838992 1917230 2177760 2291560 2200774 1879242 1282111
65156 1282111 593532 -7632 -793233 -2074618 -3391287 -3854307 -3357877 -2685354 -2305459
65147 -2305459 -1895612 -1265687 -855901 -911681 -976936 -723863 -574802 -920761 -1341745 -1231592
65137 -1231592 -693899 -210769 121200 411909 469823 156398 -69047 347512 1183803 1686953
65127 1686953 1580777 1291636 1241098 1383772 1422250 1128096 505367 -114690 -299593 -57555
65117 -57555 107722 -81049 -276444 -156135 -15311 -224173 -515356 -417897 -63462 104532
65107 104532 151083 451207 858737 843220 380252 -51597 -338008 -798134 -1323732 -1303820
65097 -1303820 -672837 -253724 -627937 -1281764 -1367474 -847095 -377160 -378176 -677981 -870360
65087 -870360 -649596 63016 1024275 1791741 2098067 1961965 1409393 458332 -480726 -671518
65077 -671518 106840 1120775 1485080 1139263 617014 115564 -649446 -1739921 -2687273
65068 -2687273 -2999849 -2622776 -1810606 -860719 -72558 319354 331854 183675 -16922 -348176
65058 -348176 -775170 -1012016 -853340 -498742 -354262 -533032 -663618 -225042 910321
65049 910321 2230108 2942132 2704869 1948683 1298260 757070 -179804 -1522542 -2369745
65040 -2369745 -1938285 -769809 -289896 -1049378 -1950154 -1606869 -130992 996537 769409
65031 769409 -200234 -610987 -102363 509369 449685 -116187 -560771 -730025 -985265 -1461457
65021 -1461457 -1743837 -1412892 -604052 190373 673788 859024 809326 619597 597622 1047146
65011 1047146 1757324 2077398 1705800 1069353 638074 219746 -592198 -1513092 -1757208
65002 -1757208 -1157264 -471330 -359986 -615948 -767352 -927347 -1448772 -2037908 -1954535 -1136246
64992 -1136246 -468174 -638162 -1185767 -1126622 -292869 421312 168699 -857516 -1688445
64983 -1688445 -1609173 -726861 341731 1064200 1240037 903259 182132 -781455 -1878810
64974 -1878810 -2977615 -3779493 -3856903 -2982628 -1380360 461773 2149872 3439920 4109834
64965 4109834 4089286 3696077 3421928 3393166 3288390 2863044 2279171 1787606 1353309 784528
64955 784528 19813 -892683 -1878865 -2683862 -2846298 -2127210 -891825 143322 491858
64946 491858 142272 -573085 -1176078 -1322057 -1117870 -994336 -1072330 -921716 -231188 596790
64936 596790 961304 923688 986117 1138919 800628 -196962 -1187486 -1495443 -1193872 -733649
64926 -733649 -256881 304523 755749 768747 429863 278178 701876 1446775 1776260 1126942
64916 1126942 -282309 -1482891 -1599154 -747927 79806 91920 -586770 -1326247 -1754005
64907 -1754005 -1873852 -1744812 -1408274 -993396 -613300 -273143 -69469 -230719 -674272
64898 -674272 -820572 -290391 441451 630965 354489 367171 898290 1337909 1305788 1242528
64888 1242528 1486674 1476421 597950 -639926 -1138331 -719674 -248693 -244757 -248136 177673
64878 177673 603205 388505 -370808 -1094849 -1524073 -1738392 -1693703 -1327686 -930028 -820574
64868 -820574 -762785 -261817 614145 1286078 1505009 1496019 1223106 289369 -1133529 -2012263
64858 -2012263 -1627367 -521610 290326 603762 847414 994972 521596 -590335 -1601967
64849 -1601967 -1964159 -1888122 -1734403 -1419468 -808988 -227303 -65322 -154137 -57397 128482
64839 128482 -177871 -1085563 -1800205 -1488607 -333695 661023 853962 547462 302106
64830 302106 119628 -324158 -927674 -1189345 -937849 -504480 -84994 521314 1306488 1719479
64820 1719479 1329874 429924 -417081 -1032626 -1387760 -1167755 -224139 840864 1248956
64811 1248956 1013265 641167 113679 -935814 -2115220 -2422525 -1729361 -1107603 -1268198
64802 -1268198 -1645577 -1625835 -1716552 -2550838 -3421637 -2975359 -1143182 624611 1049430
64793 1049430 148539 -1324921 -2727618 -3608416 -3666313 -3057299 -2411786 -2269662 -2640140
64784 -2640140 -3121918 -3224709 -2680043 -1790401 -1349454 -1768871 -2402938 -2288382 -1456194
64775 -1456194 -815392 -748387 -708918 -454624 -687206 -1816158 -2910518 -2864214 -2141061 -2249771
64765 -2249771 -3553177 -4660460 -4275640 -2788945 -1545238 -1176868 -1286548 -1367846 -1309561
64756 -1309561 -1082259 -592561 -32876 82798 -454793 -1107685 -1071556 -160189 971759
64747 971759 1492526 1167572 472429 42259 63829 178463 -57302 -647111 -1134230 -1124640
64737 -1124640 -765181 -596343 -913711 -1376977 -1346676 -582333 489242 1219819 1361066
64728 1361066 1166627 940578 634693 -37922 -1156772 -2344163 -2977404 -2683499 -1712607
64719 -1712607 -820815 -619701 -935806 -955022 -163781 980278 1540496 1164525 357344
64710 357344 -272347 -668155 -1139058 -1873513 -2821798 -3753532 -4214910 -3743223 -2445990
64701 -2445990 -1145142 -600661 -715765 -780044 -343811 413524 995022 984705 362867 -278957
64691 -278957 -165132 602580 804698 -428356 -2226769 -2909474 -2159042 -1285882 -1245255
64682 -1245255 -1471459 -1086866 -261284 326213 595542 811704 798750 307346 -174719 131753
64672 131753 1150326 1976719 2005727 1411719 578374 -297236 -1000009 -1306612 -1355437 -1567226
64662 -1567226 -2063601 -2490281 -2480494 -2023542 -1383182 -882378 -659373 -412989 343898 1439093
64652 1439093 1831355 830727 -766274 -1505624 -1104138 -655539 -1027271 -1905496 -2589908
64643 -2589908 -2871472 -2746419 -2021673 -781021 248470 361081 -343740 -1174473 -1539486
64634 -1539486 -1161181 -24616 1466214 2579032 2922811 2847057 2862730 2897871 2504132
64625 2504132 1659625 969236 994961 1547531 1723081 734618 -1174232 -2789644 -3167644
64616 -3167644 -2658544 -2313986 -2491217 -2690725 -2688517 -2955898 -3713053 -4374585 -4366782 -3832194
64606 -3832194 -3095063 -2123527 -1054894 -543695 -866556 -1263196 -969659 -431623 -616902
64597 -616902 -1469051 -1962753 -1518488 -514338 487520 1197502 1355444 865822 224704
64588 224704 100468 462075 755031 815894 830370 528966 -555475 -1954205 -2460414 -1765244
64578 -1765244 -920740 -792393 -1035320 -1110819 -1271608 -1720700 -1684606 -427155 1314328
64569 1314328 2004906 1251449 164998 -134853 423612 1267800 1836666 1704276 750097
64560 750097 -510804 -1231545 -1109817 -651275 -456495 -598233 -822389 -1003150 -1186381
64551 -1186381 -1401580 -1593557 -1619226 -1292572 -623621 -15703 19138 -594951 -1419098 -1983439
64541 -1983439 -2157805 -2055775 -1828421 -1609296 -1439390 -1171851 -629458 109706 781218
64532 781218 1305689 1836484 2364742 2558309 2178831 1459967 844004 450931 48003 -452686
64522 -452686 -683835 -181583 945891 1857422 1683756 446491 -898233 -1473649 -1385835
64513 -1385835 -1388127 -1765406 -1920820 -1159639 420364 2023100 2955552 3127713 2883782
64504 2883782 2598902 2448053 2350264 2030239 1261581 190163 -644840 -786846 -383694
64495 -383694 -58043 -167569 -395729 -280058 51363 42394 -458237 -975801 -1109317 -1003514
64485 -1003514 -927162 -836959 -682416 -709642 -1002196 -1074580 -479060 436531 974795 1098104
64475 1098104 1338107 1842603 2268318 2562715 2949017 3001854 1776278 -628105 -2534198
64466 -2534198 -2522834 -1214353 -392843 -798712 -1701236 -2368778 -2873837 -3332197 -3348958 -2721312
64456 -2721312 -2060902 -2126673 -2831172 -3402226 -3407621 -3173743 -3116209 -3010091 -2250283 -797032
64446 -797032 495731 767581 181892 -307356 -120519 510978 1245087 2047088 2655973
64437 2655973 2424834 1298879 335641 491457 1355824 1905555 2063416 2486900 3122401
64428 3122401 3192887 2591755 2033689 1645037 702283 -823925 -1800671 -1720631 -1701445 -2686655
64418 -2686655 -3757620 -3567223 -2610288 -2438786 -3020971 -2671278 -807507 860338 632027
64409 632027 -877872 -1711236 -1118582 -116846 180335 -208448 -685614 -1066270 -1520788
64400 -1520788 -1884626 -1658138 -814434 -112364 -185700 -640198 -702215 -630604 -1556459 -3627402
64390 -3627402 -5275825 -5088024 -3698453 -2862683 -3117600 -3465412 -3151473 -2544504 -2153450
64381 -2153450 -1919657 -1842287 -2301175 -3218439 -3706492 -3170728 -2162127 -1563713 -1458019
64372 -1458019 -1370602 -1150100 -958478 -718619 -200431 509016 1088205 1370579 1313647 861971
64362 861971 202488 -204502 -302192 -752745 -1972500 -3182737 -3199884 -2056927 -1023955
64353 -1023955 -908723 -1107023 -666656 353007 1106773 1126816 636383 -133581 -1271073
64344 -1271073 -2650722 -3599402 -3539740 -2756943 -2070126 -1794816 -1523936 -1027713 -793424
64335 -793424 -1295196 -2184139 -2743429 -2849351 -2898318 -3014852 -3004462 -2950453 -3099611 -3165428
64325 -3165428 -2539314 -1317939 -346511 -38804 81115 416979 695904 673725 618677 639400
64315 639400 352113 -245944 -433273 14949 128767 -822287 -1950203 -1902098 -840453
64306 -840453 -82984 -124360 -272432 -135480 -206316 -768479 -1280438 -1218519 -764582 -323947
64296 -323947 44929 453998 895388 1280768 1427777 1064936 241254 -471550 -676202 -743017
64286 -743017 -1080584 -1210017 -450149 767342 1312439 955155 469821 215914 -161380
64277 -161380 -506425 40064 1569412 2894158 3078468 2510874 1914262 1252942 263236
64268 263236 -797755 -1624224 -2352049 -2974378 -3017053 -2410685 -1926852 -2090144 -2396714 -2273977
64258 -2273977 -2011549 -1967180 -1671031 -676585 398104 732776 647633 995944 1670350 1864706
64248 1864706 1518997 1310472 1301991 746285 -638120 -2155110 -3101294 -3474493 -3516239 -3204431
64238 -3204431 -2420183 -1176447 353884 1635241 1789385 460243 -1417292 -2378478 -1991082
64229 -1991082 -1111732 -643896 -663403 -777582 -722441 -496923 -365615 -704709 -1392292 -1531757
64219 -1531757 -426881 1266703 2061969 1292711 -405089 -2143282 -3461531 -3967792 -3352393
64210 -3352393 -2147227 -1618079 -2351035 -3526442 -4041416 -3779724 -3290859 -2793246 -2168953
64201 -2168953 -1590011 -1434293 -1656840 -1795532 -1625886 -1386814 -1288996 -1171618 -841686 -534372
64191 -534372 -775676 -1803234 -3298717 -4714667 -5653998 -5836511 -5042704 -3487718 -2004089
64182 -2004089 -1243296 -764564 363772 2004774 2897309 2468621 1706410 1576047 1511951
64173 1511951 467686 -1240471 -2292444 -2131654 -1248710 -45442 1369970 2429647
64165 2429647 2414720 1595551 970351 786528 397066 -325988 -610975 -90171 609976 943533
64155 943533 1110364 1271476 1083738 480641 32063 45555 92763 -154494 -391877 -374358
64145 -374358 -383090 -655701 -1082486 -1677443 -2490543 -2919702 -2214607 -901624 -435952 -1055819
64135 -1055819 -1403772 -851096 -593346 -1478651 -2348597 -1939797 -1095725 -1394976 -2543815
64126 -2543815 -2921797 -2113558 -1155029 -605906 -47069 607674 843302 709340 965510
64117 965510 1849634 2694935 2886142 2363939 1230480 -327567 -1849887 -3095756 -4429883
64108 -4429883 -5910217 -6489915 -5219079 -2850752 -1084840 -547454 -674998 -1102912 -1691530
64099 -1691530 -1565429 83667 2249547 2927055 1871916 843289 813643 775892 -81631
64090 -81631 -853470 -571807 158167 380368 457241 1282643 2673467 3638995 3633307 2722843
64080 2722843 1181974 -349302 -1024121 -820026 -738090 -1404242 -2269783 -2711150 -2897340
64071 -2897340 -2923438 -2268149 -1004089 -353371 -920866 -1501438 -939952 -103609 -471366
64062 -471366 -1689258 -2286459 -2129886 -2239377 -2570488 -2056338 -872615 -635185 -1907144
64053 -1907144 -3258932 -3425782 -2868762 -2481101 -2161258 -1568151 -1098846 -1100817 -1015324 -257449
64043 -257449 795209 1550596 2186074 2947386 3170066 2143919 528494 -270947 4835
64034 4835 299581 13907 -124949 652950 1845459 2281274 1613235 603128 38021 -131846
64024 -131846 -431964 -942801 -1090333 -465496 350674 139253 -1622246 -3984100 -5346335
64015 -5346335 -5033931 -3880034 -3259831 -3723412 -4610649 -4834280 -3923473 -2395772 -1251006
64006 -1251006 -1085860 -1578009 -1810103 -1209285 -202901 204960 -403936 -1331425 -1623434
63997 -1623434 -1257763 -1036256 -1327887 -1494004 -845963 289861 962942 842342 552987
63988 552987 763061 1342165 1554303 854740 -593488 -2034018 -2704843 -2464264 -1888284
63979 -1888284 -1676664 -1988309 -2429272 -2577277 -2339447 -1859900 -1307963 -831377 -599072
63970 -599072 -774640 -1381780 -2161018 -2647997 -2550546 -2021767 -1403640 -789257 -111755 420752
63960 420752 421921 -67962 -516515 -596887 -532615 -575078 -598434 -436833 -133622 390301 1316830
63949 1316830 2219309 2078345 636580 -865951 -1094236 -295498 253568 49433 -374257
63940 -374257 -696732 -1181972 -1790441 -2006771 -1792195 -1786645 -2246482 -2589617 -2362967 -1958190
63930 -1958190 -1974241 -2454174 -3093387 -3655482 -3870135 -3456669 -2577809 -1820100 -1495497 -1411719
63920 -1411719 -1414478 -1522201 -1427689 -701466 236662 267105 -806389 -1641130 -1040257 469840
63910 469840 1485537 1487520 910151 32796 -1153091 -2235208 -2537949 -2005521 -1205545
63901 -1205545 -460774 402596 1474955 2497519 3189943 3299885 2541040 1002025 -495881
63892 -495881 -1073422 -808925 -541743 -726372 -1069260 -1262459 -1396352 -1514634 -1379799 -944871
63882 -944871 -597331 -642207 -835190 -647376 189632 1479116 2681314 3194540 2748134
63873 2748134 1622652 424096 -305731 -275865 408147 1100720 1031613 211871 -467779
63864 -467779 -437418 -244893 -572599 -1019493 -772279 -104347 -58607 -705035 -913092 -101426
63854 -101426 899323 1210828 1189418 1718665 2948275 4366595 5512688 5974509 5237659
63845 5237659 3297016 1100358 -287990 -784733 -1050599 -1397212 -1453929 -774871 649573
63836 649573 2347146 3519578 3509447 2470632 1305202 618556 133109 -485434 -811777
63827 -811777 -391719 185142 -57243 -896768 -1032387 52008 1315596 1675241 1475412
63818 1475412 1790205 2799919 3635265 3639100 3072346 2482354 1909137 1003555 -322677
63809 -322677 -1647281 -2386324 -2238577 -1342771 -210499 451705 136562 -934553 -1757469
63800 -1757469 -1396845 -7419 1272223 1558601 1042995 432307 24578 -261005 -309739
63791 -309739 100750 730401 1001800 794482 619927 839786 1153693 1122671 846466 777233
63781 777233 1054676 1363605 1415262 1317008 1375505 1629068 1720613 1355706 816580 710986
63771 710986 1087230 1195797 495108 -473956 -802486 -530400 -443638 -631077 -247602 998967
63761 998967 2127803 2278481 1981255 2191752 2750405 2871518 2691316 3048064 3845113
63752 3845113 3980993 3161576 2512357 2815080 3247032 2717963 1583068 985889 1083516
63743 1083516 1055534 585360 201040 164520 77511 -207773 -213610 270999 696780 600934
63733 600934 318991 358159 572098 493629 109746 -220979 -357429 -412782 -421173 -399900 -553318
63722 -553318 -999028 -1439572 -1462159 -994143 -157615 1020448 2312370 3028339 2677232
63713 2677232 1731127 1095643 909167 570125 -11978 27161 1381153 3558740 5355633
63704 5355633 5971233 5413594 4207279 3030917 2355570 2131162 1966795 1703713 1541706
63695 1541706 1569794 1603371 1613844 1835249 2214500 2243085 1673323 991539 819119 1203712
63685 1203712 1844240 2619282 3460018 4026382 3978911 3385017 2544501 1676627 1022023 816732
63675 816732 814552 341735 -705729 -1453152 -1207027 -450160 45097 482338 1421845 2396118
63665 2396118 2415330 1660464 1321631 1676013 1701009 935962 361898 764460 1419186 1321005
63655 1321005 796343 865745 1649277 2416319 2788328 2966413 3074504 3118214 3351405 3920879
63645 3920879 4394915 4388571 4381751 5099327 6305868 7100856 7270199 7406701 7721964 7734166
63635 7734166 7284850 6919155 6985902 7254640 7769458 9132080 11333914 13136255 13465470
63626 13465470 12917726 13017508 14275173 15824090 16854436 17508713 18169720 18658803 18698496
63617 18698496 18775128 19877916 22314187 25245871 27716606 29917135 32995663 37627071
63609 37627071 43338846 49577458 56890824 66344512 78080184 91489274 107047989 127061601
63601 127061601 153953959 188267069 228666420 272974624 318002041 358531941 387757351
63594 387757351 399681206 391530001 364613669 323827183 276273125 229048397 187008853
63587 187008853 152076188 124315874 103107383 87211245 74638435 63523125 53296337
63580 53296337 44580888 37878181 32753496 28422912 24704851 21988949 20388743 19326138
63572 19326138 18092750 16591136 15289057 14516123 14044443 13402515 12395728 11204843
63564 11204843 10132405 9397671 9043648 8856237 8462675 7701405 6818680 6088272 5323001
63555 5323001 4084295 2432769 1176835 1188472 2582941 4638331 6360195 7069680 6710117
63546 6710117 5848180 5302180 5524644 6259517 6851150 6895792 6574749 6389800 6607070 6953676
63536 6953676 6886601 6179396 5139793 4170366 3317108 2509187 2041714 2299585 2950373
63527 2950373 2981048 1847689 147666 -1237504 -2225617 -3178089 -3823665 -3430246 -2104192
63518 -2104192 -1015394 -848541 -687152 803325 3347726 5040339 4525274 2595578 1215751
63509 1215751 1312304 2072820 2329985 1986314 1759847 2016983 2479721 2915613 3388636 3687358
63499 3687358 3224475 1939293 727818 382982 553350 443327 129497 256177 685112
63490 685112 627176 195134 547815 2019813 3309707 3311639 2688428 2592013 2774255 2337585
63480 2337585 1673915 1979500 3067322 3423519 2672237 2288632 3214927 4288542 4056521
63471 4056521 2949659 2418382 2754066 3074169 2941621 2711903 2528300 2154877 1739269
63462 1739269 1715112 1964389 2016363 2048169 2702282 3844080 4487772 4141291 3316016 2516429
63452 2516429 1674660 840556 422953 349267 -19537 -651228 -571928 493054 1275761 728589
63442 728589 -282363 -233761 793760 1448076 1270764 1098539 1413027 1693561 1595197 1499032
63432 1499032 1519059 1108975 194302 -311714 171622 826760 457868 -926842 -2213247
63423 -2213247 -2493394 -1754340 -621286 100729 -31976 -581529 -583946 224187 995350 986276
63413 986276 586497 517009 575478 37228 -1060469 -1979083 -2456166 -2866874 -3203880 -2861442
63403 -2861442 -1688621 -434335 256170 651412 1310933 2169451 2725409 2799825 2644597
63394 2644597 2466581 2201331 1711809 1033442 446520 270942 429791 361387 -281723 -989799
63384 -989799 -992866 -439320 -250745 -657018 -704533 333580 1795446 2528180 2371845 1989715
63374 1989715 1664145 1154362 534213 248676 318480 307002 190054 463761 1143265 1410038
63364 1410038 679870 -571211 -1517119 -2013817 -2389913 -2636955 -2475624 -2005083 -1607867
63355 -1607867 -1261429 -600530 245603 536137 -46351 -765922 -704025 88941 848854 1273140
63345 1273140 1758582 2437383 2703248 2076370 1024060 407491 440509 719441 989783
63336 989783 1227808 1160008 521990 -194370 -152326 444267 332160 -940056 -2059516 -1702578
63326 -1702578 -470842 32633 -443763 -675582 -42580 624132 512291 -71382 -544765
63317 -544765 -931737 -1265285 -1035774 -36828 944309 1113905 790382 724600 849706 660854
63307 660854 415998 851693 1859451 2534052 2582280 2653530 3087094 3336312 3006082 2554531
63297 2554531 2451382 2421150 2117664 1844441 1881082 1688214 667967 -643898 -1074562
63288 -1074562 -380926 541033 1019587 1317994 1788336 2135748 1972480 1515631 1227447
63279 1227447 1167016 1157132 1225155 1385455 1323752 874579 531724 801842 1256208 1079493
63269 1079493 538471 863862 2319631 3442528 2993097 1824020 1662780 2510821 2632692
63260 2632692 1175210 -539292 -836166 253115 1469059 2033185 2003682 1500966 573135
63251 573135 -382740 -912545 -1144304 -1443312 -1556748 -883940 404947 1330067 1359241 1005031
63241 1005031 934026 1137840 1301402 1383867 1422074 1264502 952050 936369 1427078 1850034
63231 1850034 1467741 342733 -747430 -1183200 -911517 -205026 509177 698592 105504
63222 105504 -866891 -1485809 -1436555 -985446 -471144 4509 361402 393801 16482 -533079
63212 -533079 -884430 -859718 -579385 -308011 -189050 -111612 79853 267751 196768 -9359
63202 -9359 173176 931103 1705553 1900399 1702005 1697519 1901135 1789836 1250631 803172
63192 803172 724127 588359 25505 -568212 -552789 -7957 289724 -210197 -1245109 -2075735
63182 -2075735 -2233760 -1945631 -1886097 -2450134 -3270783 -3601522 -3122905 -2090375 -730592
63173 -730592 1001883 2863366 4047859 3983129 3136772 2511269 2448653 2421688 1972954 1339932
63163 1339932 1009410 1070202 1240719 1251570 956747 266783 -767210 -1883711 -2810855
63154 -2810855 -3486424 -3947881 -4087018 -3710352 -2866779 -1963306 -1443688 -1369321 -1386729 -1147596
63144 -1147596 -729991 -559055 -879477 -1411931 -1651151 -1443302 -1099565 -942658 -948567 -922441
63134 -922441 -820231 -696640 -474065 -46963 411488 570582 473897 619614 1231205 1696858
63124 1696858 1181126 -254002 -1610351 -2125150 -1973252 -1548310 -635458 1054398 2869355
63115 2869355 3618456 3068412 2255099 2020803 1978407 1419057 560144 108602 49697 -158844
63105 -158844 -385602 72349 1033892 1223408 112051 -966224 -462581 1227138 2327301
63096 2327301 2102382 1505977 1342811 1053496 -50752 -1321682 -1525452 -577814 454837
63087 454837 925872 1246738 1860635 2437285 2469595 2053893 1594145 1136321 485041 -279526
63077 -279526 -875253 -1264768 -1606626 -1849062 -1783077 -1483970 -1319835 -1474257 -1778139 -2049121
63067 -2049121 -2255832 -2272068 -1858778 -1110187 -602672 -765444 -1246843 -1228233 -365393 814832
63057 814832 1515094 1512495 1297592 1413071 1781614 1829064 1284419 635519 565989 1065705
63047 1065705 1432863 1163567 482266 -115552 -473092 -693555 -778909 -678341 -468095 -140015
63037 -140015 572687 1731051 2715663 2775351 2083872 1696910 2238299 3068517 3056618 1838929
63027 1838929 -22 -1659583 -2593869 -2494569 -1410202 23566 910837 888463 407446
63018 407446 117036 154365 137501 -324585 -1241947 -2243755 -2893564 -3099319 -3179770 -3337297
63008 -3337297 -3163421 -2096828 -456636 527285 106674 -975196 -1415795 -1028877 -808893
62999 -808893 -1377005 -2096861 -1963299 -784721 845780 2268599 3046645 2951642 2182732
62990 2182732 1397385 1077967 980167 553107 -259326 -1016729 -1426168 -1548763 -1425881 -925464
62980 -925464 687 1198232 2414068 3268801 3312049 2526401 1644016 1454719 1851233
62971 1851233 2093607 1973714 2016838 2367469 2231949 937788 -923569 -2002974 -1690107
62962 -1690107 -683182 -95152 -258193 -473095 91114 1283335 2009175 1613762 843572
62953 843572 829661 1413300 1435349 676121 331344 1131403 2111833 2044060 1177969 577460
62943 577460 426168 113411 -450325 -740313 -594612 -270237 229196 857895 876894 -236728
62933 -236728 -1397027 -914296 939231 1908018 812317 -847367 -1183993 -468167 -166928
62924 -166928 -491523 -439121 213091 472427 -295819 -1544570 -2480865 -2887212 -2776347 -2061615
62914 -2061615 -960056 -128348 17876 -234311 -397639 -451767 -751416 -1463400 -2289215
62905 -2289215 -2659960 -2189856 -1116032 -285226 -440459 -1407763 -2159393 -1808988 -493237
62896 -493237 763961 1028650 321313 -467191 -549665 -39577 400072 540252 735702 1049050
62886 1049050 882220 -105044 -1229517 -1542854 -1035116 -448286 -128146 199386 575346
62877 575346 527786 -156629 -1017369 -1572527 -1896235 -2237424 -2482016 -2359967 -1912326 -1428465
62867 -1428465 -1088995 -874910 -629929 -56912 1061328 2406917 3186308 2978196 2306767
62858 2306767 1985058 2036881 1762894 918428 284745 675416 1655039 1831749 569490
62849 569490 -1053560 -1428380 -346577 804403 809463 -22780 -596684 -568341 -521357 -867956
62839 -867956 -1300226 -1404341 -1237672 -1072437 -968601 -839953 -669796 -469509 -229847 -33346
62829 -33346 -2844 -44317 140261 689747 1414815 2025889 2347713 2355644 2235163 2269886 2311927
62818 2311927 1588348 -308117 -2310788 -2664782 -1118105 530865 626789 -362891 -809160
62809 -809160 -180159 710735 1313865 1927164 2584876 2554464 1474433 177560 -271500
62800 -271500 130931 562721 533965 258227 113136 246747 578351 753901 249436 -1011261
62790 -1011261 -2236805 -2470573 -1718757 -896426 -609497 -544131 -250340 60789 -51852
62781 -51852 -442226 -552056 -224658 145186 163149 -309546 -1296055 -2520601 -3168180 -2569032
62771 -2569032 -1276803 -709678 -1346937 -1977121 -1280311 465192 1948598 2536547 2512628
62762 2512628 2030512 1010510 49997 203920 1446445 2334419 1795788 493976 -236179
62753 -236179 -161679 -78661 -406073 -715608 -569522 -156462 -19850 -522952 -1548132 -2493255
62743 -2493255 -2771652 -2543057 -2573099 -3041746 -3027379 -1777618 -12375 873408 616220
62734 616220 171381 140281 148652 -103841 -236556 -33541 3121 -485503 -1010214 -1016572 -789208
62723 -789208 -877718 -1059396 -627925 526229 1817133 2793782 3395396 3450182 2661603 1291794
62713 1291794 282593 335747 1151382 1828525 1821372 1297761 715042 293454 -54301 -378670
62703 -378670 -440530 -13967 522788 251495 -1247713 -3075820 -3763095 -2976032 -2014844
62694 -2014844 -2251879 -3385664 -3804062 -2686789 -1148464 -859383 -1845166 -2340968 -983394
62685 -983394 1467280 3110529 3232551 2886906 3179434 3833596 3877367 3091067 2092860
62676 2092860 1359251 897916 716958 843603 867393 261929 -620994 -646690 576370 1935767
62666 1935767 2220290 1764295 1837457 2654188 3010115 2085622 700845 208920 724350
62657 724350 1179998 908344 428230 554609 1287870 1899061 1820642 1132640 294883 -305707
62647 -305707 -530403 -459888 -363545 -636783 -1565544 -2986017 -4203416 -4458513 -3634811 -2429224
62637 -2429224 -1682734 -1597727 -1736715 -1652782 -1254057 -640416 -4101 218354 -431548 -1724724
62627 -1724724 -2596582 -2178878 -836095 271655 570795 512769 614981 667602 200473
62618 200473 -705455 -1514181 -1907147 -1945353 -1701483 -1166211 -529421 -189953 -369151 -910731
62608 -910731 -1486518 -1800887 -1636356 -1026638 -456463 -545452 -1328347 -2097901 -2190248 -1713019
62598 -1713019 -1230105 -935142 -545457 33063 394541 185148 -312437 -417108 205310
62589 205310 1194493 1845879 1714333 946673 129741 -215441 -37613 374446 851761 1427661
62579 1427661 1896570 1660973 411632 -1168075 -1829777 -1018591 561408 1742065 2006251
62570 2006251 1696421 1395728 1367687 1485305 1460801 1139408 693691 511142 805344 1370125
62560 1370125 1763171 1666282 1055303 178447 -541711 -741574 -399508 189058 766999 1276918
62550 1276918 1613678 1520069 960209 339651 26256 -154956 -551587 -932498 -600333 672356
62540 672356 2235401 3257407 3518684 3335649 2986067 2486357 1820793 1162889 828761
62531 828761 1001124 1423648 1456966 681415 -537878 -1326559 -1187944 -391349 519163 1252664
62521 1252664 1708570 1791091 1576741 1407008 1501743 1628021 1404293 803699 137137 -327238
62511 -327238 -525421 -547526 -656403 -1174810 -2066471 -2768777 -2749673 -2138209 -1523540 -1253862
62501 -1253862 -1266723 -1488150 -1947527 -2466208 -2645610 -2295509 -1581695 -679041 394830
62492 394830 1499584 2265131 2434649 2063228 1295610 307719 -399464 -145937 1079137
62483 1079137 2243025 2234629 1065381 -289694 -1075607 -1291660 -1152979 -654044 161089
62474 161089 1012030 1771447 2671006 3777470 4544467 4301233 3098366 1739692 973836
62465 973836 859025 899010 625518 43648 -420794 -476961 -452841 -945199 -1889354 -2399511
62455 -2399511 -1875537 -883849 -412226 -546110 -585566 -339906 -449183 -1249422 -2115686 -2325831
62445 -2325831 -1946080 -1409227 -771955 78101 933455 1547369 2039602 2498054 2558365 1954862
62435 1954862 1105831 498527 -123072 -1171044 -2149824 -2147722 -1257655 -487095 -212449 215568
62425 215568 1074538 1528588 819922 -602277 -1740475 -2225657 -2294153 -2144235 -1888036
62416 -1888036 -1713766 -1586084 -1160943 -421856 20759 -303062 -1070600 -1674742 -1908850
62407 -1908850 -1743574 -1016908 79302 753069 535885 11248 -54180 135756 -141068
62398 -141068 -945602 -1788392 -2569910 -3481136 -4171437 -3960847 -2839644 -1446746 -146686
62389 -146686 1036909 1704060 1316435 234082 -468227 -435959 -387166 -782873 -1080114 -744005
62379 -744005 -181452 -84431 -423353 -638213 -427767 72359 569291 768156 537282 81202
62369 81202 -333229 -762632 -1236371 -1222382 -258230 939764 1041961 -2292 -723471 -221374
62359 -221374 593086 529608 -105391 -182169 565214 1505632 2192450 2505072 2155376 1039582
62349 1039582 -178534 -690696 -520129 -134898 540457 1803951 3120845 3413253 2427817
62340 2427817 999645 -56227 -570280 -581735 -115160 474207 625224 214222 -405266
62331 -405266 -967721 -1386497 -1480935 -1315930 -1606489 -2873469 -4267977 -4284143 -2795608
62322 -2795608 -1331431 -989794 -1118036 -633657 285879 664358 251357 -287714 -397143
62313 -397143 -124777 254882 552786 682011 733396 898504 1072485 838429 157803 -323067
62303 -323067 -143384 127536 -439595 -1735388 -2546129 -2034226 -797186 -166679 -708931
62294 -708931 -1708566 -2072530 -1494481 -589741 2182 341007 876411 1732245 2684880 3652686
62284 3652686 4627455 5112659 4325811 2302714 259699 -656621 -652593 -802071 -1509814
62275 -1509814 -2081056 -1851912 -1190197 -1068451 -1893112 -3057983 -3623801 -3231513 -2267830
62266 -2267830 -1296386 -591520 -253472 -410910 -980734 -1445111 -1319748 -799414 -501955
62257 -501955 -567224 -510612 -98322 142381 -428066 -1778329 -3347559 -4624175 -5288221
62248 -5288221 -5121356 -4189444 -2959036 -1922693 -1205809 -689390 -263674 253835 1134542
62239 1134542 2321307 3213238 3247648 2596927 1988073 1913701 2263330 2619513 2649990 2263917
62229 2263917 1609728 941273 432667 193508 390957 1044270 1658347 1479919 351455
62220 351455 -988418 -1664883 -1462796 -758059 -78820 54633 -664912 -1903833 -2802948
62211 -2802948 -2849853 -2328833 -1693401 -993863 -271677 35858 -394464 -1283449 -2226965 -3164715
62201 -3164715 -3893964 -3773226 -2647550 -1494247 -1270455 -1593521 -1510465 -1104479 -1177026
62192 -1177026 -1641333 -1555001 -737134 -60742 65101 299597 1106725 1972453 2332780 2348737
62182 2348737 2319113 2186742 2038165 2231555 2619724 2530326 1936288 1692199 2120442 2398096
62172 2398096 1986689 1591259 1824632 1917235 867399 -870506 -2001933 -2158114 -1963649
62163 -1963649 -1811377 -1667254 -1729215 -2195394 -2636818 -2586587 -2439221 -2744955 -2988467 -2290059
62153 -2290059 -1075648 -694689 -1395671 -2036965 -1964742 -1823889 -2146327 -2431244 -2197676
62144 -2197676 -1817503 -1630933 -1233484 -391511 207876 -61897 -766617 -1222030 -1652471
62135 -1652471 -2616386 -3766595 -4182965 -3714438 -3081994 -2710475 -2278918 -1520831 -758950
62126 -758950 -380559 -268494 -73533 224263 355269 300683 495725 1280113 2250834 2542325
62116 2542325 1891428 997920 514780 218454 -217432 -228265 791641 2005533 1912348
62107 1912348 661113 56539 828838 1498815 827665 -143649 156361 1281580 1617935
62098 1617935 930799 306227 102216 -179347 -213943 1004160 3148257 4490151 4335657
62089 4335657 3933341 4310916 4702012 4007065 2540349 1293128 485955 -85278 -133039
62080 -133039 540744 1164678 818130 -253592 -1098655 -1477972 -1886988 -2424481 -2578560
62071 -2578560 -2079184 -1227824 -419298 112812 235421 100967 124335 311232 92162 -558835
62061 -558835 -508480 1011489 2771979 2749551 798584 -1219701 -2015666 -2130387 -2280150
62052 -2280150 -1996612 -844787 206296 -80323 -1326526 -2003964 -1501626 -661589 -346794
62043 -346794 -481337 -648808 -753463 -723370 -232773 758983 1570101 1423585 419639 -479772
62033 -479772 -456109 385273 1239153 1411335 857068 82879 -340687 -212614 231828 658475
62023 658475 1039502 1611308 2336361 2600872 1785780 136264 -1292918 -1675893 -1113453
62014 -1113453 -261662 253906 -103068 -1611506 -3624277 -4629300 -3802432 -2200587 -1545421
62005 -1545421 -2030785 -2368679 -1973201 -1808458 -2595190 -3359566 -2713393 -854542 724768
61996 724768 1145216 826074 467408 250526 86256 -91282 -453307 -1155523 -1917684 -2131122
61986 -2131122 -1527142 -466238 432135 659162 -45200 -1438616 -2663089 -2876070 -2107440
61977 -2107440 -1121691 -423275 112955 556861 503733 -285191 -1261912 -1606557 -1193897 -656489
61967 -656489 -553122 -793754 -907334 -640291 -175260 180145 426085 874666 1647608 2324899
61957 2324899 2352159 1748334 1081139 687306 284948 -447221 -1235879 -1486531 -1011814 -165427
61947 -165427 643978 1240132 1515713 1356001 883569 552326 771709 1464502 2106984 2222493
61937 2222493 1818796 1348111 1217173 1323680 1169071 514775 -218243 -443427 -221109
61928 -221109 -195802 -639883 -1023363 -857040 -521261 -662903 -1051480 -853045 -26726 498667
61918 498667 346211 401053 1311533 2156627 1680834 297100 -408618 69415 738743 944465
61908 944465 1159667 1587607 1470480 579542 68408 728701 1486853 1000946 -77552
61899 -77552 -47311 1063620 1356989 -247842 -2692713 -4449067 -5161892 -5128373 -4339339
61890 -4339339 -2816953 -1117323 202003 1088588 1549777 1352641 611015 -20207 -269421
61881 -269421 -718552 -1770835 -2786290 -2946591 -2456567 -2129861 -2192715 -2284518 -2332397 -2577230
61871 -2577230 -2843689 -2570139 -1630813 -537739 234203 625692 670050 293569 -428619
61862 -428619 -1156332 -1527577 -1353528 -697973 -17104 9409 -786378 -1649622 -1717021 -1159492
61852 -1159492 -968124 -1562810 -2165351 -1779903 -415348 915664 1188142 211540 -1267532
61843 -1267532 -2132178 -1759129 -545515 443457 445844 -355663 -1121798 -1222172 -823648 -645043
61833 -645043 -1127686 -1946875 -2465835 -2494789 -2261289 -1769575 -784852 450402 1174301 1149699
61823 1149699 1142397 1829151 2751288 3002498 2518624 1922466 1422314 745253 3075 -307714
61813 -307714 -210079 -283602 -649559 -741347 -326853 45622 -1004 -2955 561988 1408302 1908085
61802 1908085 1967793 1892978 1763465 1553749 1628185 2451732 3788654 4692117 4453197 3292782
61792 3292782 1992622 1032748 279118 -501202 -1063528 -959254 -399902 -326641 -1209550
61783 -1209550 -2224164 -2328585 -1880247 -2218632 -3610280 -4684175 -4319677 -3120502 -2329367
61774 -2329367 -2084654 -1652519 -832583 -127213 214316 358688 194171 -595053 -1664270
61765 -1664270 -2064161 -1445036 -549141 -166460 -138078 188589 892269 1343730 1041594 260383
61755 260383 -196759 190403 1133650 1881404 2064522 1946881 1740669 1134523 -37028
61746 -37028 -1019591 -790402 545251 1750189 2018516 1846780 2010753 2328062 2023158
61737 2023158 924437 -334455 -1139150 -1376171 -1171894 -686828 -247985 -248091 -705678 -1151309
61727 -1151309 -1088858 -433296 526552 1378794 1743553 1438654 681259 -7114 -269256 -224128
61717 -224128 -202162 -282776 -290580 -204366 -297629 -722988 -1112930 -841120 274766 1679448
61707 1679448 2579483 2660379 2232853 1763019 1426898 1147583 909377 877948 1193122 1715935
61697 1715935 2050763 1863993 1200104 460799 42571 9522 142903 256562 376992 632046
61687 632046 1076741 1658290 2239477 2589777 2470779 1867856 1084382 471160 97000 -174940
61677 -174940 -354930 -328762 -210433 -350074 -790603 -1024803 -647244 -34740 91156 -314900
61667 -314900 -620115 -628783 -1042741 -2386170 -3967888 -4559452 -3909767 -2949126 -2495727 -2375025
61657 -2375025 -2013277 -1372292 -882740 -712915 -540977 -56458 600855 1034973 1109502 1074590
61647 1074590 1083132 750158 -431882 -2122679 -2997981 -2033395 223676 2108532 2526878
61638 2526878 1772068 706910 -260825 -1113246 -1621325 -1368095 -363148 696646 974031
61629 974031 331280 -434983 -372672 548128 1397031 1489040 1231456 1360449 1758899 1764294
61619 1764294 1417403 1471397 2098724 2526826 2224526 1555501 873763 -85787 -1308277
61610 -1308277 -1888309 -1178258 132632 1006075 1541620 2455026 3556426 3958500 3584171
61601 3584171 3225690 3092579 2526428 1364017 359320 -204470 -1159344 -2956252 -4471924
61592 -4471924 -4306414 -2697578 -1147034 -476817 -262430 -73808 -189203 -762767 -1170257
61583 -1170257 -832255 -182333 -72416 -423468 -291984 576018 1084440 265618 -1168954
61574 -1168954 -1658343 -930392 -239320 -356314 -520484 12058 488099 -186648 -1549882
61565 -1549882 -2153016 -1678647 -1135146 -1017815 -713086 -25408 98588 -926140 -2199244
61556 -2199244 -2599983 -2342429 -2304930 -2447458 -2000378 -929681 -137674 -166788 -561552 -712219
61546 -712219 -670360 -832174 -1253739 -1600594 -1582748 -1250949 -936584 -926910 -1119945 -1068661
61536 -1068661 -504951 256864 612745 343678 -126102 -149164 495578 1332025 1606351 1082128
61526 1082128 307284 -111730 -302330 -763599 -1350101 -1295540 -402163 479228 551466 100487
61516 100487 -70728 217911 538971 694122 890405 1208937 1473999 1639071 1826364 1947233
61506 1947233 1690698 987016 195050 -278036 -393727 -485084 -904268 -1607168 -2093606 -1954942
61496 -1954942 -1462240 -1254961 -1401649 -1281879 -607400 27016 26963 -307762 -343362 -112531
61486 -112531 -49630 -45542 411287 1231515 1655531 1324429 789070 720617 1091578 1417111
61476 1417111 1486854 1545371 1816543 2036075 1618787 436864 -711679 -837469 9605
61467 9605 791123 908772 896325 1358263 2006774 2327122 2417755 2410430 1868506 795006
61457 795006 473940 1916684 3944980 4373793 2914566 1300493 545591 -114471 -1180772
61448 -1180772 -1664416 -825145 387037 785759 652616 781724 843450 64334 -1178694
61439 -1178694 -1818734 -1711299 -1527803 -1372140 -773634 70422 262006 -480170 -1456156
61430 -1456156 -2069575 -2396715 -2505365 -2041211 -829376 674231 1794009 2122029 1560991
61421 1560991 360742 -813399 -1282291 -926530 -125734 707696 1205651 1011853 283724
61412 283724 -39236 782915 2179792 2922003 2781369 2633076 2868837 2754281 1720134
61403 1720134 343538 -561049 -1109086 -1896706 -2873555 -3412152 -3297574 -3017916 -3053946
61394 -3053946 -3255527 -2975456 -1693231 402043 2383950 3327066 3123309 2371897 1576319
61385 1576319 885274 524797 751191 1188581 998600 158820 -143677 945113 2584838
61376 2584838 3234962 2626046 1847165 1668848 1744552 1538259 1110779 653665 -679 -913083
61366 -913083 -1611901 -1649916 -1237701 -857800 -544407 -56961 430674 408720 -168078 -658862
61356 -658862 -497891 170024 814423 1169536 1264474 1034041 340027 -605549 -1247779 -1335498
61346 -1335498 -1284964 -1581410 -1976875 -1713119 -606158 498728 634453 -153805 -908887
61337 -908887 -897342 -311003 168494 160496 -208493 -621238 -829683 -702780 -261384 309977
61327 309977 814765 1207071 1500686 1555906 1126954 172773 -989086 -1893989 -2238885 -2001451
61317 -2001451 -1390778 -715788 -175362 268436 700321 958707 775053 262115 -72465
61308 -72465 -22131 -71263 -726572 -1718563 -2348167 -2427454 -2233059 -1598777 65422 2506952
61298 2506952 4186602 3828602 1990247 342311 -374264 -878212 -1872569 -2887609 -2945984
61289 -2945984 -1840597 -317811 750462 1065139 951477 959165 1298513 1531258 966417
61280 966417 -509876 -2152063 -3031960 -2875765 -2149187 -1491980 -1209819 -1189360 -1144103 -953966
61270 -953966 -780699 -781639 -780604 -438472 242716 828066 920386 495114 -285839 -1311332
61260 -1311332 -2433770 -3369839 -3822989 -3542168 -2289992 -159197 1972622 2855073 2160579
61251 2160579 1003169 660407 1043053 1026458 141860 -807651 -949519 -452468 -23628
61242 -23628 171919 454863 738433 452088 -454264 -1039404 -425458 939356 1674271 1145165
61232 1145165 162751 -239563 -130959 -233513 -607066 -648939 -282877 -149303 -357055 -32506
61222 -32506 1248541 2384458 2056501 669811 -48540 725499 2048950 2645003 2308047
61213 2308047 1644665 1222371 1357121 2077499 2851044 2877432 2073014 1271782 1058830 975195
61203 975195 395377 -381820 -617718 -259489 213782 743140 1591748 2443095 2537623 1782072
61193 1782072 877375 204080 -563803 -1495142 -1963424 -1643112 -1142285 -1030622 -933511 -317853
61183 -317853 432279 603741 366338 407956 618193 210460 -848750 -1595770 -1491715 -1135347
61173 -1135347 -1164851 -1317506 -1155600 -1019132 -1543342 -2668953 -3762165 -4378122 -4364023
61164 -4364023 -3600006 -2291308 -1228869 -1077883 -1568933 -1966554 -2073030 -2070431 -1646838
61155 -1646838 -250190 1755177 3132773 3240788 2676132 2189051 1791000 1375347 1383814
61146 1383814 2116537 2937764 2969333 2273485 1635107 1362969 987408 94831 -1104479
61137 -1104479 -2050938 -2266213 -1595510 -438487 372238 354099 -83179 -288297 -312995 -612842
61127 -612842 -1039270 -979618 -518793 -518657 -1202733 -1521056 -553631 1058541 1843209 1341410
61117 1341410 489814 268262 651789 1015331 1018335 786279 511985 191091 -291808 -946148
61107 -946148 -1528128 -1601008 -867550 436210 1509617 1513015 298119 -1346063 -2294717
61098 -2294717 -2034456 -980105 108775 771465 818746 90866 -1281582 -2563558 -2946390
61089 -2946390 -2475665 -2022293 -2248724 -2992157 -3696069 -3963844 -3610998 -2742531 -1959568
61080 -1959568 -1889346 -2242573 -1967774 -703221 599725 995481 773092 667612 524696
61071 524696 -268831 -1464037 -2154939 -2135830 -2035153 -2163648 -2220965 -2116776 -2024724 -1579098
61061 -1579098 -211447 1472017 1908802 685568 -747120 -1123078 -964125 -1276916 -1804657
61052 -1804657 -1791500 -1549500 -1773081 -1895018 -770979 1196803 2248345 1729306 873844
61043 873844 756542 889506 519404 36768 111636 385574 174518 -131082 411056 1579177
61033 1579177 1942012 744633 -981228 -1596321 -665124 832944 1861602 2401490 2996509
61024 2996509 3566103 3287487 1906440 571685 610110 1723470 2361977 1934799 1518367
61015 1518367 1911277 2153914 997257 -964033 -1936455 -1382254 -531210 -414619 -625314
61006 -625314 -415490 7315 -48009 -622858 -1103480 -1017548 -369418 554797 1342531 1641404
60996 1641404 1496941 1319910 1340811 1379721 1314482 1358043 1572180 1516980 814146 -231371
60986 -231371 -996761 -1281577 -1271779 -1049021 -665508 -500188 -913024 -1588244 -1822314 -1507725
60976 -1507725 -1238008 -1315865 -1272466 -638693 348689 1148587 1532666 1431450 704316 -388618
60966 -388618 -977107 -602706 -128252 -727487 -2091475 -2664982 -1811658 -655383 -294844
60957 -294844 -245547 471529 1541748 1870174 1445850 1379043 2120135 2904966 3226261 3657398
60947 3657398 4638275 5439423 5146522 4008937 3002788 2523418 2264899 2011783 1781600
60938 1781600 1446925 953006 726552 1167166 1859508 1955808 1254508 288411 -535556 -1233683
60928 -1233683 -1790061 -2088462 -2239129 -2309276 -1844660 -456930 1155586 1686851 876585
60919 876585 -143026 -324573 315468 1362368 2617362 3610886 3507965 2223690 905990
60910 905990 598807 1029247 1360102 1460669 1622233 1620174 1070146 409996 557743 1643942
60900 1643942 2822406 3304936 2991581 2194727 1349486 916289 1006615 1155485 903890
60891 903890 434497 184417 115902 -64688 -252478 -161868 47041 46484 6619 230421 346549
60880 346549 -263842 -1347808 -2008666 -2055260 -2186110 -2706683 -2999139 -2548691 -1682459 -969496
60870 -969496 -600582 -623178 -1034333 -1343984 -856081 185176 483814 -736948 -2669479
60861 -2669479 -3949323 -4184542 -3935951 -3716541 -3617317 -3534508 -3219039 -2404779 -1308957
60852 -1308957 -644213 -733061 -1008455 -794204 -136594 577743 1341136 2307097 3254501 3830444
60842 3830444 3998172 3763497 2872638 1335616 -165625 -991998 -1252776 -1177751 -347579
60833 -347579 1497370 3249472 3224183 1263371 -901562 -1634188 -993669 -127588 200359
60824 200359 84390 -4076 249770 728876 973435 728273 334392 245564 316710 107523
60814 107523 -205337 83704 1097888 2001670 1964837 991787 -363432 -1536132 -2020216
60805 -2020216 -1552725 -580292 8819 -29078 -31291 371115 474035 -414304 -1651569 -1919863
60795 -1919863 -996785 8247 220639 -8933 55089 384393 390641 -82648 -527010 -492322
60785 -492322 -139504 71869 25091 35324 305666 539126 335839 -83497 86143 1240176
60775 1240176 2628599 3003195 2027473 714995 301955 918959 1621798 1579072 872145
60766 872145 90555 -482245 -990829 -1503835 -1763547 -1498638 -762861 105197 703349 761362
60756 761362 378099 116943 559561 1625986 2641975 3253109 3868575 4833944 5565087
60747 5565087 5164839 3780580 2605058 2332796 2275461 1476879 251839 -76604 1063799
60738 1063799 2598512 2947565 1739526 27728 -1071168 -1510497 -1932668 -2528609 -2725341
60729 -2725341 -1977319 -475016 1067562 2060817 2352701 2184088 2028205 2235395 2630953
60720 2630953 2688862 2293726 2025920 2382726 2997268 3055374 2334243 1411156 923364 1000439
60710 1000439 1363869 1606840 1397516 756175 138708 -24817 196491 502970 952881
60701 952881 1873817 3254896 4637877 5601844 6010701 5842867 5145664 4101724 2822900
60692 2822900 1255338 -342579 -1176039 -815355 -66425 -131383 -1019026 -1672097 -1617529
60683 -1617529 -1425402 -1385067 -938534 57699 626755 29906 -1031695 -1437442 -1137430
60674 -1137430 -699683 -55348 1152565 2387351 2628816 1889747 1221493 1134645 1044801
60665 1044801 504845 -9251 538 177990 -43391 -470606 -501244 -163029 -168338 -953604
60655 -953604 -2130511 -2987240 -3203007 -2898566 -2232819 -1282024 -304791 230114 125852
60646 125852 -227659 -319009 -157765 -102209 -185300 -109472 120459 127399 -227993 -789175 -1718122
60635 -1718122 -3342158 -5123363 -5738963 -4781713 -3507593 -3116176 -3137147 -2551006 -1725925
60626 -1725925 -1829884 -2727864 -3010828 -2117387 -988962 -417475 -147505 -12548 -537550
60617 -537550 -1688460 -2296793 -1731807 -1136332 -1832440 -3224484 -3546494 -2282044 -614306
60608 -614306 352521 631891 574458 194662 -366193 -599076 -355279 -211850 -663756 -1452973
60598 -1452973 -2131439 -2790737 -3651331 -4298243 -4081941 -3232557 -2851703 -3540901 -4558933
60589 -4558933 -4728455 -3831959 -2652551 -1852544 -1380075 -981159 -689331 -519725 -131079
60580 -131079 742377 1719440 2073813 1581592 732555 74777 -359272 -870348 -1530263 -1969703
60570 -1969703 -1749995 -912479 -33369 411486 597758 948446 1287981 962494 -88233
60561 -88233 -1037389 -1289008 -1248457 -1480673 -1758868 -1672568 -1579516 -1982509 -2382351 -1883833
60551 -1883833 -736024 -52368 -18754 297770 1125831 1383169 508683 -383560 -145551
60542 -145551 602760 465014 -607557 -1407434 -1341426 -1018485 -1011440 -1104873 -1013623 -1013356 -1422446
60531 -1422446 -1930904 -1863663 -985671 124076 500029 -296263 -1587013 -2121777 -1417506
60522 -1417506 -325602 -11874 -629061 -1323398 -1313831 -573239 390087 1029097 1123133 958140
60512 958140 1039915 1389988 1347103 399644 -987200 -1757156 -1348801 -88788 1286259
60503 1286259 2093402 1877867 685287 -749052 -1473029 -1185774 -520412 -390648 -1065390
60494 -1065390 -1842719 -1694222 -403215 1032208 1431218 728597 -236684 -1054696 -2033946
60485 -2033946 -3086149 -3368779 -2531585 -1399778 -760802 -338702 240579 386796 -431027
60476 -431027 -1322411 -973061 408250 1465355 1736905 1916569 2175322 1764371 589431
60467 589431 -203061 203515 1178729 1652923 1370736 649979 -272430 -1112938 -1467774 -1373055
60457 -1373055 -1352682 -1554967 -1489305 -930743 -351310 -107837 4623 -10215 -680783 -2055372
60447 -2055372 -3164013 -3200376 -2601642 -2266858 -2279239 -2091701 -1456685 -479376 791267
60438 791267 2144859 2974146 2870560 2114102 1129494 -13857 -1080279 -1371319 -699074
60429 -699074 -27173 -279119 -1037710 -1334636 -1214955 -1446123 -2029064 -2156479 -1530427 -650517
60419 -650517 182988 1125542 1994302 2228279 1842023 1541446 1656420 1737771 1416901 881787
60409 881787 270690 -589787 -1492449 -1665623 -781642 420939 1003827 872116 536976
60400 536976 273394 11439 -205658 -150067 225373 606270 543739 -125338 -1003012 -1415030
60390 -1415030 -1183455 -903792 -1115383 -1486287 -1375142 -937965 -874010 -1140296 -863829 243341
60380 243341 1279673 1411532 986511 831955 1059956 1226911 1235584 1372372 1663884 1798965
60370 1798965 1608941 1186659 620566 -12765 -478776 -548240 -289091 37452 284382 436884
60360 436884 472083 413872 404698 545904 783248 1052302 1341304 1507311 1297229 719966
60350 719966 146481 -142246 -273484 -495468 -840345 -1243926 -1718011 -2207720 -2541368 -2693603
60340 -2693603 -2816452 -2876968 -2642122 -2203083 -2052985 -2334230 -2453761 -1866091 -877619 -218517
60330 -218517 -111025 -230411 -345911 -505187 -713481 -834826 -712911 -140349 1003495
60321 1003495 2250666 2583738 1545324 50969 -533530 -4589 590325 416664 -218923
60312 -218923 -492168 -77343 654951 1101210 924332 313775 -178923 -196735 96647 347605
60302 347605 405533 162395 -627299 -1936514 -3163728 -3721123 -3696025 -3496580 -3182050 -2679277
60292 -2679277 -2248434 -2019520 -1473398 -284546 679902 342426 -781781 -1079655 -226169
60283 -226169 320100 -414084 -1543288 -1900281 -1706318 -1726653 -1846680 -1612868 -1347997 -1548684
60273 -1548684 -1834214 -1671123 -1539345 -2081899 -2590085 -1834265 -214114 464962 -492280
60264 -492280 -1800393 -2188809 -1946708 -1907794 -2062460 -1974089 -1719725 -1601930 -1511036 -1247189
60254 -1247189 -985548 -882959 -748737 -591817 -856607 -1534338 -1740882 -956204 -51484
60245 -51484 -126048 -810929 -842798 -59743 395864 -75914 -647129 -390576 449054 1056063
60235 1056063 1252917 1536093 2279015 3292550 3905524 3332373 1424193 -761608 -1714891
60226 -1714891 -1110583 -147490 70931 -188462 -161773 -514 -384985 -1142397 -1329149 -682707
60216 -682707 -49537 -156317 -721611 -1090333 -1103023 -953097 -700196 -362193 -134187 -117080
60206 -117080 -75097 219906 620092 839153 843514 778487 722813 711874 760548 696899 290510
60195 290510 -262397 -375720 128874 678656 756483 608588 699754 934814 1030382 1225075
60185 1225075 1836894 2444716 2452244 2297636 3013651 4488919 5290700 4596712 3264494
60176 3264494 2397936 1822877 838016 -290723 -659783 -149256 505470 881101 1177760
60167 1177760 1441708 1394802 1121880 1085699 1271947 1112502 550011 407627 1212383 2272042
60157 2272042 2553110 2073845 1726899 1875234 1839673 973251 -262505 -746123 -120766
60148 -120766 662226 479855 -516163 -1066238 -454435 584119 947926 592999 212592
60139 212592 -75104 -736957 -1588285 -1632330 -502865 821768 1303019 1123059 1024919 991628
60129 991628 439431 -604339 -1398937 -1544676 -1459028 -1706212 -2322867 -2879695 -2892754 -2221728
60119 -2221728 -1332289 -964713 -1193536 -1114534 17080 1608329 2346015 1829070 861787
60110 861787 200860 -158811 -348401 -142824 514953 1156590 1356666 1170273 727316 -28908
60100 -28908 -837291 -955080 -35482 1239038 1888960 1676619 1036916 406185 84986 318467
60090 318467 915911 1138975 597722 -31245 159341 1009320 1570359 1507000 1360779 1392676
60080 1392676 1065151 20350 -1110340 -1369726 -598343 447741 857057 246014 -1026923
60071 -1026923 -2129809 -2467824 -2233745 -2015326 -1895624 -1411714 -490633 161925 -54572
60062 -54572 -810164 -1309562 -1250851 -913614 -583229 -363550 -392581 -758096 -1213095 -1347370
60052 -1347370 -1069127 -649660 -312979 -56158 127373 128583 -89864 -348927 -341495 203916
60042 203916 1324247 2562076 2982223 1811772 -720990 -3288105 -4387047 -3483951 -1344888
60033 -1344888 686476 1766682 2012502 2015134 2086632 2127323 2065080 2041120 2090880 2007821
60023 2007821 1728849 1547021 1669594 1839841 1749622 1603546 1819868 2258034 2223504 1327544
60013 1327544 -15980 -1059767 -1393655 -1061802 -357187 284455 449967 128922 -139952
60004 -139952 229119 1152374 1822032 1520065 473740 -261469 108556 1277231 2322284
59995 2322284 2909055 3533971 4450455 4942524 4172804 2385103 630257 -506025 -1192956
59986 -1192956 -1451463 -857834 521368 1636779 1494454 300927 -922159 -1541719 -1636517
59977 -1636517 -1429710 -1041036 -714627 -687994 -759123 -464632 214359 784182 1031226 1411167
59967 1411167 2323318 3349982 3682174 3195136 2666455 2826700 3494089 3859508 3473072
59958 3473072 2672664 2019416 1605719 1175504 759658 737957 1139761 1318715 725880 -239648
59948 -239648 -667614 -354759 -7978 -113903 -238381 142844 661107 614442 263682 703098
59938 703098 2266085 3817862 4116815 3356838 2717175 2674436 2522247 1591121 229293
59929 229293 -736850 -1004225 -850306 -562265 -286204 -217584 -421790 -529120 -88651 740873
59919 740873 1289003 1243186 988058 934681 971884 854383 696324 657766 494713 -13602
59909 -13602 -387153 129492 1405295 2320549 2106218 1300506 985693 1436690 2007717 2143140
59899 2143140 1937251 1677412 1354362 867781 391662 215302 326273 385172 109580 -439979
59889 -439979 -951241 -1169004 -1130998 -1133836 -1444076 -2043903 -2683779 -3090723 -3004704 -2173513
59879 -2173513 -672472 763899 1192484 502445 -350727 -492443 -178461 -226946 -701736
59870 -701736 -887083 -553543 -436663 -1107000 -2001667 -2143557 -1443253 -672634 -319258 -88967
59860 -88967 399523 954276 1107408 807978 563657 939285 1991270 3139938 3582543
59851 3582543 2924201 1471022 -67011 -1105921 -1453216 -1244713 -769847 -288121 103837
59842 103837 426766 666835 779764 804403 771039 529014 -38746 -619075 -672732 -143679
59832 -143679 424291 591155 363161 -300216 -1625628 -3273086 -4173611 -3812653 -3097250
59823 -3097250 -3113410 -3501687 -3067033 -1684445 -460807 -69979 -56033 97075 288373
59814 288373 417867 627117 606187 -280809 -1736633 -2440080 -1793425 -789211 -492812
59805 -492812 -655375 -625887 -635431 -1115666 -1565849 -1307983 -767358 -776404 -1107099 -1013725 -842317
59794 -842317 -1581127 -2885365 -3138157 -1829424 -472422 -493342 -1295942 -1227129 266964
59785 266964 2195415 3241472 2833821 1409201 136061 69352 1140638 2208861 2377647
59776 2377647 1935275 1719817 1952559 2119710 1765132 981650 186270 -302687 -440508
59767 -440508 -339549 -67262 315544 516872 165282 -575298 -981428 -808189 -863336 -1804340
59757 -1804340 -2775831 -2309871 -469476 1089097 1378422 1221749 1682510 2469291 2645869
59748 2645869 2052881 1166130 181593 -896854 -1709670 -1877834 -1578145 -1155396 -533729
59739 -533729 357715 988900 805921 136501 -169958 191351 853318 1445760 1792167 1725655
59729 1725655 1340751 1156645 1411788 1537654 1026007 399135 411158 641785 38318 -1245251
59719 -1245251 -1820824 -1111998 -220784 -224902 -670617 -561641 -44313 -81277 -823109 -1332405
59709 -1332405 -987521 -359663 -349272 -933189 -1257657 -856245 -309454 -484564 -1413965 -2335815
59699 -2335815 -2747701 -2877427 -2980015 -2782296 -2056641 -1253279 -939803 -894588 -398506 716872
59689 716872 1905030 2674531 2931506 2649284 1853253 961158 525371 524457 390918 -222250
59679 -222250 -1150752 -2095157 -2720626 -2524196 -1375753 -199910 -267972 -1605805 -2866189
59670 -2866189 -3015902 -2379156 -1729044 -1207519 -665181 -347678 -592143 -1298890 -2192281
59661 -2192281 -3146183 -3846890 -3723210 -2751980 -1792934 -1527867 -1578872 -1344278 -1200872 -1988375
59651 -1988375 -3528167 -4543574 -4148956 -2825886 -1796599 -1791235 -2459200 -2756855 -2003837
59642 -2003837 -704305 -55908 -508542 -1307908 -1737824 -2098872 -2825636 -3307158 -2583398
59633 -2583398 -907467 383427 474401 -327994 -1512570 -2861919 -3886361 -3784452 -2477020
59624 -2477020 -1006561 -390948 -511530 -525419 2269 745221 1111284 794927 26506
59615 26506 -578663 -624363 -413159 -528588 -983594 -1232697 -1034510 -747316 -663596 -648973
59605 -648973 -630946 -795390 -982091 -576025 470790 1117713 469063 -857213 -1402382
59596 -1402382 -757122 4652 -162799 -1021844 -1529637 -1049045 196034 1484919 2118544
59587 2118544 1845011 1063131 466443 325268 312801 164939 155344 558889 941869 606956
59577 606956 -223505 -293718 1249109 3667596 5301652 5227656 3893816 2342719 1333302
59568 1333302 1140890 1579295 2019525 1855580 1177835 609875 365639 26539 -501823
59559 -501823 -513273 437068 1540956 1583078 477451 -815247 -1698434 -2411169 -3139809
59550 -3139809 -3588473 -3654516 -3709911 -3832847 -3460665 -2300040 -1017926 -451319 -527864 -559564
59540 -559564 -331891 -265164 -558394 -746998 -272973 827114 1957139 2513198 2309685
59531 2309685 1589068 754043 124654 -124304 13590 286626 281487 -158539 -710068 -993554
59521 -993554 -1062639 -1137968 -1046800 -476301 253463 328932 -447072 -1271545 -1388563 -1012231
59511 -1012231 -793633 -798147 -552109 94164 630514 415094 -661570 -1937251 -2341562
59502 -2341562 -1339549 291027 1005591 127814 -1385642 -2135015 -1874627 -1502754 -1775401
59493 -1775401 -2570864 -3298285 -3530892 -3214273 -2605376 -2084921 -1876387 -1942437 -2115523 -2105840
59483 -2105840 -1490350 -236179 743765 367532 -965563 -1436089 -212214 1093972 474262
59474 474262 -1588825 -2633125 -1403495 812812 2102448 1888451 694680 -783924
59466 -783924 -1757990 -1501817 -234049 779816 633558 -215105 -783999 -769949 -415297
59457 -415297 116811 564848 403789 -365794 -813185 -330584 188188 -529243 -2083224
59448 -2083224 -2620528 -1190717 1132856 2757283 3274217 3202389 2843559 2162433 1403417
59439 1403417 1043987 1136112 1219911 1006138 779757 927401 1289791 1290349 733301 205334
59429 205334 422564 1259707 1776167 1316091 259736 -535267 -718422 -520392 -135312
59420 -135312 408774 828725 649835 -105059 -741697 -700074 -219746 89141 70226 64151
59410 64151 301017 649255 947235 1220581 1468267 1513539 1251100 878472 690939 729221
59400 729221 797259 768700 687591 582807 386242 58473 -421930 -1225278 -2496237 -3837920
59390 -3837920 -4350559 -3592323 -2249174 -1342391 -954068 -403053 375058 529796 -284346
59381 -284346 -1055596 -712812 295776 605150 -181563 -1142338 -1515672 -1584264 -1841989 -2095279
59371 -2095279 -1880071 -1257749 -713525 -565278 -818456 -1322598 -1767186 -1803347 -1467598 -1220828
59361 -1220828 -1308816 -1427370 -1356913 -1530020 -2418332 -3587192 -3993767 -3229666 -1950794
59352 -1950794 -1012809 -662553 -711784 -1013701 -1438727 -1685590 -1502536 -1015238 -574550 -315004
59342 -315004 -87080 156727 141207 -384086 -1158929 -1531402 -1181992 -525975 -161443 -108786
59332 -108786 -18550 -24682 -697191 -1898643 -2419542 -1413055 283086 1093515 738763 393799
59322 393799 827418 1422516 1410757 1133768 1352579 1913013 1921923 968323 -532384 -2023407
59312 -2023407 -3162819 -3612761 -3204841 -2418116 -2065219 -2266421 -2225111 -1319893 -30827
59303 -30827 617664 351597 -13841 400565 1394089 1783572 713994 -1275701 -2759413
59294 -2759413 -2990011 -2586199 -2508041 -2823876 -2929343 -2612051 -2245472 -2064954 -1924370 -1798832
59284 -1798832 -1892590 -2113052 -2024703 -1528322 -1054958 -880832 -811133 -794883 -1205770 -2056338
59274 -2056338 -2503178 -1763474 -177038 1229883 1959128 2229865 2205848 1749482 932435
59265 932435 155437 -388138 -899770 -1457712 -1695487 -1255229 -382749 158747 -172174 -1054327
59255 -1054327 -1543723 -1171205 -642336 -937491 -1765664 -1761084 -548096 384364 -277237 -1569552
59245 -1569552 -1458942 252359 1654188 1389307 214179 -435658 -185596 535027 1364081
59236 1364081 1846823 1327830 -91780 -1158801 -903758 60629 478094 123220 -362219
59227 -362219 -776584 -1408941 -2083350 -2270895 -2051013 -1915026 -1690242 -818763 225865
59218 225865 130560 -1190971 -1974748 -888507 1030083 1770360 1016414 208209 238175
59209 238175 382511 -258121 -1333308 -1856218 -1588105 -1125930 -906916 -757569 -394997
59200 -394997 142891 711803 1326601 1940579 2165084 1552416 190866 -1199029 -1864122
59191 -1864122 -1630569 -910505 -255167 34621 12758 -59121 -23818 -31484 -285232 -544561
59181 -544561 -170293 1085324 2520080 3042913 2262980 798827 -400213 -755459 -183352
59172 -183352 1036361 2357777 3209081 3353430 2979063 2467037 2193164 2401126 2935676
59163 2935676 3165150 2589036 1562207 966904 1055084 1134925 672967 180422 514052 1650609
59153 1650609 2727129 3120539 2933653 2490474 1927794 1374770 1041869 923275 734528
59144 734528 306369 -221423 -690298 -1102766 -1408044 -1457123 -1360205 -1557158 -2240290 -2918487
59134 -2918487 -2846255 -1801165 -296174 822408 910940 -3142 -1056391 -1188555 -296612
59125 -296612 532421 343945 -420710 -524257 427373 1642020 2375933 2695421 2791895 2341903
59115 2341903 1104107 -361428 -1204819 -1271720 -1052785 -827412 -403806 280697 745164
59106 745164 353940 -960807 -2393182 -2788098 -1773624 -363442 52942 -563326 -839956
59097 -839956 14116 960164 586638 -894465 -2146530 -2722800 -3300230 -4039933 -4110188
59088 -4110188 -3148385 -1984163 -1380734 -1070288 -626042 -332868 -453407 -460718 143175 892460
59078 892460 1088707 896104 830574 694305 51303 -580689 -126998 1480537 3038513
59069 3038513 3420011 2484636 750845 -996863 -1773149 -977611 798799 2172640 2375974
59060 2375974 1767837 933159 -23176 -1091961 -1918851 -2091234 -1503112 -314235 1061145
59051 1061145 1937102 1882113 1321390 1044972 1067179 643853 -453514 -1449451 -1674592 -1472551
59041 -1472551 -1542966 -1944420 -2277713 -2438446 -2618900 -2781975 -2633420 -2093683 -1505395 -1324494
59031 -1324494 -1651044 -2052206 -2007732 -1679011 -1897213 -2985339 -3987404 -3767226 -2586148
59022 -2586148 -1698024 -1553652 -1507539 -1326337 -1689154 -2792283 -3699782 -3756777 -3561900 -3716118
59012 -3716118 -3588283 -2319852 -289291 1433846 2448224 2853583 2414125 1081960 -139396
59003 -139396 -153507 629117 864096 339857 252111 1326036 2817002 3680689 3771236 3475626
58993 3475626 2947101 2204907 1518093 1290111 1755310 2816206 3892761 4092193 3019971
58984 3019971 1340950 89584 -412650 -509436 -433953 -235039 -130772 -137085 329643 1535386
58974 1535386 2416424 1654156 -348070 -1827969 -2065558 -2082777 -2703808 -3357720 -3385190
58965 -3385190 -3199339 -3333883 -3485179 -3391245 -3570775 -4133345 -3872876 -1878936 663107
58956 663107 1707660 976287 -25582 -361775 -561980 -1109418 -1523359 -1475419 -1623439
58947 -1623439 -2508862 -3396407 -3124908 -1786322 -785774 -1234982 -2758493 -3950188 -3734408
58938 -3734408 -2258132 -677413 -146404 -873739 -2035162 -2571271 -2073805 -950037 118993
58929 118993 700528 628206 -136210 -1291443 -2013160 -1590416 -427249 188553 -288246
58920 -288246 -877394 -548841 160809 48589 -680050 -671147 218393 405208 -1008914 -2753895
58910 -2753895 -3271303 -2848376 -2644396 -2607644 -1911084 -827055 -464565 -850639 -938554 -585413
58900 -585413 -807923 -1642037 -1463491 601339 2997384 3792808 3393245 3630307 4710981
58891 4710981 4894123 3342216 1589300 1354952 2146590 2250491 1379929 877388 1381143
58882 1381143 1758436 929829 -369208 -636361 239167 995590 930330 658852 818197
58873 818197 1081017 918545 518457 342099 371120 411629 655356 1250808 1640928 1036278
58863 1036278 -540807 -2205291 -3150200 -3277542 -3030301 -2941347 -3207995 -3450506 -3102565
58854 -3102565 -2214490 -1456009 -1090108 -568394 395490 1059559 719085 -62595 -255621
58845 -255621 28973 -181656 -1083628 -1902560 -2285136 -2671845 -3094249 -2783095 -1442122
58836 -1442122 43731 726330 680336 490649 365232 287526 419686 757676 838716 309537
58826 309537 -563465 -1319718 -1846081 -2178145 -2209965 -1940058 -1584073 -1163753 -453196 432755
58816 432755 987677 1133294 1398466 1886926 1832324 778952 -476000 -823192 -165886
58807 -165886 852833 1805808 2363187 1883159 227564 -1378764 -1442502 -55095 1319767
58798 1319767 1799340 1810753 1918928 2057214 2140848 2416383 2819469 2846355 2462182 2334192
58788 2334192 2720022 2904410 2291818 1358641 872265 755823 453839 -44105 -346534
58779 -346534 -527811 -1026932 -1768753 -2131416 -1841262 -1272582 -773205 -311745 17756 -242861
58769 -242861 -1241076 -2313100 -2646383 -2251642 -1833596 -1774391 -1698780 -1141059 -251297 416925
58759 416925 578892 371576 -10396 -428663 -550473 44440 1245136 2240611 2354753
58750 2354753 1834817 1370500 1012881 225914 -919432 -1371126 -409341 1201256 2075413
58741 2075413 1948884 1739642 1878247 1523740 -49383 -1966040 -2505733 -1185529 665894
58732 665894 1541123 1343722 1036539 1193507 1444340 1214600 511973 -150848 -332532 -2821
58722 -2821 538582 931215 1007092 900554 912161 1193624 1540177 1535402 952699 7750 -837130
58711 -837130 -1301316 -1412937 -1221983 -636459 277097 1047706 1180532 706234 59838 -478564
58701 -478564 -856801 -908717 -505319 -47974 -148888 -662983 -744442 -155131 264809 -78539
58691 -78539 -545260 -346700 100345 -114898 -874371 -1353513 -1516576 -2047006 -2907676 -3237426
58681 -3237426 -2753275 -2025702 -1219125 91912 1505723 1650170 204159 -1192916 -1021465
58672 -1021465 129917 673434 254685 -226656 -138961 467466 1434395 2373227 2396407 1076985
58662 1076985 -616413 -1333445 -967551 -313562 418966 1517624 2523181 2498599 1551780
58653 1551780 784267 597561 303922 -389063 -812839 -628148 -426873 -517141 -280406 601871
58643 601871 1379384 1496094 1626557 2467319 3295686 2874061 1325190 20201 -184380
58634 -184380 350170 997098 1608033 2176001 2476263 2357367 2027651 1822631 1817611 1728872
58624 1728872 1182144 206927 -550101 -433347 315022 684959 140189 -721203 -1035922
58615 -1035922 -727583 -293539 -21743 21321 -398073 -1378207 -2326640 -2369550 -1398455 -265563
58605 -265563 137280 -336266 -1233132 -2073430 -2643984 -2911531 -2790504 -2076434 -761032
58596 -761032 610812 1232479 857547 70299 -431479 -536573 -515257 -445365 -131339 618953
58586 618953 1815663 3122295 3795100 3274296 2044638 1327830 1558760 1786676 1103158
58577 1103158 -10796 -563459 -718093 -1464662 -2776239 -3248043 -1908588 399445 1888409
58568 1888409 1617383 118075 -1363649 -1912837 -1457712 -551886 271712 859882 1175916
58559 1175916 1052983 519601 67379 149533 586133 858341 786878 528569 190001 -83089
58549 -83089 28204 491765 666404 300948 354461 1789307 3806766 4525105 3443960
58540 3443960 1954299 1163380 588247 -418454 -1296343 -1320888 -981646 -1143021 -1539141
58531 -1539141 -1308632 -543805 -69128 67161 629326 1716041 2420608 2213682 1634885
58522 1634885 1193656 505936 -807255 -2014187 -1912552 -392542 1298697 1903399 1331349
58513 1331349 404891 -190981 -425438 -563040 -686570 -756337 -909378 -1348302 -1952140 -2349797
58503 -2349797 -2467783 -2645433 -3038607 -3307863 -3197043 -3013407 -3051701 -2871256 -1830673
58494 -1830673 -249322 722976 607818 323654 959596 2231271 2730037 1633479 -293121
58485 -293121 -1531082 -1381779 -515908 -47375 -290498 -599288 -378353 55272 -109714
58476 -109714 -1015839 -1794518 -1569055 -542763 227102 79011 -546774 -755711 -291604
58467 -291604 278287 348271 -101976 -711742 -1191171 -1337111 -922204 28838 1036748 1699842
58457 1699842 2312875 3394859 4615150 4901328 3869122 2469575 1766960 1678052 1527713
58448 1527713 1291701 1414323 1718997 1541654 977024 996241 2002484 3087185 3186878
58439 3186878 2324717 1189115 87297 -993335 -1718005 -1633795 -958252 -417531 -248730
58430 -248730 16941 650315 1208857 1227547 949969 936506 1212486 1245201 655609 -437015
58420 -437015 -1731033 -2981138 -3833929 -3851074 -3021456 -2049036 -1787129 -2405135 -3309971
58411 -3309971 -3794568 -3535789 -2632398 -1587604 -1188082 -1813820 -2712183 -2553382 -1040147
58402 -1040147 597935 1153990 860220 583923 270206 -699103 -1953030 -2340277 -1800772
58393 -1800772 -1615710 -2305423 -2648510 -1662332 -336113 -158174 -852168 -1056340 -642115
58384 -642115 -693246 -1390072 -1638007 -1036149 -642200 -1225511 -2086338 -2298195 -1972273 -1549017
58374 -1549017 -940767 -264597 -388621 -1645823 -2830759 -2672984 -1675916 -1275262 -1713039
58365 -1713039 -2073573 -2024399 -2043960 -2072888 -1490048 -589415 -578563 -1654319 -2426162 -1920809
58355 -1920809 -1015408 -1076806 -2106004 -3091188 -3466622 -3352138 -2899130 -2234289 -1693847
58346 -1693847 -1454864 -1243415 -850582 -450398 7253 1000831 2423477 3158606 2546470
58337 2546470 1594117 1686505 2647981 3249735 3207724 3325027 3813610 3894462 3240126 2532511
58327 2532511 2218034 1838709 1086241 509287 551576 706904 310995 -424815 -788896 -540888
58317 -540888 -35779 228285 -147294 -1203784 -2310659 -2634304 -2204322 -1895746 -2031155
58308 -2031155 -1758678 -355358 1550912 2733971 2776475 2061765 947548 -241328 -865330
58299 -865330 -527374 268044 786279 1105575 1672506 2135715 1675084 445557 -367255
58290 -367255 -146950 401111 417419 21605 -136853 184918 794796 1463859 1901590 1756378
58280 1756378 1109149 658285 973204 1781422 2371170 2482625 2387127 2246139 1889657 1273571
58270 1273571 725181 508690 410740 78697 -316187 -155266 704319 1433874 1128047 66550
58260 66550 -530190 -115856 511298 553340 511696 1331032 2694415 3241978 2469152 1372337
58250 1372337 929462 885580 580537 162247 148776 279884 -229611 -1360322 -2043697 -1481328
58240 -1481328 -165218 730129 653208 81302 -194796 100080 610401 883249 893181 989657
58230 989657 1353155 1666190 1499348 966291 723872 1177418 1867341 1892348 889793 -657298
58220 -657298 -2069815 -3054179 -3496358 -3164509 -2136874 -1252040 -1390912 -2226499 -2387422
58211 -2387422 -1189742 371637 819678 -64647 -1222451 -1683378 -1358357 -700103 -214656
58202 -214656 -269137 -852216 -1483434 -1710599 -1607065 -1438312 -1089472 -358721 380226 471410
58192 471410 -107108 -720741 -938241 -817717 -416090 260564 804767 683678 87059 -241646
58182 -241646 -117599 -20089 32918 660567 1798222 2343296 1852762 1581480 2797134 4789792
58172 4789792 5729298 5086054 4030174 3584755 3503952 3093948 2200133 1082296 -17592
58163 -17592 -879300 -1324476 -1426413 -1375423 -1107954 -437364 460694 1090130 1161001 735800
58153 735800 -51603 -1014566 -1759208 -1982309 -1873859 -1796074 -1673785 -1192763 -468645 89276
58143 89276 525980 1280934 2315935 2964882 2824679 2203245 1496586 734652 25722 -145374
58133 -145374 492674 1496233 2190104 2376398 2263268 1975785 1469882 767105 50809
58124 50809 -353332 -63314 988135 2194228 2680389 2267196 1707047 1774874 2416168 2937789
58114 2937789 2717475 1609368 46799 -1104974 -1243132 -774988 -705878 -1264399 -1505429
58105 -1505429 -634123 872461 1994331 2485167 2773434 2944060 2641887 1867799 1126750
58096 1126750 740104 588521 553292 644390 652107 272995 -271932 -314313 309162 865030
58086 865030 632995 -142026 -595321 -336404 183933 353179 122269 -67384 72054 307076
58076 307076 234333 -148991 -478868 -597264 -700821 -765829 -304336 855896 1896145 1755942
58066 1755942 472259 -818592 -1215595 -832187 -263509 23168 -357277 -1555590 -2888954
58057 -2888954 -3110440 -1864060 -293400 469970 862219 2006487 3660780 4281687 3274009
58048 3274009 1993496 1895780 2566827 2497920 1339757 352942 605021 1596869 2056763
58039 2056763 1550251 779417 488871 570651 354044 -515613 -1726955 -2750361 -3368279
58030 -3368279 -3617466 -3394850 -2480923 -1032730 292496 995877 1316147 1792094 2361949
58021 2361949 2361593 1484549 274965 -576053 -1020983 -1359333 -1462831 -859400 450603 1790069
58011 1790069 2569701 2853808 2942438 2748020 1964915 700454 -449454 -992627 -970727
58002 -970727 -747731 -557989 -358724 -29442 375204 577424 309043 -381357 -1144380 -1739034
57992 -1739034 -2295585 -2975933 -3481136 -3235301 -2125911 -751869 210410 584091 429821
57983 429821 -390026 -1857222 -3177039 -3198465 -1688014 275167 1482149 1822635 1995461
57974 1995461 2337814 2488255 2143231 1641046 1628930 2381049 3497023 4104773 3464819
57965 3464819 1704588 -72555 -770823 -427434 -17002 -154606 -492144 -519608 -383143
57956 -383143 -543458 -1069661 -1723131 -2406693 -3047113 -3305399 -2963209 -2454736 -2449098 -2923699
57946 -2923699 -3170904 -2781853 -2154601 -1908185 -2187554 -2668733 -2892391 -2488536 -1459619
57937 -1459619 -398169 -48561 -449990 -861506 -751751 -464873 -557255 -844356 -657952
57928 -657952 96453 755445 900665 1016325 1758809 2869052 3346496 2733224 1740670
57919 1740670 1323881 1499349 1566505 1320408 1368217 2057031 2688858 2275655 764497 -928272
57909 -928272 -1898504 -1898366 -1257041 -629962 -650312 -1332592 -1915920 -1727782 -1039237 -585267
57899 -585267 -487228 -332676 -145427 -391861 -963726 -1069963 -416884 335835 652330 801262
57889 801262 944350 407776 -1301607 -3341039 -4344217 -4126668 -3732301 -3880952 -4151617
57880 -4151617 -3786770 -2665428 -1261093 -55526 758137 1175619 1171021 669133 -166149
57871 -166149 -745103 -553316 139583 586416 684247 1121342 2131424 2898037 2752082 2198944
57861 2198944 1982209 1829166 1151471 459343 814933 2045304 2742214 2160346 1031657
57852 1031657 268211 -118086 -420658 -471454 -19065 724848 1354614 1642201 1419297 636331
57842 636331 -245671 -508454 -62759 473625 743468 1021539 1411811 1452543 890610 121412
57832 121412 -557352 -1386798 -2348492 -2706365 -2040944 -1103813 -870652 -1239459 -1439958 -1300250
57822 -1300250 -1263956 -1431606 -1413684 -1011475 -359640 454348 1245713 1402730 501855 -763327
57812 -763327 -1046620 74597 1562954 2138758 1571849 623319 153489 511305 1496247
57803 1496247 2658838 3666911 4401100 4754158 4633065 4272011 4140193 4290296 4253000
57794 4253000 3899002 3790683 4118063 3983581 2698183 1280899 1411236 2994133 4039832
57785 4039832 3186250 1200244 -402386 -1138392 -1386168 -1413689 -1365454 -1524493 -1819696
57776 -1819696 -1615649 -693165 104091 -39253 -684710 -873476 -640516 -737329 -1069914 -640275
57766 -640275 737415 1752082 1209503 -379178 -1472803 -1350119 -682726 -477664 -1001996
57757 -1001996 -1750875 -2074841 -1712740 -899827 -74091 518441 888921 1024584 784234
57748 784234 230234 -136611 211728 1172099 2000113 2051452 1381840 519154 -183387 -744904
57738 -744904 -1183780 -1282801 -929631 -524784 -750531 -1866093 -3370690 -4407099 -4425282
57729 -4425282 -3542894 -2494817 -2189674 -2916350 -3806247 -3462503 -1500564 781742 1719590
57720 1719590 1113538 229813 68402 358055 466283 501142 865721 1249158 943582 34507
57710 34507 -558342 -344639 152523 311938 245740 352479 649604 1038855 1679130 2446667
57700 2446667 2488167 1180372 -637765 -1284476 -202241 1407710 2084939 1593270 706942
57691 706942 201048 429317 1335656 2395621 2890940 2611200 1991054 1354446 521438
57682 521438 -542282 -1318790 -1513066 -1662679 -2270909 -2801082 -2404491 -1375342 -918861
57673 -918861 -1487193 -2249412 -2369219 -1973294 -1545043 -1114696 -558434 -175267 -379600 -1037496
57663 -1037496 -1537700 -1441732 -826149 -83499 442680 698617 879619 1109140 1264000 1290203
57653 1290203 1492445 2132619 2871346 3100448 2804087 2555310 2605712 2563272 2154506 1743272
57643 1743272 1783816 2187835 2515597 2410385 1625569 105998 -1612973 -2526252 -2130314
57634 -2130314 -1026351 -231724 -148256 -474646 -794935 -887254 -696214 -326975 98060 709512
57624 709512 1670350 2546396 2439287 1105374 -534222 -1406043 -1344875 -743255 237707
57615 237707 1421031 2082702 1589695 429694 -181491 272075 1164249 1645491 1406814
57606 1406814 593307 -397045 -970284 -754780 -95681 242489 -104263 -840947 -1387544
57597 -1387544 -1183684 7152 1556650 2138608 1182192 -182485 -506750 -11823 -57323
57588 -57323 -814462 -926005 235634 1418058 1312809 362749 -158102 44988 396914
57579 396914 685357 1132102 1640536 1898772 1962385 1984885 1719775 1062820 685432 1194354
57569 1194354 1944986 1718373 462659 -702786 -1266079 -1989262 -3465937 -5026817 -5689379
57560 -5689379 -5445808 -4883649 -4041278 -2478019 -350225 1301027 1532476 426188 -1099555
57551 -1099555 -2164631 -2449841 -2029675 -1052002 197316 1113199 1136233 458550 -46989
57542 -46989 80696 253173 -234149 -975507 -887124 231168 1358431 1618481 1238909 852379
57532 852379 575588 311792 379899 1137460 2306128 3330906 4149462 4888411 5000219
57523 5000219 3650937 1140044 -954545 -1539975 -1257143 -1360395 -1916105 -1990397 -1351965
57514 -1351965 -915270 -1271307 -1721075 -1364810 -503591 -174383 -617553 -1024191 -762753
57505 -762753 -123679 292947 328210 209312 272520 936396 2377521 3916690 4291282 3030116
57495 3030116 1168320 125997 227116 795636 1292966 1677252 1901411 1845089 1732230
57486 1732230 1929627 2241339 1996246 973904 -253970 -1013180 -1102682 -659500 -17561
57477 -17561 210303 -451161 -1600599 -2192985 -1763639 -875176 -108153 708463 1815273
57468 1815273 2731950 2821177 2196604 1373082 364549 -1083699 -2560784 -3159770 -2673589
57459 -2673589 -1883670 -1413135 -909454 251287 1893782 3153901 3460432 2989313 2192179
57450 2192179 1266298 251928 -591698 -837567 -374441 376250 869592 913455 608295
57441 608295 89107 -340060 -93081 1061316 2290186 2320936 965604 -609046 -1383367
57432 -1383367 -1559836 -1736537 -1761548 -1117234 82403 1225712 1933426 1974308 980104
57423 980104 -833255 -2103078 -1648847 -215897 285690 -695780 -1799536 -1900419 -1507078
57414 -1507078 -1490104 -1601646 -1106441 -50571 964845 1683965 2106576 2014652 1330028
57405 1330028 537303 108551 -89573 -270642 -180723 237917 246441 -706389 -1836664 -1870627
57395 -1870627 -795652 213110 487851 529075 980684 1837400 2746941 3320110 3097652
57386 3097652 1957842 553496 -403846 -1160426 -2289587 -3223615 -2727462 -994193 190989
57377 190989 -44328 -363445 667487 2385562 3163579 2811221 2429049 2435949 2240666 1694647
57367 1694647 1444153 1679600 1728691 1187209 445911 -227978 -1171736 -2457034 -3412388
57358 -3412388 -3560651 -3292666 -3028049 -2422384 -1149053 126504 468553 39456 -168285
57349 -168285 173245 421656 200163 1443 221772 391081 -65906 -835827 -1097912 -568373
57339 -568373 377696 1297226 1750181 1074370 -1000305 -3439212 -4491805 -3594128 -2040289
57330 -2040289 -1326508 -1450256 -1443413 -1016119 -782231 -1070044 -1398445 -1236402 -639581 -17216
57320 -17216 216719 -259891 -1349248 -2259629 -2182894 -1338525 -712151 -690121 -729258 -530829
57310 -530829 -577606 -1071326 -1300595 -771346 -137822 -151723 -415288 -206570 61905 -543257
57300 -543257 -1720788 -2104741 -1190571 97068 884429 1234569 1302124 811239 -63805
57291 -63805 -335299 499863 1527505 1550161 622910 -222905 -297908 401623 1708817 3292420
57281 3292420 4340008 4054496 2593196 1046578 405400 789439 1555840 1880392 1442462
57272 1442462 866012 1223035 2706547 4105452 4146116 3127072 2547427 3161812 4113161
57263 4113161 4178849 3271783 2318977 2008760 2105206 1948580 1317174 621208 283306 145257
57253 145257 -253816 -888973 -1188976 -926775 -683686 -1023158 -1595286 -1622329 -1024941 -432645
57243 -432645 -190294 -33369 212402 300759 164563 243711 806719 1332314 1025582 -175460
57233 -175460 -1419152 -1754736 -1005706 129373 804168 866529 864151 1150566 1310407 805789
57223 805789 -123602 -769329 -960922 -1046716 -941428 -103746 1299710 2134916 1772960 1090002
57213 1090002 1264789 2115391 2464860 1838307 941012 554711 715996 983826 857678
57204 857678 -62152 -1643483 -2900477 -2814320 -1627925 -642202 -537900 -643835 -170331
57195 -170331 660622 1267504 1720060 2295828 2614967 2192330 1485139 1307921 1357504 522952
57185 522952 -1189058 -2289505 -1886043 -989696 -908704 -1298572 -963668 52252 550505
57176 550505 114695 -428045 -593552 -937666 -1710528 -2020508 -1118645 364535 1303695
57167 1303695 1523216 1531024 1426439 1016757 559147 388174 136387 -633431 -1258951 -612404
57157 -612404 1095282 2312822 2177277 1483176 1303896 1691575 2225670 2849863 3482146
57148 3482146 3624332 3120941 2641215 2683087 2750576 2289463 1756671 1810200 2042740 1677831
57138 1677831 1107350 1386237 2267959 2131095 218343 -2193279 -3415161 -3246533 -2611206
57129 -2611206 -2024798 -1254962 -186299 735858 1007204 663313 280023 421991 1053797
57120 1053797 1602939 1755693 1917184 2500734 3103248 3078707 2696530 2775444 3173525 2788438
57110 2788438 1403099 365573 724066 1686111 1880306 1356694 1225001 1863339 2668144
57101 2668144 3248778 3693753 3836458 3442599 3067252 3501428 4281904 4030718 2556764
57092 2556764 1303094 1177441 1267128 593007 -50083 726991 2666529 4175657 4469274
57083 4469274 4069872 3360642 2049934 290160 -926061 -1032267 -654484 -560694 -594381
57074 -594381 -267001 212186 229393 -273336 -783892 -935705 -676639 56875 1222808 2331784
57064 2331784 2828217 2839003 2997493 3437674 3525304 2827028 1837766 1315215 1209618 784996
57054 784996 -253053 -1231103 -1268488 -259024 1124231 2193936 2722341 2748506 2316933
57045 2316933 1587015 929511 604080 441307 142751 -148090 72479 936354 1888197
57036 1888197 2288422 2076680 1640199 1287571 1125607 1221058 1511212 1671129 1434605 993143
57026 993143 732736 620109 244819 -486256 -1081607 -1027535 -340597 526035 1049313 878305
57016 878305 105767 -564783 -328291 811709 1980903 2487042 2513360 2470131 2183394 1314767
57006 1314767 224825 -333776 -279522 -231614 -449024 -496245 -183543 -81226 -597911 -1127695
56996 -1127695 -823864 44244 234466 -930860 -2738915 -3986939 -4304102 -4302921 -4647387
56987 -4647387 -5271752 -5498993 -4754309 -3112526 -1216579 254526 991645 1022036 496782
56978 496782 -372716 -1340536 -2296314 -3310746 -4294177 -4729460 -4110828 -2691364 -1417336
56969 -1417336 -923126 -890263 -674571 -304797 -430060 -1336584 -2443950 -2914777 -2506196
56960 -2506196 -1700408 -1220395 -1537624 -2598755 -3792036 -4325813 -3905184 -3019510 -2407753
56951 -2407753 -2296927 -2318092 -2066974 -1494167 -763155 -6040 677791 1178254 1453987 1520520
56941 1520520 1262828 414806 -1102518 -2878081 -4189936 -4506171 -3778003 -2317781 -526904
56932 -526904 1212436 2477547 2849920 2241217 1191991 566754 692224 923850 364629
56923 364629 -1041275 -2454268 -3145278 -3134344 -2745940 -2035969 -984527 120154 912700
56914 912700 1338144 1438651 1013447 -23172 -1122844 -1521009 -1161587 -671438 -395437
56905 -395437 -80783 303183 119410 -1051521 -2504773 -3002659 -2155831 -763469 145657
56896 145657 187631 -419774 -1282233 -2017723 -2326301 -2124229 -1533532 -681500 333743 1230676
56886 1230676 1553194 1115001 308697 -283609 -570210 -990401 -1799063 -2567890 -2661101 -2097186
56876 -2097186 -1570080 -1488302 -1320852 -264382 1537250 2879842 2803173 1745347 1081107
56867 1081107 1565227 2532394 2748580 1821968 491363 -435863 -1051753 -1980500 -3268761
56858 -3268761 -4154837 -4084327 -3515862 -3335179 -3716448 -4018824 -3701546 -2840174 -1713104
56849 -1713104 -422057 849180 1664073 1808030 1653088 1667974 1768156 1568172 1177321
56840 1177321 1294269 2406177 4146841 5518445 5600380 4137325 1774263 -224624 -831502
56831 -831502 -86840 1005385 1507964 1364048 1140860 1192963 1302254 1066942 419719 -299135
56821 -299135 -666085 -491078 129562 938743 1605574 1771653 1256443 354939 -251564 -142522
56811 -142522 350083 570094 409660 367870 673133 853091 508159 46433 47415 185152
56801 185152 -384154 -1535701 -2008646 -1154588 -30490 25439 -687785 -772811 91819 738622
56791 738622 437117 33783 555392 1610782 2054548 1633986 1049158 749999 607800
56782 607800 591580 852235 1153544 1048253 658404 497859 503683 145931 -373377 -69439
56772 -69439 1263575 2410827 2304691 1426623 870742 702485 214840 -622464 -1038914
56763 -1038914 -719971 -294221 -429510 -1083256 -1790246 -2191654 -2142185 -1670145 -950135 -131876
56753 -131876 705465 1261060 1033863 51794 -769836 -581525 324260 974914 985691 657682
56743 657682 64143 -1019254 -2250060 -2711122 -2029353 -819816 149536 558426 243703
56734 243703 -791288 -1838572 -1909578 -1118574 -714147 -1192843 -1390711 -310925 1044484
56725 1044484 876915 -881533 -2516584 -2847206 -2372836 -1987862 -1703113 -1147235 -532747
56716 -532747 -454584 -1064885 -1894390 -2324697 -2024901 -1138056 -193928 378068 735500 1343544
56706 1343544 2128236 2305837 1339966 -197681 -1081279 -677954 504886 1462692 1607411
56697 1607411 987269 -89964 -1286785 -2087868 -1854736 -454126 1248898 1971690 1261021
56688 1261021 -84912 -933187 -865557 -227953 439094 734923 514878 46246 -167719
56679 -167719 561 147877 73671 236351 982982 1711640 1486724 287655 -1041653
56670 -1041653 -1932458 -2409949 -2364950 -1472430 -66340 809825 706918 412966 742144
56661 742144 1305309 1172160 288299 -564332 -979102 -1285815 -1714322 -1965737 -1878039 -1953273
56651 -1953273 -2764056 -4031655 -4681689 -3920471 -2158644 -742345 -665708 -1594688 -2352315
56642 -2352315 -2333895 -2049099 -2088039 -2052707 -1107887 594461 1766125 1480682 317307
56633 317307 -365919 -4687 753245 1083878 963921 948173 1311491 1793167 2131466 2420901
56623 2420901 2705777 2551072 1522352 58693 -693307 -187515 788165 1070014 493575
56614 493575 -183130 -494903 -720303 -1086765 -1262672 -1008703 -766842 -1030433 -1461574 -1288618
56604 -1288618 -478918 141311 42006 -342732 -393586 -230600 -362966 -752763 -877286 -669939
56594 -669939 -720025 -1264610 -1524750 -611377 1106987 2182459 1815402 917993 1007218 2268667
56584 2268667 3333538 3103323 2170960 1887678 2412423 2563452 1668576 601805 394921
56575 394921 571370 -128761 -1656536 -2428085 -1403251 552172 1845930 1960620 1482899
56566 1482899 936266 372749 -151783 -455702 -594308 -840890 -1283486 -1763760 -2114752
56557 -2114752 -2168235 -1761680 -1114424 -889331 -1356152 -1776402 -1272265 -92259 749229
56548 749229 960400 1192005 1705393 1811189 1024604 -43673 -501848 -286594 61818
56539 61818 216536 117795 -349439 -1153435 -1877410 -2159253 -2126383 -2046656 -1908435 -1720342
56529 -1720342 -1760145 -2004813 -1776889 -653027 603711 800068 -141967 -1136542 -1388274
56520 -1388274 -1174452 -1103833 -1280446 -1444459 -1447827 -1321516 -1154821 -1033481 -896202 -529205
56510 -529205 13486 203283 -266789 -800613 -621793 -107994 -530019 -2221090 -3815641
56501 -3815641 -3789086 -2153319 -112497 1421446 2318884 2637521 2362235 1758225 1366743
56492 1366743 1422939 1578731 1357720 702367 -50520 -647859 -1256361 -2227735 -3476308
56483 -3476308 -4249846 -3802039 -2275246 -600819 502091 1049689 1267014 1110694 668878
56474 668878 542815 1224119 2294186 2825483 2546805 2102362 2107629 2429246 2558643 2285879
56464 2285879 1738927 1039855 234690 -555571 -1154284 -1445674 -1320165 -620011 613236
56455 613236 1864323 2419744 2083162 1441800 1211268 1428504 1567966 1399954 1309692 1581625
56445 1581625 1779948 1291496 283208 -430559 -495691 -453677 -856472 -1409088 -1395125 -704078
56435 -704078 118 87861 -391905 -917083 -1100448 -976157 -771793 -515469 5397 784418
56425 784418 1219634 556599 -1136065 -2720002 -3016571 -1979111 -614378 139835 159170
56416 159170 -200689 -792316 -1764655 -3053105 -4050839 -4006355 -2793206 -1145553 -708
56407 -708 291431 -37182 -754553 -1800374 -2907260 -3548319 -3483781 -3017816 -2500540 -1930147
56397 -1930147 -1318861 -1059797 -1461525 -2116423 -2194130 -1322566 127693 1526154 2438379
56388 2438379 2736103 2611792 2411031 2173554 1533634 451778 -223548 417982 1969678
56379 1969678 2839230 2013622 190542 -1156392 -1410133 -1091537 -799462 -429549 439528
56370 439528 1709774 2648983 2708008 2251790 2129166 2498053 2566959 1793038 808566 536791
56360 536791 769307 502552 -410001 -932059 -396696 539431 966600 954157 1046101 1124727
56350 1124727 589111 -602819 -1756125 -2193827 -1731887 -628867 450158 669612 -204634
56341 -204634 -1395959 -1942580 -1742798 -1333106 -964037 -547126 -239267 -279468 -394803 -225614
56331 -225614 -252185 -1283895 -2921498 -3651800 -2887175 -1852419 -1793269 -2279266 -2200508 -1638489
56321 -1638489 -1537326 -1947784 -1902376 -1033826 -156523 41518 -66838 137243 500562 422240
56311 422240 -285086 -1313888 -2275555 -2813699 -2643367 -1862096 -962665 -236917 519951
56302 519951 1404575 1914977 1554970 630058 -112384 -429833 -589581 -607672 -219265 372839
56292 372839 506247 74322 -173594 233759 692866 458291 -157731 -315437 -52838 -192935
56282 -192935 -840560 -978516 29109 1338943 1691563 1046655 413652 351057 426577 112110
56272 112110 -536046 -1225275 -1809644 -2102509 -1899300 -1496767 -1616128 -2365628 -2807696 -2174194
56262 -2174194 -1097133 -830209 -1435462 -1662273 -774297 358204 437583 -602246 -1683988
56253 -1683988 -1962259 -1544520 -1040278 -931349 -1357799 -2102753 -2727826 -2965378 -2941896 -2819663
56243 -2819663 -2399924 -1422837 -109796 1035320 1895623 2703437 3307758 3092441 1925391
56234 1925391 700179 434117 1035372 1426204 859141 -252641 -878867 -471232 622108
56225 622108 1675715 2278159 2413674 2017268 822572 -1105485 -2934139 -3634538 -3042588
56216 -3042588 -1976795 -1222904 -813358 -446021 -83262 243567 764398 1526451 1892935
56207 1892935 1163809 -315977 -1259552 -785863 748954 2318472 3143245 2944079 1881255
56198 1881255 628340 92998 564037 1292077 1297846 486689 -379855 -718022 -723480 -897959
56188 -897959 -1323859 -1593093 -1302903 -493835 340864 656706 369028 -28010 19102 477399
56178 477399 786420 633720 437113 807885 1657306 2205102 1981147 1492351 1596991 2394369
56168 2394369 3120637 3115387 2464206 1578760 626005 -285621 -764878 -547666 -68973 -24815
56158 -24815 -385308 -458831 -35382 218923 -165803 -641776 -466239 125396 301784 -46628
56148 -46628 -170874 337381 961893 1101264 849802 584289 322247 -5445 -52794 522497
56138 522497 1283928 1293089 263285 -1029566 -1664240 -1542318 -1226368 -1125067 -1178215 -1217393
56128 -1217393 -1270918 -1409553 -1503464 -1347356 -1036583 -1046373 -1736593 -2764303 -3226736 -2596311
56118 -2596311 -1389279 -643282 -781712 -1290020 -1507135 -1350519 -1121940 -989002 -959158
56109 -959158 -1077735 -1281977 -1252261 -806295 -327116 -390955 -1012000 -1647762 -1935105 -1998737
56099 -1998737 -1991040 -1781322 -1260544 -577496 104723 755597 1235657 1288620 979471 768156
56089 768156 906482 1135770 1255290 1569681 2369697 3321791 3845896 3843629 3588764 3123120
56079 3123120 2257878 1029158 -280001 -1402897 -1996746 -1637577 -505723 240335 -407424
56070 -407424 -1900485 -2684968 -2180646 -1349728 -1143753 -1303746 -1108906 -525352 -37007
56061 -37007 117707 17486 -211546 -346081 -206351 -174917 -969884 -2459890 -3383104 -2882331
56051 -2882331 -1696556 -1047862 -919562 -435209 440231 746994 40822 -1011857 -1709877
56042 -1709877 -2053010 -2169803 -1926885 -1502679 -1521146 -2065872 -2243676 -1383459 -155794
56033 -155794 218776 -448890 -1245993 -1497557 -1436344 -1471761 -1458032 -1025986 -263656 325943
56023 325943 442907 289324 218768 241859 -12718 -845765 -2055583 -3024791 -3252011 -2748784
56013 -2748784 -1898868 -1031284 -257036 319040 477334 196726 -9219 559821 1911217
56004 1911217 3083588 3072145 1906703 497103 -430746 -786687 -655855 -142866 136393
55995 136393 -785234 -2984208 -5090404 -5652276 -4744670 -3605064 -3009524 -2774067 -2640691
55986 -2640691 -2719202 -2952499 -2973791 -2755859 -2707792 -2818150 -2364213 -924947 833916 1901508
55976 1901508 2099525 2032240 2113325 2144847 1786302 1041690 242278 -239916 -268644 -70999
55966 -70999 -42760 -338858 -743872 -1004107 -1135765 -1298162 -1492851 -1534685 -1308300 -1002142
55956 -1002142 -1027360 -1559741 -2147004 -2066722 -1251708 -511514 -511071 -913920 -1042297 -1004026
55946 -1004026 -1409173 -2180824 -2553216 -2291459 -2036046 -2243714 -2594914 -2693924 -2543981 -2027576
55936 -2027576 -786215 917829 2028341 1944085 1228822 540741 -345850 -1756425 -3142051
55927 -3142051 -3791697 -3923978 -4144177 -4317348 -3954575 -3305434 -3024541 -3009697 -2583943 -1673570
55917 -1673570 -847201 -320487 117663 314221 -73873 -641061 -538534 180183 559918
55908 559918 267736 64605 452803 882034 768653 408601 348517 613380 1050231 1694926
55898 1694926 2302573 2284612 1685962 1449953 2009339 2345610 1334863 -518344 -1654682
55889 -1654682 -1424139 -531419 262412 867708 1256634 1109055 454471 -12950 219794
55880 219794 674657 399073 -804509 -2029963 -2230678 -1324873 -173981 426514 430661
55871 430661 189470 -89767 -146689 576123 2160698 3381159 2702189 379933 -1420658
55862 -1420658 -1179748 138931 551381 -377734 -1415369 -1590628 -1057520 -200275 873848
55853 873848 1700564 1402415 -145450 -1790515 -2344477 -1895861 -1371924 -1214759 -1121944
55844 -1121944 -871863 -720679 -914191 -1321413 -1723005 -2067452 -2233309 -1935693 -1256731
55835 -1256731 -964997 -1683614 -2741265 -2540945 -437732 2252501 3628617 3236379 2175197
55826 2175197 1540463 1552978 2033442 2707287 2874450 1817881 41270 -785706 175067
55817 175067 1667617 1850702 506962 -1096910 -2047449 -2431634 -2419674 -1880059 -1037758
55808 -1037758 -517483 -407945 -68527 779250 1473134 1371431 823084 660789 1113578
55799 1113578 1708888 1979530 1808654 1259933 524061 -16977 -72065 142228 69853 -433034
55789 -433034 -714760 -1213 1508442 2536365 2027629 398460 -948141 -1287970 -1142168
55780 -1142168 -1069885 -745033 179091 1012927 806018 -169247 -722277 -427891 -15943 -48864
55770 -48864 -250987 -393804 -807696 -1520650 -1807493 -1278412 -679604 -827564 -1313497 -1129817
55760 -1129817 -213101 540315 665785 700050 1264391 2208729 2841281 2598020 1423666
55751 1423666 -104150 -983232 -573278 643424 1410220 995724 -75980 -731642 -544698
55742 -544698 4873 326556 458082 897259 1891453 3157721 4289246 5106130 5456906
55733 5456906 5078563 4071191 3187057 3001279 2938747 1913966 -1553 -1442358 -1600467
55724 -1600467 -1306341 -1637290 -2255748 -2076810 -1088793 -426039 -747511 -1505350 -1920212
55715 -1920212 -1878656 -1659560 -1428639 -1267139 -1219666 -1115901 -741894 -282598 -169957 -431245
55705 -431245 -648848 -619093 -546646 -531490 -450927 -474021 -1034989 -2020953 -2598129 -2216486
55695 -2216486 -1261376 -341407 498799 1355092 1780391 1204547 -228929 -1821283 -3097531
55686 -3097531 -3902203 -3970649 -3068722 -1520461 -42769 977184 1635979 2044565 2202410
55677 2202410 2279752 2472943 2549847 2084980 1237710 752485 1009163 1558560 1794143 1611163
55667 1611163 1188681 631155 136532 37488 302203 462266 473383 1122418 2892677 4796204
$$ [...]
##END NTUPLES=NMR SPECTRUM
##END=
