##TITLE=31Pdec_DE-135_oil7
, 24 sc
 31.3.2026
##JCAMPDX= 6.0         $$ Bruker NMR JCAMP-DX V2.0
##DATA TYPE= NMR SPECTRUM
##DATA CLASS= NTUPLES
##ORIGIN= UXNMR, Bruker Analytische Messtechnik GmbH
##OWNER= root
$$ XWIN-NMR		Version 3.5
$$ Tue Mar 31 16:03:57 2026 Russian Standard Time (UT+4h)  she@DPX200
##.OBSERVE FREQUENCY= 81.013821
##.OBSERVE NUCLEUS= ^31P
##.ACQUISITION MODE= SIMULTANEOUS
##.ACQUISITION SCHEME= undefined
##.AVERAGES= 24
##.DIGITISER RES= 17
##SPECTROMETER/DATA SYSTEM= spect
##.PULSE SEQUENCE= zgpg30
##.SOLVENT NAME= DMSO
##.SHIFT REFERENCE= (INTERNAL, DMSO, 0, 197.392)
##AUDIT TRAIL= $$ (NUMBER, WHEN, WHO, WHERE, WHAT)
$$ ##TITLE= Audit trail, XWIN-NMR		Version 3.5
$$ ##JCAMPDX= 5.01
$$ ##ORIGIN= Bruker BioSpin GmbH
$$ ##OWNER= she
$$ F:/spectra/data/she/nmr/P31/2/pdata/1/auditp.txt
$$ ##AUDIT TRAIL=  $$ (NUMBER, WHEN, WHO, WHERE, WHAT)
(   1,<2026-03-31 16:01:38.12 +0400>,<she>,<DPX200>,
      <created by zg, POWCHK disabled, PULCHK disabled
       configuration hash MD5:
       00 E9 B6 7A A2 85 ED C7 34 08 36 98 17 FE 4E 26
       data hash MD5: 32K
       F0 42 EF 51 8E 45 B5 53 8A 1C 75 20 D3 10 51 8F>)
(   2,<2026-03-31 16:02:18.98 +0400>,<she>,<DPX200>,
      <Start of raw data processing
       efp BC_mod = 2 LB = 1.5 FT_mod = 6 PKNL = 1 PHC0 = 1435.848 PHC1 = -73.49934 SI = 64K 
       data hash MD5: 64K
       BE 15 E4 71 BB 7C 5D 3D D5 A8 B8 77 C7 41 A7 1C>)
(   3,<2026-03-31 16:03:01.84 +0400>,<she>,<DPX200>,
      <pk PHC0 = -21.68612 PHC1 = 128.2001 
       data hash MD5: 64K
       5A 3D 10 24 BC 0C 1B DE 3A 4D C3 EE 2E E0 6B DD>)
(   4,<2026-03-31 16:03:05.68 +0400>,<she>,<DPX200>,
      <abs ABSG = 5 
       data hash MD5: 64K
       C1 DB 7A E6 1D 47 BF CE D8 1F E8 D4 A3 A8 6F 3F>)
$$ ##END=
$$ 
$$ hash MD5
$$ 30 AC 61 6F 17 FC AB 32 0A 24 45 B5 B6 6D 5D C1
##$RELAX= 
##$RELAX= 
##$RELAX= 
##$RELAX= 
##$RELAX= 
##$RELAX= 
##$RELAX= 
##$RELAX= 
$$ Bruker specific parameters
$$ --------------------------
##$DU= <F:/spectra>
##$EXPNO= 2
##$NAME= <P31>
##$PROCNO= 1
##$TYPE= <nmr>
##$USER= <she>
##$AMP= (0..31)
100 100 100 100 100 100 100 100 100 100 100 100 100 100 100 100 100 100 
100 100 100 100 100 100 100 100 100 100 100 100 100 100 
##$AQSEQ= 0
##$AQ_mod= 1
##$AUNM= <au_zg>
##$AUTOPOS= <>
##$BF1= 81.014009
##$BF2= 200.13
##$BF3= 200.13
##$BF4= 200.13
##$BF5= 200.13
##$BF6= 200.13
##$BF7= 200.13
##$BF8= 200.13
##$BYTORDA= 1
##$CFDGTYP= 0
##$CFRGTYP= 5
##$CHEMSTR= <none>
##$CNST= (0..31)
1 1 145 1 1 1 1 1 1 1 1 1 1 1 1 1 1 1 1 1 1 1 1 1 1 1 1 1 1 1 1 1 
##$CPDPRG= <waltz16>
##$CPDPRG1= <>
##$CPDPRG2= <waltz16>
##$CPDPRG3= <>
##$CPDPRG4= <mlev>
##$CPDPRG5= <mlev>
##$CPDPRG6= <mlev>
##$CPDPRG7= <mlev>
##$CPDPRG8= <mlev>
##$CPDPRGB= <>
##$CPDPRGT= <>
##$D= (0..31)
0 1 0 0 0 0 0 0 0 0.06 0 0.03 2e-05 3e-06 0 0 0.0002 0 0 0 0 0 0 0 0 0 
0 0 0 0 0 0 
##$DATE= 1774958497
##$DBL= (0..7)
120 120 120 11 120 120 24 19 
##$DBP= (0..7)
150 150 150 150 150 150 150 150 
##$DBP07= 0
##$DBPNAM0= <>
##$DBPNAM1= <>
$$ [...]
##$SUBNAM3= <"">
##$SUBNAM4= <"">
##$SUBNAM5= <"">
##$SUBNAM6= <"">
##$SUBNAM7= <"">
##$SUBNAM8= <"">
##$SUBNAM9= <"">
##$SW= 400.765351723535
##$SWIBOX= (0..15)
0 1 3 0 0 0 0 0 0 0 0 0 0 0 0 0 
##$SW_h= 32467.5324675325
##$TD= 32768
##$TD0= 1
##$TE= 0
##$TE2= 300
##$TE3= 300
##$TEG= 300
##$TL= (0..7)
0 120 53 12 22 120 120 120 
##$TP= (0..7)
150 150 150 150 150 150 150 150 
##$TP07= 0
##$TPNAME0= <>
##$TPNAME1= <>
##$TPNAME2= <>
##$TPNAME3= <>
##$TPNAME4= <>
##$TPNAME5= <>
##$TPNAME6= <>
##$TPNAME7= <>
##$TPOAL= (0..7)
0.5 0.5 0.5 0.5 0.5 0.5 0.5 0.5 
##$TPOFFS= (0..7)
0 0 0 0 0 0 0 0 
##$TUNHIN= 0
##$TUNHOUT= 0
##$TUNXOUT= 0
##$USERA1= <user>
##$USERA2= <user>
##$USERA3= <user>
##$USERA4= <user>
##$USERA5= <user>
##$V9= 5
##$VALIST= <valist>
##$VCLIST= <CCCCCCCCCCCCCCC>
##$VD= 0
##$VDLIST= <DDDDDDDDDDDDDDD>
##$VPLIST= <PPPPPPPPPPPPPPP>
##$VTLIST= <TTTTTTTTTTTTTTT>
##$WBST= 1024
##$WBSW= 4
##$XGAIN= (0..3)
0 0 0 0 
##$XL= 0
##$YL= 0
##$YMAX_a= 7683
##$YMIN_a= -7215
##$ZGOPTNS= <>
##$ZL1= 120
##$ZL2= 120
##$ZL3= 120
##$ZL4= 120
##$ABSF1= 197.3918
##$ABSF2= -203.3724
##$ABSG= 5
##$ABSL= 3
##$ALPHA= 0
##$AQORDER= 0
##$ASSFAC= 0
##$ASSFACI= 0
##$ASSFACX= 0
##$ASSWID= 0
##$AUNMP= <proc_1d>
##$AZFE= 0.1
##$AZFW= 0.5
##$BCFW= 0
##$BC_mod= 2
##$BYTORDP= 0
##$COROFFS= 0
##$CY= -3
##$DATMOD= 1
##$DC= 0
##$DFILT= <>
##$DTYPP= 0
##$F1P= 0
##$F2P= 0
##$FCOR= 1
##$FTSIZE= 65536
##$FT_mod= 6
##$GAMMA= 0
##$GB= 0
##$INTBC= 1
##$INTSCL= 9.790993e-09
##$ISEN= 30
##$LB= 1.5
##$LEV0= 0
##$LPBIN= 0
##$MAXI= 10000
##$MC2= 0
##$MEAN= 0
##$ME_mod= 0
##$MI= 50
##$NCOEF= 0
##$NC_proc= -9
##$NLEV= 6
##$NOISF1= 182.463
##$NOISF2= 159.3651
##$NSP= 0
##$NTH_PI= 0
##$NZP= 0
##$OFFSET= 197.3918
##$PC= 4
##$PHC0= 1414.162
##$PHC1= 54.70077
##$PH_mod= 1
##$PKNL= yes
##$PPARMOD= 0
##$PSCAL= 0
##$PSIGN= 0
##$REVERSE= no
##$SF= 81.014063255964
##$SI= 65536
##$SIGF1= 159.3651
##$SIGF2= -187.1042
##$SINO= 113.3802
##$SIOLD= 16384
##$SREGLST= <1H.CDCl3>
##$SSB= 0
##$STSI= 65536
##$STSR= 0
##$SW_p= 32467.5324675325
##$SYMM= 0
##$S_DEV= 0
##$TDeff= 32768
##$TDoff= 0
##$TI= <>
##$TILT= no
##$TM1= 0
##$TM2= 0
##$TOPLEV= 0
##$USERP1= <user>
##$USERP2= <user>
##$USERP3= <user>
##$USERP4= <user>
##$USERP5= <user>
##$WDW= 1
##$XDIM= 65536
##$YMAX_p= 365096748
##$YMIN_p= -25938368
$$ End of Bruker specific parameters
$$ ---------------------------------
##NTUPLES= NMR SPECTRUM
##VAR_NAME=  FREQUENCY,     SPECTRUM/REAL,   SPECTRUM/IMAG
##SYMBOL=    X,             R,               I
##VAR_TYPE=  INDEPENDENT,   DEPENDENT,       DEPENDENT
##VAR_FORM=  AFFN,          ASDF,            ASDF
##VAR_DIM=   65536,         65536,           65536
##UNITS=     HZ,            ARBITRARY UNITS, ARBITRARY UNITS
##FACTOR=    0.49542278885378, 1,            1
##FIRST=     15991.5117654749, 0,            0
##LAST=      -16476.0207020576, 0,           0
##MIN=       -16476.0207020576, -25938368,   0
##MAX=       15991.5117654749, 365096748,    0
$$ Real data points
##PAGE= N=1
##DATA TABLE= (X++(R..R)), XYDATA
$$ [...]
$$ plain form
43513 7175240 5981404 4000710 3798196 6061873 9114107 10858019 10759419 9797007 8712780
43504 8712780 6814872 3037967 -1872542 -5147655 -4737771 -1792520 623890 1119478
43496 1119478 1011113 1551635 1666119 -372287 -3934382 -6258628 -5650345 -3367198 -2093494
43487 -2093494 -3135662 -5173538 -5474659 -2733935 951220 1882327 -653222 -2961756
43479 -2961756 -1805227 733101 182624 -3184008 -4146655 -379721 3581566 2712764 -1488290
43470 -1488290 -3817283 -2753597 -968364 41771 1317275 2767416 2519241 548640
43462 548640 -858623 -1120716 -2093876 -3729706 -3133787 80032 1676469 -786323 -2998416
43453 -2998416 451397 7924309 12865519 12667858 10547021 9028161 6800392 3270079
$$ packed form
43513G175240j193836j980694k02514K263677L052234J743912r8600r62412j084227
43504H712780j897908l776905m910509l275113M09884K945251K416410M95588
43496A119478j08365N40522J14484k038406l562095k324246O08283K283147J273704
43487b093494j042168k037876l01121K740724L685155R31107k535549k308534
43479b961756J156529K538328n50477l366632r62647L766934L961287q68802m201054
43470a488290k328993J063686J785233J010135J275504J450141k48175j970601
43462E48640j407263k62093r73160j635830N95919L213819J596437k462792k212093
43453b998416L449813P472912M941210j97661k120837j518860k227769l530313
$$ plain form
43445 3270079 1519398 3880296 7617540 8217755 5351024 2728456 2914428 4888192
43437 4888192 6514396 6995342 6330525 4353609 1649948 309345 1982571 5108963
43429 5108963 5601027 1303413 -5060247 -8742238 -8360622 -6679460 -5952102 -4935322 -1934939
43420 -1934939 1379502 1826220 -677743 -3122321 -3673348 -3188710 -2402813 -603194 1976965
43411 1976965 3235176 2271548 1143595 1706578 2628059 1666003 -729532 -2545315 -3646839
43402 -3646839 -5257053 -6698237 -5770173 -2538102 197461 1008617 1736152 3927097 5762209
43393 5762209 4586227 872534 -2608633 -4579141 -5856216 -6644473 -5788966 -3241580
43385 -3241580 -1215517 -1789340 -4562473 -7493106 -8962750 -8316502 -5741475 -2806623
$$ packed form
43445C270079j750681K360898L737244O00215k866731k622568J85972J973764
43437D888192J626204M80946o64817j976916k703661j340603J673226L126392
43429E108963M92064m297614o363660l681991L81616J681162P27358J016780L000383
43420a934939L314441M46718k503963k444578n51027M84638P85897J799619K580159
43411A976965J258211r63628j127953N62983R21481r62056k395535j815783j101524
43402c646839j610214j441184R28064L232071K735563Q11156P27535K190945J835112
43393E762209j175982l713693l481167j970508j277075p88257Q55507K547386
43385c241580K026063n73823k773133k930633j469644O46248K575027K934852
$$ plain form
43377 -2806623 -1862455 -3164102 -3425368 560222 6922784 9655194 5468341 -1989130
43369 -1989130 -6055265 -4085585 711967 3504542 2221630 -1902748 -6238373 -8418732
43361 -8418732 -7203724 -3038345 1932270 4938380 4447309 1400541 -1655811 -3058755
43353 -3058755 -3218729 -2775668 -623096 4326693 9793103 11404360 8444845 5720208
43345 5720208 7561063 12019837 13784716 11305574 7614755 4906492 2364690 -180953
43337 -180953 -552237 1920164 4030482 2815560 -90985 -940619 712919 1868203 689496
43328 689496 -1388222 -2304964 -2000563 -1692544 -1784367 -1243624 1228044 5394128 8735129
43319 8735129 8265727 3749911 -1607178 -4390438 -4120493 -2553401 -1197774 -862289 -2347756
$$ packed form
43377b806623R44168j301647k61266L985590O362562K732410m186853p457471
43369a989130m066135J969680M797552K792575j282912m124378m335625k180359
43361h418732J215008M165379M970615L006110m91071l046768l056352j402944
43353c058755j59974M43061K152572M949789N466410J611257k959515k724637
43345E720208J840855M458774J764879k479142l690819k708263k541802k545643
43337a80953l71284K472401K110318j214922k906545q49634J653538J155284j178707
43328F89496k077718r16742L04401L08019r1823N40743K471668M166084L341001
43319H735129m69402m515816n357089k783260K69945J567092J355627L35485j485467
$$ plain form
43310 -2347756 -5403522 -7457795 -5629713 -370568 4520857 6014659 4854378 4160059
43302 4160059 5998957 9507422 11611952 9737097 4700657 607495 742504 3910158
43294 3910158 6145616 5635028 4262957 4510128 6799730 10070005 12878826 13391208 10405572
43285 10405572 5498590 2389485 2842533 4591291 4633699 3232784 2995024 4920922 7263789
43276 7263789 8182917 8047288 8638090 10629556 12247167 10759620 5705869 67018 -2957186
43267 -2957186 -3860577 -5552929 -8232510 -8400870 -4263567 675453 1967210 365364
43259 365364 624297 4897972 10118357 11887311 8700042 2268540 -4140987 -7289223
43251 -7289223 -5805992 -1295217 3277076 6304802 7835560 8050060 7263603 6796207 7520838
$$ packed form
43310b347756l055766k054273J828082N259145M891425J493802j160281o94319
43302D160059J838898L508465K104530j874855n036440m093162J35009L167654
43294C910158K235458n10588j372071K47171K289602L270275K808821N12382k985636
43285A0405572m906982l109105M53048J748758M2408j400915k37760J925898K342867
43276G263789R19128j35629N90802J991466J617611j487547n053751n638851l024204
43267b957186r03391j692352k679581j68360M137303M939020J291757j601846
43259C65364K58933M273675N220385J768954l187269o431502o409527l148236
43251g289223J483231M510775M572293L027726J530758K14500p86457m67396P24631
$$ plain form
43242 7520838 7745123 5015951 127650 -3333548 -3880206 -3717475 -4614435 -5312280 -4732011
43233 -4732011 -4755499 -7077979 -9368980 -7705987 -1927410 4016769 6470884 4701990
43225 4701990 -37236 -5528262 -8939694 -8616106 -5887756 -3489014 -2291112 -1252775
43217 -1252775 -132391 73894 -581242 -761801 -500499 -1743816 -5140116 -8242834 -8330955
43208 -8330955 -5574473 -2077092 856598 2943440 3568265 2207600 -77582 -1247550
43200 -1247550 -586918 759296 1780155 3063188 5648778 9005355 10953850 9798500
43192 9798500 6234646 2820899 1597224 2585328 4591011 6591826 7710052 6755992
43184 6755992 3286709 -1036743 -3658037 -4051869 -4198792 -5702586 -7769501 -8821943
$$ packed form
43242G520838K24285k729172m888301l461198n46658J62731q96960o97845N80269
43233d732011k3488k322480k291001J662993N778577N944179K454115j768894
43225D701990m739226n491026l411432L23588K728350K398742J197902J038337
43217a252775J120384K06285o55136j80559K61302j243317l396300l102718q8121
43208h330955K756482L497381K933690K086842O24825j360665k285182j169968
43200a247550O60632J346214J020859J283033K585590L356577J948495j155350
43192I798500l563854l413747j223675R88104K005683K000815J118226r54060
43184F755992l469283m323452k621294l93832j46923j503794k066915j052442
$$ plain form
43176 -8821943 -8771452 -8361826 -7223271 -4363933 -419078 2304018 2569073 1780399 1981898
43167 1981898 3154299 3650861 2894008 2146368 2310225 2577698 2454138 3640812 7534390
43158 7534390 11442654 10524021 4448452 -1009512 -1218562 1141607 387508 -3675413 -5869814
43149 -5869814 -3731841 -934733 -1577909 -4832594 -7139861 -6955931 -5388985 -4174424
43141 -4174424 -4526415 -6190484 -6784251 -4432090 -1678093 -3389821 -9444648 -13554457
43133 -13554457 -11882549 -8703714 -9686475 -13201614 -13328468 -8971953 -4417786 -2195628
43125 -2195628 -1018299 -293668 -1018352 -1845579 183560 3818525 3752293 -1500100 -6607809
43116 -6607809 -6709681 -3471341 -1154521 -554743 -134814 50817 -802146 -1802906 -2086302
$$ packed form
43176h821943N0491M09626J138555K859338L944855K723096K65055p88674K01499
43167A981898J172401M96562p56853p47640J63857K67473j23560J186674L893578
43158G534390L908264r18633o075569n457964k09050K360169p54099m062921k194401
43149e869814K137973K797108o43176l254685k307267J83930J566946J214561
43141d174424l51991j664069n93767K352161K753997j711728o054827m109809
43133a3554457J671908L178835r82761l515139j26854M356515M554167K222158
43125b195628J177329P24631p24684q27227K029139L634965o6232n252393n107709
43116f607809j01872L238340K316820N99778M19929J85631q52963j000760k83396
$$ plain form
43107 -2086302 -3063924 -5865899 -8297662 -7489198 -4158757 -1204462 695374 2944652
43099 2944652 5398194 6078258 4373499 1991625 777709 1503319 4280552 8083049
43091 8083049 10391387 9532816 7107284 6132668 7138366 8036562 7480769 6297187 5717867
43082 5717867 6059886 7133195 8373885 8665420 7357641 5174244 3037456 806868
43074 806868 -1566564 -2837023 -2075950 -230998 1756290 4783258 9092322 11659498
43066 11659498 9521687 4765714 2427793 3656957 4776162 3432964 1723486 2010378
43058 2010378 3184500 2997667 1487845 212871 92802 1554792 4946139 9310200
43050 9310200 12353658 12921689 12098061 10990533 9221357 6693039 5001464 5561572 7475137
$$ packed form
43107b086302r77622k801975k431763Q08464L330441K954295J899836K249278
43099B944652K453542O80064j704759k381874j213916P25610K777233L802497
43091H083049K308338q58571k425532r74616J005698Q98196n55793j183582n79320
43082E717867L42019J073309J240690K91535j307779k183397k136788k230588
43074H06868k373432j270459P61073J844952J987288L026968M309064K567176
43066A1659498k137811m755973k337921J229164J119205j343198j709478K86892
43058B010378J174122j86833j509822j274974j20069J461990L391347M364061
43050I310200L043458N68031q23628j107528j769176k528318j691575N60108J913565
$$ plain form
43041 7475137 8405054 6814192 3070289 -464649 -654499 3076429 6659809 5156638
43033 5156638 -1126306 -7084701 -9669421 -10731645 -12086212 -11965152 -8808447 -4940718
43025 -4940718 -3285177 -3220036 -2851317 -2690881 -3501380 -2973572 1181309 6459883 8243746
43016 8243746 6344615 4766358 5521319 6770952 6883427 6201719 4529194 897729 -3446466
43007 -3446466 -5580522 -5322495 -5477193 -6689742 -6013159 -2260033 1212750 1628089 1128457
42998 1128457 2641287 4331992 2405656 -2196452 -4410520 -2214240 826790 1067916
42990 1067916 -497888 -772225 649895 1594239 1002443 94510 -38766 36596 -419649
42981 -419649 -936716 -1083807 -1873380 -4197256 -6563881 -6635552 -5067727 -5230776 -8134277
$$ packed form
43041G475137R29917j590862l743903l534938j89850L730928L583380j503171
43033E156638o282944n958395k584720j062224j354567J21060L156705L867729
43025d940718J655541O5141L68719J60436q10499N27808M154881N278574J783863
43016H243746j899131j578257P54961J249633J12475o81708j672525l631465m344195
43007c446466k134056K58027j54698j212549O76583L753126L472783M15339m99632
42998A128457J512830J690705j926336m602108k214068K196280L041030K41126
42990A067916j565804k74337J422120R44344n91796r07933j33276P5362m56245
42981d19649n17067j47091p89573k323876k366625p1671J567825j63049k903501
$$ plain form
42972 -8134277 -10284877 -8593416 -5051539 -3618140 -4326524 -4297743 -3512810 -4819853 -7827557
42963 -7827557 -7869519 -3228900 1018540 -101261 -3994108 -4239901 172695 4017903 3612676
42954 3612676 886320 -892475 -1355227 -1393597 -610628 1199382 2219426 793906 -1747536
42945 -1747536 -2615913 -1168497 889853 2290354 3184109 3530199 2524566 129113 -2333167
42936 -2333167 -3775541 -4446065 -4890990 -4949623 -4542288 -4417069 -4988977 -5074456 -3044201
42927 -3044201 872917 4433568 5637046 4474261 2431364 922220 306856 -51846
42919 -51846 -849241 -1720691 -1398907 567597 2822160 3718840 3239185 2328373 1071732
42910 1071732 -715888 -1525873 761552 5295792 8134240 6974613 4049396 2703020
$$ packed form
42972h134277k150600J691461L541877J433399p08384K8781P84933j307043l007704
42963g827557m1962M640619M247440j119801l892847k45793M412596L845208m05227
42954C612676k726356j778795m62752l8370P82969J810010J020044j425520k541442
42945a747536q68377J447416K058350J400501Q93755L46090j005633k395453k462280
42936b333167j442374o70524m44925n8633M07335J25219n71908q5479K030255
42927c044201L917118L560651J203478j162785k042897j509144o15364l58702
42919e1846p97395q71450L21784J966504K254563Q96680m79655r10812j256641
42910A071732j787620q09985K287425M534240K838448j159627k925217j346376
$$ plain form
42902 2703020 2814835 1697290 -1608263 -5120402 -6473845 -4960876 -1593540 1272649
42894 1272649 1127017 -2091584 -5298444 -6067431 -6226448 -9182728 -14316669 -17166427 -15455429
42885 -15455429 -11904910 -10165497 -10746219 -12344124 -14629583 -17620217 -19957405 -19870741
42877 -19870741 -16998046 -11953690 -5251511 1975372 7367044 9109802 7732950 5094897
42869 5094897 2499112 763514 671876 1671452 1349379 -1653363 -4914109 -4706906 -1037479
42860 -1037479 2088275 1815052 -306284 -1250683 -892121 -1563962 -3940502 -5467504 -3728477
42851 -3728477 -233051 685063 -3057725 -8503861 -10792840 -8378028 -4035641 -1242683
42843 -1242683 -1127730 -2978539 -5891882 -8992397 -11202659 -11841594 -10963937 -8833694 -5983261
$$ packed form
42902B703020J11815j117545l305553l512139j353443J512969L367336K866189
42894A272649j45632l218601l206860p68987j59017k956280n133941k849758J710998
42885a5455429L550519J739413n80722j597905k285459k990634k337188Q6664
42877a9870741K872695N044356O702179P226883N391672J742758j376852k638053
42869E094897k595785j735598r1638R99576l22073l002742l260746K07203L669427
42860a037479L125754k73223k121336r44399L58562o71841k376540j527002J739027
42851c728477L495426R18114l742788n446136k288979K414812M342387K792958
42843a242683J14953j850809k913343l100515k210262o38935Q77657K130243K850433
$$ plain form
42834 -5983261 -3910114 -4147333 -5968965 -6603404 -4751551 -2379219 -1750142 -2231683 -1804980
42825 -1804980 -500463 -206181 -1722624 -4034501 -6139409 -7641209 -7693681 -5408649 -1687326
42816 -1687326 1035448 1475152 679752 16490 -828542 -2959081 -5998531 -7711725 -6306844
42807 -6306844 -2966376 -1290401 -3302288 -6561002 -7036033 -4815142 -4258381 -7330270
42799 -7330270 -9847157 -7166136 -1296823 1583986 -284789 -2395892 -1012060 1882986
42791 1882986 2041799 -1689678 -7061045 -10966883 -10789762 -5698971 1341271 4784358
42783 4784358 1935170 -3992032 -7821184 -7954938 -6308325 -4512381 -2772345 -1505856
42775 -1505856 -1268343 -1021971 1158229 5040014 7551975 5994593 1208896 -2808714
$$ packed form
42834e983261K073147k37219j821632o34439J851853K372332O29077m81541M26703
42825a804980J304517K94282j516443k311877k104908j501800n2472K285032L721323
42816a687326K722774M39704p95400o63262q45032k130539l039450j713194J404881
42807f306844L340468J675975k011887l258714m75031K220891N56761l071889
42799g330270k516887K681021N869313K880809j868775k111103J383832K895046
42791A882986J58813l731477n371367l905838J77121N090791P040242L443087
42783D784358k849188n927202l829152j33754J646613J795944J740036J266489
42775a505856K37513K46372K180200L881785K511961j557382m785697m017610
$$ plain form
42767 -2808714 -2204096 3222036 8964023 9041511 1770051 -7864917 -12846489 -10981876 -6066830
42758 -6066830 -2921243 -3205231 -5878334 -9089112 -10553070 -8406518 -3720328 -749355
42750 -749355 -2368034 -5892552 -5795331 -589802 5300949 7136559 4994033 1923322 -826290
42741 -826290 -4026802 -6876897 -6495897 -1929277 3614246 6036354 4595787 1698699
42733 1698699 -379485 -1236500 -1728689 -2957589 -5190542 -6750571 -5077668 -261820
42725 -261820 3873067 4329322 3331754 5177345 9287650 10186139 5185593 -1608270 -4978549
42716 -4978549 -5163521 -5797825 -7538464 -7493950 -4301018 -234649 2213996 3078441 3255246
42707 3255246 2337911 -324476 -3622993 -5253123 -4036057 -1029346 1381475 1271516
$$ packed form
42767b808714O04618N426132N741987P7488p271460r634968m981572J864613M915046
42758f066830L145587k83988k673103l210778j463958K146552M686190K970973
42750g49355j618679l524518R7221N205529N890751J835610k142526l070711k749612
42741h26290l200512k850095L81000M566620N543523K422108j440567k897088
42733A698699k078184q57015m92189j228900k232953j560029J672903M815848
42725b61820M134887M56255r97568J845591M110305Q98489n000546o793863l370279
42716d978549j84972o34304j740639M4514L192932M066369K448645Q64445J76805
42707C255246r17335k662387l298517j630130J217066L006711K410821j09959
$$ plain form
42699 1271516 -1294128 -4119304 -4813532 -3206162 -1268791 -427919 75740 1456832 3041100
42690 3041100 3191480 2384321 3535155 8220868 13666059 15110204 11138863 5314317
42682 5314317 2080480 2200330 3072733 2642824 1680462 2332738 5406959 9185847 10414412
42673 10414412 6782338 -765369 -8396539 -12873180 -14416410 -15259469 -15881442 -14189038
42665 -14189038 -8510714 -6704 8214985 13238429 13551969 9762979 4735154 1636175
42657 1636175 998392 639380 -1113250 -3417477 -4622035 -4392090 -3221467 -1317407 801625
42648 801625 1819895 1088765 -253588 -651105 254206 2067100 4244670 5209369 2636180
42639 2636180 -3538587 -9663866 -11855876 -9984909 -6500726 -2618643 2020100 6937048
$$ packed form
42699A271516k565644k825176o94228J607370J937371Q40872N03659J381092J584268
42690C041100J50380q07159J150834M685713N445191J444145l971341n824546
42682E314317l233837J19850Q72403m29909r62362O52276L074221L778888J228565
42673A0414412l632074p547707p631170m476641j543230q43059o21973J692404
42665a4189038N678324Q504010Q221689N023444L13540l788990n027825l098979
42657A636175o37783l59012j752630k304227j204558K29945J170623J904060K119032
42648H01625J018270p31130j342353l97517R05311J812894K177570R64699k573189
42639B636180o174767o125279k192010J870967L484183L882083M638743M916948
$$ plain form
42631 6937048 10821530 13579127 15837336 16643075 14330674 9820779 6377656 5503334
42623 5503334 5442056 4371032 2617405 780677 -1845176 -5399676 -7978989 -7927050 -6421032
42614 -6421032 -6122643 -7915287 -10107285 -10325946 -7616401 -3535648 -1530845 -3845338
42606 -3845338 -8390056 -10247061 -7239187 -2442682 -25167 -352972 -961403 -740360 -601763
42597 -601763 -746431 -79701 1277721 1192644 -1679793 -5732621 -8223120 -8374119 -7431869
42588 -7431869 -6066855 -3270095 1474071 5976369 6946181 4046134 839771 630136
42580 630136 2501928 3079424 1332494 -637445 -1435464 -2330551 -4428421 -6116112 -4997982
42571 -4997982 -1071744 3522053 7011169 9031400 9969662 10331824 10084691 8019001 2921665
$$ packed form
42631F937048L884482K757597K258209Q05739k312401m509895l443123q74322
42623E503334o1278j071024j753627j836728k625853l554500k579313N1939J506018
42614f421032K98389j792644k191998k18661K709545M080753K004803k314493
42606c845338m544718j857005L007874M796505K417515l27805o08431K21043J38597
42597f01763j44668O66730J357422q5077k872437m052828k490499j50999R42250
42588g431869J365014K796760M744166M502298R69812k900047l206363k09635
42580F30136J871792N77496j746930j969939p98019q95087k097870j687691J118130
42571d997982L926238M593797L489116K020231R38262L62162k47133k065690n097336
$$ plain form
42562 2921665 -3955408 -9192558 -11027161 -11151495 -11321548 -10209515 -5864235 337401
42554 337401 4964974 6805376 7183407 6834256 5429981 3776682 3219144 2704065 -247713
42545 -247713 -4907759 -6981398 -4382441 -506367 286842 -1829552 -3465513 -3054544 -1976503
42536 -1976503 -1598184 -1687835 -1629223 -1306744 -586420 813986 2754874 4687669 6043578
42527 6043578 6098196 4147273 721540 -1962150 -1828265 961436 4252771 5662747 3729764
42518 3729764 -1384667 -7166038 -9819973 -7725682 -3358573 -538958 -495560 -1977513
42510 -1977513 -4027507 -6252588 -6979800 -4234749 763223 3714343 2214626 -1324504
42502 -1324504 -3195302 -3126221 -3679247 -6167707 -9301400 -11461953 -12458931 -12909934 -13195255
$$ packed form
42562B921665o877073n237150j834603j24334j70053J112033M345280O201636
42554C37401M627573J840402L78031l49151j404275j653299n57538n15079k951778
42545b47713m660046k073639K598957L876074P93209k116394j635961M10969J078041
42536a976503L78319q9651N8612L22479P20324J400406J940888J932795J355909
42527F043578N4618j950923l425733k683690J33885K789701L291335J409976j932983
42518C729764n114431n781371k653935K094291M367109K819615M3398j481953
42510a977513k049994k225081p27212K745051M997972K951120j499717l539130
42502a324504j870798O9081n53026k488460l133693k160553r96978m51003k85321
$$ plain form
42493 -13195255 -13233213 -12449321 -10088050 -6424354 -3375919 -2762736 -4020230 -4823426 -4122554
42484 -4122554 -3370076 -4278300 -6336084 -7268756 -5506539 -1726632 1812140 3336083 3251225
42475 3251225 3637207 5559913 7253725 5975818 1574693 -2945354 -4527965 -2534219
42467 -2534219 1898502 7076554 10508120 9436658 3608493 -3325412 -6921135 -6039359
42459 -6039359 -2561676 1973313 7261492 12162419 14406450 13175549 10045333 6490122
42451 6490122 2361454 -1888744 -3428995 152401 6993488 12179377 12965958 11032155
42443 11032155 9183195 7672734 5050036 1439163 -946347 -610945 1463052 3598814
42435 3598814 5766742 8770461 11735945 12369976 10116093 7205264 5457545 3711898
$$ packed form
42493a3195255l7958P83892K361271L663696L048435O13183j257494q03196P00872
42484d122554P52478r08224k057784r32672J762217L779907L538772J523943q4858
42475C251225L85982J922706J693812j277907m401125m520047j582611J993746
42467b534219M432721N178052L431566j071462n828165o933905l595723Q81776
42459f039359L477683M534989N288179M900927K244031j230901l130216l555211
42451F490122m128668m250198j540251L581396O841087N185889P86581j933803
42443A1032155j848960j510461k622698l610873k385510L35402K073997K135762
42435C598814K167928L003719K965484O34031k253883k910829j747719j745647
$$ plain form
42427 3711898 264346 -3459049 -4311517 -2158352 -397148 -1197000 -2744776 -2331632 35742
42418 35742 2527877 3986096 3820826 1356185 -2421418 -3921622 -539557 5328503 8288906
42409 8288906 5805310 37091 -5660385 -9477576 -10462323 -8208016 -4488356 -2890990
42401 -2890990 -5058498 -8582780 -10000910 -8830580 -7421948 -7745112 -9556960 -11069243
42393 -11069243 -10346226 -6675404 -1711068 1144943 -309520 -4646693 -7981022 -7625308
42385 -7625308 -4263667 -726151 919091 1077918 1750036 4149636 7486684 10197962
42377 10197962 11677805 12086724 11181006 8672892 5432805 2798865 756425 -1510112
42369 -1510112 -3221530 -2377212 734881 2671311 1005211 -2416265 -4190796 -3828343
$$ packed form
42427C711898l447552l723395q52468K153165J761204p99852j547776M13144K367374
42418C5742K492135J458219j65270k464641l777603j500204L382065N868060K960403
42409H288906k483596n768219n697476l817191r84747K254307L719660J597366
42401b890990k167508l524282j418130J170330J408632l23164j811848j512283
42393a1069243P23017L670822M964336K856011j454463m337173l334329L55714
42385g625308L361641L537516J645242J58827O72118K399600L337048K711278
42377A0197962J479843M08919r05718k508114l240087k633940k042440k266537
42369a510112j711418Q44318L112093J936430j666100l421476j774531L62453
$$ plain form
42361 -3828343 -3299758 -3155401 -1707122 1866019 5660474 6931960 4814052 988341
42353 988341 -1672585 -1506775 84220 -126510 -3111169 -5801466 -4887876 -1228758 1756783
42344 1756783 3155069 4946539 7401334 7693278 4637444 1917860 3960095 9930749
42336 9930749 14273502 12899798 7139528 1595708 -562639 177424 1369949 1845586
42328 1845586 2800421 5518760 8981922 11047938 11424291 11499547 11300351 9144846 5121370
42319 5121370 2309178 2845120 4937619 5876371 6058326 7409063 9405682 9890857 8992501
42310 8992501 8818906 9449638 8734922 6514607 5432540 6285440 5972868 2184965 -2760691
42301 -2760691 -5451307 -6387925 -8194323 -10437652 -10048035 -6513888 -3001512 -1689639
$$ packed form
42361c828343N28585J44357J448279L573141L794455J271486k117908l825711
42353I88341k660926J65810J590995k10730k984659k690297R13590L659118K985541
42344A756783J398286J791470K454795K91944l055834k719584K042235N970654
42336I930749M342753j373704n760270n543820k158347P40063J192525M75637
42328A845586R54835K718339L463162K066016L76353P5256j99196k155505m023476
42319E121370k812192N35942K092499R38752J81955J350737J996619M85175q98356
42310H992501j73595O30732p14716k220315j082067Q52900l12572l787903m945656
42301b760691k690616r36618j806398k243329L89617L534147L512376J311873
$$ plain form
42293 -1689639 -1106000 735517 3207868 4661642 4971199 4653018 3213153 463984 -1891939
42284 -1891939 -2350927 -2375290 -4530631 -8274885 -10347084 -9560481 -8325013 -8367581 -7804907
42275 -7804907 -4723348 -1600891 -2935010 -8857128 -14000349 -13497548 -8183036 -2846841
42267 -2846841 -726452 -963310 -798628 926655 2644455 2161472 -250918 -1498960 811049
42258 811049 5055706 7285088 6134251 4204930 4118778 5301406 5887375 5774134 5736589
42249 5736589 5032697 2534029 -483778 -1477781 -546356 -465760 -2252828 -3315447 -1237779
42240 -1237779 2820675 6055771 7399942 7095495 4653560 -140039 -4984944 -6514493
42232 -6514493 -4178384 -765313 1130114 1462412 1484623 2083692 3783364 6421936 8023039
$$ packed form
42293a689639N83639J841517K472351J453774L09557l18181j439865k749169k355923
42284a891939m58988k4363k155341l744254k072199P86603J235468m2568N62674
42275g804907L081559L122457j334119n922118n143221N02801N314512N336195
42267b846841K120389k36858J64682J725283J717800m82983k412390j248042K310009
42258H11049M244657K229382j150837j929321q6152J182628N85969j13241l7545
42249E736589p03892k498668l017807r94003R31425Q0596j787068j062619K077668
42240a237779M058454L235096J344171l04447k441935m793599m844905j529549
42232f514493K336109L413071J895427L32298K2211N99069J699672K638572J601103
$$ plain form
42223 8023039 6019135 1037353 -2282392 -293019 4930690 8092664 7223827 5117129
42215 5117129 4246266 3409639 982066 -1095310 473922 5099225 8348435 7667968 5554031
42206 5554031 5824067 8680263 11255479 11738135 10685122 8662518 5028461 -141644
42198 -141644 -4610866 -5845781 -3825618 -1216716 -1011827 -4197466 -9027389 -12163183
42190 -12163183 -11296336 -7338503 -3586255 -2320249 -2859400 -3283971 -2923466 -2201701 -1102627
42181 -1102627 663696 2457701 3258371 3350901 4043048 5564547 6564522 5956964 4024104
42172 4024104 1405878 -1579004 -3957984 -3852303 -399074 4814178 9224466 11652797
42164 11652797 12484458 12421518 12274584 13293541 16003832 18644705 18283246 14081929 8403629
$$ packed form
42223H023039k003904m981782l319745J989373N223709L161974q68837k106698
42215E117129q70863q36627k427573k077376J569232M625303L249210o80467k113937
42206E554031K70036K856196K575216M82656j053013k022604l634057n170105
42198a41644m469222j234915K020163K608902K04889l185639m829923l135794
42190a2163183Q66847L957833L752248J266006n39151m24571L60505P21765J099074
42181a102627J766323J794005Q00670R2530O92147J521499R99975o07558j932860
42172D024104k618226k984882k378980J05681L453229N213252M410288K428331
42164A1652797Q31661o2940j46934J018957K710291K640873l61459m201317n678300
$$ plain form
42155 8403629 3996806 1029830 -2078947 -5585738 -7730625 -7381515 -6051408 -6240003
42147 -6240003 -8295556 -9999830 -9187795 -5774687 -1057338 3812273 7958544 10347988
42139 10347988 10408819 8831128 6853746 4855792 2318917 -1013305 -4550581 -7115166
42131 -7115166 -7270785 -4187358 804298 4421178 4858527 4427034 6643102 10840190 12239839
42122 12239839 8052001 1024444 -4320409 -6599614 -6876079 -5324128 -1548455 2798153
42114 2798153 4809628 3973458 2806373 3427989 5273029 6662835 6979620 6433812 4867089
42105 4867089 1945318 -1621922 -3630200 -1702010 4119239 10041993 11353231 7717866
42097 7717866 4290214 5779353 10490151 12524742 9229821 3789558 501497 349424
$$ packed form
42155H403629m406823k966976l108777l506791k144887L49110J330107j88595
42147f240003k055553j704274Q12035L413108M717349M869611M146271K389444
42139A0347988O0831j577691j977382j997954k536875l332222l537276k564585
42131g115166j55619L083427M991656L616880M37349m31493K216068M197088J399649
42122A2239839m187838p027557n344853k279205k76465J551951L775673M346608
42114B798153K011475q36170j167085O21616J845040J389806L16785n45808j566723
42105D867089k921771l567240k008278J928190N821249N922754J311238l635365
42097G717866l427652J489139M710798K034591l294921n440263l288061j52073
$$ plain form
42089 349424 1930391 4031615 5844045 6640658 6786900 7634928 9279188 9949433 8691146
42080 8691146 6891983 5905163 5106437 3908347 3573424 4729990 5025782 2302913 -1228835
42071 -1228835 -1552775 1010253 2183955 677079 543887 4725494 9898521 11016856
42063 11016856 8615479 7645460 9922886 11815706 10104891 6570307 4773666 4809219
42055 4809219 4010692 1643067 -22666 744046 3046467 5448182 7961214 10762154
42047 10762154 12740563 13054764 12917902 13887983 15086421 14162116 10760355 6968900 4234596
42038 4234596 2023793 122734 -8597 2399327 5432671 6721242 6616747 7218434 8764715
42029 8764715 9073727 6877116 3986448 3106400 4331984 5009536 3176198 343506 97567
$$ packed form
42089C49424J580967K101224J812430P96613J46242Q48028J644260O70245j258287
42080H691146j799163r86820p98726j198090l34923J156566K95792k722869l531748
42071a228835l23940K563028J173702j506876j33192M181607N173027J118335
42063A1016856k401377r70019K277426J892820j710815l534584j796641L5553
42055D809219p98527k367625j665733P66712K302421K401715K513032K800940
42047A0762154J978409L14201j36862R70081J198438r24305l401761l791455k734304
42038D234596k210803j901059j31331K407924L033344J288571j04495O01687J546281
42029H764715L09012k196611k890668q80048J225584O77552j833338k832692k45939
$$ plain form
42020 97567 3927511 9267043 12294416 12031926 10660973 10288116 10958771 11897490 12891690
42011 12891690 13628362 13078480 10699801 7452066 4812026 3528220 3796405 5435971
42003 5435971 7184413 7248241 5666302 4857345 6642137 10032523 13214349 16027879 18557275
41994 18557275 18874752 15028346 8707052 4232964 3812985 5863080 7868097 8617819
41986 8617819 7672092 5283151 3523738 5152967 10290494 15952753 19692570 21938670
41978 21938670 23937564 25383473 25473739 24791042 24629025 25457465 27264581 30415321 34800418
41969 34800418 38687155 39612368 36484770 30645118 25276003 23457224 25552376 28474442
41961 28474442 28889983 27063070 25722262 25289559 23086692 18105728 13451636 12149060
$$ packed form
42020I7567L829944N339532L027373k62490j370953l72857O70655R38719R94200
42011A2891690P36672n49882k378679l247735k640040j283806K68185J639566
42003E435971J748442O3828j581939q08957J784792L390386L181826K813530K529396
41994A8557275L17477l846406o321294m474088m19979K050095K005017P49722
41986H617819r45727k388941j759413J629229N137527N662259L739817K246100
41978B1938670J998894J445909R0266o82697j62017Q28440J807116L150740M385097
41969C4800418L886737R25213l127598n839652n369115j818779K095152K922066
41961B8474442M15541j826913j340808m32703k202867m980964m654092j302576
$$ plain form
41953 12149060 13315730 15034848 18309362 24433146 30237700 30585604 25523376 20762284
41945 20762284 20155624 21381035 20617132 18140824 16817136 17449920 18525816 19222292 19874228
41936 19874228 20007570 18410673 15205629 11881442 9182044 6835254 5506343 6751952
41928 6751952 10124774 12437230 11574804 9456471 9074134 9747244 8137552 3747048 212597
41919 212597 127233 1520065 1481432 757284 1736928 3577977 3132845 317650 -1328034
41910 -1328034 -125851 1351601 967326 814908 3797458 8795872 12123719 12250835 10333469
41901 10333469 7336799 3681496 1027346 1155669 2923558 3142075 976177 -1027670
41893 -1027670 -915295 167021 460465 305430 928204 2388747 4367022 7411958 11440163
$$ packed form
41953A2149060J166670J719118L274514O123784N804554L47904n062228m761092
41945B0762284o06660J225411p63903k476308j323688O32784J075896O96476O51936
41936A9874228J33342j596897l205044l324187k699398k346790j328911J245609
41928F751952L372822K312456q62426k118333l82337O73110j609692m390504l534451
41919B12597q5364J392832l8633p24148R79644J841049m45132k815195j645684
41910a328034J202183J477452l84275j52418K982550M998414L327847J27116j917366
41901A0333469k996670l655303k654150J28323J767889K18517k165898k003847
41893a027670J12375J082316K93444j55035O22774J460543J978275L044936M028205
$$ plain form
41884 11440163 14028749 12398153 7006449 1562895 -772158 -213046 622814 -445438
41876 -445438 -3414939 -6407944 -7482535 -6551233 -5503845 -6075466 -7819896 -8744354 -7744673
41867 -7744673 -5678869 -4069211 -3623454 -4333880 -6101613 -8335948 -9351810 -7413094
41859 -7413094 -2814671 1895541 4475940 5217604 5751013 6135668 4595038 390095 -4460708
41850 -4460708 -7183703 -7034536 -5265377 -3282859 -1925744 -1689215 -2207071 -2008926 -264144
41841 -264144 1610369 1709058 758506 1507059 4744140 7987250 8933773 8264912 7697622
41832 7697622 6994122 4858487 1678615 -899031 -2712428 -5051439 -7595643 -7732042
41824 -7732042 -4211106 283954 2241619 2132359 3679624 8058061 11316193 9311189
$$ packed form
41884A1440163K588586j630596n391704n443554k335053N59112Q35860j068252
41876d45438k969501k993005j074591R31302J047388n71621j744430r24458R99681
41867g744673K065804J609658M45757p10426j767733k234335j015862J938716
41859g413094M598423M710212K580399P41664N33409L84655j540630m204943m850803
41850d460708k722995J49167J769159J982518J357115K36529n17856J98145J744782
41841b64144J874513R8689r50552P48553L237081L243110R46523o68861n67290
41832G697622p03500k135635l179872k577646j813397k339011k544204j36399
41824g732042L520936M495060J957665j09260J547265M378437L258132k005004
$$ plain form
41816 9311189 3598204 -230447 253606 1643836 173678 -2774551 -2928915 640231
41808 640231 4454707 5635232 5332167 6293974 8898381 10987284 10790293 8841642 7091023
41799 7091023 6589297 6216744 4134194 808918 -343595 3452919 10670384 16802735
41791 16802735 18894771 17206908 13127316 7955691 3745551 2450164 3295827 3507612
41783 3507612 2723620 3977088 8635002 13131089 13314134 9919796 6778033 5237102
41775 5237102 3703836 1681107 572957 527922 -86303 -1428650 -1422537 646093 2325130
41766 2325130 1321975 -1211962 -2310723 -940466 1236381 2230503 2002856 2618828 6103093
41757 6103093 11556414 15035505 13643901 9102373 5382924 3531736 1670639 -128531
$$ packed form
41816I311189n712985l828651M84053J390230j470158k948229j54364L569146
41808F40231L814476J180525l03065R61807K604407K088903j96991j948651j750619
41799G091023n01726l72553k082550l325276j152513L796514P217465O132351
41791A6802735K092036j687863m079592n171625m210140j295387Q45663K11785
41783C507612p83992J253468M657914M496087J83045l394338l141763j540931
41775E237102j533266k022729j108150m5035o14225j342347O113K068630J679037
41766B325130j003155k533937j098761J370257K176847R94122k27647O15972L484265
41757F103093N453321L479091j391604m541528l719449j851188j861097j799170
$$ plain form
41749 -128531 1071166 5710322 9144727 7156457 1451747 -3328292 -5914736 -8161033
41741 -8161033 -9961521 -8717411 -4085828 430866 1922588 1585350 2453941 5414373
41733 5414373 8695150 10040601 8440155 4748695 1320339 157793 1036683 2345795
41725 2345795 3629185 5632377 7741859 7795159 5589052 4280680 6169173 8704603
41717 8704603 7471983 2519820 -1295448 -781607 1572988 1681842 -225381 -584687 1336503
41708 1336503 1618789 -2614344 -8175214 -9271005 -5135271 -1114868 -1572150 -4582128
41700 -4582128 -5453975 -3192363 -666670 299642 632723 959858 269668 -1375883 -1714668
41691 -1714668 327331 2306331 1466563 -1260757 -2722663 -1953742 -725804 -173833 715470
$$ packed form
41749a28531J199697M639156L434405j988270n704710m780039k586444k246297
41741h161033j800488J244110M631583M516694J491722l37238Q68591K960432
41733E414373L280777J345451j600446l691460l428356j162546Q78890J309112
41725B345795J283390K003192K109482N3300k206107j308372J888493K535430
41717H704603j232620m952163l815268N13841K354595J08854j907223l59306J921190
41708A336503K82286m233133n560870j095791M135734M020403m57282l009978
41700d582128q71847K261612K525693R66312L33081L27135o90190j645551l38785
41691a714668K041999J979000q39768k727320j461906P68921J227938N51971Q89303
$$ plain form
41682 715470 3012127 6212565 9223339 11341062 11574426 8542010 2369980 -4012404
41674 -4012404 -6823818 -4929367 -854111 1937079 2463513 2486379 3397793 3834058 1475386
41665 1475386 -3199115 -6613226 -6015510 -2310491 1649379 4048100 4394879 2613282
41657 2613282 -246809 -1489417 856126 5401675 8687210 8772863 6416355 3673312
41649 3673312 2893083 5786495 11113921 14266141 11953847 6795464 4337214 5966663
41641 5966663 8180775 8714626 9172290 10572496 10545063 7214593 2541076 -640164 -2061949
41632 -2061949 -2236167 -351228 3138535 4795016 2717207 466233 2520559 7559078
41624 7559078 10422674 9526106 7960877 7865227 8156828 7894381 7556377 6447607 3120238
$$ packed form
41682G15470K296657L200438L010774K117723K33364l032416o172030o382384
41674d012404k811414J894451M075256K791190N26434K2866R11414M36265k358672
41665A475386m674501l414111N97716L705019L959870K398721L46779j781597
41657B613282k860091j242608K345543M545549L285535Q5653k356508k743043
41649C673312p80229K893412N327426L152220k312294n158383k458250J629449
41641E966663K214112N33851M57664J400206k7433l330470m673517l181240j421785
41632b061949j74218J884939L489763J656481k077809k250974K054326N038519
41624G559078K863596q96568j565229r5650K91601k62447l38004j108770l327369
$$ plain form
41615 3120238 -519998 250659 6383476 12605548 13935082 11601469 9792598 9174006
41607 9174006 7078319 2736411 -1082388 -1638155 824495 3929793 5557283 5245169
41599 5245169 4166623 3842460 4591517 5574948 6312550 7183465 8305733 9203162 9930688
41590 9930688 11126970 12456381 12514485 10942185 9043297 7470255 4995208 777489
41582 777489 -3645344 -5991155 -5675832 -3516267 -381001 2618156 4110102 4254346 5230596
41573 5230596 8204830 11054791 11104992 9012388 7525704 7023786 5040708 557480 -3633783
41564 -3633783 -4035473 -633286 3058798 3574433 536214 -3529778 -6030070 -6868787 -7949514
41555 -7949514 -10187789 -11883051 -10628483 -6187128 -858955 2410442 1821835 -2370006
$$ packed form
41615C120238l640236P70657O132817O222072J329534k333613j808871o18592
41607I174006k095687m341908l818799n55767K462650L105298J627490l12114
41599E245169j078546l24163P49057R83431P37602Q70915J122268Q97429P27526
41590I930688J196282J329411N8104j572300j898888j573042k475047m217719
41582G77489m422833k345811L15323K159565L135266K999157J491946J44244R76250
41573E230596K974234K849961N0201k092604j486684n01918j983078m483228m191263
41564c633783m01690L402187L692084N15635l038219m065992k500292q38717j080727
41555g949514k238275j695262J254568M441355N328173L269397n88607m191841
$$ plain form
41547 -2370006 -7792143 -11583090 -13167598 -14837456 -18550795 -22746802 -23618358 -19410651
41539 -19410651 -12413316 -6567678 -3742555 -2540439 -532058 2571530 4584570 4146761
41531 4146761 3204559 4388035 6594915 6013373 1969172 -1329370 -425844 2665541 3517401
41522 3517401 911510 -2983555 -6200003 -7992288 -7557766 -4520621 -116732 4087855
41514 4087855 7684581 9935133 8774991 4059462 -41247 509233 3983313 5594038
41506 5594038 4909936 5960661 9926937 12778590 11735617 9582731 9872399 11276591
41498 11276591 10029531 5905034 2517399 2514822 4948347 7107812 7172798 5116978 2280650
41489 2280650 297998 -3123 1262838 3660522 6559932 8964856 10094358 9862124
$$ packed form
41547b370006n422137l790947j584508j669858l713339m196007q71556M207707
41539a9410651O997335N845638K825123J202116K008381L103588K013040m37809
41531D146761r42202J183476K206880n81542m044201l298542R03526L091385Q51860
41522C517401k605891l895065l216448j792285M34522L037145M403889M204587
41514D087855L596726K250552j160142m715529m100709N50480L474080J610725
41506E594038o84102J050725L966276K851653j042973k152886K89668J404192
41498A1276591j247060m124497l387635k577K433525K159465O4986k055820k836328
41489B280650j982652l01121J265961K397684K899410K404924J129502k32234
$$ plain form
41481 9862124 8146799 4669529 865485 285062 4614691 10317711 12284874 10339373
41473 10339373 8778893 9593684 10053102 7865210 4866797 3768042 4338443 4882114 5005037
41464 5005037 4967876 4434617 3626261 3838145 5500963 7752708 10758305 15583144 20618746
41455 20618746 21713476 17984233 14036859 13673184 14738649 13607691 11599056 12518559
41447 12518559 16011668 18152829 17582267 16494299 15813439 13621448 8855817 3156014
41439 3156014 -1585042 -4803346 -6154741 -5399938 -3536989 -1712908 689454 4282839
41431 4282839 6660271 4693680 -90107 -2290026 214746 3450028 3271149 829503
41423 829503 -167479 984359 2021879 1691905 799728 -66406 -1294085 -2639202 -2947767
$$ packed form
41481I862124j715325l477270l804044n80423M329629N703020J967163j945501
41473A0339373j560480Q14791M59418k187892k998413j098755N70401N43671J22923
41464E005037l7161n33259q08356K11884J662818K251745L005597M824839N035602
41455B0618746J094730l729243l947374l63675J065465j130958k008635R19503
41447A2518559L493109K141161n70562j087968o80860k191991m765631n699803
41439C156014m741056l218304j351395P54803J862949J824081K402362L593385
41431D282839K377432j966591m783787k199919K504772L235282j78879k441646
41423H29503r96982J151838J037520l29974q92177q66134j227679j345117l08565
$$ plain form
41414 -2947767 -2185966 -2294911 -4828901 -8264580 -8878453 -4683462 2183838 7566360 9215181
41405 9215181 7825540 4901533 1307063 -2106537 -4511385 -6523026 -9787593 -14080346
41397 -14080346 -16561182 -15278949 -11811676 -8951695 -7417823 -6542228 -6437397 -7281993
41389 -7281993 -7910954 -7444909 -7046295 -7731548 -7900639 -5849903 -3440494 -3906756 -6683590
41380 -6683590 -7869050 -5756077 -2674041 -1090916 -898945 -1023584 -911902 228880 3132607
41371 3132607 6599995 7941465 5912538 1761290 -2395452 -4563257 -3231766 707611
41363 707611 3354199 2187296 176688 1877048 6210651 7626547 4339581 428780
41355 428780 -989316 -1424085 -2165336 -1008366 3238276 7245111 7539200 5179237 3191456
$$ packed form
41414b947767P61801j08945k533990l435679o13873M194991O867300N382522J648821
41405I215181j389641k924007l594470l413600k404848k011641l264567m292753
41397a4080346k480836J282233L467273K859981J533872Q75595J04831q44596
41389g281993o28961M66045L98614o85253j69091K050736K409409m66262k776834
41380f683590j185460K112973L082036J583125J91971j24639J11682J140782K903727
41371C132607L467388J341470k028927m151248m156742k167805J331491L939377
41363G07611K646588j166903k010608J700360M333603J415896l286966l910801
41355D28780j418096m34769p41251J156970M246642M006835K94089k359963j987781
$$ plain form
41346 3191456 2485741 3061656 5856534 10061531 11586626 7749872 1162618 -3985116
41338 -3985116 -6726933 -7421707 -4600301 1981676 7980603 8994883 6507576 4780765
41330 4780765 3949659 1412369 -1696871 -1664753 571872 -246587 -5023315 -7777448 -4150002
41321 -4150002 2293479 5288029 3862461 1874791 2017138 3604086 5189028 6476099
41313 6476099 7404046 6934032 3655632 -2143474 -7195689 -7357289 -2075898 4399260 7696952
41304 7696952 7825266 7119579 5600181 1706474 -3353143 -5913263 -4736453 -2271689
41296 -2271689 -691440 159100 545424 26433 -434762 1053377 3785400 4823834 3974135
41287 3974135 4686940 8353289 11495701 11077579 9182012 9362584 11172053 11745368 10725936
$$ packed form
41346C191456p05715N75915K794878M204997J525095l836754o587254n147734
41338c985116k741817o94774K821406O581977N998927J014280k487307j726811
41330D780765q31106k537290l109240L2118K236625q18459m776728k754133L627446
41321d150002O443481K994550j425568j987670J42347J586948J584942J287071
41313F476099R27947m70014l278400n799106n052215j61600N281391O475158L297692
41304G696952J28314p05687j519398l893707n059617k560120J176810K464764
41296b271689J580249Q50540L86324n18991m61195J488139K732023J038434q49699
41287C974135P12805L666349L142412m18122j895567J80572J809469N73315j019432
$$ plain form
41278 10725936 10116100 10576480 11049831 11122063 10977555 9886793 7358943 4990976 4673092
41269 4673092 5739078 6287848 6372475 7238478 8328292 8074073 7096462 7357886 8243857
41260 8243857 6897381 3024026 117440 643627 2706861 3123500 1683285 525356
41252 525356 706326 1129023 201673 -2492488 -5574126 -6435972 -3491549 1560928 4874011
41243 4874011 4567904 2695834 2508359 4874579 8007915 9451478 7567696 2474236
41235 2474236 -3292103 -6102262 -4500483 -513977 3068051 5695263 8450305 11790323
41227 11790323 15356798 19006781 22392686 24274705 23921852 22594734 21957253 21603862
41219 21603862 20048152 17714242 16766068 17947619 19633607 20195686 19401169 17478524
$$ packed form
41278A0725936o09836M60380M73351P2232j44508j090762k527850k367967l17884
41269D673092J065986N48770Q4627Q66003J089814k54219r77611K61424Q85971
41260H243857j346476l873355k906586N26187K063234M16639j440215j157929
41252E25356J80970M22697r27350k694161l081638q61846K944423N052477L313083
41243D874011l06107j872070j87475K366220L133336J443563j883782n093460
41235B474236n766339k810159J601779L986506L582028K627212K755042L340018
41227A1790323L566475L649983L385905J882019l52853j327118o37481l53391
41219B1603862j555710k333910r48174J181551J685988N62079p94517j922645
$$ plain form
41211 17478524 15141506 14725999 18369556 24058968 26471719 23559551 19608557 19350846
41203 19350846 21435270 20921556 16615276 12265646 10998976 11956219 12663311 11858683 9488535
41194 9488535 6426015 4884044 6992644 12238882 17838027 21677733 23199700 22017234
41186 22017234 18453893 15236232 15226961 16967672 16035652 11743479 8457106 8472050 7936970
41177 7936970 3125691 -2979356 -4832462 -2620946 -1580082 -4176344 -7631334 -9013234
41169 -9013234 -8473262 -6882252 -4068224 -528333 2159897 3838840 6212550 9822205
41161 9822205 12898528 14134026 14307004 14137226 12767078 9634186 5888741 2618524
41153 2618524 -585012 -3930248 -5972083 -5567969 -4179776 -4470698 -6898615 -8792421
$$ packed form
41211A7478524k337018m15507L643557N689412K412751k912168l950994k57711
41203A9350846K084424n13714m306280m349630j266670R57243P07092q04628k370148
41194I488535l062520j541971K108600N246238N599145L839706J521967j182466
41186B2017234l563341l217661r271J740711r32020m292173l286373J4944n35080
41177G936970m811279o105047j853106K211516J040864k596262l454990j381900
41169i013234N39972J591010K814028L539891K688230J678943K373710L609655
41161I822205L076323J235498J72978j69778j370148l132892l745445l270217
41153B618524l203536l345236k041835M04114J388193k90922k427917j893806
$$ plain form
41145 -8792421 -6825622 -197057 8232589 14060913 15355799 14370693 14438066 15890399 16676824
41136 16676824 16340382 16944587 20026860 25188863 32129640 41264670 51137761 57731359
41128 57731359 58113922 53145620 45435918 36692380 28530340 23585009 23360538 26084360
41120 26084360 28549096 29155165 27863359 24743660 20460543 16913818 15374010 14838242
41112 14838242 13829533 12604316 11715909 9744100 5021918 -939291 -4242204 -3075791
41104 -3075791 161646 1364188 -1365016 -5492452 -5000906 4586328 20222052 32093695
41096 32093695 33075013 26344533 20861526 20537767 21633136 20305153 17950017 17556801
41088 17556801 18723225 18996293 17704735 15869241 14042093 12663980 13143701 15952740
$$ packed form
41145h792421J966799O628565Q429646N828324J294886r85106O7373J452333P86425
41136A6676824l36442O04205L082273N162003O940777R135030R873091O593598
41128E7731359L82563m968302p709702q743538q162040m945331k24471K723822
41120B6084360K464736O06069j291806l119699m283117l546725j539808n35768
41112A4838242j008709j225217q88407j971809m722182n961209l302913J166413
41104c075791L237437J202542k729204m127436M91546R587234J5635724J1871643
41096C2093695R81318o730480n483007l23759J095369j327983k355136l93216
41088A7556801J166424K73068j291558j835494j827148j378113M79721K809039
$$ plain form
41080 15952740 18526490 17872160 15149832 14832428 18416837 21417334 18670745 11416246
41072 11416246 6590866 8877010 15645403 20985038 22874781 24009713 26612251 30029070
41064 30029070 34252577 41986254 54078569 65199223 68294345 63139046 56745609 54556669
41056 54556669 54663298 52298077 46758998 40883073 35711233 29533709 22141602 16633309
41048 16633309 15548298 17246955 18006477 16760320 15848282 17143159 19254370 19459050
41040 19459050 17211917 14396782 12708152 12350651 13176327 15252523 17734991 18891566
41032 18891566 18263660 17286382 16551752 14167950 8755560 2634987 -472156 -7460 1866210
41023 1866210 4486051 8930863 13928419 15615605 13090402 10724708 12310004 15622410
$$ packed form
41080A5952740K573750o54330k722328l17404L584409L000497k746589p254499
41072A1416246m825380K286144O768393N339635J889743J134932K602538L416819
41064C0029070M223507P733677J2092315J1120654L095122n155299o393437k188940
41056E4556669J06629k365221n539079n875925n171840o177524p392107n508293
41048A6633309j085011J698657P59522j246157r12038J294877K111211K04680
41040A9459050k247133k815135j688630l57501Q25676K076196K482468J156575
41032A8891566o27906r77278p34630k383802n412390o120573l107143M64696J873670
41023A866210K619841M444812M997556J687186k525203k365694J585296L312406
$$ plain form
41015 15622410 16036690 13515623 12109045 13381638 14471096 13191075 11427804 11884275
41007 11884275 14087098 15591998 15458358 14731135 14735219 16567982 21191816 28144951 34741540
40998 34741540 38298659 38914435 38641328 38417149 37603799 36278006 35784510 36653765 38089532
40989 38089532 40283922 45118054 53349116 63226100 73642014 86399996 102487175 117900267
40981 117900267 127453788 132743483 141968918 160301255 184327108 208784000 235215801
40974 235215801 268981613 308648792 343437982 362763756 365096748 355742537 339096712
40967 339096712 316392033 289374656 261870154 236658605 213655457 192989628 177810814
40960 177810814 171376624 172201865 175073479 177319283 181510671 191063439 206053363 225483445
$$ packed form
41015A5622410M14280k521067j406578J272593J089458j280021j763271M56471
41007A1884275K202823J504900j33640p27223M084J832763M623834O953135O596589
40998C4741540L557119O15776k73107k24179q13350j325793m93496Q69255J435767
40989C8089532K194390M834132Q231062R876984J0415914J2757982J6087179J5413092
40981A17900267R553521N289695R225435J8332337K4025853K4456892K6431801
40974B35215801L3765812L9667179L4789190J9325774K332992r354211j6645825
40967C39096712k2704679k7017377k7504502k5211549k3003148k0665829j5178814
40960A77810814o434190Q25241K871614K245804M191388R552768J4989924J9430082
$$ plain form
40952 225483445 250814052 282979528 316424794 340225002 346447026 335188550 311304114
40945 311304114 279764961 245602150 214514921 189807751 169889359 151252456 132975578
40938 132975578 116434058 102117136 89449768 79053711 72466195 69397628 67123589
40931 67123589 62920316 56101011 48027137 41215554 37816730 37652799 38136825 37025239
40923 37025239 34536012 32108022 30510707 30195624 31665363 33942203 34616364 33346086
40915 33346086 33225928 36278614 39785788 40159288 38378284 37799318 38215790 36443126 31820417
40906 31820417 26623582 21650923 16280966 12727125 14680747 20611904 23677129 20374375
40898 20374375 14875038 12616702 13852467 16007340 18222522 20367751 21036612 19917922
$$ packed form
40952B25483445K5330607L2165476L3445266K3800208O222024j1258476k3884436
40945C11304114l1539153l4162811l1087229k4707170j9918392j8636903j8276878
40938A32975578j6541520j4316922j2667368j0396057o587516l068567k274039
40931F7123589m203273o819305q073874o811583l398824j63931M84026j111586
40923C7025239k489227k427990j597315l15083J469739K276840O74161j270278
40915C3346086j20158L052686L507174L73500j781004n78966M16472j772664m622709
40906C1820417n196835m972659n369957l553841J953622N931157L065225l302754
40898B0374375n499337k258336J235765K154873K215182K145229O68861j118690
$$ plain form
40890 19917922 19400833 20826914 21917639 20925402 20401676 23260221 27546505 28914707
40882 28914707 26458237 22565383 18806471 15618172 14391154 15869008 17579356 16796293
40874 16796293 15340507 17530599 23609617 28941290 29996441 27862688 25357706 23628528
40866 23628528 22434967 21553131 21077446 21588415 23820729 26884437 27852604 25072857 20778765
40857 20778765 18112166 16782624 14439071 11128625 9039828 8643828 8749236 9882678
40849 9882678 13492075 17564327 17334132 11693911 5439496 3645830 6720447 12249283
40841 12249283 18517673 24294230 27912411 29068978 29988439 32964864 37832644 42780176
40833 42780176 46070229 46198771 42481348 36772868 32740303 32042246 32739642 32437118 31074346
$$ packed form
40890A9917922n17089J426081J090725r92237n23726K858545M286284J368202
40882B8914707k456470l892854l758912l188299j227018J477854J710348p83063
40874A6796293j455786K190092O079018N331673J055151k133753k504982j729178
40866B3628528j193561q81836m75685N10969K232314L063708R68167k779747m294092
40857B0778765k666599j329542k343553l310446k088797l96000J05408J133442
40849I882678L609397M072252k30195n640221o254415j793666L074617N528836
40841A2249283O268390N776557L618181J156567R19461K976425M867780M947532
40833D2780176L290053J28542l717423n708480m032565o98057O97396l02524j362772
$$ plain form
40824 31074346 29460578 27237206 24119855 21520895 21039759 22426559 24478589 26797082
40816 26797082 29358341 31630425 33486403 35739785 38434169 40010575 39794243 39998589
40808 39998589 43315167 49403367 55730286 61328087 67719052 76158971 85733350 94657106
40800 94657106 102182283 108285090 111835407 110142713 101436001 88059837 75879017 69072281
40792 69072281 66253627 63384579 59535062 56974710 55837742 52443005 44447551 34737617
40784 34737617 27983759 25357708 24789539 24690126 25020377 25796121 26746842 27870507 28790071
40775 28790071 28354170 26172681 23553969 21834039 21188555 22148404 26070060 32142254
40767 32142254 36142191 35026980 31287633 29815660 31657989 34069479 35873162 39081201
$$ packed form
40824C1074346j613768k223372l117351k598960m81136J386800K052030K318493
40816B6797082K561259K272084J855978K253382K694384J576406k16332K04346
40808C9998589L316578O088200O326919N597801O390965Q439919R574379Q923756
40800I4657106P525177O102807L550317j692694q706712j3376164j2180820o806736
40792F9072281k818654k869048l849517k560352j136968l394737p995454r709934
40784C4737617o753858k626051n68169r9413L30251P75744R50721J123665R19564
40775B8790071m35901k181489k618712j719930o45484R59849L921656O072194
40767C2142254L999937j115211l739347j471973J842329K411490J803683L208039
$$ plain form
40759 39081201 45029519 52168422 58494663 63721342 68299063 72238504 75353942 77025559
40751 77025559 75856103 71497567 66371512 63092448 60553441 55570531 48353614 42844332
40743 42844332 41022377 40554560 39396699 39020287 40841330 42623558 41300662 37156585
40735 37156585 32585800 28693097 25694472 24654851 25798310 26673408 25147793 23006296
40727 23006296 23397186 25762894 26750060 25415067 23756083 22266112 18966326 13504709
40719 13504709 8472273 5479987 3361698 1700802 2695355 7435784 13293349 17290714
40711 17290714 19397585 20267429 18861260 15482400 14174303 17805304 22820183 23649662
40703 23649662 21046366 20745344 24212537 26623157 25211129 23741725 25704607 27959641
$$ packed form
40759C9081201N948318P138903O326241N226679M577721L939441L115438J671617
40751G7025559j169456m358536n126055l279064k539007m982910p216917n509282
40743D2844332j821955m67817j157861l76412J821043J782228j322896m144077
40735C7156585m570785l892703k998625j039621J143459Q75098j525615k141497
40727B3006296L90890K365708R87166j334993j658984j489971l299786n461617
40719A3504709n032436k992286k118289j660896R94553M740429N857565L997365
40711A7290714K106871Q69844j406169l378860j308097L631001N014879Q29479
40703B3649662k603296l01022L467193K410620j412028j469404J962882K255034
$$ plain form
40695 27959641 25422363 18796215 13158858 10891111 10287021 9908602 10113212 10689215 10785018
40686 10785018 11312019 14094629 18257848 20440274 19153406 16297147 13857679 11754201
40678 11754201 9644115 8209436 7531300 6444786 4778338 4420048 6996687 11931747
40670 11931747 17505159 22242210 24792383 24464958 22612956 21407041 20491023 17282030
40662 17282030 11692008 7816216 9001081 13537817 17473550 19617906 21159977 22122811
40654 22122811 21415792 19545676 18205989 17446267 16022950 14519577 15261915 18515033
40646 18515033 21309554 21273525 19787773 19990446 23004642 27554349 32309029 36882115
40638 36882115 40747237 42894081 43303716 43708826 45715218 48617169 50457305 51204221
$$ packed form
40695B7959641k537278o626148n637357k267747o04090l78419K04610N76003R5803
40686A0785018N27001K782610M163219K182426j286868k856259k439468k103478
40678A1754201k110086j434679o78136j086514j666448l58290K576639M935060
40670A1931747N573412M737051K550173l27425j852002j205915r16018l208993
40662A7282030n590022l875792J184865M536736L935733K144356J542071R62834
40654B2122811p07019j870116j339687p59722j423317j503373P42338L253118
40646A8515033K794521l6029j485752K02673L014196M549707M754680M573086
40638C6882115L865122K146844M09635M05110K006392K901951J840136P46916
$$ plain form
40630 51204221 53076823 57114832 61651818 65882917 72736188 85258709 101746402 118335636
40622 118335636 135559794 157314783 182447262 202439609 210032607 206270931 196374085
40615 196374085 182724619 165687894 147728245 131701856 117081599 102505026 90439217
40608 90439217 84527408 83492553 82815891 82052471 85243263 93701336 103664085 112559231
40600 112559231 122900332 137649030 155169585 170763829 180194436 180238634 169425811
40593 169425811 150692876 130537103 113260811 98361760 85021302 75485551 71050709
40586 71050709 67852207 60714990 49751821 39788299 34262643 32590005 32519861 32093702
40578 32093702 29923058 26384337 24205551 25370518 27849181 27845948 24765008 21210400
$$ packed form
40630E1204221J872602M038009M536986M231099O853271J2522521J6487693J6589234
40622A18335636J7224158K1754989K5132479J9992347P592998l761676r896846
40615A96374085j3649466j7036725j7959649j6026389j4620257j4576573j2065809
40608I0439217n911809j034855o76662p63420L190792Q458073R962749Q895146
40600A12559231J0341101J4748698J7520555J5594244R430607M4198j0812823
40593A69425811j8732935k0155773j7276292j4899051j3340458r535751m434842
40586G1050709l198502p137217j0963169r963522n525656j672638p0144m26159
40578C2093702k170644l538721k178786J164967K478663l233l080940l554608
$$ plain form
40570 21210400 18496192 15512802 12448024 12095651 15774602 20559743 22695035 22019475
40562 22019475 20944343 20449999 19569972 18268099 18238190 20249911 22522660 22813540 21110768
40553 21110768 19247327 18474801 18439384 18293417 17883513 17756850 18510980 20001557 20801751
40544 20801751 19153376 15451628 12893365 13705224 15221483 12656122 6432852 3392786
40536 3392786 8509828 18177883 24813150 25945790 24937812 24283890 23063478 20976015
40528 20976015 19922784 20031796 18154963 12565965 6153098 2800527 3115297 5630474
40520 5630474 9601374 14349770 18126319 19959460 20738565 20603973 17745576 12185050
40512 12185050 8232716 10141619 17213923 25984508 34986355 44054606 51361257 55638610
$$ packed form
40570B1210400k714208k983390l064778l52373L678951M785141K135292o75560
40562B2019475j075132m94344q80027j301873k9909K011721K272749K90880j702772
40553B1110768j863441p72526l5417j45967m09904j26663P54130J490577Q00194
40544B0801751j648375l701748k558263Q11859J516259k565361o223270l040066
40536C392786N117042R668055O635267J132640j007978o53922j220412k087463
40528B0976015j053231J09012j876833n588998o412867l352571L14770K515177
40520E630474L970900M748396L776549J833141P79105j34592k858397n560526
40512A2185050l952334J908903P072304Q770585R001847R068251P306651M277353
$$ plain form
40504 55638610 59918542 68376094 80168529 90963797 99880880 109505509 118787995 121999996
40496 121999996 116860373 108472902 102194544 97077758 89992397 82222636 77212898 74349176
40488 74349176 70084619 64249953 60685865 61645322 65444838 70135786 76154266 84460187
40480 84460187 94818520 106906448 120650388 134202136 143622019 146088517 142181004
40473 142181004 134082939 123098343 110174995 97360780 86783752 78547456 70978566
40466 70978566 62892015 54813584 48169674 43912779 41746373 40304593 38440696 36541496
40458 36541496 35877611 36386610 36143308 33689201 29906654 26796290 25372620 25483302 26257318
40449 26257318 25588223 21079776 13687057 8778247 10515382 16139935 19334561 18711536
$$ packed form
40504E5638610M279932Q457552J1792435J0795268Q917083R624629R282486L212001
40496A21999996n139623q387471o278358n116786p085361p769761n009738k863722
40488G4349176m264557n834666l564088R59457L799516M690948O018480Q305921
40480H4460187J0358333J2087928J3743940J3551748R419883K466498l907513
40473A42181004q098065j0984596j2923348j2814215j0577028q236296p568890
40466G0978566q086551q078431o643910m256895k166406j441780j863897j899200
40458C6541496o63885N08999k43302k454107l782547l110364j423670J10682P74016
40449B6257318o69095m508447p392719m908810J737135N624553L194626o23025
$$ plain form
40441 18711536 18645967 21266615 22691043 19497347 14423511 12095728 12606147 13328797 14104100
40432 14104100 15944238 16881690 14364489 10475731 9474960 10967344 11146093 10446654
40424 10446654 13394330 19731184 22483526 17787383 10767300 7851824 8495445 9167200
40416 9167200 10795298 16129496 22680822 24825884 22046226 19621803 21315732 26022607
40408 26022607 31625896 37593116 43006281 45868950 45504484 42940171 38560500 32147345
40400 32147345 25350045 21095532 20184204 21116230 23105260 26092442 28033699 26259976
40392 26259976 22232573 20879232 23849514 27351099 28551214 30154439 35657416 43182637
40384 43182637 47555466 46551894 41891376 35656651 29162917 24536730 23963697 26936065
$$ packed form
40441A8711536o5569K620648J424428l193696n073836k327783N10419P22650P75303
40432A4104100J840138R37452k517201l888758j000771J492384J78749o99439
40424A0446654K947676O336854K752342m696143p020083k915476O43621O71755
40416I167200J628098N334198O551326K145062k779658k424423J693929M706875
40408B6022607N603289N967220N413165K862669l64466k564313m379671o413155
40400C2147345o797300m254513r11328R32026J989030K987182J941257j773723
40392B6259976m027403j353341K970282L501585J200115J603225N502977P525221
40384D3182637M372829j003572m660518o234725o493734m626187n73033K972368
$$ plain form
40376 26936065 30399060 31873487 30905918 27824983 23173104 18621359 16588508 18083395
40368 18083395 21735188 25267613 27288413 27707384 27274949 26801834 26190951 24366207 20841659
40359 20841659 17010551 14774404 13968074 12504600 9566198 7341682 8335133 11567951
40351 11567951 13073911 10539015 6195720 4221829 6108660 9733037 12377259 13133234
40343 13133234 12538952 11669071 11959107 14132976 16524082 16174416 12691829 9388828 9241456
40334 9241456 11275551 12567728 12335762 12115365 13114028 15346733 18184368 19803121 17717435
40325 17717435 12505444 9412834 12715453 19362556 22160356 19172212 15851651 17035830
40317 17035830 20754160 21844134 18808965 14963844 14456815 18479279 24158766 26926054
$$ packed form
40376B6936065L462995J474427r67569l080935m651879m551745k032851J494887
40368A8083395L651793L532425K020800M18971m32435m73115o10883j824744l524548
40359B0841659l831108k236147q06330j463474k938402k224516R93451L232818
40351A1567951J505960k534896m343295j973891J886831L624377K644222P55975
40343A3133234n94282q69881K90036K173869K391106l49666l482587l303001j47372
40334I241456K034095J292177k31966k20397R98663K232705K837635J618753k085686
40325A7717435n211991l092610L302619O647103K797800k988144l320561J184179
40317A7035830L718330J089974l035169l845121n07029M022464N679487K767288
$$ plain form
40309 26926054 25668859 25069699 30083510 38584994 43413044 41967411 39085563 38969155
40301 38969155 39216660 35783693 29576886 24268893 20859750 18575519 18588846 22229687
40293 22229687 26821420 27582190 23465112 18091424 15291749 16153859 19612359 23433909
40285 23433909 25382157 25554292 26483281 29115240 30782340 29730769 29071258 32339886
40277 32339886 37157974 38067586 34633798 31668894 31533863 31410491 29123968 26616842
40269 26616842 25504237 23440400 17986474 11253643 7588112 8217650 10599805 11927614
40261 11927614 11327877 9521179 8038478 8236063 9871933 11155891 11014423 10572064 11538010
40252 11538010 13796829 15556313 15629904 14841888 14976339 16467881 17528130 16262379 13514532
$$ packed form
40309B6926054j257195n99160N013811Q501484M828050j445633k881848j16408
40301C8969155K47505l432967o206807n307993l409143k284231J3327L640841
40293B2229687M591733P60770m117078n373688k799675Q62110L458500L821550
40285B3433909J948248J72135R28989K631959J667100j051571o59511L268628
40277C2339886M818088R09612l433788k964904j35031j23372k286523k507126
40269B6616842j112605k063837n453926o732831l665531O29538K382155J327809
40261A1927614n99737j806698j482701J97585J635870J283958j41468m42359R65946
40252A1538010K258819J759484P3591p88016J34451J491542J060249j265751k747847
$$ plain form
40243 13514532 12133530 12842886 12715591 9221507 3977288 229877 -1895357 -4713001
40235 -4713001 -8405658 -10448707 -9644316 -7605590 -5600403 -2774923 1330374 4845590
40227 4845590 5670828 4076784 2100799 1361821 2080238 3324037 3895505 3630472 3438144
40218 3438144 3315703 1671094 -1769069 -4187072 -3607690 -2943691 -6107152 -10973360 -11150600
40209 -11150600 -5201758 966591 2486392 1386211 1494965 2158845 999738 -573488
40201 -573488 612604 3787080 5021450 3120973 1079486 1748228 5001464 9261683
40193 9261683 13266887 15945543 16497011 15135670 12754429 10002121 7470165 6010028
40185 6010028 5837019 6231976 7062831 9161337 11909126 12346514 8892960 4459053 3159314
$$ packed form
40243A3514532j381002P09356j27295l494084n244219l747411k125234k817644
40235d713001l692657k043049Q04391K038726K005187K825480M105297L515216
40227D845590Q25238j594044j975985p38978P18417J243799N71468k65033j92328
40218C438144j22441j644609l440163k418003N79382O63999l163461m866208j77240
40209a1150600N948842O168349J519801j100181J08754O63880j159107j573226
40201e73488J186092L174476J234370j900477k041487O68742L253236M260219
40193I261683M005204K678656N51468j361341k381241k752308k531956j460137
40185F010028j73009L94957Q30855K098506K747789M37388l453554m433907j299739
$$ plain form
40176 3159314 4866792 5904945 4638511 3166458 3069709 2595102 -342925 -4369462 -5844934
40167 -5844934 -3181482 1514225 5198971 7420187 10406417 15600118 21018204 23318038
40159 23318038 22188414 20729660 20880963 20687695 17757965 13563957 11765820 13115459
40151 13115459 14604869 13594392 10552432 7410838 5192933 3978609 3711736 4112914
40143 4112914 4622692 5074570 5876837 7123913 7983796 7429854 5618845 4379765 5744093
40134 5744093 9251763 11197066 8114695 1188045 -4622473 -6457237 -6434093 -7354193 -7853851
40125 -7853851 -4400477 3176351 10981908 15582695 16909748 16718181 16345212 16355529 16665143
40116 16665143 16457215 15055210 13060434 11792020 11821079 12804015 14024884 14161121 11842377
$$ packed form
40176C159314J707478J038153j266434j472053r6749m74607k938027m026537j475472
40167e844934K663452M695707L684746K221216K986230N193701N418086K299834
40159B3318038j129624j458754J51303j93268k929730m194008j798137J349639
40151A3115459J489410j010477l041960l141594k217905j214324k66873M01178
40143D112914N09778M51878Q02267J247076Q59883n53942j811009j239080J364328
40134E744093L507670J945303l082371o926650n810518j834764K3144r20100m99658
40125g853851L453374P576828P805557M600787J327053j91567l72969J0317L09614
40116A6665143k07928j402005j994776j268414K9059R82936J220869J36237k318744
$$ plain form
40107 11842377 8141879 7090641 11080056 16576612 17560711 13283487 9498317 11246694
40099 11246694 17250574 22623937 24492119 23222471 20413161 18055516 18272217 21325017
40091 21325017 24274331 23682459 19721171 15975204 14955542 15433317 15036759 14079283 14972599
40082 14972599 18037141 20011032 18014687 13612947 10894482 11195200 12329524 13118556
40074 13118556 15441993 20335078 25032523 26476789 25587901 25049637 24542829 21707207
40066 21707207 16931066 13433213 12570126 12420713 11373422 9955872 8576608 6637995
40058 6637995 4767799 4811157 6424387 6803915 5394549 5654567 9661699 13695588 12567233
40049 12567233 6915948 2833655 4512581 10062618 14991866 17449310 18674644 19433530
$$ packed form
40107A1842377l700498j051238L989415N496556R84099m277224l785170J748377
40099A1246694O003880N373363J868182j269648k809310k357645K16701L052800
40091B1325017K949314n91872l961288l745967j019662M77775l96558r57476Q93316
40082A4972599L064542J973891j996345m401740k718465L00718J134324P89032
40074A3118556K323437M893085M697445J444266q88888n38264n06808k835622
40066B1707207m776141l497853q63087j49413j047291j417550j379264j938613
40058F637995j870196M3358J613230L79528j409366K60018M007132M033889j128355
40049A2567233n651285m082293J678926N550037M929248K457444J225334P58886
$$ plain form
40041 19433530 17876080 11899448 3319501 -1855142 1171240 10583662 19384317 22270324
40033 22270324 19846238 16176703 14029762 13162699 11891771 9489047 7495117 8373189
40025 8373189 11983789 14487673 12784516 9093554 8237007 10942020 13504784 14155427
40017 14155427 15265803 17900592 18851663 15930108 12253190 11504970 11922202 9192954
40009 9192954 3314888 -1660401 -3446567 -3027046 -1174702 2383144 6325698 8045243
40001 8045243 7302773 6687266 7767094 9158322 8864770 6412433 2474854 -1511178 -3372765
39992 -3372765 -2176887 -285019 -1052826 -4232283 -6038468 -4195471 -619923 1438689
39984 1438689 793031 -1592605 -3738927 -3399767 130526 4403658 6145109 5594682 6057690
$$ packed form
40041A9433530j557450n976632q579947n174643L026382R412422Q800655K886007
40033B2270324k424086l669535k146941q67063j270928k402724j993930Q78072
40025H373189L610600K503884j703157l690962q56547K705013K562764O50643
40017A4155427J110376K634789R51071k921555l676918p48220M17232k729248
40009I192954n878066m975289j786166M19521J852344L557846L942554J719545
40001H045243p42470o15507J079828J391228k93552k452337l937579l986032j861587
39992c372765J195878J891868p67807l179457j806185J842997L575548K058612
39984A438689o45658k385636k146322L39160L530293M273132J741451n50427M63008
$$ plain form
39975 6057690 8571112 9981776 7779537 4221980 3615568 7287702 13025355 17888966
39967 17888966 19865270 18228856 14156833 10120296 7501435 5960366 5820491 8765081
39959 8765081 14465716 18819837 18201331 14028578 10513458 9121574 8105256 6485503
39951 6485503 5056971 3632395 842576 -2558665 -3384592 -525989 2732156 2758862 80897
39942 80897 -2060770 -2119109 -1044571 217257 1487307 1847233 -99391 -3720698 -6073912
39933 -6073912 -5447213 -3890703 -4579320 -7283962 -8302901 -5091916 678848 5485285
39925 5485285 7994166 9361027 10408583 10546950 9654518 9114569 9946906 11181676 11397990
39916 11397990 11089233 12047409 14675471 17253478 17945232 16443538 13549560 10326449
$$ packed form
39975F057690K513422J410664k202239l557557o06412L672134N737653M863611
39967A7888966J976304j636414m072023m036537k618861j541069j39875K944590
39959H765081N700635M354121o18506m172753l515120j391884j016318j619753
39951F485503j428532j424576k789819l401241q25927K858603L258145K6706k677965
39942H0897k141667n8339J074538J261828J270050L59926j946624l621307k353214
39933f073912O26699J556510o88617k704642j018939L210985N770764M806437
39925E485285K508881J366861J047556J38367q92432n39949Q32337J234770K16314
39916A1397990l08757R58176K628062K578007O91754j501694k893978l223111
$$ plain form
39908 10326449 8052325 7828945 9356710 10717818 10150300 7724153 4842563 2651625
39900 2651625 1497255 1309173 1709639 2221833 3187685 5872353 10509030 14807206 16065275
39891 16065275 14610272 13141595 12327281 9507296 3228929 -3090341 -4495809 -356128
39883 -356128 5589711 10244450 13347134 14971533 14339007 12157130 11032428 11702111 11401433
39874 11401433 8260543 5057010 5546220 8547687 9232898 5932674 2244289 1854749
39866 1854749 4293175 6946749 8688776 9778525 9993707 8784551 6355465 3241734
39858 3241734 -365696 -3862509 -5909574 -6110798 -5944484 -6548132 -6537508 -3877547 648009
39849 648009 3953761 4705825 4794100 6063593 7414298 6577066 3635945 943008 -336926
$$ packed form
39908A0326449k274124k23380J527765J361108n67518k426147k881590k190938
39900B651625j154370j88082M00466N12194R65852K684668M636677M298176J258069
39891A6065275j455003j468677q14314k819985o278367o319270j405468M139681
39883c56128N945839M654739L102684J624399o32526k181877j124702O69683l00678
39874A1401433l140890l203533M89210L001467O85211l300224l688385l89540
39866A854749K438426K653574J742027J089749K15182j209156k429086l113731
39858C241734l607430l496813k047065k01224J66314o03648J0624K659961M525556
39849F48009L305752P52064Q8275J269493J350705q37232k941121k692937j279934
$$ plain form
39840 -336926 -1879489 -5523675 -9872948 -11037343 -7179818 -1426243 853828 -2290663
39832 -2290663 -7413980 -9871038 -9046416 -8085514 -8773713 -8734826 -4968712 1157223 4691906
39823 4691906 3021178 -983078 -2784387 -1624038 -421370 -1151521 -2659748 -3299142
39815 -3299142 -3452246 -4044448 -4034926 -1438501 3284214 6465461 4683449 -1284591 -6311709
39806 -6311709 -5101525 2854107 12407416 17568029 17358548 15963049 16975142 19288688
39798 19288688 19767825 18041225 16161854 14344116 10071590 2229429 -6010802 -9837643
39790 -9837643 -7422327 -1148957 4849517 7632224 6742244 3606683 -210985 -4139693
39782 -4139693 -7822922 -9999347 -9566865 -7731959 -7472107 -10092852 -13364790 -13850285 -10354716
$$ packed form
39840c36926j542563l644186m349273j164395L857525N753575K280071l144491
39832b290663n123317k457058Q24622R60902o88199L8887L766114O125935L534683
39823D691906j670728m004256j801309J160349J202668p30151j508227o39394
39815c299142j53104n92202R522K596425M722715L181247j782012n968040n027118
39806f311709J210184P955632R553309N160613k09481j395499J012093K313546
39798A9288688M79137j726600j879371j817738m272526p842161q240231l826841
39790i837643K415316O273370N998474K782707q89980l135561l817668l928708
39782d139693l683229k176425M32482J834906K59852k620745l271938m85495L495569
$$ plain form
39773 -10354716 -4562512 845721 3977337 4421382 3197118 1953273 1792346 2849941
39765 2849941 4723215 6675921 7711078 7535642 7441387 8984110 11618295 13027001 12179429
39756 12179429 10543292 9560293 8452846 5670473 1319634 -3069278 -6286651 -7882750
39748 -7882750 -7807120 -6763103 -6099283 -6274632 -6286191 -5556383 -5073312 -5272754 -4345215 -931451
39738 -931451 2580024 2397948 -1137470 -3343684 -1264465 2758144 4977578 5261867 5923813
39729 5923813 7148865 6542273 3101923 -847250 -2425737 -1234614 1164482 3300345
39721 3300345 4200252 3057896 200065 -2220257 -2246273 -657916 237871 292847 1754369
39712 1754369 5184729 7667060 6834374 4605673 4403431 6120142 6891707 6110803 6179348
$$ packed form
39773a0354716N792204N408233L131616M44045j224264j243845j60927J057595
39765B849941J873274J952706J035157j75436r4255J542723K634185J408706q47572
39756A2179429j636137r82999j107447k782373m350839m388912l217373j596099
39748g882750P5630J044017O63820j75349j1559P29808M83071j99442R27539L413764
39738i31451L511475j82076l535418k206214K079219M022609K219434K84289O61946
39729E923813J225052o06592l440350l949173j578487J191123K399096K135863
39721C300345Q99907j142356k857831k420322k6016J588357Q95787N4976J461522
39712A754369L430360K482331q32686k228701k02242J716711P71565p80904O8545
$$ plain form
39703 6179348 7969662 8895726 6769121 2934027 47136 -1113061 -1123344 -226680 1122726
39694 1122726 1714006 1280216 1277819 2419757 3007230 1416658 -1330730 -3356560 -4677258
39685 -4677258 -5938360 -5839744 -2560254 2925685 7445961 9218839 8777269 6887765 3928917
39676 3928917 1138347 86113 576711 916816 532399 708544 2459115 4959482 6249382
39667 6249382 4630910 -128438 -5868013 -9093098 -8449998 -6497438 -6619092 -9073072
39659 -9073072 -11642990 -13001874 -13418836 -13237506 -12896596 -13434546 -14636027 -13818760 -9054790
39650 -9054790 -2398651 2866546 6625995 10133271 11636079 8591499 3322955 1042835
39642 1042835 2167246 2180677 -151170 -544922 2886799 5546663 3535856 -210954 -968083
$$ packed form
39703F179348J790314R26064k126605l835094k886891j160197j0283Q96664J349406
39694A122726N91280m33790k397J141938N87473j590572k747388k025830j320698
39685d677258j261102R8616L279490N485939M520276J772878m41570j889504k958848
39676C928917k790570j052234M90598L40105l84417J76145J750571K500367J289900
39667F249382j618472m759348n739575l225085O43100J952560j21654k453980
39659i073072k569918j358884m16962J81330L40910n37950j201481Q17267M763970
39650i054790O656139N265197L759449L507276J502808l044580n268544k280120
39642A042835J124411J3431k331847l93752L431721K659864k010807l746810p57129
$$ plain form
39633 -968083 870957 2106985 2222229 2158360 879047 -2209076 -4129495 -2367641 224579
39624 224579 -690556 -4073098 -5399446 -3869016 -2632454 -2756165 -2014269 580502 3667914
39615 3667914 6805910 10369906 12311152 9725840 4041657 75409 -720942 -1507541
39607 -1507541 -3665236 -4069341 -693211 3447104 4637063 3396178 2460954 2657735 3353182
39598 3353182 4642780 6502474 7505297 6627676 5009784 4237941 4233579 4216458 4259777
39589 4259777 4554076 4534730 3876178 3021720 2033949 590575 -415561 471379 2330893
39580 2330893 2203995 -552002 -3040589 -3431580 -3828457 -6332379 -8850420 -7633324 -2331262
39571 -2331262 3957787 8430922 10366508 10435507 9971226 9729968 8321587 3880093 -1635869
$$ packed form
39633i68083J839040J236028J15244o3869j279313l088123j920419J761854K592220
39624B24579r15135l382542j326348J530430J236562j23711P41896K594771L087412
39615C667914L137996L563996J941246k585312n684183l966248p96351p86599
39607a507541k157695m04105L376130M140315J189959j240885r35224J96781O95447
39598C353182J289598J859694J002823q77621j617892p71843m362j7121M3319
39589D259777K94299j9346o58552q54458r87771j443374j006136Q86940J859514
39580B330893j26898k755997k488587l90991l96877k503922k518041J217096N302062
39571b331262O289049M473135J935586O8999m64281k41258j408381m441494n515962
$$ plain form
39562 -1635869 -2850139 2183969 8533779 10576570 8792612 7074805 6108949 3723660
39554 3723660 -229039 -4007559 -7655723 -11893113 -14400906 -12320914 -8121928 -7647245
39546 -7647245 -11718978 -14750630 -12876865 -8535847 -5229595 -2639354 311851 1876604
39538 1876604 587703 -1169293 -301391 2500261 4582237 5542387 6355018 6154522 3595047
39529 3595047 398778 -83943 2298812 4136866 3095956 415363 -1479611 -1628971
39521 -1628971 -392762 1411387 2619694 2375183 1133078 90622 -212263 431017 3000424
39512 3000424 7954614 12768010 13199337 8295820 2483544 919445 3487589 5152689
39504 5152689 2338305 -2588920 -4127823 -137973 5837812 8825668 7553851 4420923
$$ packed form
39562a635869j214270N034108O349810K042791j783958j717807r65856k385289
39554C723660l952699l778520l648164m237390k507793K079992M198986M74683
39546g647245m071733l031652J873765M341018L306252K590241K951205J564753
39538A876604j288901j756996Q67902K801652K081976R60150Q12631k00496k559475
39529C595047l196269m82721K382755J838054j040910k680593j894974j49360
39521a628971J236209J804149J208307k44511j242105j042456l02885O43280K569407
39512C000424M954190M813396M31327m903517n812276j564099K568144J665100
39504E152689k814384m927225j538903L989850N975785K987856j271817l132928
$$ plain form
39496 4420923 1707407 -109669 -717524 644741 3210098 4376852 3123503 2058845
39488 2058845 3921948 7227236 7984721 5350271 2863331 3598516 6462385 8392165
39480 8392165 8304342 7269611 6071096 4538280 2931138 2245269 2811777 3768485 4371072
39471 4371072 4823170 5133271 4165476 1206975 -1932646 -2171955 1046242 4888639 7021004
39462 7021004 8551727 11231265 13348917 11547683 6369978 2621104 3412750 6774156
39454 6774156 9338979 10442216 10863463 10498412 9716711 10277083 11875800 10452839 3903407
39445 3903407 -2692772 -2558828 3062525 6157776 3118507 -1025447 -1093734 1171651 1741326
39436 1741326 1268344 2869830 5990373 7224261 5542321 2372503 -2235669 -8929854
$$ packed form
39496D420923k713516j817076o07855J362265K565357J166754j253349j064658
39488B058845J863103L305288P57485k634450k486940P35185K863869J929780
39480H392165q7823j034731j198515j532816j607142o85869N66508R56708O02587
39471D371072M52098L10101r67795k958501l139621k39309L218197L842397K132365
39462G021004J530723K679538K117652j801234n177705l748874P91646L361406
39454F774156K564823J103237M21247l65051p81701N60372J598717j422961o549432
39445C903407o596179J33944N621353L095251l039269m143954o8287K265385N69675
39436A741326m72982J601486L120543J233888j681940l169818m608172o694185
$$ plain form
39428 -8929854 -14988952 -15749158 -11101236 -6591040 -6317713 -7865203 -6343117 -932863
39420 -932863 5074792 9104991 11481561 13305652 14385928 13737808 11110724 7672948
39412 7672948 5370933 5182504 5678956 4078223 -548382 -5681965 -7762443 -5823905
39404 -5823905 -2064252 715549 1292505 -73678 -2641035 -5482103 -7297358 -6631793
39396 -6631793 -2678907 3736661 9763269 11670972 7481132 -1020526 -9291797 -13565174
39388 -13565174 -13400259 -10817583 -7712354 -4933953 -3331901 -3943388 -6320450 -7907789
39380 -7907789 -6557435 -3213672 -709048 -155030 -145339 446412 937724 909447 1775568
39371 1775568 4567058 7503121 7841911 5486823 2749084 878484 -1032124 -3573020
$$ packed form
39428h929854o059098p60206M647922M510196K73327j547490J522086N410254
39420i32863O007655M030199K376570J824091J080276o48120k627084l437776
39412G672948k302015j88429M96452j600733m626605n133583k080478J938538
39404e823905L759653K779801N76956j366183k567357k841068j815255O65565
39396f631793L952886O415568O026608J907703m189840q501658q271271m273377
39388a3565174J64915K582676L105229K778401J602052o11487k377062j587339
39380g907789J350354L343763K504624N54018R691N91751M91312k8277Q66121
39371A775568K791490K936063L38790k355088k737739j870600j910608k540896
$$ plain form
39363 -3573020 -5610568 -6056718 -5207607 -3313265 490114 6198935 10926733 10848628 5358690
39354 5358690 -1828132 -6094921 -5927657 -3381010 -1115487 403477 2516301 5665411
39346 5665411 8238685 8714548 7874661 7480295 7431978 6210521 4041645 3258370 4729023
39337 4729023 6139673 5282830 3222843 2393461 3144465 4379682 6276101 9526505 12473142
39328 12473142 12132227 8493271 5071101 4291677 4718477 3966590 1972240 -323926 -3414736
39319 -3414736 -7987730 -12584924 -14945191 -14967898 -14083014 -12243260 -8118568 -2345945 1999518
39310 1999518 3018943 2085290 1371630 1059859 197628 -1198448 -2347506 -2936030 -2826063
39301 -2826063 -1510361 789393 2382335 1935163 304866 -861256 -1428250 -1898252 -1246921
$$ packed form
39363c573020k037548m46150Q49111J894342L803379N708821M727798p8105n489938
39354E358690p186822m266789J67264K546647K265523J518964K112824L149110
39346E665411K573274M75863q39887l94366m8317j221457k168876p83275J470653
39337D729023J410650q56843k059987q29382P51004J235217J896419L250404K946637
39328A2473142l40915l638956l422170p79424M26800p51887j994350k296166l090810
39319c414736m572994m597194k360267k2707Q84884J839754M124692N772623M345463
39310A999518J019425r33653p13660l11771q62231j396076j149058n88524J09967
39301b826063J315702K299754J592942m47172j630297j166122n66994m70002O51331
$$ plain form
39292 -1246921 1679042 4773070 3758720 -2201433 -8403406 -9825004 -6805443 -3738080
39284 -3738080 -3368688 -4465244 -4618599 -3307012 -1768767 -1074543 -1078752 -1103215 -1343324
39275 -1343324 -2992557 -6189504 -8339307 -6262943 -443984 4749064 6163806 5502471
39267 5502471 6431045 9644463 12694960 13490165 11910562 9001572 6808628 8091217
39259 8091217 13497692 19310702 20591802 16670233 11323391 7762128 6065434 5457404
39251 5457404 5828340 6171593 4607582 1425793 -457466 380104 1643627 866899 -1108047
39242 -1108047 -2149169 -2262036 -2689368 -3092718 -1944585 1111249 4919773 7902304 8460439
39233 8460439 6046800 3169930 4087758 9477359 14581775 15064133 12444467 10735633
$$ packed form
39292a246921K925963L094028j014350n960153o201973j421598L019561L067363
39284c738080L69392j096556j53355J311587J538245O94224m209k4463k40109
39275a343324j649233l196947k149803K076364N818959N193048J414742o61335
39267E502471R28574L213418L050497P95205j579603k908990k192944J282589
39259H091217N406475N813010J281100l921569n346842l561263j696694o08030
39251E457404L70936L43253j564011l181789j883259Q37570J263523p76728j974946
39242a108047j041122j12867m27332m03350J148133L055834L808524K982531N58135
39233H460439k413639k876870R17828N389601N104416M82358k619666j708834
$$ plain form
39225 10735633 9957985 6995436 1430387 -3852726 -7201547 -9006703 -8416802 -4139552
39217 -4139552 951757 1074969 -4761199 -10537023 -10897053 -7294622 -4120604 -2532296
39209 -2532296 -1397857 -1125280 -2433521 -3282018 -1103089 2843468 4894051 4249542 3603849
39200 3603849 4680091 6134327 6193533 4841514 2853993 706227 -972952 -1380122 -336663
39191 -336663 1950799 5557889 9827468 12327668 10987810 7260619 5092656 6440760
39183 6440760 9538937 11681695 11705309 9455044 5130205 156812 -3112743 -3714750 -2838624
39174 -2838624 -1710693 -364173 845097 608157 -1133201 -2285151 -1670631 -1316368 -3432406
39165 -3432406 -6321587 -5997233 -1624525 3083667 4273480 1864327 -1427607 -3318802
$$ packed form
39225A0735633p77648k962549n565049n283113l348821j805156N89901M277250
39217d139552N091309J23212n836168n775824l60030L602431L174018J588308
39209b532296J134439K72577j308241q48497K178929L946557K050583o44509o45693
39200C603849J076242J454236N9206j352019j987521k147766j679179m07170J043459
39191c36663K287462L607090M269579K500200j339858l727191k167963J348104
39183F440760L098177K142758K3614k250265m324839m973393l269555o02007Q76126
39174b838624J127931J346520J209270k36940j741358j151950O14520L54263k116038
39165c432406k889181L24354M372708M708192J189813k409153l291934j891195
$$ plain form
39157 -3318802 -3468266 -3005676 -3365591 -4895637 -6292447 -6140130 -4938447 -4421122 -4911926
39148 -4911926 -5082605 -4725361 -5631039 -8431062 -10538439 -9371887 -6329296 -4964715 -5780074
39139 -5780074 -5703584 -3120421 -635516 -1423739 -4855886 -7583685 -7716049 -6103118 -4279580
39130 -4279580 -2960950 -2238889 -1615588 62247 3183493 5889371 5675745 2893920 1034214
39121 1034214 2566100 5728501 6735985 4408592 1135036 -541744 -731265 -1094120
39113 -1094120 -2273426 -3723146 -5487087 -8271348 -11079701 -10494091 -4408570 3870946
39105 3870946 7655886 4071130 -2412420 -5110597 -2561063 1007221 1721499 50614
39097 50614 -1427495 -1736809 -1595328 -1274410 -54851 2535711 5985086 9190428 11065538
$$ packed form
39157c318802j49464M62590l59915j530046j396810J52317J201683N17325m90804
39148d911926j70679L57244r05678k800023k107377J166552L042591J364581q15359
39139e780074P6490K583163K484905p88223l432147k727799j32364J612931J823538
39130d279580J318630P22061O23301J677835L121246K705878k13626k781825j859706
39121A034214J531886L162401J007484k327393l273556j676780j89521l62855
39113a094120j179306j449720j763941k784261k808353N85610O085521Q279516
39105C870946L784940l584756o483550k698177K549534L568284P14278j670885
39097E0614j478109l09314J41481L20918J219559K590562L449375L205342J875110
$$ plain form
39088 11065538 11063241 9617133 7879820 6691888 6006049 5507073 5486441 6801530 9892806
39079 9892806 13610276 15066980 11733626 4673836 -1184536 -1742070 1489975 3054906
39071 3054906 54137 -4998157 -8198913 -8732456 -8051569 -6837602 -5038570 -3640021
39063 -3640021 -3915230 -5269293 -5896512 -5563622 -5902659 -7651682 -9220677 -8683184 -6136186
39054 -6136186 -3387375 -1883165 -1442615 -806523 674030 1757658 112815 -4940348
39046 -4940348 -10625453 -12449084 -8207794 -298243 5935454 6473839 2072391 -2255566
39038 -2255566 -1934937 2523607 6145307 5011525 261777 -3780121 -4204050 -1360254
39030 -1360254 2631968 5750406 7075335 7289520 7932269 9291475 9557674 6908536 1743413
$$ packed form
39088A1065538k297j446108j737313j187932o85839m98976k0632J315089L091276
39079I892806L717470J456704l333354p059790n858372n57534L232045J564931
39071C054906l000769n052294l200756n33543O80887J213967J799032J398549
39063c640021k75209j354063o27219L32890l39037j749023j568995N37493K546998
39054f136186K748811J504210M40550O36092J480553J083628j644843n053163
39046d940348n685105j823631M241290P909551O233697N38385m401448m327957
39038b255566L20629M458544L621700j133782m749748m041898m23929K843796
39030a360254L992222L118438J324929K14185O42749J359206K66199k649138n165123
$$ plain form
39021 1743413 -3961427 -8475800 -10430213 -8545249 -3225801 2339354 4710935 3555085
39013 3555085 901701 -2178198 -5980338 -9740423 -11468118 -10664277 -9098025 -8299722
39005 -8299722 -8036772 -7652550 -7024937 -5708296 -3120059 -343488 219801 -1876951 -3850280
38996 -3850280 -2969682 149008 2716934 3136905 2039476 923172 1012291 2900756 6244787
38987 6244787 9913125 12816925 14267041 13624735 10643032 6441980 3077588 1597179
38979 1597179 1266878 998118 644701 536583 521068 -132413 -2132194 -5083981 -6655301
38970 -6655301 -4241337 1042526 3602357 -708701 -8823259 -13795205 -13355747 -11337272
38962 -11337272 -10644771 -9651696 -7039146 -5261228 -6093292 -6806653 -4735191 -2429585 -3649986
$$ packed form
39021A743413n704840m514373j954413J884964N319448N565155K371581j155850
39013C555085k653384l079899l802140l760085j727695Q03841J566252P98303
39005h299722K62950L84222O27613J316641K588237K776571N63289k096752j973329
38996c850280Q80598L118690K567926M19971j097429j116304Q9119J888465L344031
38987F244787L668338K903800J450116o42306k981703m201052l364392j480409
38979A597179l30301k68760l53417j08118j5515o53481j999781k951787j571320
38970f655301K413964N283863K559831m311058q114558m971946M39458K018475
38962a1337272O92501R93075K612550J777918q32064p13361K071462K305606j220401
$$ plain form
38953 -3649986 -6455561 -5381342 349699 5578830 6274733 3607410 366332 -2615249
38945 -2615249 -4847467 -4269233 486849 7249573 11580662 10731370 5984385 1541048
38937 1541048 910602 3711205 6414664 6670483 5651573 5394207 6005047 7298788 10627721
38928 10627721 15830610 18417122 14213180 6019314 1044820 1650692 3275582 2211524
38920 2211524 361902 270391 210931 -2296672 -5497478 -5847469 -3423242 -1353840 -1089509
38911 -1089509 -1295785 -689379 580029 1804419 1944881 -208966 -4157821 -6902758 -6116017
38902 -6116017 -3309530 -1814310 -2421505 -3206478 -2967921 -2420412 -2239716 -2185926 -2150937
38893 -2150937 -2114489 -1190963 1291639 3941250 4705497 4050137 4306265 5668609 5656399
$$ packed form
38953c649986k805575J074219N731041N229131O95903k667323l241078k981581
38945b615249k232218N78234M756082O762724M331089q49292m746985m443337
38937A541048o30446K800603K703459K55819j018910k57366O10840J293741L328933
38928A0627721N202889K586512m203942q193866m974494O05872J624890j064058
38920B211524j849622r1511n9460k507603l200806l49991K424227K069402K64331
38911a089509k06276O06406J269408J224390J40462k153847l948855k744937P86741
38902f116017K806487J495220o07195p84973K38557N47509J80696N3790L4989
38893b150937L6448R23526K482602K649611P64247o55360K56128J362344j2210
$$ plain form
38884 5656399 3430724 1733801 2658925 3893287 1883891 -2594884 -4944238 -2510779
38876 -2510779 2719519 7465294 10746796 13118202 14383539 14006217 12838812 12451664
38868 12451664 12776275 12012230 9298641 6287979 5431759 7459879 10961082 13572309
38860 13572309 13115618 8739207 2036858 -3690530 -6403902 -7035993 -7336295 -7024301 -4757792
38851 -4757792 -1241818 917857 698836 -41052 575000 2044684 2880466 2881593 2811514
38842 2811514 2858997 2554814 1557976 -191505 -2316674 -3447239 -1883733 2369657 7078224
38833 7078224 9903712 10197156 8425031 5358947 2539606 1803812 3103099 4227263
38825 4227263 3886567 3442171 4174137 4779601 3712819 2262478 2528424 3552975 2639993
$$ packed form
38884E656399k225675j696923R25124J234362k009396m478775k349354K433459
38876b510779N230298M745775L281502K371406J265337l77322j167405l87148
38868A2451664L24611p64045k713589l010662q56220K028120L501203K611227
38860A3572309m56691m376411o702349n727388k713372o32091l00302L11994K266509
38851d757792L515974K159675k19021p39888O16052J469684Q35782J127p0079
38842B811514M7483l04183r96838j749481k125169j130565J563506M253390M708567
38833G078224K825488K93444j772125l066084k819341p35794J299287J124164
38825D227263l40696m44396P31966O05464j066782j450341K65946J024551r12982
$$ plain form
38816 2639993 -1515 -1222493 299214 2420257 3405868 4472860 7020666 9707898
38808 9707898 10209345 8468489 6519409 5872013 6234205 6185541 4354969 618746 -3338814
38799 -3338814 -5374482 -5047506 -3569256 -1709120 738472 3232716 4118701 2753959
38791 2753959 446512 -1434535 -2653120 -2789947 -923705 2063761 3038130 466246
38783 466246 -2966517 -3791450 -2358883 -1480013 -1614434 -470149 2824029 6057205 6926871
38774 6926871 5371614 2432506 -942615 -3252688 -2915656 -653995 472574 -1129201
38766 -1129201 -3355863 -3607524 -2724643 -3495928 -6022396 -7158358 -4982452 -1719461 -922996
38757 -922996 -2891678 -4497380 -3507529 -1626481 -2143613 -5033405 -6076840 -1899898 5172455
$$ packed form
38816B639993k641508j220978J521707K121043R85611J066992K547806K687232
38808I707898N01447j740856j949080o47396L62192m8664j830572l736223l957560
38799c338814k035668L26976J478250J860136K447592K494244Q85985j364742
38791B753959k307447j881047j218585j36827J866242K987466R74369k571884
38783D66246l432763q24933J432567Q78870j34421J144285L294178L233176Q69666
38774F926871j555257k939108l375121k310073L37032K261661J126569j601775
38766a129201k226662k51661Q82881p71285k526468j135962K175906L262991P96465
38757i22996j968682j605702R89851J881048n17132k889792j043435M176942P072353
$$ plain form
38748 5172455 9208093 7583003 3711363 2037130 2469534 1843643 -597038 -2236391
38740 -2236391 -1574482 -719967 -2186418 -5361677 -7829508 -8613585 -8144852 -6158960 -2102838
38731 -2102838 2541403 4741145 3546080 1687998 2591203 6707945 11440845 13733267
38723 13733267 12108909 7278848 1864776 -1100933 -507232 2141132 4800272 6927490
38715 6927490 8728153 9430378 7901019 4629250 1490595 -533231 -1949487 -2949235
38707 -2949235 -2733063 -1272184 5126 557029 2272954 6738407 11780106 13139061
38699 13139061 9826645 5595783 3999430 3841960 1557682 -2819751 -4745246 -992867
38691 -992867 5582402 8966507 7002163 3553286 3302376 6028085 7376769 4616452
$$ packed form
38748E172455M035638j625090l871640j674233M32404o25891k440681j639353
38740b236391O61909Q54515j466451l175259k467831p84077M68733J985892M056122
38731b102838M644241K199742j195065j858082R03205M116742M732900K292422
38723A3733267j624358m830061n414072k965709N93701K648364K659140K127218
38715F927490J800663P02225j529359l271769l138655k023826j416256r99748
38707b949235K16172J460879J277310N51903J715925M465453N041699J358955
38699A3139061l312416m230862j596353j57470k284278m377433j925495L752379
38691i92867O575269L384105j964344l448877k50910K725709J348684k760317
$$ plain form
38683 4616452 26998 -1774895 1202967 6796177 11443648 13326811 12679583 10220028
38675 10220028 6546524 2973461 1533828 3056486 5771350 7065288 6573950 6181589
38667 6181589 6621557 5785452 1796208 -3446999 -5864264 -4019076 -291537 2835946
38659 2835946 5224992 6913870 6163709 2043254 -2721524 -4528998 -3919963 -4612013 -7362929
38650 -7362929 -8376356 -5286746 -1352743 -879941 -3009203 -3785929 -2853243 -3547200 -6405008
38641 -6405008 -7326153 -3786796 1142455 3456944 3507250 3572968 3192977 967500 -1104627
38632 -1104627 202933 3784715 5564407 5180974 6250192 9205273 9224036 3606423 -3389680
38623 -3389680 -6244529 -4908807 -2419995 513824 4141629 5923636 3593554 372873
$$ packed form
38683D616452m589454j801893K977862N593210M647471J883163o47228k459555
38675A0220028l673504l573063j439633J522658K714864J293938m91338l92361
38667F181589M39968q36105l989244n243207k417265J845188L727539L127483
38659B835946K389046J688878p50161m120455m764778j807474O09035o92050k750916
38650g362929j013427L089610L934003M72802k129262p76726R32686o93957k857808
38641f405008r21145L539357M929251K314489N0306O5718l79991k225477k072127
38632a104627J307560L581782J779692l83433J069218K955081J8763n617613o996103
38623c389680k854849J335722K488812K933819L627805J782007k330082l220681
$$ plain form
38615 372873 1595796 6612856 9399246 7423805 4437857 3324829 1844869 -1791824
38607 -1791824 -4041497 -829859 5906660 10561977 10730814 8133360 4492427 485136
38599 485136 -2203970 -1972141 -617123 -1962934 -6338035 -9441697 -7990978 -4036090
38591 -4036090 -1991069 -3127192 -4816992 -4183341 -793832 3738698 7241174 8004890
38583 8004890 5593582 1306635 -2476378 -3768717 -1979273 2020205 6194560 7991379
38575 7991379 5991442 1797769 -480004 1960210 7317792 11012015 10954467 9374977
38567 9374977 8858688 8753163 7163328 4478285 2197714 -398348 -5006536 -10203458
38559 -10203458 -12289109 -10579262 -8082830 -5952395 -1512894 5851845 10877161 8439721
$$ packed form
38615C72873J222923N017060K786390j975441k985948j113028j479960l636693
38607a791824k249673L211638O736519M655317J68837k597454l640933m007291
38599D85136k689106K31829J355018j345811m375101l103662J450719L954888
38591d036090K045021j136123j689800O33651L389509M532530L502476P63716
38583H004890k411308m286947l783013j292339J789444L999478M174355J796819
38575G991379j999937m193673k277773K440214N357582L694223n7548j579490
38567I374977n16289j05525j589835k685043k280571k596062m608188n196922
38559a0203458k085651J709847K496432K130435M439501P364739N025316k437440
$$ plain form
38551 8439721 950810 -4451240 -4761913 -3173794 -3090470 -4373400 -5926061 -8053013 -10676487
38542 -10676487 -11945806 -10443250 -7226101 -4441051 -3032770 -2511697 -1838341 -60020
38534 -60020 2764051 4932649 4604559 2227432 279308 339033 1563375 2239287 1668605
38525 1668605 316397 -903016 -1471042 -2227126 -4933483 -9639305 -13233530 -12380022 -7397904
38516 -7397904 -1526403 2859882 5276715 5627581 4757488 5663729 10268487 15012944 13930769
38507 13930769 6926044 618028 -598084 238116 -1039195 -2704095 -614374 4384037
38499 4384037 7271351 5667560 1841157 -1241150 -2409837 -1458374 1039925 3373061
38491 3373061 4560072 5851284 8195933 9715602 8552221 6664232 7245205 9560842
$$ packed form
38551H439721p488911n402050l10673J588119Q3324j282930j552661k126952k623474
38542a0676487j269319J502556L217149K785050J408281N21073O73356J778321
38534f0020K824071K168598l28090k377127j948124N9725J224342O75912n70682
38525A668605j352208j219413n68026p56084k706357m705822l594225Q53508M982118
38516g397904N871501M386285K416833L50866q70093R06241M604758M744457j082175
38507A3930769p004725o308016j216112Q36200j277311j664900K089721M998411
38499D384037K887314j603791l826403l082307j168687R51463K498299K333136
38491C373061J187011J291212K344649J519669j163381j887989N80973K315637
$$ plain form
38483 9560842 10304347 9280512 9348616 10811388 10388177 6549873 1914058 -579695 -268137
38474 -268137 2937752 8550007 12856598 11112727 4414696 -91950 1616580 5400399
38466 5400399 5959862 4185468 3402345 2685230 -435310 -3631880 -2530425 1588272 3098660
38457 3098660 847287 -360567 2012936 4166796 2193196 -2312444 -5610858 -7112850
38449 -7112850 -8307362 -9126416 -8405440 -6239108 -3481235 -384547 2315251 2702904 286859
$$ packed form
38483I560842P43505j023835O8104J462772m23211l838304m635815k493753L11558
38474b68137L205889N612255M306591j743871o698031m506646J708530L783819
38466E400399N59463j774394p83123p17115l120540l196570J101455M118697J510388
38457C098660k251373j207854K373503K153860j973600m505640l298414j501992
38449g112850j194512q19054P20976K166332K757873L096688K699798L87653k416045
$$ [...]
##END NTUPLES=NMR SPECTRUM
##END=
